##TITLE=1H_CG-1168-3
 CDCl3
 32 sc, 
 16.11.2022
##JCAMPDX= 6.0         $$ Bruker NMR JCAMP-DX V2.0
##DATA TYPE= NMR SPECTRUM
##DATA CLASS= NTUPLES
##ORIGIN= UXNMR, Bruker Analytische Messtechnik GmbH
##OWNER= root
$$ XWIN-NMR		Version 3.5
$$ Wed Nov 16 14:07:27 2022 Russian Standard Time (UT+4h)  she@DPX200
##.OBSERVE FREQUENCY= 200.1313499994
##.OBSERVE NUCLEUS= ^1H
##.ACQUISITION MODE= SIMULTANEOUS
##.ACQUISITION SCHEME= undefined
##.AVERAGES= 32
##.DIGITISER RES= 18
##SPECTROMETER/DATA SYSTEM= spect
##.PULSE SEQUENCE= zg30
##.SOLVENT NAME= Acetone
##.SHIFT REFERENCE= (INTERNAL, Acetone, 0, 15.7304)
##AUDIT TRAIL= $$ (NUMBER, WHEN, WHO, WHERE, WHAT)
$$ ##TITLE= Audit trail, XWIN-NMR		Version 3.5
$$ ##JCAMPDX= 5.01
$$ ##ORIGIN= Bruker BioSpin GmbH
$$ ##OWNER= she
$$ F:/spectra/data/she/nmr/H-F/1/pdata/1/auditp.txt
$$ ##AUDIT TRAIL=  $$ (NUMBER, WHEN, WHO, WHERE, WHAT)
(   1,<2022-11-16 14:05:10.40 +0400>,<she>,<DPX200>,
      <continue with go, POWCHK disabled, PULCHK disabled
       configuration hash MD5:
       00 E9 B6 7A A2 85 ED C7 34 08 36 98 17 FE 4E 26
       data hash MD5: 16K
       8A 9A C9 4A 3C 25 5A 23 5E F0 6D 9D F0 01 1C 5C>)
(   2,<2022-11-16 14:06:22.25 +0400>,<she>,<DPX200>,
      <Start of raw data processing
       efp BC_mod = 2 LB = 0.24 FT_mod = 6 PKNL = 1 PHC0 = -18049.08 PHC1 = 33.8007 SI = 16K 
       data hash MD5: 16K
       A3 5B F8 71 CF A0 A0 90 53 6D D7 42 98 21 A0 B6>)
(   3,<2022-11-16 14:06:25.07 +0400>,<she>,<DPX200>,
      <abs ABSG = 5 
       data hash MD5: 16K
       46 22 64 1F BC 6A 00 85 70 7C 44 E3 3B 36 FC 17>)
(   4,<2022-11-16 14:06:38.45 +0400>,<she>,<DPX200>,
      <pk PHC0 = 3.902902 PHC1 = -3.4 
       data hash MD5: 16K
       8E 05 66 57 CE 42 7A D9 92 45 CA 33 42 33 20 F5>)
(   5,<2022-11-16 14:06:41.64 +0400>,<she>,<DPX200>,
      <abs ABSG = 5 
       data hash MD5: 16K
       E4 F5 E3 C7 FE FA 3F 2A 89 A6 DA 4A A1 7E AE 22>)
$$ ##END=
$$ 
$$ hash MD5
$$ 7D D9 00 F3 CD 91 D8 EB AD B8 B6 B6 3A 57 52 40
##$RELAX= 
##$RELAX= 
##$RELAX= 
##$RELAX= 
##$RELAX= 
##$RELAX= 
$$ Bruker specific parameters
$$ --------------------------
##$DU= <F:/spectra>
##$EXPNO= 1
##$NAME= <H-F>
##$PROCNO= 1
##$TYPE= <nmr>
##$USER= <she>
##$AMP= (0..31)
100 100 100 100 100 100 100 100 100 100 100 100 100 100 100 100 100 100 
100 100 100 100 100 100 100 100 100 100 100 100 100 100 
##$AQSEQ= 0
##$AQ_mod= 1
##$AUNM= <au_zg>
##$AUTOPOS= <>
##$BF1= 200.13
##$BF2= 200.13
##$BF3= 200.13
##$BF4= 200.13
##$BF5= 200.13
##$BF6= 200.13
##$BF7= 200.13
##$BF8= 200.13
##$BYTORDA= 1
##$CFDGTYP= 0
##$CFRGTYP= 5
##$CHEMSTR= <none>
##$CNST= (0..31)
1 1 145 1 1 1 1 1 1 1 1 1 1 1 1 1 1 1 1 1 1 1 1 1 1 1 1 1 1 1 1 1 
##$CPDPRG= <>
##$CPDPRG1= <>
##$CPDPRG2= <>
##$CPDPRG3= <>
##$CPDPRG4= <mlev>
##$CPDPRG5= <mlev>
##$CPDPRG6= <mlev>
##$CPDPRG7= <mlev>
##$CPDPRG8= <mlev>
##$CPDPRGB= <>
##$CPDPRGT= <>
##$D= (0..31)
0 1.2 0 0 0 0 0 0 0 0.06 0 0.03 0 0 0 0 0.0002 0 0 0 0 0 0 0 0 0 0 0 0 
0 0 0 
##$DATE= 1668592966
##$DBL= (0..7)
$$ [...]
##$SUBNAM3= <"">
##$SUBNAM4= <"">
##$SUBNAM5= <"">
##$SUBNAM6= <"">
##$SUBNAM7= <"">
##$SUBNAM8= <"">
##$SUBNAM9= <"">
##$SW= 18.0517283424941
##$SWIBOX= (0..15)
0 0 2 0 0 0 0 0 0 0 0 0 0 0 0 0 
##$SW_h= 3612.71676300578
##$TD= 16384
##$TD0= 1
##$TE= 0
##$TE2= 300
##$TE3= 300
##$TEG= 300
##$TL= (0..7)
0 120 120 120 120 120 120 120 
##$TP= (0..7)
150 150 150 150 150 150 150 150 
##$TP07= 0
##$TPNAME0= <>
##$TPNAME1= <>
##$TPNAME2= <>
##$TPNAME3= <>
##$TPNAME4= <>
##$TPNAME5= <>
##$TPNAME6= <>
##$TPNAME7= <>
##$TPOAL= (0..7)
0.5 0.5 0.5 0.5 0.5 0.5 0.5 0.5 
##$TPOFFS= (0..7)
0 0 0 0 0 0 0 0 
##$TUNHIN= 0
##$TUNHOUT= 0
##$TUNXOUT= 0
##$USERA1= <user>
##$USERA2= <user>
##$USERA3= <user>
##$USERA4= <user>
##$USERA5= <user>
##$V9= 5
##$VALIST= <valist>
##$VCLIST= <CCCCCCCCCCCCCCC>
##$VD= 0
##$VDLIST= <DDDDDDDDDDDDDDD>
##$VPLIST= <PPPPPPPPPPPPPPP>
##$VTLIST= <TTTTTTTTTTTTTTT>
##$WBST= 1024
##$WBSW= 4
##$XGAIN= (0..3)
0 0 0 0 
##$XL= 0
##$YL= 0
##$YMAX_a= 156321
##$YMIN_a= -178618
##$ZGOPTNS= <>
##$ZL1= 120
##$ZL2= 120
##$ZL3= 120
##$ZL4= 120
##$ABSF1= 15.73036
##$ABSF2= -2.321489
##$ABSG= 5
##$ABSL= 3
##$ALPHA= 0
##$AQORDER= 0
##$ASSFAC= 0
##$ASSFACI= 0
##$ASSFACX= 0
##$ASSWID= 0
##$AUNMP= <proc_1d>
##$AZFE= 0.1
##$AZFW= 0.1
##$BCFW= 0
##$BC_mod= 2
##$BYTORDP= 0
##$COROFFS= 0
##$CY= -3
##$DATMOD= 1
##$DC= 0
##$DFILT= <>
##$DTYPP= 0
##$F1P= 0
##$F2P= 0
##$FCOR= 1
##$FTSIZE= 16384
##$FT_mod= 6
##$GAMMA= 0
##$GB= 0
##$INTBC= 1
##$INTSCL= 3.70164e-10
##$ISEN= 128
##$LB= 0.24
##$LEV0= 0
##$LPBIN= 0
##$MAXI= 10000
##$MC2= 0
##$MEAN= 0
##$ME_mod= 0
##$MI= 1.114404
##$NCOEF= 0
##$NC_proc= -7
##$NLEV= 6
##$NOISF1= 3.799351
##$NOISF2= 2.8
##$NSP= 0
##$NTH_PI= 0
##$NZP= 0
##$OFFSET= 15.73036
##$PC= 1
##$PHC0= -18045.18
##$PHC1= 30.4007
##$PH_mod= 1
##$PKNL= yes
##$PPARMOD= 0
##$PSCAL= 0
##$PSIGN= 0
##$REVERSE= no
##$SF= 200.130008240767
##$SI= 16384
##$SIGF1= 3
##$SIGF2= 2
##$SINO= 5.538805
##$SIOLD= 16384
##$SREGLST= <1H.CDCl3>
##$SSB= 0
##$STSI= 16384
##$STSR= 0
##$SW_p= 3612.71676300578
##$SYMM= 0
##$S_DEV= 0
##$TDeff= 16384
##$TDoff= 0
##$TI= <>
##$TILT= no
##$TM1= 0
##$TM2= 0
##$TOPLEV= 0
##$USERP1= <user>
##$USERP2= <user>
##$USERP3= <user>
##$USERP4= <user>
##$USERP5= <user>
##$WDW= 1
##$XDIM= 16384
##$YMAX_p= 375340099
##$YMIN_p= -1075445
$$ End of Bruker specific parameters
$$ ---------------------------------
##NTUPLES= NMR SPECTRUM
##VAR_NAME=  FREQUENCY,     SPECTRUM/REAL,   SPECTRUM/IMAG
##SYMBOL=    X,             R,               I
##VAR_TYPE=  INDEPENDENT,   DEPENDENT,       DEPENDENT
##VAR_FORM=  AFFN,          ASDF,            ASDF
##VAR_DIM=   16384,         16384,           16384
##UNITS=     HZ,            ARBITRARY UNITS, ARBITRARY UNITS
##FACTOR=    0.220516191357247, 1,           1
##FIRST=     3148.11708265986, 0,            0
##LAST=      -464.599680345916, 0,           0
##MIN=       -464.599680345916, -1075445,    0
##MAX=       3148.11708265986, 375340099,    0
$$ Real data points
##PAGE= N=1
##DATA TABLE= (X++(R..R)), XYDATA
$$ [...]
4971A141477K75731M06462k92909J67160N8160k64043j1493j11276l55130J73822
4961A187961M71233J52178o19447L29516M1130M2084o293J2764O7459K02552O8273
4950A949410l10607J7838J38485m54429j14411M15443K60211o59881N41155K21738
4940B004952j60327Q4299k057k47575n567L08010K14579j0834l24153j92237K50769
4929A919859l41939K00027J01540k68247R1024k42745Q87l23342L41006K05590
4919A683660n8130L18576p7469J05656L18318j3496n58924k64377K55986J5512
4909A725312m45246N31241J37532l62810J01083k5777l43349L80693L67239m1834
4899B024084Q9490K09616N2836l11707m71654J38941q8857K65930J64866j62533
$$ y = [1141477, 1417208, 1823670, 1530761, 1697921, 1756081, 1492038, 1480545, 1369269, 1014139, 1187961, 1659194, 1811372, 1191925, 1521441, 1562571, 1604655, 1598362, 1611126, 1678585, 1881137, 1949410, 1638803, 1656641, 1795126, 1340697, 1226286, 1641729, 1901940, 1242059, 1783214, 2004952, 1844625, 1928924, 1926867, 1679292, 1673725, 1981735, 2196314, 2185480, 1861327, 1669090, 1919859, 1577920, 1777947, 1879487, 1611240, 1702264, 1459519, 1460406, 1137064, 1478070, 1683660, 1625530, 1944106, 1866637, 1972293, 2290611, 2277115, 1718191, 1453814, 1709800, 1725312, 1280066, 1811307, 1948839, 1586029, 1687112, 1661335, 1317986, 1698679, 2065918, 2024084, 2113574, 2323190, 2376026, 2064319, 1592665, 1731606, 1642749, 1908679, 2073545, 1911012]
4889A911012K74266k29512k37276M20866J20950r22972L6132L83401K29493n19721
4879A466639k5675J68339J85852k20342K19001P5979k56692m0477K33756K50209
4869B056589k62687o1829J76014l51287M03765L5611J26445l82070j48413j12398
4859A479740J6714J36158K19454o2132M4524r0675J62181L88811k80753k07951
4849A806071l88206K67057R3777P0371o09348m643O1192K81698M19660j25452
4839A872177K14605L3065J84552j27008k12522j87842L09246L78254J06312k93554
4829B277285j56682m55409J9758O8375l5994M13796L56408Q4016N15635L0322
4819C117510j98857M78230j61074j85511k85420j62574k77994m4934M19337L42870
$$ y = [1911012, 2185278, 1955766, 1718490, 2139356, 2260306, 1337334, 1373466, 1756867, 1986360, 1466639, 1440964, 1609303, 1795155, 1574813, 1793814, 1869793, 1613101, 1572624, 1806380, 2056589, 1793902, 1732073, 1908087, 1556800, 1960565, 1996176, 2122621, 1740551, 1592138, 1479740, 1496454, 1632612, 1852066, 1789934, 1834458, 1743783, 1905964, 2294775, 2014022, 1806071, 1417865, 1684922, 1778699, 1849070, 1239722, 1235079, 1296271, 1577969, 1997629, 1872177, 2086782, 2119847, 2304399, 2177391, 1964869, 1777027, 2086273, 2464527, 2570839, 2277285, 2120603, 1665194, 1684952, 1753327, 1717333, 2131129, 2487537, 2571553, 3087188, 3117510, 2918653, 3396883, 3235809, 3050298, 2764878, 2602304, 2324310, 2279376, 2698713, 3041583]
4809C041583m73193j82596L00290j3462K4036j95428l3621j00434l88511J36741
4799B115405J83238l7180j59695l90999M2943k09040J06076J60367J53099N704
4789A969918l8850J4154N1650m104j90566L19968L35072J11213k59818k50151
4779B058486Q9175o27k41430o2771L85955M8400l30558K49859J95359O1316q2342
4768B370822l95858l8970O4643K07370O9630r7847j30416k77009N94696j13549
4758B253512j62595J43869L1618K80240j52810j12113J69746n9691M05280M1106
4748B838162l49974o28218K25332j41201M98087Q4499m39906K57892K62068j11457
4738B495284j55147K01923j46160j69020J86687o454J38454k6904J77167J63259
$$ y = [3041583, 2568390, 2385794, 2686084, 2672622, 2696658, 2501230, 2467609, 2367175, 1978664, 2115405, 2298643, 2261463, 2101768, 1710769, 1753712, 1544672, 1650748, 1811115, 1964214, 1969918, 1931068, 1945222, 1996872, 1992768, 1802202, 2122170, 2457242, 2568455, 2308637, 2058486, 2147661, 2147034, 1905604, 1842833, 2228788, 2277188, 1946630, 2196489, 2391848, 2453164, 2370822, 1974964, 1935994, 2000637, 2208007, 2277637, 2179790, 2049374, 1772365, 2367061, 2253512, 2090917, 2234786, 2266404, 2546644, 2393834, 2281721, 2451467, 2391776, 2797056, 2838162, 2488188, 1859970, 2085302, 1944101, 2442188, 2526687, 2086781, 2344673, 2606741, 2495284, 2340137, 2542060, 2395900, 2226880, 2413567, 2407113, 2545567, 2518663, 2695830, 2859089]
4728B859089j92135j43276O3786k52967J56848L54015P2630P3384K3713k20389
4718B794698k88069N9460k43441K50190j24022k0558J78428J31732O69342n6423
4708C351337l57904m65633j73560p3811p5727J43787o8182L70038J37728J26004
4698B914077l58517j19736N9898M29929J95908J1185n06790j64842M66602k54696
4688B673018k48240r5272M72416K58722k01917J7807j3666K05833K3139l39390
4678B752450l3573P7524K41321j41939K59426L7744m80155m02890p7765Q80019
4668C112162R1626m81805K31378L65302k90673j04069J40490L08568k95339j68882
4658B908758j96771j76323R3691L90203M4768k24097m8197K37450J48140N2687
$$ y = [2859089, 2666954, 2523678, 2587464, 2334497, 2491345, 2845360, 2917990, 2991374, 3015087, 2794698, 2506629, 2566089, 2322648, 2572838, 2448816, 2428258, 2606686, 2738418, 3407760, 3351337, 2993433, 2527800, 2354240, 2280429, 2204702, 2348489, 2280307, 2650345, 2788073, 2914077, 2555560, 2435824, 2495722, 2925651, 3121559, 3132744, 2625954, 2461112, 2927714, 2673018, 2424778, 2329506, 2801922, 3060644, 2858727, 2876534, 2862868, 3068701, 3091840, 2752450, 2718877, 2796401, 3037722, 2895783, 3155209, 3192953, 2712798, 2309908, 2232143, 3112162, 3203788, 2721983, 2953361, 3318663, 3027990, 2923921, 3064411, 3372979, 3077640, 2908758, 2711987, 2535664, 2629355, 3019558, 3064326, 2840229, 2792032, 3029482, 3177622, 3230309]
4648C230309K390J86232j50451j93050k8421p3365N4967O09661J16706m41484
4638C313494l70499m4731K93859p2928J45841L56146k27318j80868P2743j8356
4628C267383P8845k87177P71684n46976n52157K35049n1325K19869P3269J10616
4618C319080K30302L6060q1772j42648l71034L87829J71510o3908m0145j12188
4608C333086M02860r5893k25964K75069j39384m30694J94763K68406j71183M15918
4598C826984K31246m42133J16942j23609J35313o7575k15524L6305K14856O101
4588C718906k3760J22002K9986O8763n25837n889K12804L1065J84910j57070J52646
4577C808526L04375J93101q7574J6132K41289l07924l20273J41051L01619J9303
$$ y = [3230309, 3232699, 3418931, 3268480, 3075430, 3047009, 2973644, 3028611, 3638272, 3754978, 3313494, 2942995, 2898264, 3192123, 3119195, 3265036, 3621182, 3393864, 3212996, 3285739, 3267383, 3346228, 3059051, 3830735, 3283759, 2731602, 2966651, 2915326, 3135195, 3208464, 3319080, 3549382, 3585442, 3503670, 3361022, 2989988, 3377817, 3549327, 3485419, 3445274, 3333086, 3735946, 3640053, 3414089, 3689158, 3549774, 3119080, 3313843, 3582249, 3411066, 3826984, 4058230, 3616097, 3733039, 3609430, 3744743, 3677168, 3461644, 3497949, 3712805, 3718906, 3695146, 3817148, 3847134, 3915897, 3390060, 3384171, 3596975, 3628040, 3812950, 3655880, 3808526, 4112901, 4306002, 4218428, 4234560, 4475849, 4167925, 3847652, 3988703, 4290322, 4309625]
4567D309625j38428J45398M2642K65417n9013j65726K05349M4586R9347J01520
4557D850717P7633p32342Q9089M87636J51594m8165J82987R1430l43452L88095
4547E195222j48345o19254J48101J15875k23536j21465K49492j29562L44660Q17956
4537E629144q7631n08642L53234O6738k61580K20761l4422K39146q8331j10036
4527E418381J9174K76185K40398k76156J00190N2070j45059r5161L0730M02737
4517F023489J15707q6428k93946L367K42831K71467L93132j5279j75927K95298
4507F773711M875o79954j61630N02617k07933p02223K04604L90533O27262K45451
4497F997313O0863l9138R7296K00648m66447k99267j739K62908M14019l05026
$$ y = [4309625, 4171197, 4316595, 4359237, 4624654, 4565641, 4399915, 4605264, 4649850, 4749197, 4850717, 4928350, 4196008, 4285097, 4772733, 4924327, 4876162, 5059149, 5150579, 4807127, 5195222, 5046877, 4427623, 4575724, 4691599, 4468063, 4346598, 4596090, 4466528, 4811188, 5629144, 5541513, 5032871, 5386105, 5452843, 5191263, 5412024, 5377602, 5616748, 5528417, 5418381, 5437555, 5713740, 5954138, 5677982, 5778172, 5830242, 5685183, 5590022, 5620752, 6023489, 6139196, 6052768, 5758822, 5762189, 6005020, 6276487, 6669619, 6654340, 6478413, 6773711, 6778586, 6098632, 5937002, 6439619, 6231686, 5529463, 5734067, 6124600, 6751862, 6997313, 7058176, 7019038, 7116334, 7316982, 6850535, 6551268, 6549529, 6812437, 7226456, 6921430]
4487F921430M39319K16701m77125k27204K59490L67715J49891M4341j23585n6622
4477G514351K58278K00113m06587L2616q6539L98431j16002m0063r8972J57856
4467G813482J86063J62107L3636N1175J54698j57862K37556L07692J32269R5004
4457I015820j76654J90226J04112R7043j87993P9235N9068J72551L79311m7189
4447I685530L23494K73509l86741L99935K87903j95680K49287K45075L14433j71139
4437A1025606L38038j6513K32390J88133j22752J60810N307L83363K17358N08304
4427A2920044k5876m29412O22383N57046j9241R3839O613P7171j58645K32596
4417A3876518M52855j37457k18492J25400L45749q3165j7298L26842J98149o29022
$$ y = [6921430, 7360749, 7577450, 7100325, 6873121, 7132611, 7500326, 7650217, 7694558, 7570973, 7514351, 7772629, 7972742, 7566155, 7598771, 7512232, 7910663, 7794661, 7754598, 7655626, 7813482, 7999545, 8161652, 8195288, 8246463, 8401161, 8243299, 8480855, 8788547, 8920816, 9015820, 8839166, 9029392, 9133504, 9230547, 9042554, 9121789, 9180857, 9353408, 9732719, 9685530, 10009024, 10282533, 9895792, 10295727, 10583630, 10387950, 10637237, 10882312, 11196745, 11025606, 11363644, 11347131, 11579521, 11767654, 11644902, 11805712, 11811019, 12194382, 12411740, 12920044, 12894168, 12464756, 13087139, 13644185, 13624944, 13718783, 13725396, 13802567, 13643922, 13876518, 14329373, 14191916, 13973424, 14098824, 14444573, 14361408, 14344110, 14670952, 14869101, 14240079]
4407A4240079Q1324J23436n01767k15718M3540o3263l85110j77554k63486j40103
4397A2741378K68853k54722J27796j69499m01845L03603K07398l71759j47661
4388A2303542J03229k70509m57214J6354n6900m5214J26254N6473J82681l54024
4378A1604672k77239p2845L75693l9226j86199K39118m90953q2350j48139J9301
4368A0941833j80251J78737L15062m49638k88184J31801k92444K33164J95935
4359A0786015n6422j88995p7095k85315J38837J18531j19010L2163K45348K2452
4349A0616509R9925J6284l55472j47276R2244K71312l21035J45730L93569L18484
4339A1130274j03041l49269j18380J54799Q8173l25012J2486R7617k68933j01339
$$ y = [14240079, 14321403, 14444839, 13943072, 13727354, 13770894, 13707631, 13322521, 13144967, 12881481, 12741378, 13010231, 12755509, 12883305, 12713806, 12311961, 12615564, 12822962, 12451203, 12303542, 12406771, 12136262, 11679048, 11695402, 11638502, 11593288, 11719542, 11776015, 11958696, 11604672, 11327433, 11254588, 11630281, 11591055, 11404856, 11643974, 11153021, 11070671, 10922532, 10941833, 10761582, 10940319, 11255381, 10805743, 10517559, 10649360, 10356916, 10590080, 10786015, 10729593, 10540598, 10463503, 10178188, 10317025, 10435556, 10316546, 10348709, 10594057, 10616509, 10716434, 10732718, 10377246, 10229970, 10322214, 10593526, 10272491, 10418221, 10811790, 11130274, 11027233, 10677964, 10559584, 10714383, 10802556, 10477544, 10490030, 10587647, 10318714, 10217375]
4329A0217375j16806K46743J69655J85072j10234j8825J52248j14237k28914K41078
4319A0623155n7337o82j62056J52242L4207j58012M18481L8340R4716R6224m4864
4308A1034414k45279J95486J69976j40197r3160k27216J60374k13975L35740P8482
4298A1054645P7675j96826L27424M26067o13818J28493j30317J49869J92867k60753
4288A1155326J36103r1232N69476M4793J82102j57443k13492m4149k21449M87492
4278A1847527j9118j74505j34614P07028k32876Q9330O23339j32162L81990O7091
4268A3023030r0751N05615k96569j19565K47025O6386l11156K05956L06781n70065
4258A2966687q4724L75065k92274N6313J825n32590J11933l9545M52155J65316
$$ y = [10217375, 10100569, 10347312, 10516967, 10702039, 10591805, 10572980, 10725228, 10610991, 10382077, 10623155, 10565818, 10565136, 10403080, 10555322, 10589529, 10431517, 10849998, 10888338, 10983054, 11079278, 11034414, 10789135, 10984621, 11154597, 11014400, 10921240, 10694024, 10854398, 10640423, 10976163, 11054645, 11132320, 10935494, 11262918, 11688985, 11075167, 11203660, 11073343, 11223212, 11416079, 11155326, 11291429, 11200197, 11769673, 11814466, 11996568, 11839125, 11625633, 11581484, 11360035, 11847527, 11828409, 11653904, 11519290, 12226318, 11993442, 12082772, 12706111, 12573949, 12955939, 13023030, 12932279, 13437894, 13141325, 13021760, 13268785, 13335171, 13024015, 13229971, 13536752, 12966687, 12881963, 13257028, 12964754, 13021067, 13022892, 12490302, 12602235, 12562690, 13014845, 13180161]
4248A3180161K5677m15176o5862K04497n4060j7762J32977r3317k24029p1158
4238A2601948J68637K95801k29780L23832J56179J57026n1785j67084M3961k71291
4228A3027444K13554L41015J90819Q3028r5431K804K62527j18797j00524K79308
4218A4085747k35512r2248L24082q375J88047j55651Q5340K12924j78853p3929
4208A4151572J19036N95970J41868K3566j61531K83778k62360J87900K0220J96227
4198A5296246L42092J55863K05747L68583l85048j00140K54613K07696P48340
4189A7093992J09695N18883L72023O51980K42749P17680J215185O32035l87637
4180B1166585l25079r836o15258m27515j46503n16754r6090r6456m12445K8128
$$ y = [13180161, 13205838, 12790662, 12724800, 12929297, 12875237, 12857475, 12990452, 12897135, 12673106, 12601948, 12770585, 13066386, 12836606, 13160438, 13316617, 13473643, 13421858, 13254774, 13298735, 13027444, 13240998, 13582013, 13772832, 13855860, 13760429, 13763233, 14025760, 13906963, 13806439, 14085747, 13850235, 13757987, 14082069, 14073694, 14261741, 14106090, 14191430, 14404354, 14225501, 14151572, 14270608, 14866578, 15008446, 15032012, 14870481, 15154259, 14891899, 15079799, 15100019, 15296246, 15638338, 15794201, 15999948, 16368531, 15983483, 15883343, 16137956, 16345652, 17093992, 17203687, 17722570, 18094593, 18746573, 18989322, 19707002, 20922187, 21554222, 21166585, 20841506, 20831670, 20216412, 19788897, 19642394, 19125640, 19029550, 18933094, 18520649, 18548777]
4170A8548777m7443j50917J50558j84488N8927K47175m2182N5678r9840k7196
4160A8509049L01566k29632l74467j10168L88585k45909N2313L96334l2856Q820
4150A8663635J9452o3008k32543N55088M79689j78548k80209p8323k98166J61351
4140A8748418L75024O3895l08207j93659l9638J22365M03714K2698M2446J50046
4130A9387102M5930J8687J43898N54540J14888j15659M86309K03709J85036L34971
4120B1359411J41211k85758m88349k3851j84325L08884N3595M2642K61289o5466
4110B1119283M52217P4787J3395j75269l36913l33724l33235L29532m69339p3775
4100B0266959j22718j39833J58106k8336k77139L10352k64024n2774M80071k5024
$$ y = [18548777, 18501334, 18350417, 18500975, 18316487, 18375414, 18622589, 18580407, 18636085, 18536245, 18509049, 18810615, 18580983, 18206516, 18096348, 18484933, 18239024, 18291337, 18687671, 18654815, 18663635, 18683087, 18620079, 18387536, 18942624, 19422313, 19243765, 18963556, 18885233, 18587067, 18748418, 19123442, 19187337, 18879130, 18685471, 18645833, 18768198, 19171912, 19194610, 19237056, 19387102, 19433032, 19451719, 19595617, 20150157, 20265045, 20149386, 20635695, 20839404, 21024440, 21359411, 21500622, 21214864, 20726515, 20702664, 20518339, 20827223, 20880818, 20923460, 21184749, 21119283, 21571500, 21646287, 21659682, 21484413, 21147500, 20813776, 20480541, 20810073, 20340734, 20266959, 20144241, 20004408, 20162514, 20134178, 19857039, 20167391, 19903367, 19850593, 20330664, 20305640]
4090B0305640j22025k35513l41936K1952L53283L85036l3648l42673L16383J97252
4080B0503751p0595k51391m05039k65586k2340J89532r4637J73524j73840j44297
4070A9439082k42149j51633k3690N69744j88886L47125J96478l65097L53292m23839
4060A9510427p8709J82467L05355K4229J14167L9176m3581k63151k10494k0275
4050A9559611J79057K10748j5895k80129J64018P7889N63828k07327l82948k12002
4040A9656850K27755O124m06550k43307l69195K27546M02170j42666J67099m9510
4030A9476316J30324J15876j15940R3083j74862K45399M39480j61788n49396n9406
4020A9439086L29380j57938m23467j18085M65399J86399l41636j69462L15133
$$ y = [20305640, 20183615, 19948102, 19606166, 19628118, 19981401, 20366437, 20332789, 19990116, 20306499, 20503751, 20433156, 20181765, 19776726, 19511140, 19488800, 19678332, 19583695, 19757219, 19583379, 19439082, 19196933, 19045300, 19021610, 19591354, 19402468, 19749593, 19946071, 19580974, 19934266, 19510427, 19431718, 19614185, 19919540, 19943769, 20057936, 20097112, 20053531, 19790380, 19579886, 19559611, 19738668, 19949416, 19933521, 19653392, 19817410, 19895299, 20459127, 20251800, 19868852, 19656850, 19884605, 19890729, 19484179, 19240872, 18871677, 19099223, 19501393, 19358727, 19525826, 19476316, 19606640, 19722516, 19606576, 19699659, 19524797, 19770196, 20209676, 20047888, 19498492, 19439086, 19768466, 19610528, 19187061, 19068976, 19534375, 19720774, 19379138, 19209676, 19524809]
4011A9524809l31369L46595o6994J2827l9630o4946m7172R6846L1273l9649j07294
4000A9315296M69598L57282O5652L71974j28812k54312j18660Q7107k04013J78826
3990B0139938m0562k1721l83575m28909K67558O2644o9111o2769K80897K86530
3980B0030920L16733N76674K78633J4438k36423k18048l85860j28911n77001L51269
3970B0022424M31643M82583R576L9666m98852m39122J77157k25984J9382P8379
3960B0096852k9624k62193m72581m19108M4950J86016n40114K296O7869k73578
3950A8400785J24679N9741j40473n2953J02927l38460L0512L28294m77358k7283
3940A8010411L39093k9442l72213J45153M39665l21498J5713j94637K03086j04785
$$ y = [19524809, 19193440, 19540035, 19473041, 19485868, 19446238, 19381292, 19334120, 19430966, 19462239, 19422590, 19315296, 19784894, 20142176, 20207828, 20579802, 20450990, 20196678, 20078018, 20165125, 19961112, 20139938, 20099376, 20077655, 19694080, 19265171, 19532729, 19595373, 19526262, 19463493, 19744390, 20030920, 20347653, 20924327, 21202960, 21217398, 20980975, 20762927, 20377067, 20248156, 19671155, 20022424, 20454067, 20936650, 20946226, 20985892, 20487040, 20047918, 20225075, 19999091, 20018473, 20096852, 20067228, 19805035, 19332454, 18913346, 18958296, 19144312, 18604198, 18606494, 18674363, 18400785, 18525464, 18585205, 18444732, 18391779, 18494706, 18156246, 18186758, 18515052, 18037694, 18010411, 18349504, 18320062, 17947849, 18093002, 18532667, 18211169, 18226882, 18032245, 18235331, 18130546]
3930A8130546J42663N3264q030j18818l20969m0062K63730j73674l30721L02900
3920A7900829k22132K15631m21466k29031j24940J67816k68764K489j5295j54912
3910A6850225L0391J58785k02467k62466M03407J67096k3430l10518n38936M6015
3900A6318102l5957k27885l16378J91279K97823J19859K59361Q1487q8571R4608
3890A6693728O9225J61780m18778m3328K39574m88803n2379J28479L64455o7642
3880A6586311n27499k57865k14844K14734N17753l99885l10965J71636j21866
3871A5657510R2734p6647K10338j37479k74524o9492K49687J34048m96383q4885
3861A5204907K79968K33528q3188J14601m63366J48222k30609l42904J07294K75003
$$ y = [18130546, 18273209, 18326473, 18318443, 18199625, 17878656, 17838594, 18102324, 17928650, 17597929, 17900829, 17678697, 17894328, 17472862, 17243831, 17118891, 17286707, 17017943, 17020432, 17005137, 16850225, 16880616, 17039401, 16836934, 16574468, 16977875, 17144971, 17121541, 16811023, 16272087, 16318102, 16282145, 16054260, 15737882, 15929161, 16226984, 16346843, 16606204, 16687691, 16599120, 16693728, 16762953, 16924733, 16505955, 16462627, 16702201, 16213398, 16161019, 16289498, 16653953, 16586311, 16058812, 15800947, 15586103, 15800837, 16318590, 15918705, 15607740, 15779376, 15657510, 15750244, 15673597, 15883935, 15746456, 15471932, 15402440, 15652127, 15786175, 15289792, 15204907, 15484875, 15718403, 15635215, 15749816, 15286450, 15434672, 15204063, 14861159, 14968453, 15243456]
3851A5243456N80092j43103J02207K2765o4390L40826J14915j26242M7777P1551
3841A6189854j72677O78876j90997L7826Q0483q0418l14684l30929k94946K22458
3831A5824846J53174m25817j79589m46446N8503l13526J10392L87996Q4900m1753
3821A5212680m31251k72434N17450L48160l62069M43535l38352j78760J94702
3812A5133661Q8471l35008l10468q9671J95208R4430j70245m07798K71906K44978
3802A4715464q4089l46351k01359K7071p4610j36215J37382J08862q2266j33030
3792A3930859L15297M64680k67460l91015J44698K2343N0086k70796R1527N6009
3782A4146228k67843K80195N3317L303n38262J34219K55772M90828J70207J44661
$$ y = [15243456, 15823548, 15680445, 15782652, 15805417, 15741027, 16081853, 16196768, 16070526, 16118303, 16189854, 16017177, 16696053, 16505056, 16542882, 16623365, 16542947, 16228263, 15897334, 15602388, 15824846, 15978020, 15552203, 15372614, 14926168, 14984671, 14671145, 14781537, 15169533, 15254433, 15212680, 14781429, 14508995, 15026445, 15374605, 15012536, 15456071, 15117719, 14938959, 15133661, 15222132, 14887124, 14576656, 14486985, 14682193, 14776623, 14606378, 14198580, 14470486, 14715464, 14631375, 14285024, 14083665, 14110736, 14036126, 13899911, 14037293, 14146155, 14063889, 13930859, 14246156, 14710836, 14443376, 14052361, 14197059, 14219402, 14269488, 13998692, 14090219, 14146228, 13878385, 14158580, 14211897, 14215200, 13676938, 13811157, 14066929, 14557757, 14727964, 14872625]
3772A4872625m14784k36918o736k21064k58203L27897J74017L6790r5008k52857
3762A3925759J93087j32719M30108L1908k2391L29378k27544o0092J60705L96514
3752A5024713L56360K83712J67551K74457m376J40979J05850l67953k88204K15659
3742A5908748j76045n06753j95913j99263j01911k54684k9323n1328l24050j22884
3732A3946594K43972Q1851K49916K85744M6598n38430m25402O681K10833J52732
3722A4261089l21471K22596k21723J88616P3521L7193L91602Q8866o21937M2480
3712A4140832k16051j82873j3523o7431K47356L4192j56021K41918K20136l60104
3702A3888431j89263M094L38666k63729j90739J67809q2117J96866r7994L85191
$$ y = [14872625, 14457841, 14220923, 14214187, 13993123, 13734920, 14062817, 14236834, 14273624, 14178616, 13925759, 14118846, 13986127, 14416235, 14448143, 14425752, 14755130, 14527586, 14467494, 14628199, 15024713, 15381073, 15664785, 15832336, 16106793, 16102417, 16243396, 16349246, 15981293, 15693089, 15908748, 15732703, 15225950, 15030037, 14830774, 14728863, 14474179, 14444856, 14393528, 14069478, 13946594, 14190566, 14272417, 14522333, 14808077, 14854675, 14316245, 13890843, 13897524, 14108357, 14261089, 13939618, 14162214, 13940491, 14129107, 14202628, 14239821, 14631423, 14720289, 14098352, 14140832, 13924781, 13741908, 13728385, 13660954, 13908310, 13942502, 13786481, 14028399, 14248535, 13888431, 13699168, 13703262, 14041928, 13778199, 13587460, 13755269, 13673152, 13870018, 13772024, 14157215]
3692A4157215j2510m71648Q0041L40977J79319K8724m19534k26182L93391M3068
3682A4092861J01806L06061o6137l16493Q8133J73603k20746k61617J33456n1058
3672A3979869j3644l65694j3156O91788M5190j90234O8462J45412m7833k39730
3662A4060430m83386j5985L49796K28100J77566q1892K82746r683o3796o9893
3652A4374003q1833j23296M7522l3844k7146O4320j02662J42743J70713r9494
3642A4331026Q9934J22167J96869l60154m33171N82193M2562k76726j30968j01725
3632A4062007Q3619j6955k5562O7272J36728L25756K23592q33673P5068K21744
3622A4319596L0078M4196k71492K40215J55458j16658l13078j87360n0948J0614
$$ y = [14157215, 14144705, 13673057, 13753098, 14094075, 14273394, 14302118, 13882584, 13656402, 14049793, 14092861, 14194667, 14500728, 14434591, 14118098, 14206231, 14379834, 14159088, 13897471, 14030927, 13979869, 13966225, 13600531, 13587375, 14279163, 14324353, 14134119, 14202581, 14347993, 14300160, 14060430, 13577044, 13561059, 13910855, 14138955, 14316521, 14234629, 14517375, 14507692, 14443896, 14374003, 14292170, 14168874, 14216396, 14182552, 14155406, 14219726, 14117064, 14259807, 14430520, 14331026, 14420960, 14543127, 14739996, 14379842, 13946671, 14528864, 14571426, 14294700, 14163732, 14062007, 14145626, 14128671, 14103109, 14170381, 14307109, 14632865, 14856457, 14022784, 14097852, 14319596, 14349674, 14393870, 14122378, 14362593, 14518051, 14401393, 14088315, 13900955, 13850007, 13860621]
3612A3860621l85614N39233K58709k7068q6139n72471J8959J1201M90998k3983
3602A4084446M87373K5401j92694J60543O55j65927j87935j16326J87590L3289
3592A4316415n8856j69079J03045j057R7953J26487j88637j76644Q4619N68447
3582A4702693k28290j57650j20755p4527J74016j72029L1258l8215J01430k0368
3572A4197563k0398l77143N43172j81953n0222l1385J61049N8932m16061N02408
3562A4385962K37422J37369K8723p666n63877j6931L30265j2035o5210l5885j63393
3551A4254744L06969m688L5485K48732q9165l98888k11568L48252Q0941k24843
3541A4345971L54776m01339L07964K73608j62708l60936l23801K04722K72781
$$ y = [13860621, 13475007, 14014240, 14272949, 14245881, 14159742, 13587271, 13606230, 13617431, 14108429, 14084446, 14571819, 14597220, 14404526, 14565069, 14565724, 14399797, 14211862, 14095536, 14283126, 14316415, 14257559, 14088480, 14191525, 14190468, 14288421, 14414908, 14226271, 14049627, 14134246, 14702693, 14474403, 14316753, 14195998, 14121471, 14295487, 14123458, 14154716, 14116501, 14217931, 14197563, 14177165, 13800022, 14343194, 14161241, 14111019, 14079634, 14240683, 14299615, 13883554, 14385962, 14623384, 14760753, 14789476, 14781810, 14217933, 14201002, 14531267, 14519232, 14454022, 14418137, 14254744, 14561713, 14557025, 14592510, 14841242, 14752077, 14353189, 14141621, 14489873, 14570814, 14345971, 14700747, 14299408, 14607372, 14880980, 14718272, 14357336, 14033535, 14238257, 14511038]
3532A4511038L39892j11405m96169J0988j17775R9883J11052j47788k94458M28523
3522A4333781M93498l98363n56477M60087N00455j33873M8540J72043o3967k61838
3512A4593886k31708M4764M17311K89112L04599L63512n4909J06774L60458K69585
3502A6463384p4534j88196o01406j00830l2990k20566p2488l50101j32832r7621
3492A4591820L85302L16160r5608l62176K97645j73680j70542j36676j54576l05737
3482A4191932K57375K63309m19004N4784K15918J28051Q784k12928l62529K20417
3472A4346109l40184j741Q4074L9429N35973r736j1245r7967L3689L68174o25470
3461A4321105k81897J68713L01267J71863j30860j11615n8404k01993L77594q6539
$$ y = [14511038, 14850930, 14739525, 14243356, 14254344, 14136569, 14236452, 14347504, 14199716, 13905258, 14333781, 14827279, 14428916, 13872439, 14332526, 14832981, 14699108, 14747648, 14919691, 14855724, 14593886, 14362178, 14406942, 14824253, 15113365, 15417964, 15781476, 15726567, 15833341, 16193799, 16463384, 16388850, 16200654, 15599248, 15498418, 15465428, 15244862, 15172374, 14822273, 14689441, 14591820, 14977122, 15293282, 15197674, 14835498, 15133143, 14959463, 14788921, 14652245, 14497669, 14191932, 14449307, 14712616, 14293612, 14348396, 14564314, 14692365, 14701149, 14488221, 14125692, 14346109, 14005925, 14004184, 14088258, 14127687, 14663660, 14653924, 14642679, 14544712, 14578401, 14946575, 14321105, 14039208, 14207921, 14509188, 14681051, 14550191, 14438576, 14380172, 14178179, 14555773, 14469234]
3451A4469234p6083K50555K31290K18597N5043P2584m0013q4134j32918K51420
3441A5215575n06986m56229Q6961M28179n6691J74831j44737j14916J63744O1977
3431A4851708k91234K56558J66864K37633J62521K70995K57073j31016J61579
3422A5942681n52526l24822j47572k87686K94762K48661p0806L23501M2628N9551
3412A5528372K81116J36231j34178n53279K91904M96579l97110K66885K53755
3403A6170275j9527L13605p8779o9117L18802M82649j49681j5791M41406j99671
3393A7194171k60521K59192p0697N7285M3332q4610L80754J71702p8679m8522
3383A7563407K55067j57518j05750M54636J32473j67220p9217L10228K71510k27367
$$ y = [14469234, 14393151, 14643706, 14874996, 15093593, 15148636, 15221220, 15181207, 15097073, 14964155, 15215575, 14708589, 14252360, 14339321, 14767500, 14710809, 14885640, 14740903, 14625987, 14789731, 14851708, 14560474, 14817032, 14983896, 15221529, 15384050, 15655045, 15912118, 15781102, 15942681, 15390155, 15065333, 14917761, 14630075, 14924837, 15173498, 15102692, 15426193, 15468821, 15528372, 15809488, 15945719, 15811541, 15258262, 15550166, 16046745, 15649635, 15916520, 16170275, 16150748, 16464353, 16385574, 16316457, 16635259, 17117908, 16968227, 16952436, 17393842, 17194171, 16933650, 17192842, 17122145, 17179430, 17222762, 17138152, 17518906, 17690608, 17611929, 17563407, 17818474, 17660956, 17555206, 18009842, 18142315, 17975095, 17895878, 18206106, 18477616, 18250249]
3373A8250249L04282K29679k01454L30124l2188k11067L03889k711j54299P17361
3363A9533865k21629p1163R3985M39674r5289j19428o4625k03647J9109J87725
3353A9498577L30800J52661J44050L55267k69661N16971k19040m26189L24676
3344B0408112K04225K08908o826l0190J08747N92957L98115N0978J6496L11839
3334B2263361L33813M93799L37262K39531k38756j70568J59665m80829M7129K93918
3324B3278325j64215N61259K29269m04302j76850M52889j07636q4158L48769O16990
3314B4550340j17721K81497j51875N06923O4134k8792L07089J79018J44093P64040
3304B6498746L17392K82807N18017K01462P31487O86302L66735L71436j20338
$$ y = [18250249, 18554531, 18784210, 18582756, 18912880, 18880692, 18669625, 18973514, 18970803, 18816504, 19533865, 19312236, 19241073, 19335058, 19774732, 19679443, 19560015, 19495390, 19291743, 19310852, 19498577, 19829377, 19982038, 20126088, 20481355, 20211694, 20728665, 20509625, 20083436, 20408112, 20612337, 20821245, 20814419, 20784229, 20892976, 21485933, 21884048, 21935026, 21951522, 22263361, 22597174, 23090973, 23428235, 23667766, 23429010, 23258442, 23418107, 22937278, 22984407, 23278325, 23114110, 23675369, 23904638, 23500336, 23323486, 23776375, 23668739, 23584581, 23933350, 24550340, 24432619, 24714116, 24562241, 25069164, 25133298, 25104506, 25411595, 25590613, 25734706, 26498746, 26816138, 27098945, 27616962, 27818424, 28549911, 29236213, 29602948, 29974384, 29854046]
3295B9854046n30765j45966M0175l68050k8908k32810K94015N11463J93899m8436
3285B9538663Q17953O64546N1058N09088L03369q8019O4487p5808M87875k13903
3275C2059309k62427N07170L00221N74585K13135L11119M29662R27506R67152
3266C6027432P45178L77040J69346L42242N19493J058204J345506O00086Q95153
3257D2079680J472363J226502Q12164K157775J681305K132583K050290J833398
3249E5446060J837425J524509K13196j003765j328927j316125k089651k057459
3241E1225263k064014k552846j822892j249890j528819j072066j241138q09501
3233C8884097o89828q21459o16589k86979n86568l71731m93487n89567m66183
$$ y = [29854046, 29323281, 29177315, 29217490, 28849440, 28820532, 28587722, 28881737, 29393200, 29587099, 29538663, 30356616, 31021162, 31072220, 31581308, 31884677, 31796658, 31861145, 31785337, 32273212, 32059309, 31796882, 32304052, 32604273, 33178858, 33391993, 33703112, 34132774, 35060280, 36027432, 36772610, 37149650, 37318996, 37661238, 38180731, 39238935, 40584441, 41184527, 42079680, 43552043, 44778545, 45590709, 47748484, 49429789, 51562372, 53612662, 55446060, 57283485, 58807994, 59021190, 58017425, 56688498, 55372373, 53282722, 51225263, 49161249, 46608403, 44785511, 43535621, 42006802, 40934736, 39693598, 38884097, 38194269, 37372810, 36756221, 36469242, 35882674, 35510943, 35017456, 34427889, 33961706]
3224C3961706o92184N4165m92188l05812j26317L44086l20445p16141k15857l15569
3214C1175444m13901j93134j35845j62009R3731L91209q73441n76541J96789k94803
3204B9207499j96769o90149q6771m63128l6850P10m21048k81112n67724o1162
3194B6403496P5004k3413L6564l51243Q0424k9349l16375k6445k8957N6531j61575
3183B5714662k06697l80173n10227k83224L92166m42493j12501k49542P9806k14211
3173B3787566j94792j2170R7275k73284j84896j74378l20244j24833j82685J44453
3163B2562012j57634J46515k75865j42336J5861l54681K65768N44951n30615k17643
3153B1856333k8059J56994Q6827m4820l1618j90897k84890n32895K92815R5782
$$ y = [33961706, 33269522, 33323687, 32831499, 32525687, 32399370, 32743456, 32423011, 31706870, 31491013, 31175444, 30761543, 30568409, 30432564, 30270555, 30364286, 30755495, 29882054, 29305513, 29502302, 29207499, 29010730, 28320581, 28233810, 27770682, 27733832, 27734542, 27313494, 27032382, 26464658, 26403496, 26478500, 26455087, 26491651, 26140408, 26220832, 26191483, 25875108, 25848663, 25819706, 25876237, 25714662, 25507965, 25127792, 24617565, 24334341, 24726507, 24284014, 24171513, 23921971, 24001777, 23787566, 23592774, 23580604, 23677879, 23404595, 23219699, 23045321, 22725077, 22600244, 22417559, 22562012, 22404378, 22550893, 22275028, 22132692, 22148553, 21793872, 22059640, 22604591, 22073976, 21856333, 21828274, 21985268, 22072095, 22027275, 21995657, 21804760, 21519870, 20986975, 21279790, 21375572]
3143B1375572j59914l3954J72791l41144q9169J14268M0983l34010k08721O0853
3133B0597555j9764K69989j22611K7840m76529J75707K0798l66065M3745m565
3123B0146100m0306l9885L4866j83597l2089J37788J58887l72506k44156N1097
3113A9616199M8509l4258j47753l75447L19525K04728j14594P6825l34908O7938
3103A9326764J10272r6344j78709j33435K8187j56883J83605R1739j95807L02
3093A8979691k77533k52878R4317J82M4312p1838n88113l0462m9417k9223k93145
3082A7525893J57218j44612J87630q2194k48806K64761J72581j36495m70256l9649
3072A7186071l722j3922Q8008J51506M1415k09295m498p92445J68783K06317J01307
$$ y = [21375572, 21215658, 21181704, 21354495, 21013351, 20924182, 21038450, 21079433, 20745423, 20536702, 20597555, 20577791, 20847780, 20725169, 20753009, 20276480, 20452187, 20472985, 20106920, 20150665, 20146100, 20105794, 20065909, 20100775, 19917178, 19885089, 20022877, 20181764, 19809258, 19565102, 19616199, 19664708, 19630450, 19482697, 19107250, 19426775, 19631503, 19516909, 19593734, 19258826, 19326764, 19437036, 19340692, 19161983, 19028548, 19056735, 18899852, 19083457, 19175196, 18979389, 18979691, 18702158, 18449280, 18543597, 18543779, 18588091, 18516253, 17928140, 17897678, 17848261, 17819038, 17525893, 17683111, 17538499, 17726129, 17643935, 17395129, 17659890, 17832471, 17695976, 17225720, 17186071, 17182349, 17168427, 17256435, 17407941, 17449356, 17240061, 17235563, 16443118, 16611901, 16818218, 16919525]
3061A6919525M41720l09723j86312K9230k81520m21786j8155N592J87016m5757
3051A6319830J46687K0862L6497j59406K19710j65624J84366L0702j79291P6510
3041A6530843k91107m45567K05221K1705K3898l01495Q7110K72579L6575l25115
3031A5814647K45808k6006k02126K75120l30828Q4888n4883L44739l00520K30160
3021A6080999k9500l70013L05703Q3540r9632O6138M48946M8694m38329n0785
3011A6045761j69087j34610L47048k4004J34337Q0219p2217m74343R2423j59153
3001A5666374N2150L93974K69914K12475M1942M87731m25555o632j78966k4505
2991A6488902K68519p5686Q7430P5590j65381r435j46800j3097K31233J89373
$$ y = [16919525, 17361245, 17051522, 16865210, 16894440, 16612920, 16191134, 16172979, 16178571, 16365587, 16319830, 16466517, 16487379, 16523876, 16364470, 16584180, 16418556, 16602922, 16633624, 16454333, 16530843, 16239736, 15794169, 15999390, 16021095, 16044993, 15743498, 15830608, 16103187, 16139762, 15814647, 16060455, 16034449, 15832323, 16107443, 15776615, 15861503, 15806620, 16151359, 15850839, 16080999, 16051499, 15681486, 15987189, 16070729, 15971097, 16037235, 16486181, 16534875, 16096546, 16045761, 15876674, 15742064, 16089112, 16065108, 16199445, 16279664, 16207447, 15733104, 15825527, 15666374, 15718524, 16112498, 16382412, 16594887, 16636829, 17124560, 16699005, 16692373, 16513407, 16488902, 16757421, 16681735, 16769165, 16844755, 16679374, 16669939, 16523139, 16510042, 16741275, 16930648]
2981A6930648J45031J41752J43149L0135K21756L09997J2130K87502j67154l76051
2971A7678895J92487K08207L7708J50314M01868j63599K00464J53566Q846l2102
2961A8836654l64345K30314M03036J12896P7408j92371L97942L38L71136J7025
2951A9890033j52006M66271J71841K62649K98291N06246k08056J34314L7848j01576
2941B1305855L92308K24110M10774l11191M0088K64907O36927J71945M51380L0234
2931B3617337l23639K63612J54999J82472K85252M27434J6550J07667j26835O68674
2921B5273523L93003K0834K69101N00384J47110L90676K81082M47110P04126M28956
2911B8855905M65289N20830M46583L82566L84104N10066Q0873k56879j19124j31912
$$ y = [16930648, 17075679, 17217431, 17360580, 17390715, 17612471, 17922468, 17934598, 18222100, 18054946, 17678895, 17871382, 18079589, 18117297, 18267611, 18669479, 18505880, 18706344, 18859910, 18868756, 18836654, 18472309, 18702623, 19105659, 19218555, 19295963, 19103592, 19501534, 19501872, 19873008, 19890033, 19738027, 20204298, 20376139, 20638788, 20937079, 21443325, 21235269, 21369583, 21407431, 21305855, 21698163, 21922273, 22333047, 22021856, 22061944, 22326851, 22963778, 23135723, 23587103, 23617337, 23293698, 23557310, 23712309, 23894781, 24180033, 24607467, 24624017, 24731684, 24604849, 25273523, 25666526, 25687360, 25956461, 26456845, 26603955, 26994631, 27275713, 27722823, 28426949, 28855905, 29321194, 29842024, 30288607, 30671173, 31055277, 31565343, 31646216, 31389337, 31270213, 31138301]
2901C1138301m09669m62655n01522k72527L16480P9737q2973n1862J23956O34119
2891C0511385M48249M4935m10440L26256N11901L38965N5149L84689M66371l5705
2881C2641755k32517L36312M41176j80085j58695J87688j16262Q3420l56349k23498
2871C2422945n5242n42234N52620j93591K13115q4202L56471l55651n68698L0877
2861C1776410L14707j58656p11883J9823J33395m36105m83971j14827K23734m56672
2851C0105955j74133n65990j70175q0434n56843R749o49592j75347J97868N78609
2841B8519667k7519m33457k77745o85345m59484k02345P1610m1024l83170k83794
2831B5797394k55450j68791m61134N4402p8851m34897m95257N18586m55969m91083
$$ y = [31138301, 30728632, 30265977, 29764455, 29491928, 29808408, 29888145, 29805172, 29753310, 29877266, 30511385, 30959634, 31004569, 30594129, 30920385, 31432286, 31771251, 31826400, 32211089, 32677460, 32641755, 32409238, 32745550, 33186726, 33006641, 32847946, 33035634, 32919372, 33002792, 32646443, 32422945, 32367703, 31825469, 32378089, 32184498, 32397613, 32313411, 32669882, 32314231, 31745533, 31776410, 32091117, 31932461, 31220578, 31240401, 31373796, 30937691, 30453720, 30338893, 30562627, 30105955, 29931822, 29365832, 29195657, 29115223, 28558380, 28568129, 27918537, 27743190, 27941058, 28519667, 28492148, 28058691, 27780946, 27095601, 26636117, 26433772, 26505382, 26464358, 26081188, 25797394, 25541944, 25373153, 24912019, 24966421, 24887570, 24452673, 23957416, 24476002, 24020033, 23528950]
2821B3528950j7073N6872o7959j83719l43009k73144l74130j55215k5062m53047
2811B1693464L83038N43242m60096m91656m18609j73660R3541l71762L9197q7343
2801B0749356l2950m69696j50484j28441O318j24522J36506J06739n48245j4945
2791A9529636j96269R5276k52693l0355L17275k59830m51919m63849K29731m39038
2781A8077965J2070P7012K69553j89705j83838k74193l09994k18448P6604K82192
2771A7619218n09818R8116K06340p0906l27530R907K24770m57554m24547k49760
2761A6118236K7643M40919k91822k77354M6104O0799K02274k15348j61784j05686
2751A5843981m05654K2077k57474K36803j35410J39333k35899k06492n51223n64652
$$ y = [23528950, 23511877, 23568749, 23500790, 23317071, 22974062, 22700918, 22326788, 22171573, 22146511, 21693464, 22076502, 22619744, 22159648, 21667992, 21249383, 21075723, 21169264, 20797502, 20836699, 20749356, 20716406, 20246710, 20096226, 19967785, 19974103, 19849581, 19986087, 20092826, 19544581, 19529636, 19333367, 19428643, 19175950, 19145595, 19462870, 19203040, 18751121, 18287272, 18517003, 18077965, 18090035, 18167047, 18436600, 18246895, 18063057, 17788864, 17478870, 17260422, 17337026, 17619218, 17109400, 17207516, 17413856, 17342950, 17015420, 17025327, 17250097, 16792543, 16367996, 16118236, 16145879, 16586798, 16294976, 16017622, 16063726, 16124525, 16326799, 16111451, 15949667, 15843981, 15438327, 15460404, 15202930, 15439733, 15304323, 15443656, 15207757, 15001265, 14450042, 13885390]
2741A3885390L27411M54371j6942m68372J31267N6378m15210j46004j07461j50685
2731A3550143M36560J73265J4279q03995j13252J84853j03965j47808K73535l784
2721A3459831k24054n99810J91728K05202K15061m30328p52923K26339K24772
2712A2515818J50487k09974k57726J3121P743K8929m23615j46703M56744j4365
2702A2120459n9893k30534j30084j16372L04292Q8672j37210j88496j17730k41234
2692A1291870m4325K42635L31j01759K46673j3083k80894M5230j60993J6394n42464
2681A0699615K28568K45935m98265N02832Q6474p5851j20554k55406L23594r4022
2671A1042920K01195k30669o24033k6614p9760L4877l57412m7369Q8492r3459
$$ y = [13885390, 14212801, 14667172, 14650230, 14181858, 14313125, 14369503, 13954293, 13808289, 13700828, 13550143, 13986703, 14159968, 14174247, 13370252, 13257000, 13441853, 13337888, 13190080, 13463615, 13459831, 13235777, 12635967, 12827695, 13032897, 13247958, 12817630, 12064707, 12291046, 12515818, 12666305, 12456331, 12198605, 12211726, 12219469, 12248398, 11824783, 11678080, 12134824, 12120459, 12060566, 11830032, 11699948, 11583576, 11887868, 11976540, 11839330, 11650834, 11533104, 11291870, 11247545, 11490180, 11490511, 11388752, 11635425, 11622342, 11341448, 11386678, 11225685, 11242079, 10699615, 10928183, 11174118, 10675853, 11178685, 11265159, 11189308, 11068754, 10813348, 11136942, 11042920, 11244115, 11013446, 10389413, 10362799, 10283039, 10317916, 9960504, 9913135, 10001627, 9908168]
2661I908168K62709k8459M71169L01940l00985j86035J5880K07897j66315l33597
2651A0152372l89721J33537K64170M2349n37477J61729k68108K62064K19462Q1126
2641A0121503k31361k58406N0847p9047p6171J29969k38366k55771P8184K61992
2631I503373K11764N1093o2593j60165q2057j56603K76774j72010K72058k09291
2621I472343m71970L9416J63701K06224k61394n6390j76615L27490j40299n7137
2611I045369J37100l37833O6227L4374J14343n7977k17257j6183K30813k14638
2601H784338j21201Q1211K19165j42612R3212j71687L02249r1771n479j47451
2591H799974k61592J61162k20921k23119j93969K26595r5943P8018P08067p6741
$$ y = [9908168, 10170877, 10142418, 10613587, 10915527, 10614542, 10428507, 10444387, 10652284, 10485969, 10152372, 9762651, 9896188, 10160358, 10202707, 9665230, 9826959, 9558851, 9820915, 10040377, 10121503, 9890142, 9631736, 9682583, 9603536, 9527365, 9657334, 9418968, 9163197, 9241381, 9503373, 9715137, 9766230, 9703637, 9543472, 9461415, 9304812, 9581586, 9409576, 9681634, 9472343, 9000373, 9039789, 9203490, 9409714, 9148320, 9091930, 8915315, 9242805, 9102506, 9045369, 9182469, 8844636, 8910863, 8945237, 9059580, 9001603, 8784346, 8768163, 8998976, 8784338, 8663137, 8744348, 8963513, 8820901, 8914113, 8742426, 9044675, 8952904, 8947425, 8799974, 8538382, 8699544, 8478623, 8255504, 8061535, 8288130, 8192187, 8270205, 8978272, 8901531]
2581H901531m37067K86388L7853j25967k54301K65525k60345n20555K91094J63500
2571H347656j46283J89851k07419J99675L158k75401J4349k8448p995p43713K53112
2560G598542o6342K8278j16234j56003K50330k11217L4465j86481j74501l22037
2550F678800j82937J28672M30409J80346j21161q2832o7586r8289j87877j92056
2540F485489j53295O0238k54495J87538J23765P3233k60309k4403m96187j30128
2530E611446j54547L50526L61237j21138J35230r6549k3545l94836j62006O4585
2520E570403K27253K44990n74350K59659m1286k10729j03042m71849j71169R7218
2510D827098J49698l0005k32195J12364r6743j00062j22087o7120J63295j34610
$$ y = [8901531, 8464464, 8750852, 8788705, 8662738, 8408437, 8673962, 8413617, 7893062, 8184156, 8347656, 8201373, 8391224, 8183805, 8383480, 8386638, 8111237, 8125586, 8097138, 8089143, 7345430, 7598542, 7532200, 7560478, 7444244, 7288241, 7538571, 7327354, 7361819, 7175338, 7000837, 6678800, 6495863, 6624535, 7054944, 7235290, 7114129, 7031297, 6963711, 6865422, 6677545, 6485489, 6332194, 6392432, 6137937, 6325475, 6449240, 6522473, 6262164, 6237761, 5741574, 5611446, 5456899, 5807425, 6168662, 6047524, 6182754, 6086205, 6062660, 5667824, 5505818, 5570403, 5797656, 6042646, 5468296, 5727955, 5686669, 5475940, 5372898, 4901049, 4729880, 4827098, 4976796, 4946791, 4714596, 4826960, 4730217, 4630155, 4508068, 4440948, 4604243, 4469633]
2500D469633K11652m4944k89Q4285K61176j92989l47023J05392N22503k72624
2490D796772L13846j18100l56449j89170k79298K9629k2329k70663q3990K50633
2480D070881J78886p3905M45311q3995n67593j19518K96239O603k46036m4299
2470C862574K01230o038p5861J07670P4834j20077L856k81332m38567M99331M33185
2459D260805m610j99862L41903m45333o34118J77500J29485l9655L28387k6532
2449C887970J92290P250p97654k50044K3237N18479j62440K71689J6353j53163
2439C553967j79634J96229M3840k36882N2512m79883K53718K8146k85161K20330
2429C167182J22124K4906J3037r766J30393m54488n20513M29472M34861L36266
$$ y = [4469633, 4681285, 4636341, 4636052, 4720337, 4981513, 4788524, 4441501, 4546893, 5069396, 4796772, 5110618, 4992518, 4636069, 4446899, 4167601, 4197230, 4174901, 3904238, 3820248, 4070881, 4249767, 4175862, 4621173, 4537178, 3969585, 3850067, 4146306, 4152909, 3906873, 3862574, 4063804, 4057766, 3981905, 4089575, 4164409, 4044332, 4048188, 3766856, 3328289, 3827620, 4260805, 4256195, 4056333, 4398236, 3952903, 3318785, 3496285, 3625770, 3586115, 3914502, 3887970, 4080260, 4087510, 3289856, 3039812, 3063049, 3581528, 3419088, 3690777, 3707130, 3553967, 3374333, 3570562, 3614402, 3377520, 3430032, 2950149, 3203867, 3232013, 2946852, 3167182, 3289306, 3314212, 3327249, 3317483, 3447876, 2993388, 2472875, 2902347, 3337208, 3673474]
2419C673474k02156r688k55530l21187K39575j82782j10827l2202l2128o8760
2409B697789J26147m4140J49570l47740J85556j43349m0327L6565L9554K29133
2399B888758R2514J00413k22141j0110K5711p6124n2933q4459K16362j10026l40729
2388B427236K13206J97202L14195j63619K03269m765l33926k27126N45241R2424
2378C263337j26858P48680l17384k10446L29345l64007R9893k57477l91927k78134
2368B495022j34641L44776n4068J34006m19124j93904P277M69463j18359l85387
2358B145061j8366J47293K27919k25032k32469k16679J49934m4389l5295J46747
2348B044724L4879j95465j20961N4535K8519O4222k09439k54862K32383J32560
$$ y = [3673474, 3471318, 3461630, 3206100, 2884913, 3124488, 2941706, 2830879, 2798677, 2766549, 2697789, 2823936, 2779796, 2929366, 2581626, 2767182, 2623833, 2583506, 2620071, 2659625, 2888758, 2981272, 3081685, 2859544, 2849434, 2875145, 2799021, 2746088, 2661629, 2877991, 2767965, 2427236, 2640442, 2837644, 3151839, 2988220, 3191489, 3186724, 2852798, 2625672, 3170913, 3263337, 3136479, 3885159, 3567775, 3357329, 3686674, 3322667, 3422560, 3165083, 2773156, 2495022, 2360381, 2705157, 2651089, 2785095, 2365971, 2172067, 2179344, 2648807, 2530448, 2145061, 2126695, 2273988, 2501907, 2276875, 2044406, 1827727, 1977661, 1933272, 1897977, 2044724, 2079603, 1884138, 1763177, 1817712, 1846231, 1910453, 1701014, 1446152, 1678535, 1811095]
2338A811095Q8264k48810J5828K04303j73291J23525J1983k39131J24990j13836
2328A604920j94713J74912N3926j1533m38791J19860O4012J4343K24250J142k63222
2317A349106N72849N5589m35881l47807L6957M49277J09492J73445m3286k19918
2307A699823m51855N14318j92046m64360J23907N34801r0075m08657K9827j9275
2297A276408l55621J64818Q2865J99297j8864l53006K5611k1630L69302j25635
2287A243545K56738R2185k71625m5782J55595k56808l68405K81718L09399l06296
2277A090264K06170k44593L21173K92453J24205R6423j35087j22453m15589m622
2267A208344L05717R5713l85281j15838J64415k4035J99212M66464j51434k02451
$$ y = [1811095, 1899359, 1650549, 1666377, 1870680, 1697389, 1820914, 1832897, 1593766, 1718756, 1604920, 1410207, 1585119, 1639045, 1627512, 1188721, 1308581, 1372593, 1386936, 1611186, 1612328, 1349106, 1921955, 1977544, 1541663, 1193856, 1230813, 1680090, 1789582, 1963027, 1919741, 1699823, 1247968, 1762286, 1570240, 1105880, 1229787, 1764588, 1674513, 1265856, 1295683, 1276408, 920787, 1085605, 1168470, 1367767, 1348903, 995897, 1021508, 999878, 1369180, 1243545, 1500283, 1592468, 1320843, 1275061, 1430656, 1173848, 805443, 1087161, 1396560, 1090264, 1296434, 1051841, 1373014, 1665467, 1789672, 1886095, 1751008, 1628555, 1212966, 1208344, 1514061, 1609774, 1224493, 1108655, 1273070, 1249035, 1448247, 1914711, 1763277, 1560826]
2257A560826k5567O9122p0155Q6465K99497q4087j10909o06259P9124J47403J08970
2246A454430J7351J00654K7871r0057J62544Q1454q1785L84625R0167m90539K69790
2235A926505j23075m1047m88711k1843k11599M9355L28645m98783K73159N67698
2225A760304k2279j14427L56914j16304J04120k11714k42949K17868K66161l4965
2215A962729l07835r4326J61612J11354n77759j99139J76136K16689m52444j86942
2205H10075O34840M17918n4737j73192J22608O0146j0697L71585j89968K15221
2195B203799j68168N9941J85550l45952j34928J08107R5665L61012j56506P8616
2185B287136L49781M02672M2290j48417M3634J87503n9858l4951K53172J52462
$$ y = [1560826, 1535259, 1604381, 1534226, 1620691, 1920188, 1836101, 1725192, 1118933, 1198057, 1345460, 1454430, 1471781, 1572435, 1600306, 1510249, 1672793, 1754247, 1672462, 2057087, 2147254, 1656715, 1926505, 1803430, 1762383, 1273672, 1251829, 1040230, 1089585, 1418230, 919447, 1192606, 1760304, 1738025, 1623598, 1980512, 1864208, 1968328, 1756614, 1513665, 1731533, 1997694, 1962729, 1654894, 1560568, 1722180, 1833534, 1255775, 1056636, 1232772, 1449461, 997017, 810075, 1444915, 1862833, 1808096, 1634904, 1757512, 1817658, 1806961, 2178546, 1988578, 2203799, 2035631, 2095572, 2281122, 1935170, 1800242, 1908349, 2004014, 2365026, 2208520, 2287136, 2636917, 3039589, 3081879, 2933462, 2977096, 3164599, 3104741, 3069790, 3322962, 3475424]
2175C475424J22467M64720K99888k82366K5974n473J51065o7967M97132L59810
2165E040674K29910M83011R4073O1703K9952j22352j41860K26803j9854K51324
2155F133384j30315O45588M51059j30778O8800M50272L1575O32253N44430K59499
2145H955767L69250P65647M38330N15928K32646O36746O56717L48027O37127J052165
2135A4608350N71566R30359P57669J075582J447711J645436J612889J475587J489408
2126B5614557K188550K875118L029899L317164L596876J717263J515882K525293
2118D6380602L949545N977041R057751J2116743J6076836J9883965K5294177L3233507
2110A71970167M7559200O1353560O0809863L3647309m3440485p0893663n5643494
$$ y = [3475424, 3597891, 4062611, 4362499, 4080133, 4106107, 4100634, 4251699, 4183732, 4680864, 5040674, 5270584, 5753595, 5847668, 5909371, 5939323, 5816971, 5675111, 5901914, 5882060, 6133384, 6003069, 6648657, 7099716, 6968938, 7037738, 7488010, 7519585, 8151838, 8696268, 8955767, 9325017, 10090664, 10528994, 11044922, 11277568, 11914314, 12571031, 12919058, 13556185, 14608350, 15179916, 16110275, 16867944, 17943526, 19391237, 21036673, 22649562, 24125149, 25614557, 27803107, 30678225, 33708124, 37025288, 40622164, 42339427, 43855309, 46380602, 50330147, 56307188, 65364939, 77481682, 93558518, 113442483, 138736660, 171970167, 219529367, 280882927, 341692790, 375340099, 331899614, 261005951, 205362457]
2103B05362457m2130807l0843216k2827605j7026748j3058044r569974p881374
2096F2024689n476034m614886k633592k059626j724244l952229m010807k880555
2088C4672716l268614k823947k040439j901987j317211j263058j050721j207432
2080A9799307r31481q99066q95357j435868j58473j092128o56757n80109j66227
2071A2983841m51936n19246n65996o55450k12780L88280o41084m94973m89964
2062I340692k35740J47302n22636n52380k72646l69281l63610K13096n16028k31006
2052F637763J91040n00356k84218m92091k96208J431r1341k98897M41980M47598
2042E756701l49981m07954j52371K2389J23362J48299k14588m64939j5110q8074
$$ y = [205362457, 163231650, 132388434, 109560829, 92534081, 79476037, 69906063, 62024689, 56548655, 51933769, 49300177, 47240551, 45516307, 41564078, 37553271, 34672716, 31404102, 28580155, 26539716, 24637729, 23320518, 22057460, 21006739, 19799307, 18867826, 17968760, 17073403, 15637535, 15479062, 14386934, 13730177, 13150068, 12983841, 12531905, 12012659, 11446663, 10791213, 10578433, 10966713, 10325629, 9830656, 9340692, 9104952, 9252254, 8729618, 8177238, 7904592, 7535311, 7171701, 7384797, 6868769, 6637763, 6828803, 6328447, 6044229, 5552138, 5255930, 5257361, 5166020, 4867123, 5309103, 5756701, 5406720, 4998766, 4846395, 4868784, 4992146, 5140445, 4925857, 4460918, 4445808, 4357734]
2032D357734j09676l54924M7508j10288k08479J92415j08924j10593j4145o54279
2022B926349q9245L9069J336r338m08263J08344N80124k69966m8358l5283j54540
2011B640229p5124J9878P7099k94781l20300Q3895r9763q8462M4383l86723J69901
2000A770232J66561k45256R8182k76418l41729J23219L90359k13872k03958O4078
1990A331398M42298l91125l29532L75869J2222J13037l13971Q5991k1394k8372
1980A276421J066j92607K65701m8846R5223j70886l1712J5330k51888j60486J91560
1969I88876k9349J3260j16440K0383L87208J00097j42479o292j76345K2771Q5465
1958A147155j17797k81380p6269r8150J78186j10252P6317J11176j07801P9260
$$ y = [4357734, 4248058, 3893134, 3940642, 3830354, 3621875, 3814290, 3705366, 3594773, 3580628, 2926349, 2837104, 2876173, 2877509, 2868171, 2459908, 2568252, 3148376, 2878410, 2830052, 2794769, 2640229, 2565105, 2584983, 2662082, 2367301, 2047001, 2130896, 2031133, 1942671, 1987054, 1600331, 1770232, 1936793, 1691537, 1789719, 1513301, 1171572, 1294791, 1685150, 1471278, 1267320, 1331398, 1773696, 1382571, 1053039, 1428908, 1441130, 1554167, 1240196, 1326187, 1304793, 1276421, 1277487, 1084880, 1350581, 1301735, 1396958, 1226072, 1194360, 1209690, 957802, 797316, 988876, 959527, 972787, 856347, 876730, 1263938, 1364035, 1221556, 1215264, 1038919, 1061690, 1147155, 1029358, 747978, 671709, 573559, 751745, 641493, 717810, 828986, 721185, 800445]
1948H00445k57363J47291J46407K77274n90491k5920l642J75923K03439L24013
1938A197376l97417K77394k71861l91539K84065n686j8745j71673M1455j6758
1928E26611j50274J72099P1526j87793k32269M57169k10865J44357J74171o45857
1918A18875K70531K08950k95865L53668J80254p0268o8816j5134N0693p4417N7890
1907G16361k66148j69138J97613J36444P8315m23031j87935J20409J4933l18676
1897a00853j79732j28901N03869o2640K56715J9555o8768k5219k62097N6711k84680
1886b76040L83576J31229K0489M53296m23015l37610k28858J5815O7962J94016
1876H60L83793l8638l60123J48739K74802j53917J30731j23456j10284P9544J95759
$$ y = [800445, 543082, 690373, 836780, 1114054, 523563, 497643, 494001, 669924, 873363, 1197376, 799959, 1077353, 805492, 413953, 698018, 692332, 673587, 501914, 543369, 526611, 376337, 548436, 619962, 432169, 199900, 657069, 446204, 590561, 764732, 118875, 389406, 598356, 302491, 656159, 836413, 766145, 697329, 682195, 732888, 658471, 716361, 450213, 281075, 478688, 615132, 693447, 270416, 82481, 202890, 217823, -100853, -280585, -409486, 94383, 31743, 288458, 308013, 239245, 214026, -48071, 8640, -276040, 107536, 238765, 259254, 712550, 289535, -48075, -276933, -261118, -193156, 860, 384653, 346015, -14108, 134631, 409433, 255516, 386247, 262791, 152507, 232051, 427810]
1865D27810j17869K5869r8160k5788O8604L44263R5710j02050l34054j00913L8792
1854B22214k49947M07959l1216Q5474R1391k1588Q8553m78620J52277L84708j09719
1843E41486L28971K09765N3006L05112L61964j81268l32126J25563N9956K59484
1833A731913o78907k81294j24242J79917L5715l70656K09403l216j63334o6079
1823D69220n7313J11620k82089M97005n00584l11745N3385J06196K67916j56602
1813A97009q239o1450J3125J19678j19694j86568r7516L02083L2129l25118K15104
1802H0543j79476n29997K05020Q5697K07359K7070j8498p0074N37401p2019j35984
1791A37042O0308M6539r5917j17078J3589q6595P8716k45059q4366K65128N6099
$$ y = [427810, 309941, 335810, 237650, 211862, 280466, 624729, 720439, 618389, 284335, 183422, 222214, -27733, 380226, 349010, 434484, 525875, 504287, 592840, 114220, 266497, 651205, 541486, 870457, 1080222, 1133228, 1438340, 1800304, 1619036, 1286910, 1412473, 1472429, 1731913, 1053006, 771712, 647470, 827387, 863102, 492446, 701849, 698633, 535299, 469220, 411907, 523527, 241438, 738443, 237859, -73886, -20501, 85695, 353611, 197009, 188770, 127320, 140445, 260123, 140429, -46139, -143655, 158428, 190557, -134561, 80543, -98933, -628930, -423910, -338213, -130854, -103784, -122282, -192356, 345045, 273026, 137042, 197350, 243889, 147972, 30894, 44483, -42112, 36604, -208455, -292821, -27693, 28406]
1780B8406j4387l27832o415L7913J13575k614k3474J09897p0640K53502l7627
1769F0304j59094j18737L30886L679O4527J20141k54572j35005L9712k06553K97865
1758D3153l2496M9542J25288j02603j08774L92296J58420l70607l11228K20124
1748F3115l36169l0184K24030p6213l7456L48326J2790m18056k9878J40596r1065
1737b30164R9709K76973j84121j26158L787J14716j18868K91118L11139l92326
1727D5805M40065o8983l02387j39635J19124j07024q1953L53840k22476J509J15752
1716A53637p3416K5401k00139k27311j11499J08135N8137l48282M98103p3288
1706a90522k29627M23522p8398k2708m83474M7945K92827K88211n6287k22804
$$ y = [28406, 14019, -313813, -320228, -282315, -168740, -171354, -194828, -84931, -155571, 97931, 60304, -98790, -217527, 113359, 117038, 181565, 301706, 47134, -87871, -48159, -254712, 43153, 10657, 60199, 185487, 82884, -25890, 366406, 524826, 154219, -157009, 63115, -273054, -303238, -79208, -155421, -192877, 155449, 168239, -249817, -279695, -139099, -230164, -130455, 146518, -37603, -163761, -159974, -45258, -164126, 126992, 438131, 45805, 485870, 416887, 114500, -25135, 93989, -13035, -94988, 258852, 36376, 37885, 153637, 80221, 105622, -94517, -321828, -433327, -325192, -267055, -615337, -117234, -190522, -420149, 3373, -75025, -97733, -581207, -533262, -240435, 47776, -8511, -231315]
1696b31315L47770m60570J21661K01840k20313m8368L4259J15910J59837N6215
1686G6926n47336j77297k10496J63010J26268K65073m2181j29994o9745m3880
1676e89652Q7459L42780j13369m48791M40702j13782N4474J89277J41514j9124
1666b8512J99355m1387m48285J18062K31022j48359J13558L5046k58256Q1769
1656a45987k79973j03424J32576k49826L3828K99776J08284o1614J16476J95208
1646D5324r6169j49458j56807M4275r780K93683j27048j87779J47986k2296j17548
1635c35617N6759L6839K04861J15542m51661J35246q7697n79234K16768K27108
1625d61086J98725p7395j16641J59788j77890O7459K73068P854J49814L22614
$$ y = [-231315, 116455, -344115, -222454, -20614, -240927, -289295, -255036, -139126, 20711, 76926, -470410, -647707, -858203, -695193, -568925, -303852, -346033, -476027, -545772, -589652, -502193, -159413, -272782, -721573, -280871, -394653, -340179, -150902, -9388, -28512, 170843, 129456, -318829, -200767, 30255, -118104, -4546, 30500, -227756, -145987, -425960, -529384, -396808, -646634, -612806, -313030, -204746, -266360, -149884, 45324, -50845, -200303, -357110, -312835, -322615, -28932, -155980, -343759, -195773, -218069, -335617, -278858, -242019, -37158, 78384, -373277, -238031, -325728, -904962, -688194, -461086, -262361, -339756, -456397, -296609, -474499, -407040, -133972, -126118, 23696, 346310]
1615C46310n51341K19254K44346K10512q2118j15744m88031q6149q6924K55510
1605a34375J4137k00420p5025M94334P9602n18511q0460J2254q985L27487J7005
1594g2957L299J26556J80535j00518O0873k68113l27699M09045J44425K7451k27596
1583d4699J74825R9660j02695j54951J00621o8412m0478o54538J43957L284K65404
1572b78022j10875L7581l80892j16761L75872K48713K54165p7701q6955L8930
1562i5945J72115K45903j51675p3998j74277k29565K94858r3896L07258l94374
1552a93596k79943Q5748n3438K05568J26234j81949j23141m7826j05183L36169
1542b31357N0575L68876J24109l07210p84j79390L0067q3480K47294J15933k03950
$$ y = [346310, -205031, 14223, 258569, 469081, 386963, 271219, -216812, -302961, -389885, -134375, -120238, -320658, -395683, 98651, 178253, -340258, -420718, -408464, -417449, -89962, -72957, -69658, 56898, 237433, 136915, 197788, -70325, -398024, 11021, 155446, 182897, -44699, 130126, 229786, 127091, -27860, 72761, 4349, -36129, -690667, -546710, -543426, -278022, -388897, -351316, -732208, -848969, -473097, -224384, 29781, -47920, -134875, -95945, 76170, 322073, 170398, 96400, -77877, -307442, -12584, -106480, 200778, -193596, -473539, -387791, -441229, -235661, -109427, -291376, -414517, -462343, -567526, -231357, -180782, 188094, 312203, 4993, 4209, -175181, -145114, -228594, 18700, 134633, -69317]
1531f9317k66987Q5571N3969j3854J63765p3386o4072J60722J2081K45165j76822
1520E6835j36311j38235Q509j42313j57314J34405M3165K24159O1393l73119j43784
1509e62610K33722K04611k95800q3516k1943L31121L94146l0030J12571l8961
1499B43311P4744o03207j15325J55469J38725J88468l15267J58351j26920p3996
1489b75647j02463J32401J61106L149J27028j94916J04010J79636k3877m98886
1479c88459j05305K04035L3218J92399P1234p3394m25126L11938L16376j59303
1469b2387N953j77290r6039r0718j56889l4773L83011j80111l1685K110L96920
1458a898k35236l58971P9491j2093K20077J76737j75966k94254M69510n5714l13115
$$ y = [-69317, -336304, -250733, -196764, -210618, -46853, -120239, -184311, -23589, -11508, 233657, 56835, -79476, -217711, -209202, -351515, -508829, -374424, -331259, -107100, -45707, -418826, -562610, -328888, -124277, -420077, -503593, -525536, -194415, 199731, 169701, 282272, 243311, 318055, -285152, -400477, -245008, -106283, 82185, -233082, -74731, -201651, -275647, -378110, -245709, -84603, -81454, 45574, -149342, -45332, 134304, 110427, -388459, -493764, -289729, -256511, -64112, 7122, -66272, -491398, -179460, 136916, -22387, -16434, -193724, -289763, -380481, -537370, -572143, -189132, -369243, -400928, -398818, -1898, -237134, -596105, -516614, -528707, -308630, -131893, -307859, -602113, -132603, -188317, -501432]
1447e01432M75042n8427J07923j58672K41758K17156l88336k01219l7425K38042
1437f5590k22436j02788M10508j61944L50748k90298l47308l379k548K71971P2860
1426i0204J65522k88658k27924L50985k62258J01236l17673M3356P520K56654
1416b61444J55278m11308j373n0228O2243r6907O16682M1305n9522J4844N20108
1405E29678q11042l81499O29563j77388k96720l0258J29357J57833L25867j05444
1395c0053m9178m8370j7255K15632l34381j65880L10123j44510m71654j4835K11704
1384e38657K21777J51104K06712L2985j37849l20694p5602k4821o3479J39748
1374d08776L37961j91758J45095j45285j70086m9078J81224K89569j93024k71823
$$ y = [-501432, -26390, -84817, 23106, -135566, 106192, 323348, -64988, -266207, -303632, -65590, -288026, -390814, 19694, -142250, 208498, -81800, -429108, -432487, -435035, -163064, -90204, 75318, -213340, -441264, -90279, -352537, -251301, -568974, -525618, -518098, -261444, -106166, -517474, -518847, -569075, -506832, -603739, 12943, 54248, -5274, 9570, 529678, -281364, -662863, -33300, -210688, -507408, -537666, -408309, -250476, 75391, -30053, -79231, -127601, -144856, 70776, -263605, -429485, -119362, -263872, -735526, -750361, -538657, -316880, -165776, 40936, 73921, -63928, -384622, -460224, -485045, -548524, -408776, -70815, -262573, -117478, -262763, -432849, -481927, -300703, -11134, -204158, -475981]
1364d75981K3834m0332J35765L91292l29938J51539j58362K24240o762k92471
1354c77176m3212J48386L75630l7629J5751k82397k10392K34439K83385r8343
1344H442m0247P0134l57084m89332N10238K76114j92377j10652Q5858k9849J72777
1333i5978m96898P2708m96470K99948O28736k47419N49836L5586N2652p84482
1323d81781J173L35083l11619q0217J68456Q4801K99102J26848N1628K08396k97291
1312A04579N6124l62393j15127K28601k58991Q6225j65399L02501J40008j82551
1302a66423P3443O9294j04642J11928k07641K90139o5735j67650L41525o6250
1292A07988k23423k5368j9554K92141J04067n96298K50024L93100l51926l56280
$$ y = [-475981, -452147, -492479, -356714, 34578, -295360, -143821, -302183, -77943, -84705, -377176, -420388, -272002, 103628, 65999, 81750, -200647, -411039, -176600, 106785, 8442, -31805, 38329, -318755, -808087, -297849, -21735, -214112, -324764, -238906, -268755, -95978, -592876, -520168, -1016638, -716690, -87954, -335373, 214463, 250049, 302701, -481781, -480608, -145525, -457144, -537361, -368905, -284104, 14998, 141846, 193474, 401870, 104579, 160703, -201690, -316817, -88216, -347207, -260982, -426381, -123880, 16128, -166423, -92980, -23686, -128328, -16400, -224041, 66098, 363, -167287, 174238, 107988, -115435, -140803, -160357, 131784, 235851, -360447, -110423, 282677, -69249, -425529]
1282d25529L6039k9355L05607o3369P3196l7935K50065O9611k79815m2602M502
1271a39585j11171m2353Q2556R1545M00123j17272l57333q4063K7463o01654J88208
1260f63536M22659p12649K77407L90499J14531O6349j77964k31985J51798K37561
1250a25330L4450J88436j83379J07743j91502o1418p5492k2926L16496l4938l92572
1239d40432J42505O6278m26596K8217M21513P2334K45469L5566j72724n9592p073
1228i4535J00223M40738j62377l05731q2121l03950k24274L3250P2776r3174K03135
1217d16040M47994K43062j34954k53328n4796J8249M7603o3409P7987L0894K87750
1206B31012k1824l23235L42632j02889l96617Q8934J94037K25034k36647j22327
$$ y = [-425529, -389490, -418845, -113238, -176607, -103411, -141346, 108719, 178330, -101485, -144087, -139585, -250756, -293109, -210553, -119008, 281115, 163843, -193490, -277553, -250090, -851744, -663536, -240877, -953526, -676119, -285620, -171089, -104740, -282704, -514689, -362891, -125330, -90880, 97556, -85823, 21920, -169582, -231000, -306492, -329418, -12922, -47860, -440432, -297927, -231649, -658245, -630028, -208515, -136181, 109288, 144854, -27870, -87462, -94535, 5688, 446426, 284049, -21682, -103803, -407753, -632027, -598777, -526001, -619175, -416040, 31954, 275016, 140062, -113266, -168062, -149813, -102210, -165619, -87632, -56738, 231012, 209188, -114047, 228585, 125696, -270921, -181987, 12050, 237084, 437, -121890]
1196a21890Q549J91904J13558O8783k70116k97988k13662R3097K11033J73072
1186d3660o5873K4696K20639n69690M0500K81885J38649o07107p5069K93588o3437
1175d24879r253K91958n2702k46801K527J21527o5770q5835K25812q4577k2966
1164c50959J37722n2480L34529p7654M2961J68522k32013N4616K09761m5528K45378
1153D34855k88791j5297J55255j04493j1218J85665n352l79976K57879m02961
1143a74434j5802j5955M46937k54254l15290j01007R8286L88425n4816k89351
1133b87261j56623M91446j81857j51786j67859j01960l7147J00009L58937J10590
1123b3511k3473K90997n03914l90975L08371J12273k20965J26623K27655j34820
$$ y = [-121890, -113341, 78563, 192121, 260904, -9212, -307200, -520862, -427765, -216732, -43660, -109533, -84837, 135802, -433888, -393388, -111503, 27146, -579961, -655030, -361442, -424879, -434132, -142174, -194876, -441677, -439150, -317623, -383393, -469228, -243416, -327993, -350959, -213237, -265717, 68812, -8842, 34119, 202641, -29372, 25244, 235005, 189477, 434855, 146064, 130767, 286022, 181529, 170311, 355976, 350624, -29352, 228527, -174434, -190236, -206191, 240746, -13508, -328798, -429805, -331519, 56906, 2090, -287261, -443884, 47562, -134295, -286081, -453940, -555900, -593047, -493038, -134101, -23511, -46984, 244013, -259901, -650876, -342505, -230232, -451197, -324574, -96919, -231739]
1113b31739j41302J71972j891k72928K67611P27636k18830N2200k96646p6018
1103a9935p544K72296k80833N4424J37326l26277K00030O7845p8669j25999m27829
1092e35165Q1704o8062k06912M70448l23842K57852K11891J78896J49849k89494
1082g2835l89364M25495O2679O0214M53241j54996m77978q797K02875j06323R9982
1071I4193J31046n3185L00345k43239j04550j03646l41045N2273k8317N1477L84260
1060A39612l00680r3790K18972l68198k0204P7258J67016j84746K60385J61342
1050E6967r8137K32447l88002J22235K64637j28063L48496j47381m26221K9296
1040a33726K06541k60032k45947L55918j44497J02724l98937O82017K59200r04530
$$ y = [-231739, -373041, -201069, -202960, -475888, -208277, 519359, 300529, 352729, 56083, -19935, -27479, 244817, -36016, 18408, 155734, -170543, 29487, 97332, 18663, -107336, -535165, -453461, -521523, -728435, -257987, -581829, -323977, -112086, 66810, 216659, -72835, -462199, -36704, 25975, 86189, 539430, 384434, -93544, -102341, 100534, -5789, 94193, 225239, 172054, 472399, 229160, 124610, 20964, -320081, -267808, -296125, -244648, 139612, -161068, -254858, -35886, -404084, -424288, -347030, -180014, -364760, -104375, 56967, -41170, 191277, -196725, -74490, 190147, 62084, 410580, 263199, -163022, -133726, 72815, -187217, -433164, -77246, -221743, -119019, -517956, 164061, 423261, -481269]
1030d81269j39029M74881l87342j92863P16909k39316L66610L26337L7037o91476
1020b09521K53897j20373J23338J03558P903J41538n78069j13635l5214K25205
1010b01373k2280L18296k67253J41351J95484p9582l65507J98077O22039j32577
1000D06675l43136M6186m42039R9883K95121R7981J84330j53592j22448N157j70566
989i6448k35968K59902j57690O9337m67606Q8602O06205j97965J59850r654l31660
978c13095K13294k96151j03279J67637K3887K5356l74047M47570n2449N8940O6908
967a35429p49O8257K88564m18109J17801K49051j86181j70683k34641K95882m8615
956a74852j44277J48751j97261l44914L98839O45501J3638j81717j79688K96799
$$ y = [-481269, -620298, -145417, -532759, -725622, -8713, -248029, 118581, 444918, 481955, -209521, 44376, -75997, 47341, 150899, 158802, 300340, -277729, -391364, -426578, -201373, -223653, 94643, -172610, -31259, 164225, 84643, -280864, -82787, 539252, 406675, 63539, 109725, -332314, -232431, 62690, 160671, 345001, 191409, 68961, 74118, -96448, -332416, -72514, -230204, -160867, -628473, -539871, 66334, -131631, 28219, 18565, -313095, -99801, -395952, -499231, -331594, -307707, -282351, -656398, -208828, -261277, -202337, -135429, -136178, -67921, 220643, -197466, -79665, 169386, -16795, -187478, -422119, -126237, -174852, -319129, -170378, -367639, -712553, -313714, 331787, 345425, 163708, -15980, 280819]
946B80819k23603j15303L9656P5010K32379l45385M60193J24703l53101j87339
936a1971r7198k9152l15570r5377K59264K8851J86515o9452J3182p1579J80145
925b2342J03189J84791l71072k99392J11454L17436O3519o6155l4411K78406K1896
914B87319j04898k07162M9803K62327J57205j96532m2084k58764N4924K7686J01320
903A31144Q8934p198K61596J80815l32172p0852k28423l19680p1955P7428N0720
892b39643l3121M70475j7846j39030O0731N3592N836k62781J78091J34082k59695
881d9309j91931L51371J31503j47124j50811J31255o4475j41757k96580J07977
871c19881O4286j50593K26390J14751L950L51467k4882K59205Q6243j01936k4369
$$ y = [280819, 57216, -58087, -18431, 56579, 288958, -56427, 403766, 528469, 175368, -11971, -109169, -138321, -453891, -549268, -290004, -261153, -74638, -144090, -130908, -202487, -22342, 80847, 265638, -105434, -404826, -293372, 24064, 87583, 21428, -12983, 265423, 287319, 182421, -24741, 25062, 287389, 444594, 248062, 205978, -52786, 2138, 29824, 131144, 220078, 212880, 474476, 655291, 323119, 252267, 23844, -295836, -367791, -290363, -239643, -272764, 197711, 179865, 40835, 101566, 155158, 160994, -101787, 76304, 210386, -49309, -241240, 110131, 241634, 94510, -56301, 74954, 10479, -131278, -427858, -319881, -255595, -406188, -179798, -65047, -61097, 290370, 265488, 524693, 610936, 509000, 484631]
860D84631m55733K57634l18918j56408p9661J35096k57966K1158Q201J39490K2380
849b00096K38170o3222j88498L2190O26964n29226l84632J13011J94955M73178
839C12794J61842M61M4328k37014q9793l42050J15501J23500J73909n5983k04259
828C236K00625l27650j42105M61225r7812j41979J12535J58402J01231j86888
818A40820J36677K27632k0418m92398P6049J52537j70860N0921R347j02583j66296
807a58572J72752R0066P4840J5295j96996k51700l89865O25208k13241k01284
797d33497J92774J14089K03865j39229o1507n6014K68205L16797m26980J18475
787I6978r911O9678j21400k52389L68208Q1626l58077K8148q8996Q1646K21210
$$ y = [484631, 28898, 286532, -32386, -188794, -268455, -133359, -391325, -370167, -361966, -222476, -200096, 38074, -25148, -213646, -181456, 445508, -83718, -468350, -355339, -160384, 312794, 474636, 475097, 519425, 282411, 192618, -149432, -33931, 89569, 263478, 207495, 3236, 203861, -123789, -265894, 195331, 97519, -44460, 68075, 226477, 327708, 140820, 277497, 505129, 484711, -7687, 68362, 220899, 50039, 100960, 110307, 7724, -158572, 14180, 104246, 179086, 194381, -2615, -254315, -644180, -18972, -232213, -433497, -240723, -126634, 77231, -61998, -123505, -179519, 88686, 405483, -21497, 96978, 87067, 156745, 35345, -217044, 151164, 232790, -125287, -97139, -186135, -104489, 116721]
776A16721K9817j98374R661j28795N187K98086k98563K3463q4930L39450R6762
765B08485j22009M47157N1955k60415L62725k46981M8688l36347R2773j29873
755A16158l44968k8330k69812K49158k26366J87481K17168j46195J78870L00563
745B33727j53576L06290K13710l73116r0494k79826j11996l299Q0876q6250L5732
734b28222M822j42503J32811J67087J38318k29890k37437r3966J48235N02810
724A62065M4270k33486J48823m13506N22004K3317q9623R7120j59099R4903j65799
713C0989L22085Q0498J03961J18912l48524l25892J26843L7176n70366l2166L67614
702h8870N04280j11623j53276q1546l61076K19775P028j94583K85949R5376N5920
$$ y = [116721, 146538, -51836, -42175, -170970, -165783, 132303, -166260, -142797, -227727, 111723, 208485, 86476, 533633, 585588, 325173, 687898, 440917, 489605, 153258, 246031, 116158, -228810, -257140, -526952, -277794, -504160, -316679, -99511, -245706, -66836, 233727, 80151, 386441, 600151, 227035, 136541, -143285, -255281, -258580, -177704, -263954, -228222, -223400, -365903, -233092, -66005, 72313, -157577, -395014, -488980, -340745, 162065, 206335, -27151, 121672, -291834, 230170, 253487, 163864, 260984, 101885, 196788, 30989, 353074, 433572, 537533, 656445, 307921, -17971, 108872, 146048, -424318, -456484, -88870, 415410, 303787, 150511, 68965, -292111, -72336, -65308, -259891, 26058, 121434, 177354]
691A77354p9765M5092m61508q0721O76420J36189j67366J72627n0249j90445j37003
680D0625J57944J32456k27808j8476j23517o7554k283j99157L09979R608j99700
669a87883J96999J13787N9471k06761M4783Q9464k18246p9244K97311K14490J25478
658D49649k41715j85628j63733M00505L29313k20716j88727R3997o628j31260
648A35057J42580L28425k54704k46150K03193j04711l46523j45664L39951N8085
638A09539Q9628l23652J06000K38691K59563M6832k81252k04141k12231L64819
628A93796j01911R4047j24451l19881j98452K74309K49487J89706K63402J74405
618F94457k39064q6908m5429q6505k93455L18643J08285q2389j20718j57268K68
$$ y = [177354, 97589, 142681, -318827, -399548, 276872, 413061, 245695, 418322, 368073, 177628, 40625, 198569, 331025, 103217, 84741, -38776, -106330, -108613, -307770, 2209, 11817, -187883, 9116, 122903, 182374, -24387, 20396, 109860, -108386, -187630, 109681, 324171, 449649, 207934, 22306, -141427, 259078, 588391, 367675, 178948, 272945, 266317, 135057, 277637, 606062, 351358, 105208, 308401, 203690, -142833, -288497, 51454, 109539, 199167, -124485, -18485, 220206, 479769, 526601, 245349, 41208, -171023, 193796, 91885, 185932, 61481, -258400, -456852, -182543, 66944, 256650, 520052, 694457, 455393, 368485, 323056, 236551, -56904, 261739, 370024, 287635, 166917, 9649, 9917]
607I917L50213k7958p8220k73344o5441L94067P7267j80657p9298L05545l69154
596F2937r6133j02593o9948j2383L64393j8223l1976J75783l27287J66378J42906
585B53854j75753j07731J72461P2559l08438K70932L9080k03443p7424L76980
575C13077j58559J60292m0640L63887O2890L9859l91406k48919K20586l11297
565I770K49358l89597K99372L69450m62412j56752K78304K30298o1763N5311K79622
554G00961k21108L5278n2480j43694o3329n01225K98220N371j71581O7040J61425
543A14878K63514J69656j82816j39844j41825k11666K14537M9941L76596L58073
533H71044l48587m09025L22096k7200P7433n73728J02720K13924j49493L90388
$$ y = [9917, 360130, 332172, 253952, -19392, -84833, 309234, 386501, 205844, 126546, 432091, 62937, -33196, -135789, -205737, -218120, 146273, 128050, 96074, 271857, -55430, 110948, 253854, 78101, -29630, 142831, 215390, -93048, 177884, 216964, 13521, -63903, 313077, 154518, 314810, 274170, 638057, 700947, 740806, 349400, 100481, 321067, 9770, 259128, -130469, 168903, 538353, 75941, -80811, 197493, 427791, 366028, 421339, 700961, 479853, 515131, 462651, 318957, 255628, -245597, 52623, 57994, -113587, -46547, 114878, 378392, 548048, 365232, 225388, 83563, -128103, 86434, 136375, 512971, 871044, 522457, 113432, 435528, 408328, 485761, -87967, 14753, 228677, 79184, 469572]
523D69572k13318l144K55426k93169j72111K19028K09232l05919K5686j46934
513D4349k38031M82385j40904j23647k1196J24459k81368M009K67094K35570N8457
502D11177o174n2204l80807P0175q8239K065o5699K21074J233p540j63247j38975
490a97161j12113L67927L08100r4716l45228M625j07072L08444J02781O5272m0334
479B60525l29541K84805L20777J07860K4119k91751N1423L29061j98594j06064
469D52620o1715K66691j13045m46100l6059K8685J32575L34182m29009K00129
459C28954j86381O5296j29428K73737J63784Q049l91398l07335J53957J17170
449I6405J00230K27701j34851J47729q9762m31815J75229M74730j00609j10893
$$ y = [469572, 256254, 253110, 508536, 215367, 43256, 262284, 471516, 165597, 191283, 44349, -193682, 288703, 147799, 24152, 2956, 127415, -153953, -149944, 117150, 352720, 411177, 405003, 352799, -28008, 42167, -46072, -44007, -109706, 111368, 112601, 105061, -58186, -197161, -309274, 58653, 366753, 272037, -73191, -68566, -175638, 132806, 235587, 300859, 260525, -69016, 215789, 536566, 644426, 668545, 376794, 428217, 757278, 558684, 452620, 390905, 657596, 544551, 98451, 62392, 91077, 223652, 557834, 128825, 328954, 142573, 207869, 78441, 352178, 515962, 524011, 132613, -174722, -20765, 96405, 196635, 424336, 289485, 437214, 347452, -84363, 90866, 565596, 464987, 354094]
439C54094k40812L5801k47928k17583K19143j27157L38566k0899J66799J32686
429C92710j94513J09620m16866L77060K13481O4350K29247p9883o00127k02138
419a07059K06589l40917J46055N23254j95525j12994k79129L3323L77898j35692
409A15803O8568l51018M14626k06998J61831l78553k61295J03629K72949L19325
399B58867l37123j88369J71713K97757R2414m69161o3198J22905J5408J30609
389C1822j64968N1694K79810J76159J62016j25185j4253l88652k30056o349j64097
378c92059N5472J89546l4467m1259K56844L99446k08934k41076J23890m83673
368c76270J68543R7710k90306L31632Q1078J35987k31904J252J21348l78038L0533
$$ y = [354094, 113282, 149083, -98845, -316428, -97285, -224442, 114124, 93225, 260024, 392710, 198197, 307817, -109049, 268011, 481492, 545842, 775089, 695206, 95079, -107059, 99530, -241387, -95332, 427922, 232397, 119403, -159726, -126403, 251495, 115803, 184371, -166647, 247979, 40981, 202812, -175741, -437036, -333407, -60458, 258867, -78256, -266625, -94912, 202845, 295259, -173902, -237100, -114195, -98787, 31822, -133146, -81452, 198358, 374517, 536533, 411348, 397095, 8443, -221613, -227962, -392059, -336587, -147041, -181508, -222767, 34077, 433523, 224589, -16487, 107403, -376270, -207727, -110017, -400323, -68691, 12387, 148374, -83530, -82278, 39070, -338968, -308435]
357c08435M39045J43375J15296l64890P7660n32879J41309L46956N1191o0131
347D8497K3318M07895l02301l36516J05149j329j86284J55627N02959l16529O4299
336A64785L75226j40365l04737l01575K06895J88540l16347l09109K67568M21092
326B51973J65007J05580k74416l31688k68817J32752M35531L2127k40127J08402
316A16324L16195k39337J04405l11912K0441l52415j41874L02283M04258k71712
306e3344K42735J40797k82551J26761r2379j9313P4143p04896K79057L60783k1567
295E0226m8005j48283r095l29589J14686K77344k15613O76595j25163k29998n2476
284c9371J7051k02833J50721k65924L01581M51283R1262p1813k74814j81130j56834
$$ y = [-308435, 130610, 273985, 389281, 24391, 102051, -430828, -289519, 57437, 108628, 48497, 71815, 479710, 177409, -159107, -53958, -55287, -241571, -85944, 417015, 100486, 164785, 540011, 399646, 94909, -206666, 229, 188769, -127578, -436687, -169119, 251973, 416980, 522560, 248144, -83544, -352361, -219609, 215922, 248049, 7922, 116324, 432519, 193182, 297587, -14325, 6116, -346299, -488173, -185890, 218368, -53344, 189391, 330188, 47637, 174398, 82019, 62706, 136849, -568047, -288990, 71793, 50226, 2221, -146062, -155157, -484746, -370060, -92716, -308329, 368266, 243103, 13105, -39371, -22320, -225153, -74432, -340356, -38775, 412508, 503770, 431957, 157143, -23987, -180821]
273a80821J49436K08577J74616k66887m71877o5238N27406k2298k44057R9006
263i2137N7411o0258k59807K23531J9898j30909M18021k1124k982J48134l78667
252g8889n65209M05444k2499O22477Q7455m0836N4086q0955K8555l97650K45453
241B57432j52460q3791M702R7082J72271m6063K30445m45344N0207O4713l3880
230A15314n9048J61808k01312K75079j73464m48733K6490J03684Q6909L33691
220B20418N511j36460N6931l3967j3735J10679J95397l18179k24313L61397J14715
209C38394k50907j84473K75143j91136K8741K65084k68967r2924K8297j155o3596
198a17499r6800M96087m46722l17151N25634J44554L63339m2540m11344J08373
$$ y = [-180821, -31385, 177192, 351808, 84921, -386956, -452194, 75212, 52914, -191143, -92137, -34726, -94984, -354791, -131260, -111362, -242271, 175750, 154626, 151644, 299778, -78889, -644098, -238654, -261153, 361324, 448779, 407943, 462029, 381074, 409629, 11979, 257432, 104972, 21181, 25883, 122965, 295236, 249173, 479618, 34274, 84481, 149194, 115314, 56266, 218074, 16762, 291841, 118377, -330356, -303866, -200182, -113273, 220418, 225929, 89469, 146400, 112433, 98698, 209377, 404774, 86595, -137718, 223679, 338394, 87487, -96986, 178157, -12979, 15762, 280846, 11879, -81045, -52748, -53903, -117499, -214299, 281788, -164934, -482085, 43549, 188103, 551442, 508902, 97558, 205931]
188B05931j31054M0131n3367k99996r1748o2902M16738j24641J0439k57601J66353
177a81717M21152l15253J41573r4529m680m8376p255N601J04981o1289K8889k20149
165b31052l8786O30883r8402p8249J79458N9895m43665j47644j91100J98103K87155
154A26596K59281j68796j89382k41021r1738J48018L34511K61910J54767l27885
144B66261j82211K09453J75824k43079J12837j52259j16423J95878j86995k39901
134a60615J13500L81187k14957n0907q163L2111J28783k7909j70137K40608Q2467
123C45968m50744J5430L19623J37189j46291L8715l53238J65284p2399K7137n1307
112b4633M2778l5694j94251K34917M14760K48693n8741m27305k90561J43388J10777
$$ y = [205931, 74877, 115008, 61641, -238355, -330103, -393005, 23733, -100908, -90469, -348070, -181717, 239435, -75818, 65755, -28774, -33454, -81830, -89085, -83484, 21497, -39792, -10903, -231052, -269838, 361045, 262643, 184394, 363852, 423747, -19918, -167562, -358662, -160559, 126596, 385877, 217081, 27699, -213322, -305060, -157042, 177469, 439379, 594146, 266261, 84050, 293503, 469327, 226248, 339085, 186826, 70403, 266281, 79286, -160615, -47115, 334072, 119115, 68208, 60045, 92156, 220939, 193030, 22893, 263501, 345968, -104776, -89346, 230277, 367466, 221175, 259890, -93348, 71936, -463, 26674, -24633, 18145, -17549, -211800, 23117, 437877, 686570, 627829, 200524, -90037, 53351, 164128]
101A64128J94219j68839k10205P2423J21731J56724o1948j72053K22858p8936
91B40102P9394j21197J41251l60j28578o7711O6362k86729N752O4430J66668j46027
79A3357J61112j8259o0761n1766j97085R6232J96000k6854j08724m8550J02632
68E7334K90360k06087k2932O2795L03566j00598m46638J60521J01597l47559j25827
57b73468K04026O2718O2999j49324p5225K13310q5526M4461O6231m6261J69850
46A93791L3932j90747Q9800O4769J36879j85391j7636J41068J09817Q3469L1277
35D91028m25246l888k22408q2752K30875j39736K01642m1809K8593N7800n0543
24D3556o6790L11037P048j08968q4354k2589q6197P2188J97692p4975L0163N6225
$$ y = [164128, 358347, 189508, -20697, 51726, 173457, 330181, 268233, 96180, 319038, 240102, 319496, 198299, 339550, 339190, 210612, 142901, 209263, -77466, -71714, -7284, 159384, 13357, 174469, 156210, 95449, 43683, -153402, -57170, 138830, 111976, 3252, -45298, 57334, 347694, 141607, 118675, 181470, 485036, 384438, -62200, 98321, 199918, -147641, -273468, -69442, -6724, 56275, -93049, -168274, 45036, -40490, 3971, 70202, 23941, 193791, 227723, 36976, 126776, 191545, 328424, 143033, 125397, 266465, 376282, 459751, 491028, 65782, 61894, -160514, -243266, -12391, -152127, 49515, 7706, 36299, 94099, 43556, -23234, 287803, 294851, 185883, 101529, 78940, -7257, 64931, 262623, 187648, 217811, 274036]
12B74036q5749O3956j4371O96r4400k36719m0490J12070J04549J25551M72454
1F81583J10955
0G92538
$$ y = [274036, 188287, 252243, 237872, 238568, 144168, -92551, -133041, -20971, 83578, 209129, 681583, 792538]
$$ Imaginary data points
##PAGE= N=2
##DATA TABLE= (X++(I..I)), XYDATA
16383b462106K33981N22732p622J11181J95868j09301M3934J16774K12681j71652
16373a313530k01022j54271J30827j23343k40692J94401M7448Q5676K58605K175
16363a313726L91O6695m9777j78606J01865J13802J42263J05148J34282j52692
16353a030355K37499m0418j20416o1576Q7013k32626J36380j4512K5673L09585
16343g03753j72080R9423M10061k33182o9414J62449j8107J6107q600r9049J08244
16332e07901K6730k15680J2679K2578K12737Q2554j06953j30131L04214j50375
16322d49548M9205r2482l22936J71336P9924J82880P009j39723J86477O0735k4783
16311b91906K3189r2482o5269j4983m2775K98809L98897L0739j46198k14947j93823
$$ y = [-2462106, -2228125, -1705393, -1713015, -1601834, -1405966, -1515267, -1471333, -1354559, -1141878, -1313530, -1514552, -1668823, -1537996, -1661339, -1902031, -1707630, -1660182, -1574506, -1315901, -1313726, -1313335, -1246640, -1296417, -1475023, -1373158, -1259356, -1117093, -1011945, -877663, -1030355, -792856, -833274, -953690, -1015266, -928253, -1160879, -1024499, -1039011, -1013338, -703753, -875833, -776410, -366349, -599531, -668945, -506496, -524603, -508496, -517096, -616145, -507901, -481171, -696851, -684172, -661594, -448857, -366303, -473256, -603387, -299173, -449548, -400343, -492825, -815761, -644425, -564501, -381621, -374612, -514335, -327858, -267123, -291906, -268717, -361199, -426468, -441451, -484226, -185417, 213480, 244219, 98021, -116926, -310749]
16300c10749J94333M13745j83753j727p0923j5741L55845m389R7896o3818l114
16289D07605j81680J84039R3544j13125k01028j270M08501Q3194j96223k16324
16279B67233J10301P3892J18749L892j68337j07243J12037K41729n8021J54445
16269G48677r3052r1589M50321r6803N396J06635p1568o1269k25141r1023K561
16258E83145r7320J66618L1278k27958J04121j86510K10826J38614l4164Q9721
16248G78371p6524n3118L46505j498J60620k84632K0146L8278j97088J15541q3732
16237G62869k23452J50654L86453J90737M0895n2308j27864j72290j33959P55241
16227A576976k84280k01401p0366r7764j72238j00937K06053J61973L56850j56227
$$ y = [-310749, -116416, 297329, 113576, 111849, 40926, 25185, 381030, 376641, 474537, 410719, 407605, 225925, 409964, 503508, 390383, 189355, 188085, 596586, 679780, 483557, 267233, 377534, 451426, 570175, 574067, 405730, 298487, 410524, 652253, 594232, 748677, 655625, 564036, 1014357, 917554, 922950, 1029585, 958017, 896748, 671607, 580584, 583145, 485825, 652443, 683721, 455763, 559884, 373374, 584200, 722814, 688650, 778371, 701847, 648729, 995234, 993736, 1154356, 869724, 889870, 928148, 731060, 846601, 762869, 539417, 690071, 1076524, 1267261, 1308156, 1255848, 1127984, 955694, 821735, 1576976, 1292696, 1091295, 1020929, 923165, 750927, 649990, 856043, 1018016, 1374866, 1218639]
16217A218639K82835q9386j19196q4493L14967l15261J56407k8568o6707J62361
16207A431598l90743K31947J92351p5048M15290j41934j39646N5032k08788k5883
16197A344176O2083M7030J52736N3888k64301Q4770J64754m19563K2414L24054
16187A572041k21564j12083N7965J60013J19076k59422J09023J85596N03375n1218
16177B062802k58395k53966J7513j03914o4264L0231R1969o0178K90651N7562
16167A810011P7294J14028K4970k25241j97877n0921J90845j19886L54163J31678
16157B109064k00783Q1822K52575l3793l95083L283R9272m4433k00274L20543
16147A992193k12550K5759K30303k65920k29546L45046o357j17697O9561J26697
$$ y = [1218639, 1501474, 1412088, 1292892, 1208399, 1523366, 1208105, 1364512, 1335944, 1269237, 1431598, 1040855, 1272802, 1465153, 1390105, 1805395, 1663461, 1523815, 1578847, 1370059, 1344176, 1406259, 1453289, 1606025, 1659913, 1395612, 1480382, 1645136, 1225573, 1247987, 1572041, 1350477, 1238394, 1296359, 1456372, 1575448, 1316026, 1425049, 1610645, 2114020, 2062802, 1804407, 1550441, 1567954, 1464040, 1399776, 1430007, 1521976, 1461798, 1752449, 1810011, 1887305, 2001333, 2026303, 1801062, 1603185, 1552264, 1743109, 1623223, 1977386, 2109064, 1908281, 1990103, 2242678, 2208885, 1813802, 1817085, 1916357, 1871924, 1671650, 1992193, 1779643, 1805402, 2035705, 1769785, 1540239, 1885285, 1878928, 1761231, 1830792, 1957489]
16137A957489k26343M99544j85854m47491K45298P9260J55299j31213K0786N0443
16127B017218n63728J97273J11515K33145L47305k20362n95967L30978K88041
16118B145418j17347j29207q749J41681J30283m280j74042k27120J05982M22644
16108B285263O3901o75442j32826J18800j2217q4885k26451L29981k30822J34088
16098A569390K42901J01876J58152K20762q7600l87668k19361n9480L60194l9359
16088A859807j80673K69231j80451j79178R6283J34429N6761k48845K05105J05426
16078A937895o01460K19305J58277l37821K10285O27279K8936k56697k278N21486
16068B505207k88763o08428M38983J79080n01053n0315K279K5417j37532N81819
$$ y = [1957489, 1731146, 2230690, 2044836, 1597345, 1842643, 1921903, 2077202, 1945989, 1966775, 2017218, 1453490, 1650763, 1762278, 1995423, 2342728, 2122366, 1526399, 1857377, 2145418, 2028071, 1898864, 1890115, 2031796, 2162079, 2157799, 1983757, 1756637, 1862619, 2285263, 2349164, 1673722, 1540896, 1659696, 1647479, 1562594, 1336143, 1666124, 1435302, 1569390, 1812291, 1914167, 2072319, 2293081, 2205481, 1817813, 1598452, 1538972, 1899166, 1859807, 1679134, 1948365, 1767914, 1588736, 1685019, 1819448, 1876209, 1627364, 1832469, 1937895, 1336435, 1555740, 1714017, 1376196, 1586481, 2213760, 2242696, 1985999, 1983721, 2505207, 2216444, 1608016, 2046999, 2226079, 1725026, 1674711, 1676990, 1702407, 1564875, 2146694]
16058B146694j37983k44303L01906Q9623j98780o9171J28120n00406L26408l0827
16048A811281J93302m5499q0597k89381O37905j82557K20964j83752k31306k0890
16038A829470k16948M31254k85778k73554J46872N23961N3504j82918k26105K41938
16028B041696j95953j05105j87805J75294M54939m2255o3806n1956J65439j70902
16018B019586L2876K44580l80683k81329J21078L503j65368n6259N02986k19431
16008A821539J04226K90808j5722K41263j1383l23352k68332K21999p6390m04499
15998A580157o4742N46500K74918K28980j16332j77718J18444N1875p67970j12990
15988A561122M10290K83454j67934R4808J70146J75496l5813m03990j23374J24982
$$ y = [2146694, 2008711, 1764408, 2066314, 2155937, 1957157, 1887986, 2016106, 1515700, 1842108, 1811281, 2004583, 1959084, 1878487, 1589106, 2227011, 2044454, 2265418, 2081666, 1850360, 1829470, 1612522, 2043776, 1757998, 1484444, 1631316, 2155277, 2208781, 2025863, 1799758, 2041696, 1845743, 1740638, 1552833, 1728127, 2183066, 2140811, 2077005, 2025049, 2190488, 2019586, 2052462, 2297042, 1916359, 1635030, 1756108, 1759611, 1594243, 1537984, 2040970, 1821539, 1925765, 2216573, 2200851, 2442114, 2430731, 2107379, 1839047, 2061046, 1984656, 1580157, 1515415, 2061915, 2336833, 2565813, 2449481, 2271763, 2390207, 2442082, 1674112, 1561122, 1971412, 2254866, 2086932, 2181740, 2351886, 2527382, 2491569, 2087579, 1964205, 2089187]
15978B089187K0002J71179j02037J33113q2759l81461L50925J93791j19546L08502
15968B580896j51327l03464m96405k47525J08365K04244L47528J74653j08864
15959B108101N5428K01382N7238n20424j26269q6611R9194K25356j38808O24524
15949B499111m58085J55032j00613Q0748j02406J02588J10350k68326j11762K31332
15939B137969j48024Q2830r2758L101J5494M1798Q9782l70720L4725p7538k9792
15928A686867J83001M30494o98253K45593J74406k5857n6791k2327o4762L89331
15918B241702j15763l43852K81419k26917R1453k2584L9726J59576L11624k13867
15908B202517j30116J87800j53563k07235n6126J57401j72244k73783L58827j09967
$$ y = [2089187, 2109189, 2280368, 2178331, 2311444, 2228685, 1847224, 2198149, 2391940, 2272394, 2580896, 2429569, 2126105, 1629700, 1382175, 1490540, 1694784, 2042312, 2216965, 2108101, 2163529, 2364911, 2422149, 1901725, 1775456, 1688845, 1788039, 2013395, 1874587, 2499111, 2041026, 2196058, 2095445, 2176193, 2073787, 2176375, 2286725, 2018399, 1906637, 2137969, 1989945, 2072775, 1980017, 1983118, 1998612, 2040410, 2130192, 1759472, 1794197, 1716659, 1686867, 1869868, 2300362, 1602109, 1847702, 2022108, 1996251, 1939460, 1917133, 1852371, 2241702, 2125939, 1782087, 2063506, 1836589, 1928042, 1905458, 1945184, 2104760, 2416384, 2202517, 2072401, 2260201, 2106638, 1899403, 1843277, 2000678, 1828434, 1554651, 1913478, 1803511]
15898A803511K19275l41969O4567J62004Q2382l23914l92202M49068j41692K34042
15888A815072J82059k06758p826L3156L46809R4785j01604k15008j87225j5896
15878A737564Q8564J12545p9512K71308l36336K72248j00128j8641R2234r6853
15868A942993L7882M64235q5521l93755P4383m2378m44162j67880J6019K03713
15858A605529K28582j06564j801K43233L4876m29499n5977K40722p0279R121P3446
15847A771389M21279R3701l4768J59220m17693K8806J39472K55481j89182l30628
15837A897077J14002J223l43506J36107J7232K93280p0926q6252k48926J70661
15827A879972K41889L52317l23009k27285j92323n7229K47283L20911J0749l37736
$$ y = [1803511, 2022786, 1680817, 1745384, 1907388, 1989770, 1665856, 1273654, 1722722, 1581030, 1815072, 1997131, 1790373, 1782547, 1815703, 2162512, 2257297, 2155693, 1940685, 1753460, 1737564, 1826128, 1938673, 1859161, 2130469, 1794133, 2066381, 1966253, 1947612, 2039846, 1942993, 1980875, 2445110, 2359589, 1965834, 2040217, 1997839, 1553677, 1385797, 1401816, 1605529, 1834111, 1727547, 1725746, 1968979, 2003855, 1574356, 1518379, 1759101, 1688822, 1697943, 1771389, 2192668, 2286369, 2251601, 2410821, 1993128, 2021934, 2161406, 2416887, 2227705, 1897077, 2011079, 2012302, 1668796, 1804903, 1822135, 2115415, 2044489, 1958237, 1709311, 1879972, 2121861, 2474178, 2151169, 1923884, 1731561, 1674332, 1921615, 2242526, 2253275, 1915539]
15817A915539j9657J37748o6685R7847o71K99901n7690q1565k53058K85780O0353
15806B317842k59252K98659j95513n51720m8285J56741O6789J64052N8386l33812
15796A673887J71960M79129k22589n8641p6829J49123l0467L52726j24884J7260
15786B330675J42584J93746m41419l98211j11682J15699M40706J64909l15071
15777B121936K2743j65640k60702N4751K84376m1775j41984n9701n8176j82122
15767A573706L26830J56878O8350Q4675O3246j22518L46551n74226J44403L8293
15757B106188J44812L60448j64850m03855K7124k8466j33541M47006K26251l74180
15747B206937J25984j44322j18926L53809j89024Q0514J45417k04956k95460K87385
$$ y = [1915539, 1895882, 2033630, 1966945, 2064792, 2064121, 2364022, 2306332, 2224767, 1971709, 2257489, 2317842, 2058590, 2357249, 2161736, 1610016, 1561731, 1718472, 1785261, 1949313, 2007699, 1673887, 1845847, 2324976, 2102387, 2043746, 1966917, 2116040, 2085573, 2438299, 2313415, 2330675, 2473259, 2667005, 2225586, 1827375, 1715693, 1831392, 2272098, 2437007, 2121936, 2144679, 1979039, 1718337, 1773088, 2057464, 2015689, 1873705, 1814004, 1755828, 1573706, 1900536, 2057414, 2125764, 2210439, 2273685, 2151167, 2497718, 1923492, 2067895, 2106188, 2251000, 2611448, 2446598, 2042743, 2069867, 2041401, 1907860, 2354866, 2581117, 2206937, 2332921, 2188599, 2069673, 2423482, 2234458, 2314972, 2460389, 2255433, 1959973, 2247358]
15737B247358j59575j35376l8425j49989j19462K87815R5259j16459k68180J22271
15727A765237J92235J04712Q2647l7939p022J00636R3794J51843J3374J19362
15717B578879q2644l01869j80086J20645J12109R8430L699K1351P9761k93388
15707B156887k21757l6505m10038Q5546L29547K81289n6880R7422p3756R693j71001
15696A990447N4617J36505l67101J64550j04355P0619K62894j19426J17172J02031
15686B307953j36305m61216j75468L34109n8681o9313R5462j06693j01517O60342
15676B288673j85241m2069K74861k75180l86880Q0460K80566k60372N6668K22015
15666B053501l05342j9068J12907P3081l6188J17164N32865m09474L8511m63851
$$ y = [2247358, 2087783, 1952407, 1913982, 1763993, 1644531, 1932346, 2027605, 1911146, 1642966, 1765237, 1957472, 2062184, 2144831, 2106892, 2099870, 2200506, 2294300, 2446143, 2459517, 2578879, 2496235, 2194366, 2014280, 2134925, 2247034, 2345464, 2349163, 2370514, 2450275, 2156887, 1935130, 1898625, 1488587, 1574133, 1903680, 2184969, 2128089, 2225511, 2151755, 2161448, 1990447, 2045064, 2181569, 1814468, 1979018, 1874663, 1945282, 2208176, 2088750, 2205922, 2307953, 2171648, 1710432, 1534964, 1869073, 1810392, 1741079, 1836541, 1729848, 1628331, 2288673, 2103432, 2061363, 2336224, 2061044, 1674164, 1754624, 2035190, 1774818, 1831486, 2053501, 1748159, 1729091, 1841998, 1915079, 1878891, 1996055, 2528920, 2119446, 2157957, 1694106]
15656A694106K6761M15979J78702L13628l84192l16782L52735R1632l17083k11799
15646A843687O13942j50842k27454j11379L8765J47810j07312J75567p7152j27956
15636B017676M4815m10615L77885M1004k08125q873M5382j91684L00569l7289
15626A970745k01080J3033q7315K36918K024j36725Q7656j3216J87240l7577q9596
15615A932107M51982J60704k79864O4623J00901m33355q4116l529j54817K64859
15605B019495J78427K21972j96020l93323L61295O5515k39020o1641O16333k27428
15595B345605k07802p9336M5043j05148J33838j11277M78966j15228j47702l04993
15585A931966K34091J72340j59497M5613N7369j04091K82864o0246l36107m3289
$$ y = [1694106, 1720867, 2136846, 2315548, 2629176, 2244984, 1928202, 2280937, 2372569, 2055486, 1843687, 2457629, 2306787, 2079333, 1967954, 2006719, 2154529, 2047217, 2222784, 2145632, 2017676, 2062491, 1651876, 2029761, 2070765, 1862640, 1853767, 1899149, 1707465, 2008034, 1970745, 1769665, 1782698, 1695383, 1932301, 1934325, 1797600, 1885256, 1872040, 2059280, 2021703, 1932107, 2384089, 2544793, 2264929, 2329552, 2430453, 1997098, 1912982, 1909453, 1754636, 2019495, 2197922, 2419894, 2223874, 1830551, 2191846, 2257361, 2018341, 1956700, 2573033, 2345605, 2137803, 2058467, 2103510, 1998362, 2132200, 2020923, 2499889, 2384661, 2236959, 1931966, 2166057, 2338397, 2178900, 2224513, 2281882, 2177791, 2460655, 2400409, 2064302, 2021013]
15575B021013P3884J85711L25785j29059k34338j04979M08698k80584k55849J20389
15565B130671N7570j63231q7922K88350m35108l0472M35598O7655n143n5981j65899
15554B036088R402j48382l03740L97134l77741j10733p0949p5622J99682J23266
$$ y = [2021013, 2094897, 2280608, 2606393, 2477334, 2242996, 2138017, 2546715, 2266131, 2010282, 2130671, 2188241, 2025010, 1937088, 2225438, 1790330, 1759858, 2195456, 2263111, 2257968, 2201987, 2036088, 2045490, 1897108, 1593368, 1990502, 1612761, 1502028, 1431079, 1355457, 1555139, 1678405]
$$ [...]
##END NTUPLES=NMR SPECTRUM
##END=
