##TITLE=1H_CG-1168-2
 CDCl3
 32 sc, 
 16.11.2022
##JCAMPDX= 6.0         $$ Bruker NMR JCAMP-DX V2.0
##DATA TYPE= NMR SPECTRUM
##DATA CLASS= NTUPLES
##ORIGIN= UXNMR, Bruker Analytische Messtechnik GmbH
##OWNER= root
$$ XWIN-NMR		Version 3.5
$$ Wed Nov 16 14:13:30 2022 Russian Standard Time (UT+4h)  she@DPX200
##.OBSERVE FREQUENCY= 200.1313499994
##.OBSERVE NUCLEUS= ^1H
##.ACQUISITION MODE= SIMULTANEOUS
##.ACQUISITION SCHEME= undefined
##.AVERAGES= 8
##.DIGITISER RES= 18
##SPECTROMETER/DATA SYSTEM= spect
##.PULSE SEQUENCE= zg30
##.SOLVENT NAME= Acetone
##.SHIFT REFERENCE= (INTERNAL, Acetone, 0, 15.7337)
##AUDIT TRAIL= $$ (NUMBER, WHEN, WHO, WHERE, WHAT)
$$ ##TITLE= Audit trail, XWIN-NMR		Version 3.5
$$ ##JCAMPDX= 5.01
$$ ##ORIGIN= Bruker BioSpin GmbH
$$ ##OWNER= she
$$ F:/spectra/data/she/nmr/H-F/1/pdata/1/auditp.txt
$$ ##AUDIT TRAIL=  $$ (NUMBER, WHEN, WHO, WHERE, WHAT)
(   1,<2022-11-16 14:12:16.54 +0400>,<she>,<DPX200>,
      <created by zg, POWCHK disabled, PULCHK disabled
       configuration hash MD5:
       00 E9 B6 7A A2 85 ED C7 34 08 36 98 17 FE 4E 26
       data hash MD5: 16K
       80 D7 61 C0 0C B5 AC 75 A4 EB 1B 0B 92 B5 1D 37>)
(   2,<2022-11-16 14:12:19.14 +0400>,<she>,<DPX200>,
      <Start of raw data processing
       efp BC_mod = 2 LB = 0.24 FT_mod = 6 PKNL = 1 PHC0 = -18045.18 PHC1 = 30.4007 SI = 16K 
       data hash MD5: 16K
       9E 89 DE 3B C6 04 5E 24 99 77 DF FA D5 F3 1C C8>)
(   3,<2022-11-16 14:12:33.21 +0400>,<she>,<DPX200>,
      <pk PHC0 = 11.36077 PHC1 = -15 
       data hash MD5: 16K
       A0 FB 48 86 72 DE 17 63 01 B9 C5 9A 72 6D 3A 38>)
(   4,<2022-11-16 14:12:36.68 +0400>,<she>,<DPX200>,
      <abs ABSG = 5 
       data hash MD5: 16K
       D0 9B 30 9F 02 6C B0 F0 72 CA DA C2 2B 6A 02 AA>)
$$ ##END=
$$ 
$$ hash MD5
$$ EC D4 1D 8C 55 CE 87 96 F6 96 3B 86 35 37 63 FD
##$RELAX= 
##$RELAX= 
##$RELAX= 
##$RELAX= 
##$RELAX= 
##$RELAX= 
$$ Bruker specific parameters
$$ --------------------------
##$DU= <F:/spectra>
##$EXPNO= 1
##$NAME= <H-F>
##$PROCNO= 1
##$TYPE= <nmr>
##$USER= <she>
##$AMP= (0..31)
100 100 100 100 100 100 100 100 100 100 100 100 100 100 100 100 100 100 
100 100 100 100 100 100 100 100 100 100 100 100 100 100 
##$AQSEQ= 0
##$AQ_mod= 1
##$AUNM= <au_zg>
##$AUTOPOS= <>
##$BF1= 200.13
##$BF2= 200.13
##$BF3= 200.13
##$BF4= 200.13
##$BF5= 200.13
##$BF6= 200.13
##$BF7= 200.13
##$BF8= 200.13
##$BYTORDA= 1
##$CFDGTYP= 0
##$CFRGTYP= 5
##$CHEMSTR= <none>
##$CNST= (0..31)
1 1 145 1 1 1 1 1 1 1 1 1 1 1 1 1 1 1 1 1 1 1 1 1 1 1 1 1 1 1 1 1 
##$CPDPRG= <>
##$CPDPRG1= <>
##$CPDPRG2= <>
##$CPDPRG3= <>
##$CPDPRG4= <mlev>
##$CPDPRG5= <mlev>
##$CPDPRG6= <mlev>
##$CPDPRG7= <mlev>
##$CPDPRG8= <mlev>
##$CPDPRGB= <>
##$CPDPRGT= <>
##$D= (0..31)
0 1.2 0 0 0 0 0 0 0 0.06 0 0.03 0 0 0 0 0.0002 0 0 0 0 0 0 0 0 0 0 0 0 
0 0 0 
##$DATE= 1668593535
##$DBL= (0..7)
120 120 120 120 120 120 120 120 
##$DBP= (0..7)
150 150 150 150 150 150 150 150 
##$DBP07= 0
##$DBPNAM0= <>
##$DBPNAM1= <>
##$DBPNAM2= <>
##$DBPNAM3= <>
##$DBPNAM4= <>
$$ [...]
##$SUBNAM3= <"">
##$SUBNAM4= <"">
##$SUBNAM5= <"">
##$SUBNAM6= <"">
##$SUBNAM7= <"">
##$SUBNAM8= <"">
##$SUBNAM9= <"">
##$SW= 18.0517283424941
##$SWIBOX= (0..15)
0 0 2 0 0 0 0 0 0 0 0 0 0 0 0 0 
##$SW_h= 3612.71676300578
##$TD= 16384
##$TD0= 1
##$TE= 0
##$TE2= 300
##$TE3= 300
##$TEG= 300
##$TL= (0..7)
0 120 120 120 120 120 120 120 
##$TP= (0..7)
150 150 150 150 150 150 150 150 
##$TP07= 0
##$TPNAME0= <>
##$TPNAME1= <>
##$TPNAME2= <>
##$TPNAME3= <>
##$TPNAME4= <>
##$TPNAME5= <>
##$TPNAME6= <>
##$TPNAME7= <>
##$TPOAL= (0..7)
0.5 0.5 0.5 0.5 0.5 0.5 0.5 0.5 
##$TPOFFS= (0..7)
0 0 0 0 0 0 0 0 
##$TUNHIN= 0
##$TUNHOUT= 0
##$TUNXOUT= 0
##$USERA1= <user>
##$USERA2= <user>
##$USERA3= <user>
##$USERA4= <user>
##$USERA5= <user>
##$V9= 5
##$VALIST= <valist>
##$VCLIST= <CCCCCCCCCCCCCCC>
##$VD= 0
##$VDLIST= <DDDDDDDDDDDDDDD>
##$VPLIST= <PPPPPPPPPPPPPPP>
##$VTLIST= <TTTTTTTTTTTTTTT>
##$WBST= 1024
##$WBSW= 4
##$XGAIN= (0..3)
0 0 0 0 
##$XL= 0
##$YL= 0
##$YMAX_a= 201847
##$YMIN_a= -210555
##$ZGOPTNS= <>
##$ZL1= 120
##$ZL2= 120
##$ZL3= 120
##$ZL4= 120
##$ABSF1= 15.73036
##$ABSF2= -2.321489
##$ABSG= 5
##$ABSL= 3
##$ALPHA= 0
##$AQORDER= 0
##$ASSFAC= 0
##$ASSFACI= 0
##$ASSFACX= 0
##$ASSWID= 0
##$AUNMP= <proc_1d>
##$AZFE= 0.1
##$AZFW= 0.1
##$BCFW= 0
##$BC_mod= 2
##$BYTORDP= 0
##$COROFFS= 0
##$CY= -3
##$DATMOD= 1
##$DC= 0
##$DFILT= <>
##$DTYPP= 0
##$F1P= 0
##$F2P= 0
##$FCOR= 1
##$FTSIZE= 16384
##$FT_mod= 6
##$GAMMA= 0
##$GB= 0
##$INTBC= 1
##$INTSCL= 3.70164e-10
##$ISEN= 128
##$LB= 0.24
##$LEV0= 0
##$LPBIN= 0
##$MAXI= 10000
##$MC2= 0
##$MEAN= 0
##$ME_mod= 0
##$MI= 1.114404
##$NCOEF= 0
##$NC_proc= -8
##$NLEV= 6
##$NOISF1= 3.799351
##$NOISF2= 2.8
##$NSP= 0
##$NTH_PI= 0
##$NZP= 0
##$OFFSET= 15.73367
##$PC= 1
##$PHC0= -18033.82
##$PHC1= 15.4007
##$PH_mod= 1
##$PKNL= yes
##$PPARMOD= 0
##$PSCAL= 0
##$PSIGN= 0
##$REVERSE= no
##$SF= 200.130007578835
##$SI= 16384
##$SIGF1= 3
##$SIGF2= 2
##$SINO= 5.538805
##$SIOLD= 16384
##$SREGLST= <1H.CDCl3>
##$SSB= 0
##$STSI= 16384
##$STSR= 0
##$SW_p= 3612.71676300578
##$SYMM= 0
##$S_DEV= 0
##$TDeff= 16384
##$TDoff= 0
##$TI= <>
##$TILT= no
##$TM1= 0
##$TM2= 0
##$TOPLEV= 0
##$USERP1= <user>
##$USERP2= <user>
##$USERP3= <user>
##$USERP4= <user>
##$USERP5= <user>
##$WDW= 1
##$XDIM= 16384
##$YMAX_p= 422244347
##$YMIN_p= -2134624
$$ End of Bruker specific parameters
$$ ---------------------------------
##NTUPLES= NMR SPECTRUM
##VAR_NAME=  FREQUENCY,     SPECTRUM/REAL,   SPECTRUM/IMAG
##SYMBOL=    X,             R,               I
##VAR_TYPE=  INDEPENDENT,   DEPENDENT,       DEPENDENT
##VAR_FORM=  AFFN,          ASDF,            ASDF
##VAR_DIM=   16384,         16384,           16384
##UNITS=     HZ,            ARBITRARY UNITS, ARBITRARY UNITS
##FACTOR=    0.220516191357247, 1,           1
##FIRST=     3148.77954330943, 0,            0
##LAST=      -463.937219696346, 0,           0
##MIN=       -463.937219696346, -2134624,    0
##MAX=       3148.77954330943, 422244347,    0
$$ Real data points
##PAGE= N=1
##DATA TABLE= (X++(R..R)), XYDATA
$$ [...]
5585E361616N94824N53335M45845k7346J87585l75429M53579J64840P47540K85343
5575H391732O0027M27664N38864R28504J462586N50388J063189R83860J062315
5566A5469129J891279K109356K320862K837870M582591O075054P261786P893427
5558E0441354O919353L163732l048718p457970q120078o703834n811787m287834
5550B5094218l239369k149396j654829k184699j124192j079597r72170r68740
5542A1721226l59090k11646n04107m39171J06533J1365R4538L98710K50443m7559
5532A1021242K48991N86507Q20754J031970J979088J525800J644108R78008N9307
5523A9895775q65224j081200j603038j375222j10969n29389o85662n05216l59158
$$ y = [5361616, 5956440, 6509775, 6955620, 6928274, 7115859, 6740430, 7194009, 7358849, 8106389, 8391732, 8451759, 8879423, 9418287, 10346791, 11809377, 12359765, 13422954, 14406814, 15469129, 17360408, 19469764, 21790626, 24628496, 29211087, 35286141, 42547927, 50441354, 57360707, 60524439, 57475721, 50017751, 41897673, 35193839, 29382052, 25094218, 21854849, 19705453, 18050624, 15865925, 14741733, 13662136, 12689966, 11721226, 11362136, 11150490, 10646383, 10207212, 10313745, 10325110, 10419648, 10818358, 11068801, 11021242, 11270233, 11856740, 12677494, 13709464, 15688552, 17214352, 18858460, 19836468, 19895775, 19030551, 17949351, 16346313, 14971091, 14860122, 14330733, 13645071, 13139855, 12780697]
5514A2780697p78683k82971o61200j039242r47702k32620l06131l30897l89845
5505G811406o03273n45568p2665M7322q62165m24553j74003o3609n36883M11885
5495D987894K36720j06524J89812k25238k35393Q1989K6696J87929Q8670k05461
5485E027094O5644J56686K95828j0675l67537n46531M99728n49188k23939k34980
5475D112130m19962j0908L49923M26431k48238j003920M28555J70761k75835N00791
5465D029728q3192J59667j45696m03813J66817R8121k9581l60833J45474j22245
5455C454447o5171M38042K28391n7070L57019P5229l51267L03873j83823k25734
5445C973936k37599l09674j4528l50987Q3491k77724R252L43504j44017K92930
$$ y = [12780697, 12002014, 11719043, 11057843, 10018601, 9070899, 8838279, 8532148, 8201251, 7811406, 7208133, 6662565, 6589900, 6637222, 5775057, 5350504, 5176501, 5112892, 4576009, 4987894, 5224614, 5118090, 5307902, 5082664, 4847271, 4929260, 4955956, 5143885, 5232555, 5027094, 5092738, 5249424, 5545252, 5534577, 5167040, 4620509, 5120237, 4571049, 4347110, 4112130, 3692168, 3681260, 4031183, 4457614, 4209376, 3205456, 3634011, 3804772, 3528937, 4029728, 3946536, 4106203, 3960507, 3556694, 3723511, 3821632, 3792051, 3431218, 3576692, 3454447, 3389276, 3827318, 4055709, 3998639, 4355658, 4430887, 4079620, 4383493, 4199670, 3973936, 3736337, 3426663, 3412135, 3061148, 3144639, 2866915, 2876167, 3219671, 3075654, 3368584]
5435C368584l42349M53008m9246m0981j71093J90668N22053N4181M9389k20606
5425C813608M1866l33918l93639k864K70119J34687L58271k79769p14769k006
5415B891586K12142J75352J51515p8600k84206N92711j14707l73516n7227k8961
5405C086089K76001K72901l67018Q6084m4734N27n62232j43945M91571N53956
5395C649200m57809k10335k31523K45806J11468o7506J51856k63533L7772R5757
5385C061153q4516j16457k08059k09601M6505J08964K08190n01895K65636K70009
5375B839929J44001o81767K20753k66317k37108L19567r7338K35457K20345L4742
5365B732264J01931n48253N14554l10524p4106J65368j43721N1098l7768r7862
$$ y = [3368584, 3026235, 3479243, 3429997, 3389016, 3217923, 3408591, 3930644, 3984825, 4034214, 3813608, 3855474, 3521556, 3127917, 3125053, 3395172, 3529859, 3888130, 3608361, 2893592, 2891586, 3103728, 3279080, 3430595, 3351995, 3067789, 3660500, 3545793, 3172277, 3115050, 3086089, 3362090, 3634991, 3267973, 3354057, 3309323, 3309850, 2747618, 2603673, 3095244, 3649200, 3191391, 2981056, 2749533, 2995339, 3106807, 3039301, 3191157, 2927624, 2965396, 3061153, 2976637, 2860180, 2652121, 2442520, 2489025, 2597989, 2806179, 2304284, 2569920, 2839929, 2983930, 2302163, 2522916, 2256599, 2019491, 2339058, 2241720, 2477177, 2697522, 2732264, 2834195, 2285942, 2800496, 2489972, 2415866, 2581234, 2437513, 2488611, 2450843, 2352981]
5355B352981L49368J48562j59075p0551k91203l74054M0823L02251L69568l21215
5345B347455m56019K86530M02343l89224r8507Q89745n05026n42766K29085L28419
5335B492035j0902j22833n4946L07960k93076K74732l52835O2407K07994j83858
5325B326678k63101L57844k6140k020J88748L80713o14924o0180J34343k59695
5315B162266j99498L53136J43012m99719J3500Q92099k44373n57331J14756J36811
5305B314659q3448J05115M29726k50491k97818j94648J87285j02607J03758K52788
5295B464319J54147j33639J18190n16313J44141J2812k10485q4747J9421N26027
5285B493873J02528N09629r8146o46316J29364J3080K34153n9362K44260L50890
$$ y = [2352981, 2702349, 2850911, 2691836, 2621285, 2330082, 1956028, 1996851, 2299102, 2668670, 2347455, 1891436, 2177966, 2580309, 2191085, 2092578, 2982323, 2477297, 1934531, 2163616, 2492035, 2481133, 2358300, 2303354, 2611314, 2318238, 2592970, 2240135, 2302542, 2510536, 2326678, 2063577, 2421421, 2395281, 2393261, 2582009, 2962722, 2347798, 2287618, 2421961, 2162266, 1962768, 2315904, 2458916, 1959197, 1972697, 2864796, 2620423, 2063092, 2177848, 2314659, 2231211, 2336326, 2766052, 2515561, 2217743, 2023095, 2210380, 2107773, 2211531, 2464319, 2618466, 2484827, 2603017, 2086704, 2230845, 2243657, 2033172, 1948425, 1967846, 2493873, 2596401, 3106030, 3007884, 2361568, 2490932, 2504012, 2738165, 2678803, 2923063, 3273953]
5275C273953K84732l29649o9571j70428k57143J02183R2429n0594L20413q0502
5265C115823K49986K19710o30160r0447M0394O189j1321j8008O69736Q432l6447
5254C523887Q7908L35217q3090K43658l4076M13416N98326K32356M56429J71236
5244E945267J95557p6812j49903j7696L30618P44714L92067J99952Q11400Q69305
5234I244469J602139J641039J662291P09848r69362j598972j266208j540485j458011
5225H026748j166780q20943l56378m15607j99819j54967k62241L90663K4486j26632
5215D938530q35484j91602q2107o21209P8826Q0407J08505J33933j50078q0336
5205C379385K37449J89964m0594m27428j08198k79589K81047M0746l37303k24020
$$ y = [3273953, 3558685, 3229036, 3159465, 2989037, 2731894, 2834077, 2926506, 2875912, 3196325, 3115823, 3365809, 3585519, 2955359, 2864912, 2905306, 2911495, 2900174, 2882166, 3551902, 3560334, 3523887, 3611795, 3947012, 3863922, 4107580, 4073504, 4486920, 5085246, 5317602, 5774031, 5945267, 6140824, 6064012, 5914109, 5896413, 6227031, 6971745, 7363812, 7563764, 8375164, 9244469, 10846608, 12487647, 14149938, 14859786, 13890424, 12291452, 11025244, 9484759, 8026748, 6859968, 6039025, 5682647, 5267040, 5067221, 4912254, 4650013, 5040676, 5065162, 4938530, 4103046, 3911444, 3829337, 3208128, 3286954, 3367361, 3475866, 3609799, 3459721, 3379385, 3616834, 3806798, 3766204, 3338776, 3230578, 2950989, 3232036, 3272782, 2935479, 2711459]
5195B711459k62553M52099k49981K098R5202k50628j62692K67732J5256j63534
5185B454458K22191N45244n31643m0166k46612m2609j4586L3083j35598j06866
5175B136896k6072N56939P34942q81075L5451K50167J25574K3747k18340p66682
5165A971547l68296O94608P9082k103K78333R2695J01973l18645K36874k88151
5155B477917j7601P5970J51866o44881J18397K80494k85316k3458O0756P9456
5145B273600k36133K28570j59853N00861J53786l44214o7284P4139j30408n3069
5135B239995O6229j45179L4577K59088L10527j0870K3059K93310M9752J5672J54245
5124C290405l14041m10231Q31964O74248l36119k62821J01935J68355O1484j00091
$$ y = [2711459, 2448906, 2901005, 2651024, 2653122, 2748324, 2497696, 2335004, 2602736, 2617992, 2454458, 2676649, 3221893, 2690250, 2650084, 2403472, 2360863, 2346277, 2379360, 2243762, 2136896, 2110824, 2667763, 3402705, 2521630, 2557081, 2807248, 2932822, 2956569, 2738229, 1971547, 1603251, 2297859, 2376941, 2374838, 2653171, 2745866, 2847839, 2529194, 2766068, 2477917, 2460316, 2536286, 2688152, 2043271, 2161668, 2442162, 2156846, 2133388, 2194144, 2273600, 2037467, 2266037, 2106184, 2607045, 2760831, 2416617, 2349333, 2423472, 2293064, 2239995, 2306224, 2161045, 2195622, 2454710, 2765237, 2754367, 2777426, 3070736, 3120488, 3136160, 3290405, 2976364, 2566133, 3398097, 4072345, 3736226, 3473405, 3575340, 3743695, 3805179, 3705088]
5114C705088K84614O33973Q9298K33195j23484n22003L94375j4795l77892l76862
5104C925507j06281M60929k216j34777m01933M52000K98993K69751K01679J01453
5094E065105N72836O3780l68570m26775k8134n1527j59157o36105J97380J52786
5084D381619p7567K20597l3882j10962L64295K86371l47766R7555q6613J95661
5074D889308R8045k490j71093M48462n86241k69486K92969R7165l48571k83657
5064D164411P1146k63609M51439Q7702K05579n40507k7424M19250k27616N6647
5054D397018P0050q0961M90145K58725l9404j59457k41086J773N2921n32956n11970
5043C704798q7616K84040L7036m36131J93581J03637l62801M08743m58817j82337
$$ y = [3705088, 3989702, 4623675, 4712973, 4946168, 4822684, 4300681, 4695056, 4680261, 4302369, 3925507, 3819226, 4280155, 4277939, 4143162, 3741229, 4193229, 4492222, 4761973, 4963652, 5065105, 5637941, 5701721, 5333151, 4906376, 4878242, 4826715, 4667558, 4031453, 4228833, 4381619, 4304052, 4524649, 4490767, 4379805, 4744100, 5030471, 4682705, 4780260, 4693647, 4889308, 4987353, 4984863, 4813770, 5262232, 4675991, 4406505, 4699474, 4796639, 4448068, 4164411, 4235557, 3971948, 4423387, 4511089, 4716668, 4176161, 4148737, 4567987, 4340371, 4397018, 4467068, 4386107, 4876252, 5134977, 5095573, 4936116, 4695030, 4696803, 4749724, 4216768, 3704798, 3617182, 3901222, 3938258, 3502127, 3695708, 3799345, 3436544, 3845287, 3386470, 3204133]
5033C204133n8047m22790Q8884J9251r4761M19950O67062k14010j41613o29818
5023B838241n57785L03134M33777l01518j17072J6650n1425N561q0900Q8709L84081
5012B961453m35188j61445K45616J8924k86681j86801L58455K196k62479l63471
5002A890579M21495M24021q44408Q3401J98589J4936J56364J20835m85176l01273
4992A679363J70841N65857k74134j63768M85367j99423J69151Q6260O10364n30132
4982B599746k39400K29355l08640k3496l13025j38966M85295k16252k4525n9122
4972A990970l5600L1169k19453j91305r9063M10895N06655j38432q10224j13455
4962A332157P62295J38425k95352P6692J6268k65991N30243K15521m8982J45014
$$ y = [3204133, 3146086, 2723296, 2812180, 2831431, 2736670, 3156620, 3823682, 3609672, 3468059, 2838241, 2280456, 2583590, 3017367, 2715849, 2598777, 2615427, 2564002, 2569563, 2488663, 2577372, 2961453, 2526265, 2364820, 2610436, 2629360, 2342679, 2155878, 2514333, 2516529, 2254050, 1890579, 2312074, 2736095, 1891687, 1975088, 2173677, 2188613, 2344977, 2465812, 1980636, 1679363, 1850204, 2416061, 2141927, 1978159, 2463526, 2264103, 2433254, 2519514, 3129878, 2599746, 2360346, 2589701, 2281061, 2257565, 1944540, 1805574, 2290869, 2074617, 2050092, 1990970, 1955370, 1986539, 1767086, 1575781, 1476718, 1887613, 2394268, 2255836, 1445612, 1332157, 2094452, 2232877, 1937525, 2014217, 2030485, 1764494, 2294737, 2510258, 2461276, 2606290]
4952B606290k22402k76198j25479j23742J28141J74262m2221j24550M92772L14892
4942B801765k04153L05702k34362l05236k61776J64859L02010k27874j17040m93964
4932A729931j67507K13068j19079M72099l890j01491N11699o34063l04576J29437
4922A725628K86952j04112P571K7113J05467k73765l8751j26298j6269J07899
4912A701435r2170k04500K63195K28034j80846M92379L19210J66243m83680M886
4902B214186K4308j22225l14656P1662K30163K87135j25905J58600l81257M19962
4892B461973K01680L4580j60981J06556l61439m65293L50347N14576J79411l77658
4882B483752m20954J02231k7594j11544k47057L92342K11149k51776J84328N348
$$ y = [2606290, 2383888, 2107690, 1982211, 1858469, 1986610, 2160872, 2118651, 1994101, 2486873, 2801765, 2597612, 2903314, 2668952, 2363716, 2101940, 2266799, 2568809, 2340935, 2223895, 1729931, 1562424, 1775492, 1656413, 2128512, 2124622, 2023131, 2534830, 1900767, 1596191, 1725628, 2012580, 1908468, 1916039, 1943152, 2048619, 1774854, 1736103, 1609805, 1593536, 1701435, 1609265, 1404765, 1667960, 1895994, 1715148, 2207527, 2526737, 2692980, 2209300, 2214186, 2238494, 2116269, 1801613, 1873275, 2103438, 2390573, 2264668, 2423268, 2042011, 2461973, 2663653, 2698233, 2537252, 2643808, 2282369, 1817076, 2167423, 2681999, 2861410, 2483752, 2062798, 2165029, 2137435, 2025891, 1778834, 2171176, 2382325, 2130549, 2314877, 2320225]
4872B320225L8707L12228J26325l44023J43691O3280l72259j90090o6979m11164
4862A619941L57165L42921P36605r6495q09339L25925K88861r9198L7607j6030
4852B687963K47910Q6245j23459N02407J07551r37800K30552L12297M15408m8260
4842C480814J73956K71757J26862o5802P22650M96132l56290q3025M82431m56914
4832D792571j99141r5939o00513j82099N10778K24390n02343j23746J88176K63683
4822D275817l20905l93037J95299K43708n0122M90927M84739J02203j88877J93335
4812E033087L61128N46053k05085l27829J49068n69431m88010M59710K90424k27755
4802E021360K8349K22092j27446j41062k48431J20702J6789J35202O52840O42254
$$ y = [2320225, 2358932, 2671160, 2797485, 2453462, 2597153, 2660433, 2288174, 2098084, 2031105, 1619941, 1977106, 2320027, 3056632, 2960137, 2150798, 2476723, 2765584, 2666386, 2703993, 2687963, 2935873, 3022118, 2898659, 3401066, 3508617, 2570817, 2801369, 3113666, 3529074, 3480814, 3654770, 3926527, 4053389, 3987587, 4710237, 5206369, 4850079, 4767054, 5249485, 4792571, 4593430, 4497491, 3896978, 3714879, 4225657, 4450047, 3947704, 3823958, 4012134, 4275817, 3954912, 3561875, 3757174, 4000882, 3950760, 4441687, 4926426, 5028629, 4839752, 5033087, 5394215, 5940268, 5735183, 5407354, 5556422, 4986991, 4498981, 4958691, 5249115, 5021360, 5049709, 5271801, 5144355, 5003293, 4754862, 4875564, 4892353, 5027555, 5680395, 6322649]
4792F322649L0152M86133L55552N72598P70276O77250M69597R87279J229357J551807
4782A3452650J870858J582215K337428J001979J76586p12156k310405j835400
4774A5563755k117433j894097q06603j427505j351560q21361K45422j2629p49108
4765F628881k46465n34410m98949k73460M57343R4405k48699K58603L66340m54081
4755E549508l76515K60862L12128m68976j28111J97972J1301J72863n23461k55408
4745D752163l62148K37445O81190n56024j25938O4928K24408j63509l75194J69760
4735D547081k44109M16650l93503N01952L80984j08028l85889L90068J63590P7713
4725E346509M29648l2717N2374p4947K1183j85740K15668J88582j3241m22029
$$ y = [6322649, 6352801, 6838934, 7194486, 7767084, 8537360, 9214610, 9684207, 10671486, 11900843, 13452650, 15323508, 16905723, 19243151, 20245130, 20421716, 19709560, 17399155, 15563755, 13446322, 11552225, 10745622, 9318117, 7966557, 7145196, 7390618, 7377989, 6628881, 6382416, 5848006, 5349057, 5075597, 5532940, 5627345, 5378646, 5637249, 6003589, 5549508, 5172993, 5433855, 5745983, 5277007, 5148896, 5346868, 5358169, 5531032, 5007571, 4752163, 4390015, 4627460, 5308650, 4752626, 4626688, 4691616, 4916024, 4752515, 4377321, 4547081, 4302972, 4719622, 4326119, 4828071, 5209055, 5101027, 4715138, 5105206, 5268796, 5346509, 5776157, 5743440, 5795814, 5720867, 5742050, 5556310, 5771978, 5960560, 5947319, 5525290]
4715E525290P7853N03837j9569K4918Q49475L29519J36241J57811O30480O22943
4705H838798M49026K24248O26028O65291P21773J189671R11807K546795K475445
4696A8648882J355612R64983J16680p22323j153985k155200k143629j819897j121900
4687A1969223j052515r15531o51450n33083k83937K52753k71725l56519j19140
4678H038076k63211o8802l37309l59555j90553J50228P8832K90008m29232K4295
4668F932777K4154l48055L68284N3500J83431K38191l20205J36874j78709K32635
4658G322877j20146k10372M98614J09308j49462J42250J0032l66566K08427J049032
4648H493994O4430P60168K84690r664J07912L05530J83669j33339N76667J95561
$$ y = [5525290, 5603143, 6106980, 6087411, 6112329, 6961804, 7291323, 7427564, 7585375, 8215855, 8838798, 9287824, 9512072, 10138100, 10803391, 11525164, 12714835, 13626642, 16173437, 18648882, 20004494, 20969477, 21086157, 20363834, 19209849, 17054649, 14911020, 13091123, 11969223, 10916708, 10001177, 9349727, 8816644, 8532707, 8785460, 8513735, 8157216, 8038076, 7774865, 7706063, 7368754, 7009199, 6818646, 6968874, 7047706, 7337714, 6908482, 6932777, 6956931, 6608876, 6977160, 7030660, 7214091, 7452282, 7132077, 7268951, 7090242, 7322877, 7202731, 6992359, 7490973, 7600281, 7450819, 7593069, 7603101, 7236535, 7444962, 8493994, 8558424, 9318592, 9603282, 9593618, 9701530, 10007060, 10190729, 10057390, 10634057, 10829618]
4638A0829618N3506L82515P21999J74094P93644O95224J141293K93695j4872O01523
4628A5672239R13202J028472Q55149J339175R20940Q65530J155356O70079J115817
4619B4535959R07249O39086J76438N4396j22574q51563n71723p47368j056817
4610B2963083m12096m52248r75504m19688o60194p49637k69138m08323n38767
4601A8077488M66354J09194m51172l66255o666J22768K45057N50172J3357N24908
4591A9285205L78573k95010M51563J068147P86610O95728L51048M62116J086831
4582B4270811O0753p5705K0591N00253K74776p14700j233805o75286o33364r66257
4572B0828067j323158j011442p72385r93830m82913o61956o20985j216047n55794
$$ y = [10829618, 10883124, 11265639, 11987638, 12161732, 12955376, 13650600, 14791893, 15085588, 15070716, 15672239, 16585441, 17613913, 18469062, 19808237, 20729177, 21594707, 22750063, 23420142, 24535959, 25443208, 26082294, 26258732, 26313128, 26190554, 25338991, 24767268, 24019900, 22963083, 22550987, 22098739, 21123235, 20703547, 20043353, 19293716, 19024578, 18616255, 18077488, 18543842, 18653036, 18201864, 17835609, 17828943, 17951711, 18196768, 18746940, 18760297, 19285205, 19663778, 19368768, 19820331, 20888478, 21675088, 22370816, 22721864, 23183980, 24270811, 24331564, 24255859, 24276450, 24776703, 25051479, 24336779, 23102974, 22427688, 21794324, 20828067, 19504909, 18493467, 17721082, 16727252, 16244339, 15582383, 14961398, 13745351, 13189557]
4563A3189557n48454L3627o36974k26027l07222r15995o06536p42210Q250j2408
4553I235608K78793l51401j05707j68764l7380j45696l85623j38213K65447o90250
4543G756814k33624m88196L6314O98654q142l97467J30967K33733j39963j72994
4533G416096K86667J89261n95717L51565K50987k16683n02214K14514J4579j500
4523G407555l30469J23264Q5087L06749K37268M05111o27522n74739j96231K89530
4513G125603j5835M32674M22611K72686m65041N2622K76635j45574K0137m25530
4503G550988M51838M61819J54767n16081J11099P36765l99841j92317J45590M13961
4493H918588K07556m4234J50431j29049J07573j32585K39403J56230J52297J90190
$$ y = [13189557, 12641103, 12674730, 12037756, 11811729, 11504507, 10588512, 9981976, 9239766, 9248016, 9235608, 9514401, 9163000, 9057293, 8888529, 8851149, 8705453, 8319830, 8181617, 8447064, 7756814, 7523190, 7034994, 7071308, 7769962, 7761820, 7364353, 7495320, 7729053, 7589090, 7416096, 7702763, 7892024, 7296307, 7647872, 7898859, 7682176, 7179962, 7394476, 7409055, 7407555, 7077086, 7200350, 7285437, 7592186, 7829454, 8234565, 7607043, 7032304, 6836073, 7125603, 7109768, 7542442, 7965053, 8237739, 7772698, 7825320, 8101955, 7956381, 7976518, 7550988, 8002826, 8464645, 8619412, 8103331, 8214430, 8951195, 8551354, 8359037, 8504627, 8918588, 9126144, 9081910, 9232341, 9103292, 9210865, 9078280, 9317683, 9473913, 9626210, 9816400]
4483I816400j63082M1170K43045j24622k67419J98309P06878K91278j44409L30342
4473A0927890O3282o4983O40717J02358Q37750R8759L62898J01102J56360q3505
4463A3142628J31269O70016N92912N35741O88427M41920M40787L85889J117266
4454A8146855P72821Q61359J209129J292652J224139J852581J880618J676149
4446B8916303L415918L491370M473905N364499M805180L368566N9290k021285
4438E1873746l294589k909767k298823k352884j452120j612983p76569l80966
4430C6795045l19561m32282M4044O2309Q32258N08718L74489L27765o83567K08342
4420C7717560r7995n99941R0876R764j77488n70838q94451M19758M68950l2843
$$ y = [9816400, 9653318, 9694488, 9937533, 9812911, 9545492, 9743801, 10450679, 10741957, 10597548, 10927890, 10991172, 10926189, 11566906, 11669264, 12507014, 12605773, 12968671, 13069773, 13226133, 13142628, 13273897, 13943913, 14536825, 15072566, 15760993, 16202913, 16643700, 17029589, 18146855, 18919676, 19781035, 20990164, 22282816, 23506955, 25359536, 27240154, 28916303, 32332221, 35823591, 40297496, 45661995, 50467175, 53835741, 53895031, 51873746, 48579157, 45669390, 43370567, 41017683, 39565563, 37952580, 37176011, 36795045, 36475484, 36043202, 36087246, 36149555, 36981813, 37490531, 37865020, 38192785, 37509218, 37717560, 37619565, 37019624, 37110500, 37120264, 36942776, 36371938, 35477487, 35897245, 36366195, 36333352]
4410C6333352k79289l80570J42447L50926m63389j9852J38717J38791M51740P75913
4400C7188786P27825J328905J102021M88400O38743J480420Q74191M41009P06326
4391D4976626P4517k72110J61872P47185l36948n52736p75789q68294j496305
4382D1658018q73012j896900j443232j667070j417835j708822j867038j495754
4374B9288355j277326j314721j105890q45154m03655r25015p58674p98555k37961
4365B1621404q384o59892L1988O8552p45600n96900k55624l49311k0270K19852
4355A9305815l35065l7489J05863k06787O19877n56678k26522m52790l24577O15933
4345A8507580P91566o7611r2811r6427Q6597N86360k11822J39876L90411k40468
$$ y = [36333352, 36054063, 35673493, 35815940, 36166866, 35703477, 35683625, 35822342, 35961133, 36412873, 37188786, 37916611, 39245516, 40347537, 40835937, 41474680, 42955100, 43829291, 44270300, 44976626, 45051143, 44779033, 44940905, 45688090, 45351142, 44798406, 44022617, 43154323, 41658018, 40785006, 38888106, 37444874, 35777804, 34359969, 32651147, 30784109, 29288355, 28011029, 26696308, 25590418, 24745264, 24341609, 23416594, 22657920, 21859365, 21621404, 21613020, 20953128, 20985116, 21053668, 20308068, 19711168, 19455544, 19106233, 19085963, 19305815, 18970750, 18933261, 19039124, 18832337, 19452214, 18895536, 18669014, 18216224, 17891647, 18507580, 19299146, 19231535, 19138724, 19042297, 19128894, 19715254, 19503432, 19643308, 20033719, 19793251]
4335A9793251O75784Q32888K30513M68040L12182O64411M44848L30088Q03801
4326B4555806P70627J001855Q36136Q51257J449631J617876J051827J454218J902294
4317C5491527J879002J913941K077736J185459J354865J214961J454183N80296
4309D7151970K40092N6082N0191j94308j78612r773o12268m77098j02103q17371
4299D5106802r22056j05776p05407q90837p84569q73390j010342J3630r30321
4290C8897734k49429K58507o26245K18511M17499K67111K52670M67179L320K93906
4280D0200763N80010p39691r6043O1671l40892o73988M8419l03472l13131k83335
4270C8140311l09591r31441k35517l70096n59214m14578l63285n45403q12287
$$ y = [19793251, 20469035, 21301923, 21532436, 22000476, 22312658, 22977069, 23421917, 23752005, 24555806, 25326433, 26328288, 27164424, 28015681, 29465312, 31083188, 32135015, 33589233, 35491527, 37370529, 39284470, 41362206, 42547665, 43902530, 45117491, 46571674, 47151970, 47392062, 47448144, 47498335, 47304027, 47125415, 47115642, 46503374, 46026276, 45924173, 45106802, 44184746, 44078970, 43373563, 42482726, 41698157, 40824767, 39814425, 39828055, 38897734, 38648305, 38906812, 38280567, 38499078, 38916577, 39183688, 39436358, 39903537, 39906857, 40200763, 40780773, 40041082, 39945039, 40006710, 39665818, 38991830, 39040249, 38736777, 38423646, 38140311, 37830720, 36899279, 36663762, 36293666, 35734452, 35319874, 34956589, 34411186, 33598899]
4261C3598899J50958o18158k88742k67846o50971q98094l66345j342426j485326
4252B7831949r82541q82713n42472q46533p78018j012817l97474j10413k85774
4243B1993194m18072m83000l15722l62018l27233J47338K73641n82651k99710
4234A9625767k68362J92260n50888k9535K59127o25574l4116K45155k17975l35822
4224A8260037k51892Q0192Q58966J94025j92617K96893K27222j72743P4889K25412
4214A9600384K83410J58310n0154O4428O33467L87795l08649P5242k55530K66898
4204B0855601m55845j23494j9052O6741l523J10550j26657n9498K52426n26805
4194A9970444K28994J58193q9982L36824K96925O5335L99947N6784O24909P92993
$$ y = [33598899, 33749857, 33131699, 32842957, 32575111, 31924140, 31026046, 30659701, 29317275, 27831949, 26849408, 25966695, 25424223, 24577690, 23799672, 22786855, 22389381, 22278968, 21993194, 21575122, 21092122, 20776400, 20414382, 20087149, 20234487, 20508128, 19925477, 19625767, 19357405, 19549665, 18998777, 18969242, 19228369, 18602795, 18568679, 18813834, 18595859, 18260037, 18008145, 18088337, 18947303, 19141328, 18948711, 19245604, 19472826, 19300083, 19374972, 19600384, 19883794, 20042104, 19991950, 20056378, 20689845, 21077640, 20768991, 20844233, 20588703, 20855601, 20399756, 20276262, 20257210, 20323951, 20320428, 20430978, 20304321, 20244823, 20497249, 19970444, 20199438, 20357631, 20267649, 20604473, 20901398, 20966733, 21366680, 21423464, 22048373, 22841366]
4184B2841366j62299J06388n5369L23474R88261L30801K31821P35200O38785N07096
4174B6485524L04926j56203K10275J72679L22549l34374q26522N58951M37385
4165B7175190j70775j69714n3207k37319P06304L01564L2689J15978O1441J39730
4155B7901881M84420K62455m92891o547R24784P0124K55660P12307Q11771P50448
4145C1674412j446P15338O10214L10732M52412Q78077M98733L40390N9675j30876
4135C5407661J16150O22938k01828J17935K67124p20973l52073K27904r0639L65237
4125C5759436j15841l3892j94612L3543P1230K42174L81702N75370L24473O41122
4115C7684705M25614J329911N98250L68410N35491Q13144Q10494P00945P59262
$$ y = [22841366, 22679067, 22785455, 22730086, 23053560, 24041821, 24372622, 24604443, 25339643, 25978428, 26485524, 26790450, 26634247, 26844522, 27017201, 27339750, 27005376, 26178854, 26737805, 27175190, 27004415, 26834701, 26781494, 26544175, 27250479, 27552043, 27584732, 27700710, 27762151, 27901881, 28386301, 28648756, 28155865, 28149318, 29074102, 29144226, 29399886, 30112193, 30923964, 31674412, 31672966, 32388304, 32998518, 33309250, 33761662, 34639739, 35138472, 35478862, 35538537, 35407661, 35523811, 36146749, 35944921, 36062856, 36329980, 35609007, 35256934, 35484838, 35394199, 35759436, 35643595, 35609703, 35415091, 35448634, 35519864, 35762038, 36143740, 36719110, 37043583, 37684705, 38110319, 39440230, 40038480, 40406890, 40942381, 41755525, 42566019, 43266964, 44026226]
4106D4026226P69750M45417Q51128Q94967P31461J096405Q80989O53286J216879
4097E1566508R42902R68505L43180J034202J571189P54396J406956J629387J024185
4088F1241410J442057J925843K011576J953329J684898K155453K707019K576651
4080G7698236K551924L491477L498295M312010M626774N043234N889562O916274
4072A14027786O476294P533266Q429931R041399R123231Q132849P745465P937462
4064A78447683P917520P191929N915745M901780J811968m59345l852621o272595
4056A95602064p864963q806719r706851r318951p699238o098120n657697m038037
4048A36411488k172127j713762j583555j581692k474569k649768k156712k113404
$$ y = [44026226, 44795976, 45241393, 46092521, 46987488, 47718949, 48815354, 49696343, 50349629, 51566508, 52509410, 53477915, 53821095, 54855297, 56426486, 57180882, 58587838, 60217225, 61241410, 62683467, 64609310, 66620886, 68574215, 70259113, 72414566, 75121585, 77698236, 80250160, 83741637, 87239932, 91551942, 96178716, 101221950, 107111512, 114027786, 120504080, 128037346, 136467277, 145508676, 154631907, 162764756, 170510221, 178447683, 186365203, 193557132, 199472877, 204374657, 206186625, 205727280, 201874659, 195602064, 187737101, 178930382, 169223531, 159904580, 152205342, 146107222, 140449525, 136411488, 134239361, 132525599, 130942044, 129360352, 126885783, 124236015, 122079303, 119965899]
4040A19965899j182374m71845j68493J002560K140356K919869L406460M317939
4032A31930371N437210O996590P745147J0175806J1385295J2999193J4545743
4025B01215355J3124504Q503066n34523q668545j3294963j6000178j5622399j4637771
4017A54084546j3344378j1147073r000399q350117o729098n552530n513339m299604
4009I0148008m014014l368584l495929k957542k988633k698018k215233k366458
4001F6043597k508964k165790k016984j669179k247035k051272j662785j560521
3993E0161067r55458j069992r99214q27609j089931j630622r12858p64031j146575
3984D0764777j168653p69108p15284o99326l66957p95905q42506k09487J90558
$$ y = [119965899, 118783525, 118311680, 118143187, 119145747, 121286103, 124205972, 127612432, 131930371, 137367581, 144364171, 152109318, 162285124, 173670419, 186669612, 201215355, 214339859, 222842925, 222308402, 213639857, 200344894, 184344716, 168722317, 154084546, 140740168, 129593095, 120592696, 112242579, 105513481, 99960951, 94447612, 90148008, 86133994, 82765410, 79269481, 76311939, 73323306, 70625288, 68410055, 66043597, 63534633, 61368843, 59351859, 57682680, 55435645, 53384373, 51721588, 50161067, 49205609, 48135617, 47136403, 46308794, 45218863, 43588241, 42675383, 41911352, 40764777, 39596124, 38827016, 38111732, 37412406, 37045449, 36249544, 35407038, 35197551, 35388109]
3975C5388109m88798j34631p55515n16290k42807m37470m40551j82960j15682
3966C2073405o05229r21846j19861k85701K9742n16827k09028M92671p56615j81392
3956B8999319Q545k25956K59831k6645M47579j5210J55962J48972m1383n92727
3946B9118287k94413J01235N07745N48765p4594j63597M51262M14232O9914M53801
3936C1132637J16685r5135P1147K84345M92841K16698k21940J17685K04101q8414
3926C2230650J95987R0968P53409j70274j87867k41146l70145n74258l68033L2202
3916C1391493n86031p57569Q5129m84043m82810J91645j82565J54479l66417l92514
3906B8570797k04260K30592p86486o23249l90832o94358k61882J77998m28532
$$ y = [35388109, 34899311, 34764680, 34009165, 33492875, 33250068, 32812598, 32372047, 32189087, 32073405, 31468176, 30546330, 30426469, 30140768, 30170510, 29653683, 29444655, 29937326, 29180711, 28999319, 29007864, 28781908, 29041739, 29015094, 29462673, 29447463, 29603425, 29752397, 29711014, 29118287, 28823874, 28925109, 29432854, 29981619, 29907025, 29743428, 30194690, 30608922, 30678836, 31132637, 31249322, 31154187, 31225334, 31509679, 32002520, 32219218, 31997278, 32114963, 32319064, 32230650, 32426637, 32517605, 33271014, 33100740, 32912873, 32671727, 32301582, 31727324, 31359291, 31391493, 30805462, 30047893, 30133022, 29648979, 29166169, 29357814, 29175249, 29329728, 28963311, 28570797, 28366537, 28597129, 27810643, 27187394, 26796562, 26102204, 25840322, 26018320, 25589788]
3897B5589788M4004O3972M94608J97229k9768k20095k53490J08060m44229l05060
3887B5245019j296371q46703J93915o19348m63121o88357l54861J9235o03304
3878B0586104p77550J36027J0222n49709m90162M72222J10201p18912K66168L7822
3868A9082433k33170J41183l99178k69377k0581K58826J47735o844l14851j86393
3858A8199783J37380l61059k07506k23704O76329K86k01506o2610j73479M20150
3848A8204064p9525L511n96726j86924K68734N07126j67166m60550J42899O16211
3838A8251654l01784r39917M42753L63557k00812K90835k59481j61682P43939
3829A8229062M32246m24655M36198M84813J33671k81596J01847k22617j27779
$$ y = [25589788, 25633792, 25697764, 26192372, 26389601, 26359833, 26139738, 25886248, 25994308, 25550079, 25245019, 23948648, 23101945, 23295860, 22676512, 22213391, 21525034, 21170173, 21189408, 20586104, 19808554, 19944581, 19954803, 19405094, 18914932, 19387154, 19497355, 18778443, 19044611, 19082433, 18849263, 18990446, 18591268, 18321891, 18301310, 18560136, 18707871, 18701027, 18386176, 18199783, 18337163, 17976104, 17768598, 17544894, 18221223, 18221509, 18020003, 17957393, 17783914, 18204064, 18124539, 18128050, 17531324, 17344400, 17613134, 18120260, 17953094, 17492544, 17635443, 18251654, 17949870, 17009953, 17452706, 17816263, 17615451, 17906286, 17646805, 17485123, 18229062, 18661308, 18236653, 18672851, 19157664, 19291335, 19009739, 19111586, 18888969, 18761190]
3820A8761190O7186r0730K83780l24561j85288Q9823J8367K24516N36874L83093
3810A9764250J18129m41826k40689N7210J90421K69422j5381k35715M5969L03653
3800A9815443k48275M5359O6309k72826l3066r1945N45830l03740K45378P47334
3790B0515801J00122m19468n1691m871J19086M99222O42004J78787K17483k05536
3780B1590939L34432Q73337M40966M6474L5478p3429J45029O94990N85127J9423
3770B4692766J72038M44198O71821L65254L90361J258729K15023o5506N08492
3761B8653176J79963K71158R50060J99260J85536L19109P47649P48806J128655
3752C3383372Q19556O07721J013364O62327Q39616J121036J340602J364669J880338
$$ y = [18761190, 18828376, 18737646, 19021426, 18696865, 18511577, 18601400, 18619767, 18844283, 19381157, 19764250, 19882379, 19440553, 19199864, 19257074, 19447495, 19716917, 19701536, 19465821, 19511790, 19815443, 19567168, 19612527, 19678836, 19406010, 19372944, 19280999, 19826829, 19523089, 19768467, 20515801, 20615923, 20196455, 20144764, 20139893, 20258979, 20758201, 21400205, 21578992, 21796475, 21590939, 21925371, 22798708, 23239674, 23286148, 23321626, 23248197, 23393226, 24088216, 24673343, 24692766, 24864804, 25309002, 25980823, 26346077, 26736438, 27995167, 28210190, 28144684, 28653176, 28833139, 29104297, 30054357, 30253617, 30439153, 30758262, 31505911, 32254717, 33383372, 34202928, 34810649, 35824013, 36486340, 37325956, 38446992, 39787594, 41152263, 43032601]
3743D3032601J683885J980878K306644K266425K884337L370786K612449K553748
3735F2691753K888234L051767L012905K516894K466862K177411J923498O73369
3727H1402693M77342L83301l28384k59864o89894q94288k00822r03297q59501
3718G8127286j20415l68708l27345j252146j429081k174665k275825k012801k808171
3709F5358129k958009k428564l007713k951144k731037k780884k504362j870776
3701D4125640j921395j516994j425497j497678p14189m70773q44450r33058m57838
3692C4343768n03206o50987j498108p6976k45510q57360j14374m6192o39013r40747
3682B8771295J34661L3830M3899N822p24172l11230j85908j29254K8988k04154
$$ y = [43032601, 44716486, 46697364, 49004008, 51270433, 54154770, 57525556, 60138005, 62691753, 65579987, 68631754, 71644659, 74161553, 76628415, 78805826, 80729324, 81402693, 81880035, 82263336, 81934952, 81675088, 80985194, 80090906, 79890084, 78986787, 78127286, 78006871, 77638163, 77310818, 76058672, 74629591, 72454926, 70179101, 68166300, 65358129, 62400120, 59971556, 56963843, 54012699, 51281662, 48500778, 45996416, 44125640, 42204245, 40687251, 39261754, 37764076, 37049887, 36579114, 35734664, 34801606, 34343768, 33840562, 33189575, 31691467, 31614491, 31368981, 30511621, 30397247, 30351055, 29712042, 28771295, 28905956, 28939786, 28983685, 28989507, 28265335, 27954105, 27768197, 27638943, 27667931, 27463777]
3672B7463777J47160K90113N03598l23034o66022Q0804o25137N538O21121m03763
3662B7094155m91099J56757j34917k38918m02868L53448J75323o47746O8263k758
3652B5929640o08934p10254K4093L43139l38313k45299j69801R0194m47668O7064
3642B3933861Q54090j2245j40987L46058q9226J0438L85315l73609L40584M33675
3632B5687954O59421K21240n82587K5701N69023K35158J13157j27913K14416P01289
3622B7716859N43570K84620M46855m29961r9911O46717K46893L56013P42153N59292
3612C1013100Q21618L36096N67566J048209M72456P50821J063983O48828J082411
3603C7805088J364582R19612Q88568P30175J348377N77668L81727k90827L8276
$$ y = [27463777, 27610937, 27901050, 28404648, 28081614, 27415592, 27496396, 26871259, 26876797, 27497918, 27094155, 26603056, 26759813, 26624896, 26385978, 25983110, 26336558, 26511881, 25864135, 25932398, 25929640, 25320706, 24610452, 24634545, 24977684, 24639371, 24394072, 24224271, 24314465, 23866797, 23933861, 24787951, 24775706, 24634719, 24980777, 24891551, 24901989, 25287304, 24913695, 25254279, 25687954, 26347375, 26568615, 25986028, 26011729, 26580752, 26815910, 26929067, 26801154, 27015570, 27716859, 28260429, 28545049, 28991904, 28561943, 28462032, 29108749, 29355642, 29711655, 30453808, 31013100, 31834718, 32170814, 32738380, 33786589, 34259045, 35009866, 36073849, 36722677, 37805088, 39169670, 40089282, 40977850, 41708025, 43056402, 43634070, 44015797, 43724970, 43763246]
3594D3763246Q36976j81146k28671J230510M46640j47328K14705Q38934R35148
3585D7709014N69051O77525Q01752P90286N02772M41936J020629Q28108R45078
3576E4286151M14561N82185R23968J127735R66706J306597J653050J702926J890586
3567F4854465K458966K694763K036960K617511L398152L121600K859571L827673
3559H7869661L133301L403308L491824M008206M011336M242563M360875N018832
3551A19539906M308121L650338M074858L958636L213584K283002J603708N88341
3543A43220494O11013n82317j199099p61039q12703j347128j191007j111939j331835
3534A35494440j541148j142485j368539j940594j993999k400709k579153j985726
$$ y = [43763246, 44600222, 44419076, 44190405, 45420915, 45867555, 45720227, 45934932, 46773866, 47709014, 48278065, 48955590, 49757342, 50547628, 51050400, 51492336, 52512965, 53341073, 54286151, 54700712, 55282897, 56206865, 57334600, 58301306, 59607903, 61260953, 62963879, 64854465, 67313431, 70008194, 72045154, 74662665, 78060817, 81182417, 84041988, 87869661, 91002962, 94406270, 97898094, 101906300, 105917636, 110160199, 114521074, 119539906, 123848027, 127498365, 131573223, 135531859, 138745443, 141028445, 142632153, 143220494, 143831507, 143249190, 142050091, 141289052, 140476349, 139129221, 137938214, 136826275, 135494440, 133953292, 132810807, 131442268, 129501674, 127507675, 125106966, 122527813, 120542087]
3526A20542087k015609k349166k426771k103577k108952k384119j892456r76621
3518A04284816k093797j726916k042875k726696k094378j992444j894507j678152
3510H8035051j570636j566251j155100j476610j465238o10387q33533j208276
3502G8149020j497993j349529j110091j703034j889729j619936j171627j508600
3494F6298481k059853k007591j260137j664283j741347j469514o86372j717461
3486E3691923j448127q00458n02690r14790q66791j260467j227010o35555p98860
3477D5237175p45394j093088j105024j136630j329725p00334r94519p75867l80336
3468C6976258j279323j169500p28164k00897k81954r24846m31815q12828q13269
$$ y = [120542087, 118526478, 116177312, 113750541, 111646964, 109538012, 107153893, 105261437, 104284816, 102191019, 100464103, 98421228, 95694532, 93600154, 91607710, 89713203, 88035051, 86464415, 84898164, 83743064, 82266454, 80801216, 80190829, 79357296, 78149020, 76651027, 75301498, 74191407, 72488373, 70598644, 68978708, 67807081, 66298481, 64238628, 62231037, 60970900, 59306617, 57565270, 56095756, 55409384, 53691923, 52243796, 51443338, 50940648, 50025858, 49159067, 47898600, 46671590, 46036035, 45237175, 44491781, 43398693, 42293669, 41157039, 39827314, 39126980, 38132461, 37356594, 36976258, 35696935, 34527435, 33799271, 33598374, 33316420, 32391574, 31959759, 31146931, 30333662]
3459C0333662j59759m95686J1217m05069l95041n90942k62486k26220o74875M97546
3449B7632347M2027j56950k65281j87133J13056Q0842j096625k94356j07528N7752
3439B5818151j71207l39106N98076m40326n02703P6614K05991L04256L43843j43133
3429B5750456k10691m5837Q27035J10246o57134O34405K79366l88073O68894M70675
3419B7439342L36282M00798K0418L02028L89634P56956R68520k19904N38917N99100
3409C1532091M71754R15568J153823O42712P99409P19643M26999M46066L12608
3400C7420673O58925j60466K86336O36384j40902j52350m74566l00594m88939
3391C7284501j96268n42570l62744L30392J186k1812p8430K25771M16655j33169
$$ y = [30333662, 30173903, 29678217, 29689434, 29284365, 28889324, 28298382, 28035896, 27809676, 27134801, 27632347, 27674374, 27517424, 27252143, 27065010, 27178066, 27258908, 26162283, 25867927, 25760399, 25818151, 25646944, 25307838, 25905914, 25465588, 24962885, 25039499, 25245490, 25549746, 25893589, 25750456, 25539765, 25493928, 26320963, 26431209, 25774075, 26408480, 26687846, 26299773, 26968667, 27439342, 27775624, 28176422, 28196840, 28498868, 28888502, 29645458, 30613978, 30394074, 30932991, 31532091, 32003845, 32919413, 34073236, 34715948, 35515357, 36235000, 36661999, 37108065, 37420673, 38079598, 37919132, 38205468, 38841852, 38700950, 38548600, 38074034, 37773440, 37284501, 37088233, 36545663, 36182919, 36513311, 36514497, 36492685, 36414255, 36640026, 37056681, 36923512]
3381C6923512N32859J412280R06491K51076L92134P08662J263125O32171N26929
3372D3549239Q48920J166485J283359R95769O85484P65705J372016J381844J259019
3363E3307840O73358J065202J629870J086574J713874J424754J599600J572488
3355F4073560J110518J910399K249698J806258J340959J676992R02376Q66797
3347G5937557Q32594j84903K74556n62231n39222J53161j159133j204055m0194
3338G3508130r85745r02184r14323j50019P5996j7123l90082N24618O75104J97281
3328G1621653J272404J380286J940169K014286K117307J968442K149531J960799
3320H6424877L338550K924724L182374L527925L343648M017768M132371L711818
$$ y = [36923512, 37456371, 38868651, 39775142, 40026218, 40418352, 41127014, 42390139, 43022310, 43549239, 44398159, 45564644, 46848003, 47843772, 48529256, 49294961, 50666977, 52048821, 53307840, 53981198, 55046400, 56676270, 57762844, 59476718, 60901472, 62501072, 64073560, 65184078, 67094477, 69344175, 71150433, 72491392, 74168384, 75070760, 75937557, 76770151, 76585248, 76859804, 76297573, 75758351, 75911512, 74752379, 73548324, 73508130, 72522385, 71620201, 70705878, 70555859, 70631855, 70614732, 70224650, 70749268, 71424372, 71621653, 72894057, 74274343, 76214512, 78228798, 80346105, 82314547, 84464078, 86424877, 89763427, 92688151, 95870525, 99398450, 102742098, 106759866, 110892237, 114604055]
3312A14604055L843052L530694K594097K441366L651592K080699K187416K504212
3304A37437183K629092K332782K908183L639820L109790L658691M312490L614710
3296A63642741L283473K740773K403200K278667J787240J255256J05170q34364
3288A76662156j038338j729456j704574j947203j644354k091633j627597k026408
3280A62852593j996103j942103j753580k014445k066816j666019k143966j812940
3272A47456621k171880k438674k939213k113701k539511j926852j916606j970859
3264A29439325j825149j112585p66825m21354Q290K39142M92572J325724J682612
3255A29061752K565568K699664L588283M514219M833317M885921O420050O857434
$$ y = [114604055, 118447107, 121977801, 124571898, 127013264, 130664856, 132745555, 134932971, 137437183, 140066275, 142399057, 145307240, 148947060, 152056850, 155715541, 160028031, 163642741, 166926214, 169666987, 172070187, 174348854, 176136094, 177391350, 177496520, 176662156, 175623818, 173894362, 172189788, 170242585, 168598231, 166506598, 164879001, 162852593, 160856490, 158914387, 157160807, 155146362, 153079546, 151413527, 149269561, 147456621, 145284741, 142846067, 139906854, 137793153, 135253642, 133326790, 131410184, 129439325, 127614176, 126501591, 125734766, 125313412, 125321702, 125560844, 126053416, 127379140, 129061752, 131627320, 134326984, 137915267, 142429486, 147262803, 152148724, 158568774, 165426208]
3247A65426208P231119Q033747Q231172P748793P431544N983059M737657K016866
3239B16840165j557473m737938p119553r078284j0732717j0906062j0275590r383741
3231A53048807r010360p472403o596019n975275m896682m735375m009229l944866
3223A06408598l030814j878902k459955j357216j410600j247485j533046j032042
3215I2458538r28968j305447q79742q63060l28751K81743K07434O98180P58312
3206I0098239J582354J533313J377535K120066J922309J439697J405515J676796
3198A03155824J321809R80339n2657L1440K15121o45065l18538m72363r66081
3189A03249829l56254m57465r89665o83817j154991j492068j895668k370305l038354
$$ y = [165426208, 172657327, 180691074, 188922246, 196671039, 204102583, 210085642, 214823299, 216840165, 215282692, 210544754, 203425201, 194346917, 183614200, 172708138, 162432548, 153048807, 144038447, 136566044, 129970025, 123994750, 119098068, 114362693, 110353464, 106408598, 103377784, 101498882, 99038927, 97681711, 96271111, 95023626, 93490580, 92458538, 91529570, 90224123, 89344381, 88481321, 88152570, 88434313, 88641747, 89339927, 90098239, 91680593, 93213906, 94591441, 96711507, 98633816, 100073513, 101479028, 103155824, 104477633, 105457972, 105405315, 105436755, 105651876, 105006811, 104688273, 104215910, 103249829, 102893575, 102436110, 101446445, 100762628, 99607637, 98115569, 96219901, 93849596, 90811242]
3180I0811242k559315l050335k866536l067554k802940k340213l023528k428292
3172F8672529k485119j562438k098140j154875q01154n84107q30942j076323n13238
3163E7566193j62505j36874p10494J5536n5482J55154J18931J164820O24026Q8383
3153E8667688N22790M59461R77853J513725J408450J708294J994647J961107K727895
3144G1941910K836870M143712L824694M396102M799055N073835N115783N306772
3136A07438733N201723M134637L711187K392088J386500K93369l55964k423158
3128A21779115l710671m160526m495068n060967n653551n415001n050530n534342
3120H2698459m156354l572303m122281l986806l137468k452955l024355k194724
$$ y = [90811242, 88251927, 85201592, 82335056, 79267502, 76464562, 74124349, 71100821, 68672529, 66187410, 64624972, 62526832, 61371957, 60570803, 59986696, 59155754, 58079431, 57566193, 57403688, 57266814, 56556320, 56571856, 56516374, 56671528, 56790459, 57955279, 58579305, 58667688, 59190478, 59649939, 60627792, 62141517, 63549967, 65258261, 67252908, 69214015, 71941910, 74778780, 78922492, 82747186, 87143288, 91942343, 97016178, 102131961, 107438733, 112640456, 116775093, 120486280, 122878368, 124264868, 124558237, 124202273, 121779115, 118068444, 113907918, 109412850, 104351883, 98698332, 93283331, 88232801, 82698459, 78542105, 74969802, 70847521, 66860715, 63723247, 61270292, 58245937, 56051213]
3112E6051213j145355j553342j713277j845971j980281r41005k28718j321989
3104D5321275j375079p79416r44581j117080j134696n98865r08406q66167j148884
3095C6448101o91874p06219r70998n46603j66944p13381q90361K09002l01589
3086C1669134q12647k07239m48312j70495k83132q29635l72229R0241l84983Q7834
3076B8338537m76863j24335n9156k33880k42224O4981j71471J12750K252L58672
3066B7569263k32944o23316J28697n6822K85107L81066m9204m05190K51163l05518
3056B6942302O64925J31558J80068M74751P39910N27889M50109Q57693N12653
3047C1481858L22203J201625O77809L24529J623148J273408J139208L81730P97826
$$ y = [56051213, 54905858, 53352516, 51639239, 49793268, 47812987, 46871982, 46643264, 45321275, 43946196, 43166780, 42222199, 41105119, 39970423, 39371558, 38463152, 37596985, 36448101, 35756227, 35050008, 34079010, 33532407, 33365463, 32652082, 31761721, 31970723, 31669134, 30856487, 30649248, 30200936, 30030441, 29747309, 28917674, 28545445, 28635686, 28250703, 28338537, 27861674, 27737339, 27678183, 27444303, 27202079, 27267060, 27095589, 27208339, 27210591, 27569263, 27336319, 26713003, 26841700, 26784878, 27069985, 27451051, 27401847, 26996657, 27247820, 26942302, 27607227, 27738785, 27918853, 28393604, 29133514, 29661403, 30111512, 30969205, 31481858, 31804061, 33005686, 33683495, 34008024, 35631172, 36904580, 38043788, 38425518, 39223344]
3038C9223344J315105Q59330J284639J224810M56387L75681K77048O31968O60794
3029D6309106P8789J31448j31604k85141k88855l49519p32754l03137j145629
3020D3282704q64738j613579j106337o74545j096572j631748j711734j686820
3012C2896631j306693j046052j054694r95298r43088j141441q20502k20799q14431
3003B4553633n25533p25190l29313l91082n81440r2259l9461o14513n7446p17496
2993B0479900m86526j1256J04371k45118M62562k00035R3244j65212k82184j28657
2983A9621089l88612M67884J2558K88655R2046J28074j14550L0786K64752N80477
2973B0983159q8353N5308M42880j81907J98272M92219K67877M11037K0682p2488
$$ y = [39223344, 40538449, 41397779, 42682418, 43907228, 44363615, 44739296, 45016344, 45648312, 46309106, 46387895, 46519343, 46387739, 46102598, 45813743, 45464224, 44731470, 44428333, 43282704, 42417966, 40804387, 39698050, 39023505, 37926933, 36295185, 34583451, 32896631, 31589938, 30543886, 29489192, 28493894, 27550806, 26409365, 25588863, 25368064, 24553633, 24028100, 23302910, 22973597, 22582515, 22001075, 21908816, 21869355, 21254842, 21197396, 20479900, 19993374, 19982118, 20086489, 19841371, 20303933, 20103898, 20197142, 20031930, 19749746, 19621089, 19232477, 19700361, 19712919, 20001574, 20093620, 20221694, 20107144, 20137930, 20402682, 20983159, 20894806, 20950114, 21392994, 21211087, 21409359, 21901578, 22169455, 22580492, 22601174, 22528686]
2963B2528686N04091l24031j81276M83543J05960l35341P45664j04483M41247
2954B3864060J61443L6895K02289M7521M58596J07948L72734j1693J020531m12561
2944B5847763J69180O04164N09148N31485L7785R46281O05850N98058O47563L71934
2934C0869211L98696R17813J085674N63245Q68006K46924j31560L59455O03265
2925C5780729O50783M64708L58072J88232J62193L49115M71531N79245O44973
2916C9649581Q36089N59510J009774Q23361J130140L62084N62002J476139J460346
2907D7869026J276876R68649J800999K030118K373119J687964J169814J208259
2899F0384824K80859K83757M28010Q44970J351388P30809J853590K079190K025694
$$ y = [22528686, 23032777, 22708746, 22527470, 23011013, 23116973, 22781632, 23527296, 23422813, 23864060, 24025503, 24062398, 24264687, 24312208, 24770804, 24878752, 25251486, 25239793, 26260324, 25847763, 26016943, 26621107, 27130255, 27661740, 27699525, 28645806, 29251656, 29849714, 30497277, 30869211, 31267907, 32185720, 33271394, 33834639, 34702645, 34949569, 34818009, 35177464, 35780729, 36431512, 36896220, 37254292, 37442524, 37604717, 37953832, 38425363, 39004608, 39649581, 40485670, 41045180, 42054954, 42878315, 44008455, 44370539, 44932541, 46408680, 47869026, 49145902, 50114551, 51915550, 53945668, 56318787, 58006751, 59176565, 60384824, 60665683, 60949440, 61377450, 62222420, 63573808, 64304617, 66158207, 68237397, 70263091]
2890G0263091K108669J486574K555339L305704K907485L266066L869706M415155
2882I4177789M789869L829117L185193K603292J706939J695683K017791K491765
2874A16497438L000317M179938N237324O476280P581162Q864470J0167937J1828013
2866A73832879J3342188J5643308J7830085K1227434K4942072K9554294L3468786
2859C29841046L3653604L0530761K1109318P109618q645002k1510397k8576916
2852C63512032l1857183l0486471k8129718k4725792k1713493j8901439j6029288
2845A91668648j2989249j1401276r776894p415283p837314o150553n640992n821240
2837A24635847n427845m883910n107165n148643m550273m087769l742010l396354
$$ y = [70263091, 72371760, 73858334, 76413673, 79719377, 82626862, 85892928, 89762634, 94177789, 98967658, 102796775, 105981968, 108585260, 110292199, 111987882, 114005673, 116497438, 119497755, 123677693, 128915017, 135391297, 142972459, 151836929, 162004866, 173832879, 187175067, 202818375, 220648460, 241875894, 266817966, 296372260, 329841046, 363494650, 394025411, 415134729, 422244347, 413599345, 392088948, 363512032, 331654849, 301168378, 273038660, 248312868, 226599375, 207697936, 191668648, 178679399, 167278123, 157501229, 150085946, 142248632, 136098079, 130457087, 124635847, 119208002, 114324092, 109216927, 104068284, 99518011, 95430242, 91688232, 88291878]
2829H8291878l542053k877514k307577k569312k441097k216605k226724k034845
2821F8076151j967564j652590j227156j164236j242978q56033o67962j132454
2813E8165178o27824j69752k82462p63825k03891K109p3153k19666J11509q6534
2803E5851689k03839N16943L01435J19187Q5310K97852R38031L04281J179625
2794E9390514R90279O26458J543397J810627J886781K082365K464826L579167
2786G4374414L192099L680037M958765N212861O030282P315491P490902Q940407
2778A21195258R989126J0681232J1808006J1506999R977237O978550J979637l442230
2770A80673815q258026j0556279j2463960j3149663j1853276j1423924r379826
$$ y = [88291878, 84749825, 81872311, 79564734, 76995422, 74554325, 72337720, 70110996, 68076151, 66108587, 64455997, 63228841, 62064605, 60821627, 59965594, 59297632, 58165178, 57537354, 57367602, 57085140, 56321315, 56117424, 56119533, 56046380, 55826714, 55938223, 55851689, 55647850, 56164793, 56466228, 56585415, 56670725, 56968577, 57906608, 58210889, 59390514, 60380793, 61007251, 62550648, 64361275, 66248056, 68330421, 70795247, 74374414, 77566513, 81246550, 86205315, 91418176, 97448458, 104763949, 112254851, 121195258, 131184384, 141865616, 153673622, 165180621, 175157858, 182136408, 184116045, 180673815, 172415789, 161859510, 149395550, 136245887, 124392611, 112968687, 103588861]
2763A03588861q715176p510941o795704n175667n232158m407664l776609l289455
2755E8685487l356475k411805k402529k494318k076633k326297k200119j500774
2747C9916537j530763j643370j362236r60820q39981j206024r86510n59979j549198
2738B9277656m53901p27022p98001j003164r49347p40492m82855k96768o15116
2729B3210990o13738r36412q37023l12684n1191p8802n13106n16041n1901q40279
2719A8459813m04203m61705j8251k40121J07708p92402n88488l08978j54071J6540
2709A5615842j87402N6217M13123k90301k54657o87624n9227j37575j14373l99087
2699A3954936l79146j65809j80487L85122n23559n67174l67091k02680j05743
$$ y = [103588861, 94873685, 87362744, 80567040, 75391373, 70159215, 65751551, 61974942, 58685487, 55329012, 52917207, 50514678, 48020360, 45943727, 43617430, 41417311, 39916537, 38385774, 36742404, 35380168, 34419348, 33579367, 32373343, 31386833, 30826854, 29277656, 28823755, 28096733, 27298732, 26295568, 25346221, 24605729, 24122874, 23826106, 23210990, 22597252, 21660840, 20823817, 20511133, 20459942, 20381140, 19868034, 19351993, 19300092, 18459813, 18055610, 17593905, 17575654, 17335533, 17443241, 16650839, 16062351, 15753373, 15599302, 15615842, 15428440, 15484657, 15897780, 15607479, 15352822, 14665198, 14605971, 14468396, 14354023, 13954936, 13575790, 13409981, 13229494, 13614616, 13091057, 12523883, 12156792, 11954112, 11848369]
2690A1848369O21406j74747M29896l06196p5196m61904o42463K5013n40034L18114
2680A1042258k80787K52747j60203l51401j40012j04856m84633m01145J70105
2671I542073j026L30474m3702r00498J63037K92396l15241j8835N26056n58759
2661I015975l59402j84374N5700k57469L10725J34886k38110k72437n05577N9545
2651G759462Q2927l74375k58756L08338J30439k03586l33338q40342J01187M99723
2641F871679l67562M11817q7757l72189Q0935k82082r363O36157j54943j21863
2631F604829K84011l09636j40447m26854J26168N7123n62748J76204q13447L74674
2621E369877O29280j19522q9286l22828P7051M7714k48086o00530l2462M22209
$$ y = [11848369, 12469775, 12295028, 12724924, 12418728, 12343532, 11881628, 11239165, 11264178, 10724144, 11042258, 10761471, 11014218, 10854015, 10502614, 10362602, 10257746, 9773113, 9371968, 9542073, 9541047, 9871521, 9827819, 8927321, 9090358, 9382754, 9067513, 9048678, 9574734, 9015975, 8656573, 8472199, 8527899, 8270430, 8581155, 8716041, 8477931, 8205494, 7699917, 7759462, 7842389, 7468014, 7209258, 7517596, 7648035, 7444449, 7111111, 6270769, 6371956, 6871679, 6504117, 6915934, 6828177, 6455988, 6536923, 6254841, 6245478, 6881635, 6726692, 6604829, 6888840, 6579204, 6438757, 6011903, 6138071, 6195194, 5632446, 5808650, 4995203, 5369877, 5999157, 5879635, 5790349, 5467521, 5544572, 5592286, 5344200, 4743670, 4711208, 5133417]
2611E133417k86120n02856j59370M60565M93838O7796q4338m70100K39040J57497
2601E049369l7668j736j50761J6683l81786K4609J63540m55555J57324n29234
2591C854785m55154K17997p1176L36683J88621n7157M46151k56841k5373m93395
2581C685141J58939K80410j15076L92265J41882l29295j89990L32228k49496J46150
2571D253158o3849M28692p1067n3978n36867l35537j80818P2386J74212k43373
2561C442959L8713q3661j7570J62388j59474K63388r3017k40792m36986K6702
2551B902650k09003O0976q70038J94097M12993j96318J03187p27332k4223L99187
2541B046176M18935j0588k8184J27933j70595J08139l50097m6576l710K3005j59154
$$ y = [5133417, 4847297, 4344441, 4185071, 4645636, 5139474, 5207270, 5122932, 4652832, 4891872, 5049369, 5011701, 5009965, 4859204, 4875887, 4494101, 4518710, 4682250, 4226695, 4384019, 3854785, 3399631, 3617628, 3546452, 3883135, 4071756, 4014599, 4460750, 4203909, 4178536, 3685141, 3844080, 4124490, 4009414, 4401679, 4543561, 4214266, 4024276, 4356504, 4107008, 4253158, 4189309, 4618001, 4546934, 4492956, 3956089, 3620552, 3439734, 3512120, 3686332, 3442959, 3481672, 3398011, 3380441, 3542829, 3383355, 3646743, 3553726, 3312934, 2875948, 2902650, 2693647, 2754623, 1884585, 2078682, 2491675, 2295357, 2398544, 1671212, 1646989, 2046176, 2465111, 2454523, 2426339, 2554272, 2383677, 2491816, 2141719, 2095143, 2091433, 2114438, 1955284]
2530A955284Q1669j42296J90235J10224J98752k48492Q3248j92864m32696L05984
2520A909048j18049k16343l08893m42738Q6419K88534j0937L82733R9261k77289
2510A391746K06685O2228j6486J95392k18748J03235n36163L19443K14902L20313
2500B042547j02959L74976k0999j05818L41082k01326J18327k11864j056866m0583
2490A136517M39907M00166L61109k80094m71133J92846K24559j33478L23334n4211
2480B139522l08451n83503N6984k59985L40621K68264j15200l18783J83618L92075
2470A795162k46662j37510m05961j65294n01901P21086O70324N4988q15230O9690
2460A038692k54140M49258l53330N73930k54621J68990l7514j43339k45913j69159
$$ y = [1955284, 2036953, 1894657, 2084892, 2195116, 2393868, 2145376, 2228624, 2035760, 1603064, 1909048, 1790999, 1574656, 1265763, 823025, 909444, 1197978, 1187041, 1569774, 1669035, 1391746, 1598431, 1660659, 1644173, 1839565, 1620817, 1724052, 1187889, 1507332, 1722234, 2042547, 1939588, 2314564, 2293565, 2187747, 2528829, 2327503, 2445830, 2233966, 1177100, 1136517, 1576424, 1976590, 2337699, 2057605, 1586472, 1779318, 2003877, 1870399, 2193733, 2139522, 1831071, 1247568, 1304552, 1044567, 1385188, 1653452, 1538252, 1219469, 1403087, 1795162, 1548500, 1410990, 1005029, 839735, 337834, 1058920, 1729244, 1784232, 969002, 1038692, 784552, 1233810, 880480, 1454410, 1199789, 1368779, 1331265, 1187926, 942013, 772854]
2450G72854L99763L27767j12071o00422q8094N28442l52261k82520M60271K45342
2440A299071N8747k11468K24575J67736J80412m42619L67760j26596m21307K2349
2430A118660k65885k83616k74529m43131N53164J11903L94848J32397K08540j56273
2420A096078k72734o8032K78335p7867k12502L26651K67862j47080j84485N610
2410A011836k50417K5102R2994J85132N4739p6512m3190n05502K58093P06550
2400A458825r8331m65966j23014K3897K87677K34841q0688j15278J86812j69145
2390A139630L11530L68726k51138m97068j79574m0267R9559J41864l89392J33829
2380H37699J29944O1539J88191n3227J29610K99331M87159n6592M51191L4757
$$ y = [772854, 1172617, 1500384, 1388313, 787891, 699797, 1228239, 875978, 593458, 1053729, 1299071, 1357818, 1146350, 1370925, 1538661, 1719073, 1276454, 1644214, 1517618, 1096311, 1118660, 852775, 569159, 294630, -148501, 404663, 516566, 911414, 1043811, 1252351, 1096078, 823344, 755312, 1033647, 955780, 743278, 1069929, 1337791, 1190711, 1006226, 1011836, 761419, 786521, 879515, 1064647, 1119386, 1042874, 999684, 494182, 752275, 1458825, 1360494, 894528, 771514, 795411, 1083088, 1317929, 1237241, 1121963, 1308775, 1139630, 1451160, 1819886, 1568748, 1071680, 892106, 851839, 951398, 1093262, 703870, 837699, 967643, 1029182, 1217373, 1164146, 1293756, 1593087, 2080246, 2023654, 2474845, 2509602]
2370B509602m56695j74393K48554K09143l59141j295398Q5102J81639n31683j13910
2360C02820M09943j19579R0729P9609L96147M44316j37622p7222Q8761J8975q73637
2349F23240j48673l79635L47555K3643N52555O82237l17141k22769k69071j03517
2339G88424j42079J11269j7160j08502K11552K38459l31628K79286m5759k89905
2329F93957l05700L88292K65355J3297o05575j21006M67214J93444l87883m70218
2319A31177N99009j09027K51061m2016k71019K04808L91928K88517m77236K55383
2309A222585L81171o02419N7301K81635k88645l86175L09819N37637m86766m78780
2299E47363L63472k43261M01816J06714o305J38119j62783l5600L2647j9825J25922
$$ y = [2509602, 2052907, 1878514, 2127068, 2336211, 1977070, 681672, 766774, 948413, 416730, 302820, 712763, 593184, 683913, 763522, 1159669, 1603985, 1466363, 1389141, 1477902, 1496877, 623240, 474567, 94932, 442487, 466130, 1018685, 1700922, 1383781, 1161012, 891941, 788424, 646345, 757614, 740454, 631952, 843504, 1081963, 750335, 1029621, 983862, 693957, 388257, 776549, 1041904, 1055201, 449626, 328620, 795834, 989278, 601395, 131177, 730186, 621159, 872220, 830204, 559185, 763993, 1155921, 1444438, 967202, 1222585, 1603756, 1001337, 1058638, 1340273, 1051628, 665453, 975272, 1512909, 1026143, 547363, 910835, 667574, 1069390, 1176104, 1169799, 1307918, 1145135, 1109535, 1142182, 1122357, 1248279]
2288A248279K4422K28228m28241l10705l0840m44159L78853K32078J264K68547
2278A167726l40875k28345L33928k21332r0575N91357L4717K10028J15855k85132
2268A287352K0387K61753p40760J97450O03279J69764l23546l01533j34037K28398
2258A268507J8222l0448J43510K24833n167l90882j19263L06115J99085Q9309
2248A703821j79649K25324m91206k8771Q4669J02097M54688l29747L88713l80880
2238A549059k1841j21514K48370J41878j51919M1669K04540J57071J40847k48075
2228A940085k44992J05387j1596m9012r105K65112L1234j42904K02331M1832j09614
2217B018758r4046M69843o045K8875k62841N52634L85315k14764n9169O58852
$$ y = [1248279, 1272701, 1500929, 1072688, 761983, 731143, 286984, 665837, 897915, 899179, 1167726, 826851, 598506, 932434, 711102, 620527, 1211884, 1246601, 1456629, 1572484, 1287352, 1307739, 1569492, 828732, 1026182, 1629461, 1799225, 1475679, 1174146, 1040109, 1268507, 1286729, 1256281, 1399791, 1624624, 1619457, 1228575, 1109312, 1415427, 1614512, 1703821, 1524172, 1749496, 1258290, 1229519, 1314188, 1416285, 1870973, 1541226, 1929939, 1549059, 1527218, 1405704, 1654074, 1795952, 1644033, 1685702, 1890242, 2047313, 2188160, 1940085, 1695093, 1800480, 1788884, 1739872, 1730767, 1995879, 2027113, 1884209, 2086540, 2128372, 2018758, 1924712, 2394555, 2388510, 2417385, 2154544, 2707178, 3092493, 2877729, 2818560, 3477412]
2207C477412l47212k37798M96085m70843M98559l15337k67333N08894r6855m0967
2197C204605J46646k8385O87719M50265M5689K55925k05596L67194J83184m67704
2187D639542J10147J12123J3869q8618p3832K31022K31304Q4364q7882K73033
2177E445072j68425k0668P09934k76509M877O8304l8868Q2408k0548l99053P1687
2166E458211J56819O68266K03182Q0685k90801J00772m7320L82405K93560O9662
2156G075441L71418L46039J37026K49499m5205J82403O4770J22433R10729L1874
2146I446427L49387N16350O87389N45693O43404M53707M79433N87301J014356
2137A4723447P19467P22992R68853K59100O18931Q87256M44496J035236R57684
$$ y = [3477412, 3130200, 2892402, 3388487, 2917644, 3416203, 3100866, 2833533, 3342427, 3245572, 3204605, 3351251, 3322866, 4010585, 4460850, 4506539, 4762464, 4556868, 4924062, 5107246, 4639542, 4749689, 4861812, 4875681, 4787063, 4713231, 4944253, 5175557, 5259921, 5172039, 5445072, 5276647, 5255979, 5965913, 5689404, 5694281, 5762585, 5723717, 5806125, 5785577, 5386524, 5458211, 5615030, 6283296, 6486478, 6567163, 6276362, 6377134, 6329814, 6712219, 7005779, 7075441, 7446859, 7792898, 7929924, 8179423, 8134218, 8316621, 8381391, 8503824, 9414553, 9446427, 9795814, 10312164, 10999553, 11545246, 12188650, 12642357, 13121790, 13709091, 14723447, 15442914, 16165906, 17134759, 17393859, 18012790, 18900046, 19344542, 20379778, 21337462]
2128B1337462N58661R32075J289024J248399J550010K211799K550853L170485
2120C4848768L720651L113393L198665K974182L316650M515748N392791O627787
2112F7708635Q597701R991748J3780781J8319253K4793651L3256328M0119121
2105B16567218L8484142L6788093j0684879m4222023l6969498l6521659k9687363
2098A33754031k3969470j8050382j3185854r776451p135841n416716m904562l387487
2090D7927268k797023j526016l243684l495789l063474k570953j849347j925163
2082B7455819k027451j341345j733861j450920j419580j017685q60461q25645
2074A6778871j156433n33957p69833k31850n57630o59394l70971n09628j058073
$$ y = [21337462, 21896123, 22828198, 24117222, 25365621, 26915631, 29127430, 31678283, 34848768, 38569419, 41682812, 44881477, 47855659, 51172309, 55688057, 61080848, 67708635, 76306336, 86298084, 100078865, 118398118, 143191769, 176448097, 216567218, 255051360, 291839453, 281154574, 236932551, 199963053, 163441394, 133754031, 109784561, 91734179, 78548325, 68771874, 61636033, 56219317, 51314755, 47927268, 45130245, 43604229, 40360545, 36864756, 33801282, 31230329, 29380982, 27455819, 25428368, 24087023, 22353162, 20902242, 19482662, 18464977, 17604516, 16778871, 15622438, 15088481, 14318648, 14086798, 13529168, 12869774, 12498803, 11989175, 10931102]
2065A0931102o19163j6655N1469n93553n60452k92236r5240l03488M3681l91669
2055H153796j49892n19265J42837l39246j09570r1074l88410m70666j66647j3467
2045F048396o01065j19642j35786K30892J69507l90660n03894j65006k86033L63595
2035D610304j89602k58079M27593L93367k87245m78316K63641n75945m9551J93295
2025D049462N7313k84933k704k42886M726J06871o0038J29173j07909m69717j44471
2014C034887J79647k33061J73953j39502L48020o47925K1091O1155m2313o06999
2004B148953l32605k75198L53508J91481k23955O2495L88584P2423n41772K52834
1994B096748O5493M6402o2567k71807L19258n9987k09021M68161Q3323j33234
$$ y = [10931102, 10311939, 10295284, 10346753, 9753200, 9192748, 8900512, 8805272, 8501784, 8545465, 8153796, 8003904, 7484639, 7627476, 7288230, 7178660, 7087586, 6699176, 6228510, 6061863, 6048396, 5447331, 5327689, 5191903, 5422795, 5592302, 5201642, 4697748, 4532742, 4246709, 4610304, 4420702, 4162623, 4590216, 4983583, 4696338, 4218022, 4481663, 3905718, 3856167, 4049462, 4106775, 3821842, 3819138, 3576252, 3580978, 3687849, 3627811, 3756984, 3649075, 3179358, 3034887, 3214534, 2981473, 3155426, 3015924, 3363944, 2716019, 2737110, 2798265, 2755952, 2148953, 1816348, 1541150, 1894658, 2086139, 1862184, 1924679, 2313263, 2385686, 1843914, 2096748, 2162241, 2208643, 2146076, 1874269, 2193527, 2133540, 1924519, 2392680, 2476003, 2342769]
1984B342769p15501n20486j05465M66678O78760k81513L00819k11544n18142R456
1974A445831n4868k40046M29741K17685j99396p31749M33026K61850k93330k69550
1964I99194K21831L23377m58509n16325J44325K06428k17705K82071J70477k3251
1954A131913K55037l08323k1378l27634r6648l2439L75237J56153k7729j12990
1944I91199o15134K51308J14560P66468k15633J04914M38238o74588k23918L68134
1934A305548j19455K96540n29158J12957K17332o1083L43262o49935L872J97397
1924A117277j12255K28832j22449k00409k79582n38197N04508J01429J11365K87819
1914A098338l29122m68394J71119j1738K92537J91659m25463L5316R8812R5930
$$ y = [2342769, 1627268, 1106782, 1001317, 1467995, 2146755, 1865242, 2166061, 1954517, 1436375, 1445831, 1390963, 1150917, 1580658, 1798343, 1598947, 867198, 1300224, 1562074, 1268744, 999194, 1221025, 1544402, 1085893, 569568, 713893, 920321, 702616, 984687, 1155164, 1131913, 1386950, 1078627, 1057249, 729615, 632967, 600528, 975765, 1131918, 1104189, 991199, 376065, 627373, 741933, 1508401, 1292768, 1397682, 1835920, 1161332, 937414, 1305548, 1186093, 1482633, 953475, 1066432, 1283764, 1222681, 1565943, 916008, 919880, 1117277, 1005022, 1233854, 1111405, 910996, 631414, 93217, 597725, 699154, 810519, 1098338, 769216, 300822, 471941, 460203, 752740, 944399, 518936, 554252, 653064, 748994]
1904G48994m70958K8303K91326m59891K95675j68876O9993R9250j52153N1313
1894C32976k30287l24754k63529J28564R2170Q42596l18471J2448J91656k3990
1884D39379R3102M02671o7308n51315n3546J71682k91689j21830L84274N264K76838
1873F87522j78920K78945l34505J00036L37399o13193j45746L33747k61557K8285
1863B32013J96685M68034k43822l07957J8371J06681J15110O3691J38738m87083
1853C00461j96586K16098O63052p76940m5567M35199M14926n99467N6855o9940
1843C98091N58801j84694k76324M34102K50310l1139M52218N672m22728L82751
1833A567060L90870k52976k37676l65998l22650l51444j54362J24476j36169j94769
$$ y = [748994, 278036, 306339, 597665, 137774, 433449, 264573, 334566, 433816, 281663, 332976, 102689, -222065, -485594, -357030, -264860, 577736, 259265, 271713, 463369, 439379, 532481, 935152, 867844, 316529, 262983, 434665, 142976, 21146, 405420, 410684, 687522, 508602, 787547, 453042, 553078, 890477, 277284, 131538, 465285, 203728, 232013, 428698, 896732, 652910, 344953, 363324, 470005, 585115, 648806, 787544, 300461, 103875, 319973, 983025, 206085, 160518, 595717, 1010643, 411176, 468031, 398091, 956892, 772198, 495874, 929976, 1180286, 1149147, 1601365, 1607037, 1184309, 1567060, 1957930, 1704954, 1467278, 1101280, 778630, 427186, 272824, 397300, 261131, 66362]
1823F6362L15624K21216j32116J53088j53646k25760l36228K72617M03328K3553
1813F08038m44767Q6973K07929Q7635m62525k34680J18075J30980O5554Q5842
1803B49054q3783K39323j38466J3075K20008j34660k35212K26867L39063l26043
1793C69226j71878m3950J80042K11434j79181J0178N8934J70547L30148n24603
1783D10897l79341O78162m03092K60415m67575L07194O51760l58197o37744O8468
1773A30947K59939j24261q1543O0247k1646K26254o81621k37733L03182m0501
1763b06736M19367J06857j83449k35680k0064q3463q8065L93387J89254Q6639
1753C78047J51289n63020n47728O1746R01559k38545k88080m54875J07148K72633
$$ y = [66362, 381986, 603202, 471086, 624174, 470528, 244768, -91460, 181157, 584485, 608038, 163271, 250244, 458173, 545808, 83283, -151397, -33322, 97658, 163212, 249054, 165271, 404594, 266128, 279203, 499211, 364551, 129339, 356206, 695269, 369226, 197348, 153398, 333440, 544874, 365693, 375871, 434805, 605352, 935500, 410897, 31556, 709718, 306626, 567041, 99466, 406660, 1058420, 700223, 62479, 130947, 390886, 266625, 185082, 245329, 223683, 449937, -231684, -469417, -166235, -206736, 212631, 319488, 136039, -99641, -119705, -203168, -291233, 102154, 291408, 378047, 529336, -33684, -581412, -519666, 381893, 143348, -144732, -599607, -492459, -219826]
1743b19826k58211K68287K80503q264K88286L3160j71867j64702J41904K53486
1733D42756J99746l00601j20423m10318l50265L82830K40435k45104j68584J31293
1723a98235K41971k11305J7597L46164j06521M48974l81882L69439O1737j47254
1713D40685k29688n09292q1107M36533k12421J41188M19254j37723n60798j01430
1703c94799L80685K070J85217k9017k91406K03115j35668k42379j30194Q6601
1693c65775P65596J12160k45255k63882J95154N13455k13839l8750j75583n7579
1683B25702J34545m84767q5774o4151j56078Q4256J50185O23135N7882l75759
1673A09176l29893n93514M49094M47510r3012J95368K16286m65115k85432l3731
$$ y = [-219826, -478037, -209750, 70753, 62489, 350775, 383935, 212068, 47366, 189270, 442756, 642502, 341901, 221478, -188840, -539105, -156275, 84160, -160944, -329528, -198235, 43736, -167569, -149972, 196192, 89671, 538645, 156763, 526202, 587939, 440685, 210997, -298295, -379402, 57131, -155290, -14102, 405152, 267429, -293369, -394799, -14114, -12044, 173173, 144156, -147250, 55865, -79803, -322182, -452376, -365775, 399821, 511981, 266726, 2844, 197998, 711453, 497614, 458864, 283281, 225702, 360247, -124520, -210294, -274445, -430523, -346267, -196082, 427053, 484935, 109176, -220717, -814231, -365137, 82373, -10639, 184729, 401015, -64100, -349532, -383263]
1663c83263K73659l21469L20724J64342j04404l63654M33393m4381L71981O08115
1653I55043q28452n90588P5416p7679J93603J32628j24146L51509M3100n3090
1643G7344M23377l75081n9173k37794k32927K81517J15186M12102J8136k10390
1633B12297M77585q61466J25987L52915L34750k04353M41638k50756m19267J24496
1623C33826j0926L60757o12055l45189K7548J62028K52844M69209p6325l82927
1613A78790l16458l0122l3454k2496J80140L03507j04686j69049k23331L02171
1603F5012l89910L20392m21738J12153K25015K38144j18335J97155j80143J44303
1593A92048L94815o19240L04608J96318J61162j63773m24377J37216l70511q5092
$$ y = [-383263, -109604, -431073, -110349, 53993, -50411, -414065, 19328, -25053, 346928, 955043, 126591, -463997, -388581, -466260, -272657, -140029, -264175, 87334, 130434, 77344, 500721, 125640, 66467, -171327, -404254, -122737, -7551, 404551, 422687, 212297, 689882, -171584, -45597, 307318, 642068, 437715, 879353, 628597, 209330, 333826, 322900, 683657, 71602, -273587, -246039, -84011, 168833, 638042, 561717, 178790, -137668, -167790, -201244, -223740, -43600, 259907, 155221, -13828, -237159, 65012, -324898, -4506, -426244, -314091, -89076, 149068, 30733, 227888, 47745, 192048, 586863, -32377, 272231, 468549, 629711, 465938, 41561, 178777, -191734, -276826]
1583b76826J77468j36496k5870M39284n69171J06609M7483K57824L04407m99332
1573a74620Q3551L45108k77099l60255o6546N33725k17535k53132P6857J32792
1563a77154r1972J44736J84351r1877p7847L02281m81090l30154O28977J87296
1553A97547K20010j5194m66704l49418Q379M35540K61382J78601J51541l99975
1543B21709k90938j46839j7677q501l32733K38496L92174j77240K83870n72495
1533d10174q1287M88075M13552m31350l52835M88271J11064O4483L61856n1779
1523E99876j3603o25385j27804k1356m5615M47830R9691k62404K51359O6290o9978
1512B98901k04728K77173q7203m38036O78256o99395l62980K98139q3296j08723
$$ y = [-276826, -99358, -235854, -261724, 177560, -391611, -285002, -237519, 20305, 324712, -174620, -91069, 254039, -23060, -383315, -449861, 83864, -133671, -386803, -309946, -177154, -269126, -124390, 59961, -31916, -109763, 192518, -288572, -618726, 10251, 197547, 417557, 402363, -64341, -413759, -405380, 30160, 291542, 470143, 621684, 221709, -69229, -216068, -233745, -242246, -574979, -336483, 55691, -121549, 162321, -410174, -491461, -3386, 410166, -21184, -374019, 114252, 225316, 289799, 651655, 599876, 586273, -39112, -166916, -188272, -233887, 213943, 313634, 51230, 302589, 368879, 298901, 94173, 371346, 284143, -153893, 524363, -175032, -538012, -239873, -323169, -431892]
1502d31892l98615L34820N54037l97690M8364O51318k1462J16384n2046l27623
1492G5595J52874K0939n14216J28550j52696L53962j17000K3902j65424J64485
1482b9029k49300m0941J37675j20953M30344j96871j87926K45169R2252k57083
1472a76663L61487j08975k55876j83853j21016M03922N23832q6372k51853N16379
1462F21012N9086r52250K5885L2624L46295Q2077k30137N24877m84857m2668m5085
1451f3141n05619K02474O44901j12061l66362j85092J10455m90142L32896L6757
1441c94934k03372J78775k70648M82531J914J24619J17588P971k2948J69964l0832
1430A60628j24920n2933K79293K59858k39706j99385N7729N9146j1708l24994
$$ y = [-431892, -830507, -495687, 58350, -339340, -290976, 360342, 338880, 455264, 403218, 75595, 228469, 249408, -264808, -136258, -288954, 65008, -51992, -28090, -193514, -29029, -278329, -319270, -181595, -302548, 127796, -69075, -257001, -11832, 80420, -176663, 184824, 75849, -180027, -363880, -484896, -80974, 442858, 356486, 104633, 621012, 680098, -272152, -246267, -213643, 132652, 214729, -15408, 509469, 24612, -18056, -63141, -568760, -366286, 278615, 166554, -199808, -384900, -274445, -764587, -431691, -394934, -598306, -419531, -690179, -207648, -205734, -81115, 36473, 44444, 21496, 191460, 160628, 35708, -17225, 262068, 521926, 282220, 82835, 140564, 199710, 188002, -136992]
1420a36992J61274n6685n25754N5596N27844L44787o02258r5367N26251l12470
1410a13774j44713L10257j16308m07899j27069J64899o9792K93834J71417J04297
1400F5149m40892O7801J43852J91299N5272j68847M67530l27007k00785p65833
1390i12461N57258J5138n00381K75244M25243o0223j51697M36636k7592Q4338
1380A41503K37485J39229n97248J32J53786J98236j81652r9555k9625M09070j10714
1369B60647p22516j43193k07225O38893K41109J01399k28330j9680r9388j98810
1359c77094J41748J48287J36161k4148J37406L27748m05305l27450k90713M13345
1349a20015K24372j95950J41412l39398J96839J96701Q552l1621m23365O72558
$$ y = [-136992, 24282, -32403, -558157, -502561, 25283, 370070, -232188, -327555, 198696, -113774, -258487, 51770, -64538, -472437, -599506, -434607, -504399, -210565, -39148, 65149, -375743, -307942, -164090, 27209, 82481, -86366, 381164, 54157, -146628, -912461, -355203, -340065, -840446, -565202, -139959, -200182, -351879, 84757, 57165, 141503, 378988, 518217, -79031, -78899, 74887, 273123, 91471, -8084, -37709, 371361, 260647, -461869, -605062, -812287, -173394, 67715, 169114, -59216, -78896, -178284, -377094, -235346, -87059, 49102, 24954, 162360, 490108, 84803, -242647, -533360, -120015, 104357, -91593, 49819, -289579, -92740, 103961, 112513, 80892, -342473, 330085]
1339C30085J93713j70498J17128N7651j38138n97735n07642O56857K69664k93002
1329h1917m22695O7097J49448k0463j65214L75953m6305j77404M4844J75621L40885
1318B39850P5378l70450L46944l91106K7125J54154o36274P92942J28077j24816
1308B41824m54239K08635M39522n52014R3013L52391k96930O5602J83304j85747
1298I5361k9486K86246j1106K8895k58295j71895N4471l01401n4401K42588j87985
1287c07008q623j00137L57449N23496L01669p03830R7178K28745m67966n36530
1277f15557K89005m3542K68496m34822K41883M21709J39615o72698m9301l02895
1267g58107M87717N46402k64685k99423M74323J7243j79157k3732N9202r0461
$$ y = [330085, 523798, 353300, 470428, 528079, 389941, -207794, -715436, -58579, 211085, -81917, -504612, -437515, -288067, -308530, -473744, -97791, -144096, -321500, -276656, -101035, 239850, 315228, -55222, 291722, -99384, -72259, 81895, -554379, 238563, 366640, 241824, -212415, -3780, 435742, -116272, -23259, 329132, 32202, 97804, 281108, 95361, 65875, 352121, 341015, 369910, 111615, -60280, -5809, -307210, -361611, -119023, -307008, -315631, -415768, -58319, 465177, 766846, 63016, 160194, 388939, -79027, -615557, -326552, -370094, -101598, -536420, -294537, 127172, 266787, -405911, -455212, -758107, -270390, 276012, 11327, -288096, 186227, 203470, 24313, 581, 59783, -30678]
1257c0678M0558k75051J792M55887j11362j54161j71279K01726p5515K00167M7553
1246A29637M73100n80503j25356J02474L15633k24385r9687N08245o23396j42970
1236b67208M76498j0604K22081k28260K75645J50309j003490m94075J94527r1002
1226g75579M74390J44603N65815j08382n99693r5092L25676P2358j43908k23699
1216c63511J71995l9607m0717k30036n00441L27353M61462N5457J55095k59683
1206b62633M68306J71233m42739p6031M5073J14043j25481j19447Q6098J63645
1196B2067j49938L01816l16407k36451L55620J71394k20671o6207l00118k2115
1186d61010j9120k98383L88911K20793J39782N1474j83584N4141J03383J83450
$$ y = [-30678, 9880, -265171, -263379, 192508, 81146, -73015, -244294, -42568, -118083, 82084, 129637, 602737, 22234, -103122, -648, 314985, 90600, -9087, 499158, -124238, -267208, 209290, 198686, 420767, 192507, 468152, 618461, -385029, -879104, -684577, -775579, -301189, -156586, 409229, 300847, -298846, -393938, -68262, 4096, -139812, -363511, -191516, -231123, -271840, -501876, -1002317, -674964, -213502, -158045, -2950, -262633, 205673, 376906, -65833, -141864, -96791, 17252, -108229, -227676, -141578, 22067, -127871, 173945, -142462, -378913, -23293, 148101, -72570, -138777, -438895, -461010, -480130, -778513, -389602, -168809, -29027, 22447, -161137, -106996, -3613, 179837]
1176A79837R8756O6918q5126l79584l35762J46262K12425k72258J77180L7816
1166a53536j0333N6618K19298K13260k89824L81423K75112Q3877k06971o23316
1156e4392J28804K43431J19019l91253O1206k14997j55136N06269J78661k15037
1146B06575j90692o5628Q36385j21530n42637l24771K32440L25265p69977j05553
1136e20123L83723p841L22657m6157J58476J12319J6246k12832n02138P37852
1126D42182J07351J54424j33914k36087L57431k0201k85582j66586k05501l85341
1116c71824k20731L30031j40860K64165J98601j96309J94148l10480q8922K86915
1106e5266j33744K22395K57332j11836J8862J85528j79599j92948m5526K58924
$$ y = [179837, 278593, 345511, 260385, -119199, -454961, -308699, -96274, -368532, -191352, -153536, -163869, -107251, 112047, 325307, 35483, 416906, 692018, 775895, 568924, -54392, 74412, 317843, 436862, 45609, 106815, -108182, -263318, 242951, 421612, 206575, 15883, -49745, 786640, 665110, 122473, -202298, 30142, 355407, -414570, -520123, -136400, -144241, 178416, 132259, 290735, 403054, 419300, 206468, -295670, 442182, 549533, 703957, 570043, 333956, 691387, 671186, 385604, 219018, 13517, -371824, -592555, -262524, -403384, -139219, 59382, -136927, 57221, -253259, -342181, -55266, -189010, 33385, 290717, 178881, 197743, 383271, 203672, 10724, -34802, 224122]
1096B24122k93498r285j35614q5150N52983o942J9428k7889J11045n26708J76076
1085a432K38535l54835Q8502L85947l77089l9070P62k24727j08438M7860M99143
1074A55158O9864j01909K89244j13951n94426N82800L6319n64182p8622L61248
1064D1543K16331M9316k11135j08378R517P0811J60503k97984L497l58551j34439
1053e58969L99872j59951O28376O3145k20004k13596j59836l90013J26070J20390
1043c64516M62216K2955J07204j05381R4323L6583j97316j4865L02384n8406k27110
1032E8071L14935m29177k20798L16737m88291L48326K08140m04253l3134q1263
1022d10707O90481J85821r5813k97191m29713J16657M03718m45016j70979K17277
$$ y = [224122, -69376, -78661, -214275, -299425, 253558, 246616, 266044, 238155, 349200, -177508, -1432, 237103, -117732, -29230, 356717, -20372, -59442, -58680, -283407, -391845, -343985, 155158, 225022, 123113, 412357, 298406, -296020, 286780, 323099, -241083, -319705, 41543, 257874, 307190, 96055, -12323, -2806, 68005, 228508, -69476, -65979, -424530, -558969, -159097, -319048, 309328, 372473, 152469, -61127, -220963, -610976, -484906, -364516, 97700, 120655, 227859, 122478, 216801, 253384, 56068, 41203, 343587, 285181, 58071, 373006, -56171, -276969, 39768, -448523, -100197, 107943, -296310, -329444, -410707, 279774, 465595, 369782, 72591, -357122, -240465, 163253, -281763, -452742, -235465]
1012b35465n3888K73500K03563l69031j59429K22821K77069K10365j84287l1607
1002A53611J78786m20841J1690m8629o3015q4410J40325L60258K58883l0194k10459
991B46005k58335Q30556J16278o8095k53658n03875k20021K70128M2222J61167
981C62372J76999m25165j36393J54902P048L20535M1150J1311l53251l23626n0060
970b14178l48749N9104J71544L93693M4829k65432n2260J59902m01169M62083
960I367J63232K07664O181j25479j96516M4490k1656k72486k87100J4436N70885
949A13018O6505O4212J32804m89214o8261J39581l83926J84916j76486N4212j14014
938d76653p0778K95501M46187l45538L307m0697R7766j71768O7931K19461r2655
$$ y = [-235465, -289353, -15853, 187710, -181321, -340750, -117929, 159140, 369505, 185218, 153611, 332397, -88444, -76754, -125383, -188398, -272808, -132483, 227775, 486658, 456464, 246005, -12330, 818226, 934504, 866409, 612751, 108876, -111145, 158983, 201205, 362372, 539371, 114206, -22187, 132715, 139763, 460298, 501448, 512759, 159508, -164118, -214178, -562927, -503823, -332279, 61414, 106243, -159189, -211449, -51547, -452716, 9367, 172599, 380263, 386444, 260965, 64449, 108939, 87283, -185203, -472303, -457867, 113018, 179523, 243735, 376539, -112675, -180936, -41355, -425281, -240365, -416851, -362639, -476653, -547431, -251930, 194257, -151281, -147974, -188671, -90905, -262673, -194742, 24719, -67936]
927f7936j19188q6233J62829k46295J24916P4080J55563k30411l71672J33106
917d71241M49695l43423J84927N06149k74223J09793q4956L18288n25472l51392
907d81855N20598p1013k94850L13290J1660m75367Q5079J281J77145l80266J6315
896e77983K48742K99638N41540l41380l37900k95828J61077M92879j52873n20627
886d82715R6470L45263k85493o0548J79940k38233K676J10945p1092k34119K25173
875d11733l025j36985N87582L94917j76059l68415K7473J05406M91888n32903
865b1854k55027K79517q0562j5460M03127m48379n5772N30359J25726N5503o3230
854D53948N5741n44799k25968N36170m68827J80532M995K16793j7437n09832J21605
$$ y = [-67936, -187124, -273357, -110528, -356823, -231907, -157827, -2264, -232675, -604347, -471241, -21546, -364969, -180042, 326107, 51884, 161677, 76721, 395009, -130463, -481855, 38743, -32270, -327120, -13830, -2170, -477537, -392458, -391177, -214032, -594298, -577983, -329241, -29603, 511937, 170557, -167343, -463171, -302094, 190785, 37912, -482715, -386245, -40982, -326475, -387023, -207083, -445316, -442640, -331695, -402787, -636906, -411733, -414758, -551743, 35839, 430756, 254697, -113718, -86245, 19161, 511049, -21854, -276881, 2636, -77926, -93386, 309741, -138638, -194410, 335949, 461675, 517178, 453948, 509689, -35110, -261078, 275092, -193735, -13203, -8208, 208585, 191148, -318684, -197079]
843a97079L27967k3456N14627K55710n77024J14033n43121k90056M75360m0443
833A6518l19564K78024l1273j93243L04631J49262J7139l10722Q3248r6114J43694
822D1600O77435O5373l48168n2605n04953l27037L05139k32573J10148J45159
812a20482m077Q6527K20927J43311l3551l1515N0169Q4200L59442m84188n62798
801b92035N1951j28654m68617K68429Q9154L18536K30637m45861j01751L03669
791a74542K01560q5860R2384N03771j00998m86868K15012j33439J29909l28117
781a67188m84863J96124P34369M54378r1671J27432l25836J85514K18629j53229
771F93659k27777o22005k78713L67454l7723K07225J84694K4223l8327k95435
$$ y = [-197079, 130888, 107432, 622059, 877769, 300745, 414778, -128343, -418399, 56961, 16518, -303046, -25022, -56295, -249538, 55093, 204355, 221494, -89228, -5980, -102094, 41600, 719035, 784408, 436240, 383635, -121318, -448355, -143216, -375789, -265641, -120482, -124559, -38032, 182895, 326206, 292655, 261140, 311309, 395509, 754951, 270763, -292035, -240084, -368738, -837355, -568926, -479772, -161236, 69401, -376460, -478211, -174542, 27018, -58842, 33542, 537313, 436315, -50553, 164459, 31020, 160929, -167188, -652051, -455927, 278442, 732820, 641149, 768581, 442745, 628259, 846888, 693659, 465882, -156123, -434836, -67382, -105105, 102120, 286814, 311037, 272710, -22725]
761b2725L1521M82494n88237j91272K43267k01985Q3248J49876O9490L98155l61293
750I2539K37711J81665m15777J62646k59799l54428n1351M78884j30211R1006
740C2885J9870m1348L1632l02303J53161O52907l09294m07883l33209N72517N2636
729A21571K20662j32137P5199K07140l84752k30553l27302m016n6891K24642Q5735
718b00702Q734p449J69442k32281M22372L76162j36085j25134k00250l54440P6306
707b03325K19755j09527j90284M36895k35229L94377N36502o83966m57946q8573
697c81321l2157J32247Q3969L75039q8803l04255J84752J78965K47082j030717
687f35199l03396M57573j9328L95578O93455J58622J76342O1693m4590m02417
$$ y = [-22725, 8796, 491290, -96947, -288219, -44952, -246937, -163689, -13813, 55677, 453832, 92539, 330250, 511915, 96138, 258784, -1015, -355443, -406794, 72090, -58121, 32885, 52755, 11407, 43039, -259264, -106103, 546804, 237510, -170373, -503582, 68935, 121571, 342233, 210096, 285295, 492435, 107683, -122870, -450172, -454188, -511079, -286437, -200702, -191968, -199417, -29975, -262256, 160116, 536278, 400193, 275059, 74809, -279631, -203325, 16430, -93097, -283381, 153514, -81715, 312662, 849164, 165198, -292748, -381321, -413478, -281231, -197262, 177777, 88974, -215281, -30529, 148436, 395518, -635199, -938595, -481022, -500350, -104772, 588683, 747305, 923647, 985340, 940750, 538333]
677E38333l53387n74815k54044M53317K33206j10581l86331K6727J80426J09656
667a37493L31068l72186n62249N40339k1999j39507K61068K39484j2987O52179
657G77717K3536m43127j3600N5501l8541k67621J36432J72240j70652j8066k99850
646h6031k28144N02013M4674k40511j03079O5462j42852M07427M4968J5406K84318
635E63651J48284j1163l57272m15559k87295n1352J03257k1378l34287J79624
625d83490N04218j47795k08693J39917L76920n4786j2070J58265L3852j27397
615A78941J40922K90064k78885n71717j34592R00989m26163k7809N26638m9609
605E48779m27737k52013m97646k8366L84453l3685k03779N65117L81041j46962
$$ y = [538333, 184946, -389869, -643913, -190596, 42610, -67971, -454302, -427575, -247149, -137493, 193575, -178611, -740860, -200521, -222520, -362027, -100959, 138525, 125538, 777717, 801253, 358126, 344526, 400027, 361486, 93865, 230297, 402537, 231885, 213819, -86031, -314175, 187838, 232512, -7999, -111078, -45616, -188468, 218959, 263927, 279333, 563651, 711935, 700772, 343500, -72059, -359354, -410706, -307449, -328827, -663114, -483490, 20728, -127067, -335760, -195843, 181077, 126291, 114221, 272486, 306338, 178941, 319863, 609927, 331042, -240675, -375267, 525722, 99559, 71750, 598388, 548779, 121042, -130971, -628617, -656983, -272530, -306215, -509994, 55123, 436164, 289202]
595B89202k90412k23670l47150M71659N29518k79071m01102J46156K32467L82246
585E09843O7426n84986K28943J58516R3540p62577m7920k07303N40468j16572
575a20622M47219j52153K12869N23032m25887l43541J20206j10062r3078L4574
565I2557O7105k86077r0864q541K68219J0981o34738M09822J41486J6637J27432
554A14019l3726K89744k19773o79381k33437J44676Q3021K8217q9912j59033O91560
543f4025l2385L1138m9789k32053r287L03171k6190l76359L33431p1439j8146
532b11933P6812k11048L23932J2909l76020K4858J70174O7495k71260J5700L34310
521d4071q2217K83323n1499L85294k63025J54745j57877J35437N98648l84727
$$ y = [289202, -1210, -224880, -572030, -100371, 429147, 150076, -251026, -104870, 127597, 509843, 577269, -7717, 221226, 379742, 473282, -289295, -337215, -544518, -4050, -120622, 326597, 174444, 387313, 910345, 484458, 140917, 261123, 151061, 57983, 92557, 159662, -126415, -217279, -225820, 42399, 53380, -581358, -171536, -30050, -13413, 114019, 80293, 370037, 150264, -529117, -762554, -617878, -534857, -506640, -596552, -755585, -64025, -96410, -65272, -115061, -347114, -356401, -53230, -79420, -455779, -122348, -193787, -211933, -135121, -346169, -22237, -9328, -385348, -360490, -190316, -122821, -394081, -378381, -44071, -126288, 157035, 105536, 490830, 227805, 382550, 224673, 360110, 958758, 574031]
511E74031j072934K68003M64975n83025k86428j44519L86727J50396J69192l55656
501d29238N04816L03047n91605K7646P0570l20390M04269K26130l60277k22096
491c87128m8954O08533n6029M3511J9060K68094k65224m36617J15252M93975l94208
480c9735l96772m33965N02369p4683M6236N8938l78282J55282P7397L52427M9294
469h1494L11641k60082m03338j51755N51547R4115p8876j90639L3658L57734j28681
458E3830L70576k7367o62371P3166L42941J6517j47104L76662l66917L24056n73767
447b19778k39689K56442j98619j03978l42519J39233N17048J4768L03209m58975
437c32858P5375N36738o5757O525q2526L30113l19760K7676k13290n3731l4490
$$ y = [574031, -498903, -230900, 234075, -348950, -635378, -779897, -393170, -242774, -73582, -429238, 75578, 378625, -212980, -185334, -114764, -435154, -30885, 195245, -165032, -387128, -436082, 172451, 116422, 159933, 178993, 447087, 181863, -254754, -139502, 354473, -39735, -436507, -870472, -368103, -442786, -396550, -337612, -715894, -560612, -483215, -130788, -81494, 230147, -29935, -433273, -585028, -33481, 60634, -18242, -208881, -175223, 182511, 53830, 424406, 397039, -265332, -192166, 150775, 167292, 20188, 396850, 29933, 353989, -219778, -459467, -203025, -401644, -505622, -848141, -708908, -191860, -177092, 126117, -332858, -257483, 279255, 213498, 220023, 137497, 467610, 147850, 175526, -37764, -91495, -125985]
426a25985Q2501J17155K88484j19600m57922l03290J98744J99046m01139K23272
416b98734o1948L88476R87K34969L2710k34659q6028L39302K49866q1201j97514
405B86226J1342l7312J39476m3491j85830J69996k24033K00857j64010l4682m04856
394b86317L09767L59458m29911l01161L53160M43629k76627l29426L74711j93285
384B3998K88582k20885l76648n13L85462k8490j31101J38234J43085L5044N60068
373H16836k47609j73275l08324j5664K09695k71400K4523K88092q7050p51427
363e15603L77729K11729K98631J08950p6561l46914Q34216l43460m17166l05367
353a73816l42161J79675L95630J20580K43110m34430k99903L1593l68627K70152
$$ y = [-125985, -43484, 73671, 362155, 242555, -215367, -518657, -319913, -120867, -522006, -298734, -360682, 27794, 28781, 263750, 296460, 61801, -24227, 315075, 564941, 483740, 286226, 297568, 260256, 399732, 356241, 170411, 340407, 116374, 317231, 153221, 118539, -286317, 23450, 382908, -47003, -348164, 4996, 448625, 171998, -157428, 217283, 23998, 312580, 91695, -284953, -285466, 99996, 71506, -59595, 78639, 221724, 256768, 816836, 569227, 395952, 87628, 71964, 281659, 10259, 34782, 322874, 235824, -515603, -137874, 73855, 372486, 481436, 404875, 57961, 892177, 548717, 131551, -173816, -515977, -336302, 59328, 179908, 423018, -11412, -311315, -279722, -648349, -378197]
343c78197M21691J48507k88002K25617o4494K8784K36471J81797n7457m4053J4735
332D25399j09022J32352k22914p31084K2651L52304N8377L25845j3688l33379
322i3159k86392L47981j35935j01713q8243K30459M32350K23117m33882k07172
312a12589J53764J81310N2500L13909m9834l40703J01278M12086J12762j5271
302H09212j77154n76705j44250J98302N11729n13649J23356p135L84963J51602
292G60271o6582j8497j95352O1696l78587l26852J23692L92832n1429k37565K7334
281I0961L71274n9063K365r2016j75305J15291j41274j22196R8327J96254M19552
270G04170k46217l18876p6348l1060L98366l90232K27296j25024j90070j16056
$$ y = [-378197, 43494, 192001, -96001, 129616, 65122, 93906, 330377, 512174, 454717, 410664, 425399, 316377, 448729, 225815, -505269, -482618, -130314, -71937, 253908, 240220, -93159, -379551, -31570, -167505, -269218, -357461, -127002, 305348, 528465, 94583, -112589, 41175, 222485, 274985, 588894, 539060, 198357, 299635, 711721, 824483, 809212, 632058, 55353, -88897, 109405, 621134, 107485, 230841, 223706, 608669, 760271, 693689, 675192, 479840, 541536, 162949, -163903, -40211, 352621, 301192, 63627, 90961, 462235, 403172, 405537, 313521, 138216, 253507, 112233, -9963, 88364, 284618, 704170, 457953, 139077, 62729, 31669, 430035, 39803, 267099, 142075, -47995, -164051]
260a64051k99085J7645N85356k36308j6513N809k15956N01878K65372j36508l06828
249H11k37776K55994K15539j5293J52542j79874M87734k97455M063m51735q7672
238a53122N57224l52115j27282l86673N30578J65151l05842k3539J62319K68132
228C34831J75745k66681k58992P939R3215J57232k77643m02627M40059K54812
218B57890n4398J90188L8348j58165n08461K00061J12948M25744k51300l57516
208a04661P54416o9738k61451o18414n5062R5287K40712K62127K6652j54970k06682
197i1784K20349m5569m10950j42209J32254M69608L7614k41014K22045j60544
187a0200j06561N16559r5763o05323K92660j05958R7502K80793j7939m04977Q4576
$$ y = [-164051, -463136, -445491, 139865, -96443, -112956, -107147, -323103, 178775, 444147, 307639, 811, -236965, 19029, 234568, 219275, 371817, 191943, 679677, 382222, 386285, -65450, -153122, 404102, 51987, -75295, -461968, 68610, 233761, -72081, -95620, 66699, 334831, 510576, 243895, -15097, -7158, 86057, 243289, -34354, -436981, 3078, 257890, 203492, 393680, 432028, 273863, -234598, -34537, 78411, 504155, 252855, -104661, 649755, 580017, 318566, -299848, -354910, -259623, -18911, 243216, 269868, 114898, -91784, 128565, 82996, -327954, -470163, -337909, 131699, 169313, -71701, 150344, -10200, -116761, 399798, 304035, -301288, -8628, -114586, -17084, 263709, 245770, -159207, -74631]
176g4631l43585M38530L24574j90082o5149j8357M3082k40379K49189o2144j23415
165f2367k83713K35359K37920J9290J9717l51557K4468l1875J51225p0441j26264
154b38238R352L20283j07511k17716M16648K37172j6939m39563K60487p8955K97290
143D42310r9248j43956K15376j33907L66183m57248M15098K60711q75273m3446
133e3400K10258J67246l47102j56348j14145m4520J55802O3329m3208M65954J18056
122D21922N5107P6700m62994j34285O0070K95793j91208k42003l3474K19550L5619
111A00797J50261p1921L70348r8088r5678k20302J51793R1965o56996K51667P43737
100G17583o84044J80507N29170m57031P5102j79925k10238L95308k73157q8514
$$ y = [-74631, -418216, 20314, 344888, 154806, 89657, 71300, 114382, -125997, 123192, 61048, -62367, -346080, -110721, 127199, 146489, 166206, -185351, -160883, -192758, -41533, -111974, -238238, -228886, 91397, -16114, -233830, 182818, 419990, 403051, -36512, 223975, 145020, 442310, 343062, 199106, 414482, 280575, 646758, 189510, 604608, 865319, -9954, -53400, 156858, 324104, -22998, -179346, -293491, -338011, -182209, -118880, -162088, 303866, 421922, 477029, 553729, 90735, -43550, 16520, 312313, 121105, -120898, -154372, 65178, 100797, 251058, 179137, 549485, 451397, 355719, 135417, 287210, 379175, -277821, -26154, 717583, 33539, 214046, 743216, 286185, 361287, 181362, -28876, 366432, 93275, 4761]
90D761p8887J82218J15954J01079k74438j07240N74278n57750N1468k24815r566
79b22938L64171K8079Q2517l66171O3448P4597N77090K4141n05030L07321r0944
68C36281J38510l46448l16174J3912L50137j36861j4749j27625R7214k6996J51753
57A18954O6041k81635k87553J98220N63410j45273j02803Q3288o2689k66665n0877
46a67582P320J54250M748J13129K31472n8798k70030K9083J37612j04707J4072
35I0569j50520o925p7356J01731j22668j43995m15460K58792J61839j56454J77524
24b82923Q2121K53743N673m30998K9846L27177J10480r3823K45493M65j77624
13F9630P8581O0311j40328k7048L68694L82039K6686k65456j09919j46914p6520
$$ y = [4761, -74126, 108092, 224046, 325125, 50687, -56553, 517725, -40025, 11443, -213372, -222938, 141233, 169312, 251829, -114342, -50894, 23703, 600793, 624934, 119904, 427225, 336281, 474791, 128343, -187831, -173919, 176218, 39357, 24608, -103017, -5803, -32799, 118954, 184995, -96640, -384193, -185973, 377437, 232164, 129361, 212649, 149960, -116705, -167582, -160262, -6012, -1264, 111865, 343337, 284539, 14509, 43592, 181204, 76497, 90569, -59951, -66876, -144232, -42501, -165169, -309164, -724624, -465832, -303993, -460447, -282923, -200802, 52941, 58614, -372384, -342538, -15361, 95119, 1296, 246789, 247254, 69630, 148211, 208522, 68194, 41146, 409840, 791879, 818565, 553109, 443190, 296276, 219756]
2B19756l01479j94195
0b75918
$$ y = [219756, -81723, -275918]
$$ Imaginary data points
##PAGE= N=2
##DATA TABLE= (X++(I..I)), XYDATA
16383c675178R7299j69228l39635J30002k03562R8935M16567j19010o2987K01016
16373c625781M35354P250j92359o6656J94061J13810O0619P5601q8338K6791K94219
16362b765429L72374J76626k08612j86225M37539j18395m28026R7267J86043j71672
16352b608510N90083L4641j35238J37736K55256K09189j85370j3002q2594R3271
16342a704538L27158k27212N618L23790n1525P1380J00913K72555l57662n1282
16332a290805k01482J38549j96991N535J35728J15025J98565L52279Q1516j74254
$$ y = [-3675178, -3577879, -3747107, -4086742, -3956740, -4160302, -4061367, -3644800, -3763810, -3826797, -3625781, -3190427, -3183177, -3375536, -3442192, -3248131, -3134321, -3073702, -2998101, -3086439, -3059648, -2765429, -2393055, -2216429, -2425041, -2611266, -2173727, -2292122, -2720148, -2622881, -2436838, -2608510, -2018427, -1983786, -2119024, -1981288, -1726032, -1516843, -1702213, -1715215, -1797809, -1704538, -1377380, -1604592, -1598974, -1275184, -1326709, -1255329, -1154416, -881861, -1239523, -1290805, -1492287, -1353738, -1550729, -1545194, -1409466, -1294441, -1095876, -743597, -662081, -836335]
$$ [...]
##END NTUPLES=NMR SPECTRUM
##END=
