##TITLE=1H_CG-1168-1
 CDCl3
 8 sc, 
 15.11.2022
##JCAMPDX= 6.0         $$ Bruker NMR JCAMP-DX V2.0
##DATA TYPE= NMR SPECTRUM
##DATA CLASS= NTUPLES
##ORIGIN= UXNMR, Bruker Analytische Messtechnik GmbH
##OWNER= root
$$ XWIN-NMR		Version 3.5
$$ Tue Nov 15 15:55:14 2022 Russian Standard Time (UT+4h)  she@DPX200
##.OBSERVE FREQUENCY= 200.1313499994
##.OBSERVE NUCLEUS= ^1H
##.ACQUISITION MODE= SIMULTANEOUS
##.ACQUISITION SCHEME= undefined
##.AVERAGES= 8
##.DIGITISER RES= 18
##SPECTROMETER/DATA SYSTEM= spect
##.PULSE SEQUENCE= zg30
##.SOLVENT NAME= Acetone
##.SHIFT REFERENCE= (INTERNAL, Acetone, 0, 15.7326)
##AUDIT TRAIL= $$ (NUMBER, WHEN, WHO, WHERE, WHAT)
$$ ##TITLE= Audit trail, XWIN-NMR		Version 3.5
$$ ##JCAMPDX= 5.01
$$ ##ORIGIN= Bruker BioSpin GmbH
$$ ##OWNER= she
$$ F:/spectra/data/she/nmr/H-F/1/pdata/1/auditp.txt
$$ ##AUDIT TRAIL=  $$ (NUMBER, WHEN, WHO, WHERE, WHAT)
(   1,<2022-11-15 15:53:41.09 +0400>,<she>,<DPX200>,
      <created by zg, POWCHK disabled, PULCHK disabled
       configuration hash MD5:
       00 E9 B6 7A A2 85 ED C7 34 08 36 98 17 FE 4E 26
       data hash MD5: 16K
       33 C8 A3 86 FF F8 24 61 4A A9 49 49 89 1D 08 3C>)
(   2,<2022-11-15 15:53:43.64 +0400>,<she>,<DPX200>,
      <Start of raw data processing
       efp BC_mod = 2 LB = 0.24 FT_mod = 6 PKNL = 1 PHC0 = -18044.22 PHC1 = 28.8007 SI = 16K 
       data hash MD5: 16K
       91 00 BC FF F8 41 5F 05 73 1F D7 E4 41 AF 58 94>)
(   3,<2022-11-15 15:54:00.32 +0400>,<she>,<DPX200>,
      <pk PHC0 = 1.612402 PHC1 = -2.4 
       data hash MD5: 16K
       D8 55 26 4A 86 3B A2 4E A1 2F E2 7B 92 90 2C 08>)
(   4,<2022-11-15 15:54:03.62 +0400>,<she>,<DPX200>,
      <abs ABSG = 5 
       data hash MD5: 16K
       09 74 3C 77 7E F4 58 EF 31 4E 7D 7C 14 30 19 D8>)
$$ ##END=
$$ 
$$ hash MD5
$$ 56 46 AE 56 6B 6B A9 40 BF CA 8C 5E 1E 5A 7C 76
##$RELAX= 
##$RELAX= 
##$RELAX= 
##$RELAX= 
##$RELAX= 
##$RELAX= 
$$ Bruker specific parameters
$$ --------------------------
##$DU= <F:/spectra>
##$EXPNO= 1
##$NAME= <H-F>
##$PROCNO= 1
##$TYPE= <nmr>
##$USER= <she>
##$AMP= (0..31)
100 100 100 100 100 100 100 100 100 100 100 100 100 100 100 100 100 100 
100 100 100 100 100 100 100 100 100 100 100 100 100 100 
##$AQSEQ= 0
##$AQ_mod= 1
##$AUNM= <au_zg>
##$AUTOPOS= <>
##$BF1= 200.13
##$BF2= 200.13
##$BF3= 200.13
##$BF4= 200.13
##$BF5= 200.13
##$BF6= 200.13
##$BF7= 200.13
##$BF8= 200.13
##$BYTORDA= 1
##$CFDGTYP= 0
##$CFRGTYP= 5
##$CHEMSTR= <none>
##$CNST= (0..31)
1 1 145 1 1 1 1 1 1 1 1 1 1 1 1 1 1 1 1 1 1 1 1 1 1 1 1 1 1 1 1 1 
##$CPDPRG= <>
##$CPDPRG1= <>
##$CPDPRG2= <>
##$CPDPRG3= <>
##$CPDPRG4= <mlev>
##$CPDPRG5= <mlev>
##$CPDPRG6= <mlev>
##$CPDPRG7= <mlev>
##$CPDPRG8= <mlev>
##$CPDPRGB= <>
##$CPDPRGT= <>
##$D= (0..31)
0 1.2 0 0 0 0 0 0 0 0.06 0 0.03 0 0 0 0 0.0002 0 0 0 0 0 0 0 0 0 0 0 0 
0 0 0 
##$DATE= 1668513220
##$DBL= (0..7)
120 120 120 120 120 120 120 120 
##$DBP= (0..7)
150 150 150 150 150 150 150 150 
##$DBP07= 0
##$DBPNAM0= <>
##$DBPNAM1= <>
##$DBPNAM2= <>
##$DBPNAM3= <>
##$DBPNAM4= <>
$$ [...]
##$SUBNAM3= <"">
##$SUBNAM4= <"">
##$SUBNAM5= <"">
##$SUBNAM6= <"">
##$SUBNAM7= <"">
##$SUBNAM8= <"">
##$SUBNAM9= <"">
##$SW= 18.0517283424941
##$SWIBOX= (0..15)
0 0 2 0 0 0 0 0 0 0 0 0 0 0 0 0 
##$SW_h= 3612.71676300578
##$TD= 16384
##$TD0= 1
##$TE= 0
##$TE2= 300
##$TE3= 300
##$TEG= 300
##$TL= (0..7)
0 120 120 120 120 120 120 120 
##$TP= (0..7)
150 150 150 150 150 150 150 150 
##$TP07= 0
##$TPNAME0= <>
##$TPNAME1= <>
##$TPNAME2= <>
##$TPNAME3= <>
##$TPNAME4= <>
##$TPNAME5= <>
##$TPNAME6= <>
##$TPNAME7= <>
##$TPOAL= (0..7)
0.5 0.5 0.5 0.5 0.5 0.5 0.5 0.5 
##$TPOFFS= (0..7)
0 0 0 0 0 0 0 0 
##$TUNHIN= 0
##$TUNHOUT= 0
##$TUNXOUT= 0
##$USERA1= <user>
##$USERA2= <user>
##$USERA3= <user>
##$USERA4= <user>
##$USERA5= <user>
##$V9= 5
##$VALIST= <valist>
##$VCLIST= <CCCCCCCCCCCCCCC>
##$VD= 0
##$VDLIST= <DDDDDDDDDDDDDDD>
##$VPLIST= <PPPPPPPPPPPPPPP>
##$VTLIST= <TTTTTTTTTTTTTTT>
##$WBST= 1024
##$WBSW= 4
##$XGAIN= (0..3)
0 0 0 0 
##$XL= 0
##$YL= 0
##$YMAX_a= 106461
##$YMIN_a= -124963
##$ZGOPTNS= <>
##$ZL1= 120
##$ZL2= 120
##$ZL3= 120
##$ZL4= 120
##$ABSF1= 15.73256
##$ABSF2= -2.319289
##$ABSG= 5
##$ABSL= 3
##$ALPHA= 0
##$AQORDER= 0
##$ASSFAC= 0
##$ASSFACI= 0
##$ASSFACX= 0
##$ASSWID= 0
##$AUNMP= <proc_1d>
##$AZFE= 0.1
##$AZFW= 0.1
##$BCFW= 0
##$BC_mod= 2
##$BYTORDP= 0
##$COROFFS= 0
##$CY= -3
##$DATMOD= 1
##$DC= 0
##$DFILT= <>
##$DTYPP= 0
##$F1P= 0
##$F2P= 0
##$FCOR= 1
##$FTSIZE= 16384
##$FT_mod= 6
##$GAMMA= 0
##$GB= 0
##$INTBC= 1
##$INTSCL= 3.70164e-10
##$ISEN= 128
##$LB= 0.24
##$LEV0= 0
##$LPBIN= 0
##$MAXI= 10000
##$MC2= 0
##$MEAN= 0
##$ME_mod= 0
##$MI= 1.114404
##$NCOEF= 0
##$NC_proc= -9
##$NLEV= 6
##$NOISF1= 3.799351
##$NOISF2= 2.8
##$NSP= 0
##$NTH_PI= 0
##$NZP= 0
##$OFFSET= 15.73257
##$PC= 1
##$PHC0= -18042.61
##$PHC1= 26.4007
##$PH_mod= 1
##$PKNL= yes
##$PPARMOD= 0
##$PSCAL= 0
##$PSIGN= 0
##$REVERSE= no
##$SF= 200.130007799141
##$SI= 16384
##$SIGF1= 3
##$SIGF2= 2
##$SINO= 5.538805
##$SIOLD= 16384
##$SREGLST= <1H.CDCl3>
##$SSB= 0
##$STSI= 16384
##$STSR= 0
##$SW_p= 3612.71676300578
##$SYMM= 0
##$S_DEV= 0
##$TDeff= 16384
##$TDoff= 0
##$TI= <>
##$TILT= no
##$TM1= 0
##$TM2= 0
##$TOPLEV= 0
##$USERP1= <user>
##$USERP2= <user>
##$USERP3= <user>
##$USERP4= <user>
##$USERP5= <user>
##$WDW= 1
##$XDIM= 16384
##$YMAX_p= 483466440
##$YMIN_p= -2186251
$$ End of Bruker specific parameters
$$ ---------------------------------
##NTUPLES= NMR SPECTRUM
##VAR_NAME=  FREQUENCY,     SPECTRUM/REAL,   SPECTRUM/IMAG
##SYMBOL=    X,             R,               I
##VAR_TYPE=  INDEPENDENT,   DEPENDENT,       DEPENDENT
##VAR_FORM=  AFFN,          ASDF,            ASDF
##VAR_DIM=   16384,         16384,           16384
##UNITS=     HZ,            ARBITRARY UNITS, ARBITRARY UNITS
##FACTOR=    0.220516191357247, 1,           1
##FIRST=     3148.55929566463, 0,            0
##LAST=      -464.157467341155, 0,           0
##MIN=       -464.157467341155, -2186251,    0
##MAX=       3148.55929566463, 483466440,    0
$$ Real data points
##PAGE= N=1
##DATA TABLE= (X++(R..R)), XYDATA
$$ [...]
5542A9324356n88584L7936L71920O26694p41384J51614Q58325J831605J234109
5533B3106591J445182K348098L517907L231527K273052J239173j617665l895566
5525C1648299k663500k389119k685974k241304r87632j596809j129552j370953
5517A6583456r00304o76050j19983q21631q37555n74658k66214q57945j003660
5508A0525456L27673o84898K11653P6690n78304K88350K90313l71030N64707L91468
5498A1042078j194540L76205P13806P31551N03541k80063P97114k3173L542q48149
5488A1821912P84137J29454l47315j300417j113761Q27163o34995l44344k31325
5479I590509j11096q05908p58580j67467L66998K03749r9527m5398m66559P49552
$$ plain form
5542 19324356 18735772 18773708 19145628 19772322 19030938 19182552 20040877 21872482 23106591
5533 23106591 24551773 26899871 30417778 33649305 35922357 37161530 35543865 31648299
5525 31648299 28984799 26595680 23909706 21668402 20680770 19083961 17954409 16583456
5517 16583456 15683152 15007102 14887119 14065488 13227933 12653275 12387061 11529116 10525456
5508 10525456 10853129 10168231 10379884 10456574 9878270 10166620 10456933 10085903 10650610 11042078
5498 11042078 9847538 10223743 10937549 11669100 12172641 11892578 12689692 12666519 12670061 11821912
5488 11821912 12606049 12735503 12388188 11087771 9974010 10801173 10166178 9821834 9590509
5479 9590509 9479413 8673505 7914925 7747458 8114456 8318205 8218678 8173280 7706721 8456273
5469H456273O4691o0884R86641N56845O38665K67827O03973j94520o7356j64109
5459A1088046L4559O03217o5245J32369p29590n66932m33151k55910p50308o65147
5449H391908q81765j376185o5184K69723j2065j62683j23365j32671M96572R2513
5439F496798Q36006j98020o06588Q44342m90703K88562O70117J34717k98668j61883
5429G514680J63358l22300Q52459L85784m51081J92920m83156l60430q39622r9447
5419F553165n50383J47636o15230j86170M5129O08219o01280l93298K38298M40296
5409E686382l80534J36867m32852m21577N80371o90757R6399N41623O6067m81199
5399D700790K48779l58455l25783J23515l47831o67519J24904O86873O05368j01613
$$ plain form
5469 8456273 8520964 8460080 9446721 10003566 10642231 10910058 11514031 11319511 11252155 11088046
5459 11088046 11122605 11725822 11660577 11792946 11063356 10496424 10063273 9807363 9057055 8391908
5449 8391908 7510143 6133958 6068774 6338497 6326432 6163749 6040384 5907713 6404285 6496798
5439 6496798 7332804 7134784 6528196 7372538 6881835 7170397 7840514 7975231 7676563 7514680
5429 7514680 7678038 7355738 8208197 8593981 8142900 8335820 7852664 7492234 6652612 6553165
5419 6553165 6002782 6150418 5535188 5349018 5394147 6002366 5401086 5007788 5246086 5686382
5409 5686382 5305848 5442715 5009863 4588286 5168657 4477900 4574299 5115922 5181989 4700790
5399 4700790 4949569 4591114 4265331 4388846 4041015 3373496 3498400 4185273 4790641 4689028
5389D689028j47657k3618l32912L46896N75796l40071P20542l46629n06661q24519
5379C810195N05400M49069J34315r68920p64183Q713Q6891K32430J025764R58636
5369E478310r58235m76305m16823K6956P8723J27635J5371k17337O23836K0643
5359D302774q20673O84549L94646p71378m95173O86874K40906P3829O5564L0575
5349D392493N8381L19336N71753k50943o02165k64181l45872K54031p30804K45777
5339C647806l50106q5746m2142Q17294O61780r25637r87864k20918R19158j23790
5329C309835J225903q312n91652N86676j20892J31949N03993R3189j97460p55961
5319D177268m75585j27034m4994Q54718J76667M22491L92748o69700P41178J61631
$$ plain form
5389 4689028 4541371 4517753 4184841 4531737 5107533 4767462 5488004 5141375 4634714 3810195
5379 3810195 4315595 4764664 4898979 3930059 3165876 3174589 3261480 3493910 4519674 5478310
5369 5478310 4520075 4043770 3626947 3653903 3732626 3860261 3875632 3658295 4282131 4302774
5359 4302774 3482101 4166650 4561296 3789918 3294745 3981619 4222525 4296354 4361918 4392493
5349 4392493 4450874 4770210 5341963 5091020 4488855 4224674 3878802 4132833 3402029 3647806
5339 3647806 3297700 3211954 3169812 3987106 4648886 3723249 2735385 2514467 3433625 3309835
5329 3309835 4535738 4527426 3935774 4522450 4401558 4533507 5037500 5130689 4933229 4177268
5319 4177268 3701683 3574649 3529655 4384373 4561040 4983531 5376279 4706579 5447757 5609388
5309E609388o94870K04295M91399p06771J44517K21172J38778k58366n62585n26039
5299D060918L60586n72015Q35525J580471M17091n80847O60494o29456l99261
5290E733506q77460m27130N38142m26333J67463Q90290L20774Q49123M3306J07163
5280F918844p82810M06833l48854L13413R19541o76036l45158J15089J362023
5271G882885l2937M52698m98076k00753O51416J57600L44985k31576k72235J092607
5261I346614L24359P98437j14069Q24595N25582M32270L87803p29652k21314M47719
5251A2022344J09429p9254k10326J096068K59399n00467L96362P38870Q63671
5242A4696096J404609J560569K475503L400108L334544K490589J151367k096414
$$ plain form
5309 5609388 4914518 5118813 5610212 4903441 5047958 5269130 5407908 5149542 4586957 4060918
5299 4060918 4421504 3849489 4685014 6265485 6682576 6101729 6762223 6132767 5733506
5290 5733506 4856046 4428916 4967058 4540725 4708188 5598478 5919252 6768375 6811681 6918844
5280 6918844 6136034 6542867 6194013 6507426 7426967 6750931 6405773 6520862 7882885
5271 7882885 7849948 8302646 7804570 7603817 8255233 8412833 8757818 8526242 8254007 9346614
5261 9346614 9670973 10469410 10355341 11179936 11705518 12137788 12525591 11795939 11574625 12022344
5251 12022344 12131773 12052519 11842193 12938261 13197660 12697193 13093555 13832425 14696096
5242 14696096 16100705 17661274 20136777 23536885 26871429 29362018 30513385 28416971
5234B8416971m065199l234031k838790j691004k744173k081596q62669q93368
5226A0006141n9553l43188l0058l30242k64050n24381l88591j11016k50428j118772
5216F585862m79212q58195L18516O43747k83847p85695p93102J142338J29371
5207E619783l23064K07226M45271J48387l95666p14044K33480j02635k30446m91181
5197D397111q96749J137426M8454k89922l41976l37572k13547k47119L6020O69886
5187C962012k32851j04349L57953K2475m35837J69433J02228l22179R0505r7578
5177C511812K22250l77262j93811J092183p19808N60067R45391n51407K16028
5168D705443M7629l94051l44603M17082n7521l79525n18992M286p5999L56359
$$ plain form
5234 28416971 24351772 21117741 18278951 16587947 13843774 11762178 10899509 10006141
5226 10006141 9946588 9603400 9573342 9243100 8979050 8454669 8066078 7955062 7704634 6585862
5216 6585862 6106650 5248455 5566971 6210718 5926871 5141176 4348074 5490412 5619783
5207 5619783 5296719 5503945 5949216 6097603 5701937 4987893 5221373 5118738 4888292 4397111
5197 4397111 3500362 4637788 4686242 4396320 4054344 3716772 3503225 3256106 3292126 3962012
5187 3962012 3729161 3624812 3982765 4005240 3569403 3738836 3841064 3518885 3609390 3511812
5177 3511812 3734062 3356800 3162989 4255172 3535364 4095431 5040822 4489415 4705443
5168 4705443 4753072 4359021 4014418 4431500 4373979 3994454 3475462 3479748 3403749 3760108
5158C760108M19262m45416j37918j30676J66361O4837k57395P07605M48201j21928
5148D473041q32559l86768O12243P99211p7011n21279K11964n348p7916m05538
5138C790040j52048M54377k30476N25036J268706l6535m06097J80262P00309m1474
5128F052100m12356N22775j79626k99083K53194K18877j44928M47091o17192J94434
5118F035286L82839k82814k84981L14112J33106k34975l39639n27439M80333R87530
5108F663358L86542Q53580L78939j53474J39249j59890o18559j78569n54356J008463
5098G765283L45074m93431j15472J6135j80252k96246o60649j70968J58810Q71998
5088G240282O14622j76758O27693j11552J202511L37013m41054p79230m2933J6852
$$ plain form
5158 3760108 4179370 3733954 3596036 3465360 3631721 3696558 3439163 4146768 4594969 4473041
5148 4473041 3640482 3253714 3865957 4665168 4588157 4066878 4278842 4273494 4195578 3790040
5138 3790040 3637992 4092369 3861893 4386929 5655635 5619100 5213003 5393265 6093574 6052100
5128 6052100 5639744 6162519 5982893 5683810 5937004 6155881 6010953 6458044 5840852 6035286
5118 6035286 6418125 6135311 5850330 6164442 6297548 6062573 5722934 5195495 5675828 6663358
5108 6663358 7049900 7903480 8282419 8128945 8268194 8108304 7489745 7311176 6756820 7765283
5098 7765283 8110357 7616926 7501454 7517589 7337337 7041091 6380442 6209474 6368284 7240282
5088 7240282 7854904 7678146 8305839 8194287 9396798 9733811 9292757 8513527 8470594 8487446
5078H487446j083694m1373K52132r86680L19697k49078p02351P78489l29579o25337
5068E819672m42491J359800l02745m21484l60063K40324Q50950O17843q8216j99715
5058G073875k47909n90049m21512p98476k14316K03971L1080J28984j28673o3139
5048D973836q9515q03488q95818j16247q0650L64370J212180n45869j42289n9738
5038C816772K44709j342630k22842P16794j75818K17704L46117K23429p08563
5029C115672J52318k60775j13339N70289p0865r7914L2729L85548o3254J40370
5019C790779q23992p24888O27159Q32994k2830O52052j055512j95976P17397Q68552
5009D665735k37087j308051n52686J57695P084K74264J22424k48075j31283J39238
$$ plain form
5078 8487446 7403752 7362379 7614511 6627831 6947528 6698450 5996099 6774588 6445009 5819672
5068 5819672 5377181 6736981 6434236 6012752 5652689 5893013 6743963 7361806 7273590 7073875
5058 7073875 6825966 6235917 5814405 5015929 4801613 5005584 5036664 5165648 5036975 4973836
5048 4973836 4884321 4080833 3185015 3068768 2988118 3352488 4564668 4018799 3876510 3816772
5038 3816772 4061481 2718851 2496009 3212803 3036985 3254689 3600806 3824235 3115672
5029 3115672 3267990 3007215 2893876 3464165 3393300 3295386 3328115 3713663 3650409 3790779
5019 3790779 2966787 2241899 2869058 3702052 3679222 4331274 3275762 3079786 3797183 4665735
5009 4665735 4428648 3120597 2567911 2725606 2732690 3006954 3129378 2881303 2750020 2889258
4999B889258q72416K99493O34822o5925L290n09742k82729N49023J201675J12298
4989C959047l3575k91281K70444L46238k84743r23966n95712J89892R57065k0716
4979C572693o02405k5954J627294q50109o4386Q1390k93052K06583K99221Q9079
4969D040354p69097K94889m20022l03036J95484P0429m6361r4328K75450O6843
4959C310605J39898N47398k59780q57291j06156k40286J11774M9155q20044M86654
4949B361927J26229L1637j39839k05462K67967q9372l44302R69667p16302O80297
4939B942447J388611K54089p93411r04197k07938j40896R53564R71588j478271
4930B985586m66692K22585j10615J09184l81010N78542Q75646p2773m94321o57528
$$ plain form
4999 2889258 2016842 2316335 2951157 2885232 2888522 2378780 2096051 2645074 3846749 3959047
4989 3959047 3925472 3634191 3904635 4250873 3966130 3042164 2446452 2636344 3593409 3572693
4979 3572693 2970288 2944334 4571628 3721519 3657133 3738523 3445471 3652054 3951275 4040354
4969 4040354 3271257 3566146 3146124 2843088 3038572 3109001 3062640 2968312 3243762 3310605
4959 3310605 3450503 3997901 3738121 2880830 2774674 2534388 2646162 2695317 1875273 2361927
4949 2361927 2488156 2519793 2379954 2174492 2442459 2353087 2008785 2978452 2262150 2942447
4939 2942447 4331058 4585147 3791736 2887539 2679601 2538705 3492269 4463857 2985586
4930 2985586 2518894 2741479 2630864 2740048 2359038 2937580 3813226 3740453 3246132 2588604
4920B588604m01222M52363N72598m72931m9017O39208l86096k46685m91351M89393
4910B694864R10440L38738j57617p84848M09590m89992O52136M44279K10219M1961
4900D269770L71599M06070m22098l42447p16126n2335m44691K15777J55957K46895
4890C688371Q2633K25616j04644Q26897j37418L60207k80210p35775J9678o7663
4880C877692L39778O21527n05915l51202j10644M71309N00778L17913L1718N0775
4870E243729m40460p985p90505L14222K60157k5936l78773L49922L663O85978
4860E214012J30586l1667l2664o02302L62717M06476n91405L9245N88613j71199
4850E312412q66j75768m9709J79882O39490Q93694J00061j0508k37832j82196
$$ plain form
4920 2588604 2187382 2639745 3212343 2739412 2690395 3329603 2943507 2696822 2205471 2694864
4910 2694864 3605304 3944042 3786425 3001577 3411167 2921175 3573311 4017590 4227809 4269770
4900 4269770 4641369 5047439 4625341 4282894 3566768 3514433 3069742 3285519 3441476 3688371
4890 3688371 3771004 3996620 3891976 4718873 4581455 4941662 4661452 3925677 3945355 3877692
4880 3877692 4217470 4838997 4333082 3981880 3871236 4342545 4843323 5161236 5192954 5243729
4870 5243729 4803269 4795284 4004779 4319001 4579158 4553222 4174449 4524371 4528034 5214012
4860 5214012 5344598 5312931 5280267 4677965 5040682 5447158 4855753 4894998 5483611 5312412
4850 5312412 5311546 5135778 5086069 5265951 5905441 6799135 6899196 6888688 6650856 6468660
4840F468660J95665J94139n1495q2040o11962J60979N04006n91972O55749L72373
4830G214102l56566n46052L81644M28138J78676N36682n49232K65498Q0305r3839
4820G539356J34872J067287J71872k64819l5792r9084j32246N82341J273968l06597
4810I931158K62293R044P45925N66854Q8328P4897l20726n4249P71755k58245
4800A1817034P82108j20040J295253Q92044J501628J768046Q84839R12371J052819
4791B0786102O82619K663820K377331K348345K620806M029713M773488L839547
4783D4121771M020546L012512N19537j967867m092860m040483n031856m367533
4775C2173767l205448k371761l400961k983615j357083q78891r44988n20077j98196
$$ plain form
4840 6468660 6664325 6858464 6806969 6724929 6112967 6273946 6777952 6185980 6841729 7214102
4830 7214102 6857536 6311484 6693128 7121266 7299942 7836624 7287392 7552890 7633195 7539356
4820 7539356 7674228 8741515 8913387 8648568 8612776 8513692 8381446 8963787 10237755 9931158
4810 9931158 10193451 10202495 10948420 11515274 11603602 11678499 11357773 11303524 12075279 11817034
4800 11817034 12599142 12479102 13774355 14666399 16168027 17936073 18820912 19733283 20786102
4791 20786102 21468721 24132541 26509872 28858217 31479023 35508736 40282224 44121771
4783 44121771 48142317 51154829 51674366 49706499 45613639 41573156 36541300 32173767
4775 32173767 28968319 26596558 23195597 20211982 18854899 17976008 17031020 16510943 16312747
4766A6312747k196718r22327o11098j191742r3806J29764k17561p7947m64191
4757A0667121k63433M92646l61952R7463m47470M56496j36334R5177p35846l34277
4747I529591n44655J74192M34652l28972M43648J14800K86044j84447N56521l54685
4737A0126689q7314L60731K45132o3362L11621q73962J293222N33797P92761M14185
4727A3053500n54268m34050P49923Q5076J14834Q02392J723639Q87244J053640
4718A7481930L56514J218625J616121R08080J307754J250519J922066K119889
4710B8181498L083392L479895L691318M040853K612576L173797J041337m9385
4702D9255281k316083l370851k926713m263351l830725l841787l021934k218324
$$ plain form
4766 16312747 14116029 13193702 12582604 11390862 11297056 11426820 11209259 11131312 10667121
4757 10667121 10403688 10896334 10534382 10631845 10184375 10640871 10504537 10599714 9863868 9529591
4747 9529591 8984936 9159128 9593780 9264808 9708456 9823256 10109300 9924853 10481374 10126689
4737 10126689 10039375 10400106 10645238 10581876 10893497 10019535 11312757 11846554 12639315 13053500
4727 13053500 12499232 12065182 12815105 12900181 13015015 13817407 15541046 16428290 17481930
4718 17481930 17838444 19057069 20673190 21581270 22889024 24139543 26061609 28181498
4710 28181498 31264890 34744785 38436103 42476956 45089532 48263329 49304666 49255281
4702 49255281 46939198 43568347 40641634 36378283 32547558 28705771 25683837 23465513
4694B3465513j568577k112527j205313j705985j507233j068660M2163k92655o92038
4685A3354688o84442l60627M1558l69891L9179j84224l83454p37571k31418n25166
4675I958632j61427L20729l03955P9747N75492K24454o88174l98853J42857l82964
4665I366538Q5601q0896N1366Q91825J51441m20595p24350K64891P45407k59808
4655A0071420J19965l00852N25095Q07412r0893M33952P42223P6066N146O15210
4645A3004744O1160K11843N29148Q94226P0219K39624M10383O67898J330835J378710
4635A8798790M07211J37325O61593J74430k91819m20416N58946l32405n13904
4626A9179751j021819l63901q3021p89119L7051j38177p44960j0108K57685m67064
$$ plain form
4694 23465513 21896936 19784409 18579096 16873111 15365878 14297218 14339381 14046726 13354688
4685 13354688 12670246 12309619 12351177 11981286 12020465 11836241 11452787 10715216 10483798 9958632
4675 9958632 9797205 10117934 9813979 9893726 10469218 10693672 10005498 9606645 9749502 9366538
4665 9366538 9452139 9371243 9422609 10314434 10465875 10045280 9320930 9585821 10331228 10071420
4655 10071420 10191385 9890533 10415628 11223040 11132147 11566099 12308322 12384388 12389534 13004744
4645 13004744 13065904 13277747 13806895 14701121 14771340 15010964 15421347 16089245 17420080 18798790
4635 18798790 19206001 19343326 20004919 20179349 19887530 19467114 20026060 19693655 19179751
4626 19179751 18157932 17794031 17711010 16921891 16958942 16820765 16075805 16065697 16323382 15856318
4616A5856318r57094K6688q94178M10199P70172o13490L9672N06562O11673m24030
4606A5332492P50589k30193j34203j5307O91669N97629J18652P90495L59654l33404
4596A7928073J50214J46612k93778J83698J99107K6584k93291n88646j66347o79733
4586A6612493m66166m30690k64704j139951q31880p70678o49738n29197N1807
4577A1581296L88916m38930r11098j50275p61940K07271J81072l81429K04262
4568I919145L53559L91966j183967m06002j13606N84073m60525r8519K92301K23410
4558I501835m8038k73487n62191L51154n14693k27491R8141m41152K61563O48475
4548H794116r6940m97385M39798l72141M73237n35275j86007o41799j58614O79101
$$ plain form
4616 15856318 14899224 14925912 14031734 14441933 15212105 14598615 14638287 15144849 15756522 15332492
4606 15332492 16083081 15852888 15718685 15703378 16395047 16992676 17111328 17901823 18261477 17928073
4596 17928073 18078287 18224899 17931121 18114819 18313926 18340510 18047219 17458573 17292226 16612493
4586 16612493 16146327 15715637 15450933 14310982 13479102 12708424 12058686 11529489 11581296
4577 11581296 11970212 11531282 10620184 10469909 9707969 9915240 10096312 9714883 9919145
4568 9919145 10272704 10664670 9480703 9074701 8961095 9545168 9084643 8986124 9278425 9501835
4558 9501835 9453797 9180310 8618119 8969273 8454580 8227089 8325230 7884078 8145641 8794116
4548 8794116 8697176 8199791 8639589 8267448 8740685 8205410 8019403 7377604 7218990 7898091
4538G898091J126479j08600K16915k12549q40226R98959L79411l08286m43405
4529H706789P63461j75575n39332L36733K02847N51797L28684r86190l38870J113919
4519I964263K06330m73731L01150N4273n46803J85425O60457O25907L64788j152018
4509A0190041K79979m11110l57523N03492l12518L53213L82345O70563k19888
4500A1078594K42689M60631O32885m7076m5898m7024K16488N75687K90943L20962
4490A3678881q2147Q32644m50336o41251R10142n77926L53492J654418j84176
4481A5493741J43152j58025Q4479P38488Q17424M13172J42688k67423K20403J102954
4471A8731053J838763J009599m43724L68482J123267Q08016M32122J870342J665577
$$ plain form
4538 7898091 9024570 8915970 9132885 8920336 8080110 9079069 9458480 9150194 8706789
4529 8706789 9470250 9294675 8755343 9092076 9294923 9846720 10175404 9189214 8850344 9964263
4519 9964263 10170593 9696862 9998012 10052285 9505482 9690907 10351364 10977271 11342059 10190041
4509 10190041 10470020 10058910 9701387 10204879 9892361 10245574 10627919 11298482 11078594
4500 11078594 11321283 11781914 12414799 12367723 12321825 12274801 12491289 13066976 13357919 13678881
4490 13678881 13596734 14429378 13979042 13337791 14247933 13670007 14023499 15677917 15493741
4481 15493741 15636893 15478868 15563347 16301835 17119259 17532431 17675119 17407696 17628099 18731053
4471 18731053 20569816 21579415 21135691 21504173 22627440 23435456 23867578 25737920 27403497
4462B7403497J034096J922447J747181J150525J299634K015956J367874J581882
4454C9523092J965486N58387P36140j99371n69701M34130K27155l35074M3454
4445D2383698O4602j235746P37490N58871N54424M22768j36570N90637J085150
4436D5025324l02873P03945J4092l57458j57589N74633Q9761l79516K41872k09977
4426D5242214M6661L5671L69131K1184k30458o67217N23261m38258n78481L44031
4416D4667739J436464Q09440O82345M27272J333898P44784O01560J855942N70794
4407E3130238J46958n89307Q90569L14474O90202P96013j92374n58529o47980
4398E3980264L9532j777869k098519j683302j530308k047542k072538j984325
$$ plain form
4462 27403497 28437593 30360040 32107221 33257746 34557380 36573336 37941210 39523092
4454 39523092 41488578 42046965 42783105 42583734 42014033 42448163 42675318 42340244 42383698
4445 42383698 42448300 41212554 41950044 42508915 43063339 43486107 43349537 43940174 45025324
4436 45025324 44722451 45426396 45440488 45083030 44925441 45500074 45589835 45210319 45452191 45242214
4426 45242214 45288875 45324546 45693677 45714861 45484403 44817186 45340447 44902189 44323708 44667739
4416 44667739 46104203 46913643 47595988 48023260 49357158 50101942 50703502 52559444 53130238
4407 53130238 53277196 52687889 53578458 53892932 54583134 55379147 55186773 54628244 53980264
4398 53980264 54019796 52241927 50143408 48460106 46929798 44882256 42809718 40825393
4390D0825393k063004k356536j546797j357367j457504j171534r23341l25176
4382B9624134o04637j139623j482760O9188p59141j403015N78715m95719j22717
4373B4264425K41372P2440m44010m27184m4899r0512O39554l86448j0571J28122
4363B3942289k82426j4364n39047l39779J49680P81170p7401o96656J70716M25699
4353B3519881N27248J43907M67489K95219N70074O64975k56032K17603P80105
4344B6930469P15491j0749P07881J573874Q14312O79288J986578J357197R87211
4335C5741552J064074P30466J456186J174930J614812J229616J771029K431766
4327D7214431J484471K270382J725319J333964O12246O53787R39066J330731J081350
$$ plain form
4390 40825393 38762389 36405853 34859056 33501689 32044185 30872651 29949310 29624134
4382 29624134 29019497 27879874 26397114 26466302 25707161 24304146 24882861 24387142 24264425
4373 24264425 24505797 24578237 24134227 23707043 23662144 23571632 24211186 23824738 23814167 23942289
4363 23942289 23659863 23645499 23106452 22766673 22916353 23697523 23620122 22923466 23094182 23519881
4353 23519881 24047129 24191036 24658525 24953744 25523818 26188793 25932761 26150364 26930469
4344 26930469 27645960 27635211 28343092 29916966 30731278 31410566 33397144 34754341 35741552
4335 35741552 36805626 37536092 38992278 40167208 41782020 43011636 44782665 47214431
4327 47214431 48698902 50969284 52694603 54028567 54640813 55294600 56233666 57564397 58645747
4318E8645747M43200o84395L37208k12274p07005l47246k21453k88979o87056
4309E6277747k64644j238737j544949m49025j308702j065313o50988k96256o34337
4300D8824796j013491P28438L24369O63028L49496L2923k62674J73956m81745
4291D9339096k26057o99254K89308M7862p44581P04828l57130l16127L79129j044429
4281D7372645j156226n63021m83870r19322p28763n42814n55289m57826m73856
4272D1491658j87452L31811j23819q96676j120272k70372k57027n94276j401753
4263C6971822j762237m40328j277194j140413p51051j461213o32529j295282o9877
4254B8141698p54728j871565L08662l22798o32167n96192m30931J54914k29815
$$ plain form
4318 58645747 59088947 58404552 58741760 58529486 57822481 57475235 57253782 56964803 56277747
4309 56277747 56013103 54774366 53229417 52780392 51471690 50406377 49755389 49459133 48824796
4300 48824796 47811305 48539743 48864112 49527140 49876636 49909559 49646885 49820841 49339096
4291 49339096 49113039 48413785 48703093 48750955 48006374 48711202 48354072 48037945 48417074 47372645
4281 47372645 46216419 45653398 45169528 44250206 43521443 42978629 42423340 41965514 41491658
4272 41491658 41304206 41636017 41512198 40615522 39495250 39224878 38967851 38373575 36971822
4263 36971822 35209585 34769257 33492063 32351650 31600599 30139386 29506857 28211575 28141698
4254 28141698 27386970 25515405 25824067 25501269 24869102 24272910 23841979 23996893 23767078
4245B3767078K22945n93831K74811N83284q3953j019245M42601o10204p17204
4236B2266282O5195L92256Q11912l07925M17091P6519l7854k01245P81332l82801
4226B3880762p01047J75936o93002n40083Q34821M65261o6325l38370K51154L93360
4216B3662467K44866J88853N3752J253309K82621J02562p06874J18204O15923
4207B5815683n48557K69398K61671R82230o96743N41401l20074m16537O78187
4198B6566659m95367N3619P03863j71725j64433M44070j91251L1216L05097k99298
4188B6782450k20941J058079M80437L47445N90557o48380J48404M00895L63725
4179B9302671R6342M48506Q67425j24373l36530J255939K63721n0379O03344K18576
$$ plain form
4245 23767078 23990023 23396192 23671003 24254287 24170334 23151089 23593690 22983486 22266282
4236 22266282 22331477 22723733 23535645 23227720 23644811 23721330 23683476 23482231 24263563 23880762
4226 23880762 23179715 23355651 22662649 22122566 22957387 23422648 23356323 23017953 23269107 23662467
4216 23662467 23907333 24096186 24149938 25403247 25685868 25788430 25081556 25199760 25815683
4207 25815683 25267126 25536524 25798195 26780425 26083682 26625083 26305009 25888472 26566659
4198 26566659 26071292 26124911 26828774 26657049 26492616 26936686 26745435 26776651 27081748 26782450
4188 26782450 26561509 27619588 28100025 28447470 29038027 28389647 28538051 28938946 29302671
4179 29302671 29399013 29847519 30714944 30590571 30254041 31509980 31773701 31723322 32326666 32545242
4169C2545242J16941K40138O3342m37911m36316R72842P72817k14310p184P29246
4159C4344847N33342Q44882N04872L04656K93634J86793J77689L32786O38660
4150C8162161K41155L24579M0651J341637O23215r4089m03526P67542l49333k21288
4140D0432704P09790K35263J9409J181861O94567R4919l46161N8751j07058R57047
4130D3931092O32113L19326N5637J2021O81612J725630r1425N42418J427598M22946
4120D9658968R96329Q15947N71280K69000J691510n6529L78037J731217N29522
4111E6585281J50885K138616J442996J471806Q63246J216524J112725J727647
4103F6709726J560015J130436J806188J540012K830716K346884K326985K443302
$$ plain form
4169 32545242 32662183 32902321 32965663 32527752 32091436 33064278 33837095 33622785 33615601 34344847
4159 34344847 34878189 35723071 36227943 36532599 36826233 37013026 37190715 37523501 38162161
4150 38162161 38403316 38727895 38768546 40110183 40733398 40639309 40235783 41003325 40653992 40432704
4140 40432704 41142494 41377757 41397166 42579027 43273594 43368513 43022352 43081103 42974045 43931092
4130 43931092 44563205 44882531 44938168 44950189 45631801 47357431 47266006 47808424 49236022 49658968
4120 49658968 50655297 51471244 52042524 52311524 54003034 53946505 54324542 56055759 56585281
4111 56585281 56736166 58874782 60317778 61789584 62652830 63869354 64982079 66709726
4103 66709726 68269741 69400177 71206365 72746377 75577093 77923977 80250962 82694264
4095H2694264K901109L061451L936405L801564M682456M992489M225183M369503
4087A14664424M763723M948226M093533L042074K999315K787783R39545M54206
4079A38692829n07046l76020o98122k046510l234477k584696k762205r87155m12540
4070A25084058J610674K647463K749528K483116J739795J755124p8433J00134
4062A38091459j810434k607445j826744l69956J155980J013893K625921L660414
4054A39933088M010208N643321P167735Q059467R555827J1210648J2875228J4991557
4046B13447079J4353668J2266600Q134852J038652n239190j1682414j4579632
4039B17739615j6090353j5604698j4418970j2670732j0475453r330174q562731
$$ plain form
4095 82694264 85595373 88656824 92593229 96394793 101077249 106069738 110294921 114664424
4087 114664424 119428147 124376373 128469906 131511980 134511295 137299078 138238623 138692829
4079 138692829 138185783 137809763 137111641 135065131 131830654 129245958 126483753 125496598 125084058
4070 125084058 126694732 129342195 132091723 134574839 136314634 138069758 137991325 138091459
4062 138091459 136281025 133673580 131846836 131476880 132632860 133646753 136272674 139933088
4054 139933088 143943296 149586617 156754352 164813819 174369646 185580294 198455522 213447079
4046 213447079 227800747 240067347 248202199 249240851 244001661 232319247 217739615
4039 217739615 201649262 186044564 171625594 158954862 148479409 139149235 130586504
4032A30586504p359439n886596n701655m947669m350373l959893l473741l306305
4024I1600833l509742j404044k380589k261982j757053j506006j894747j647648
4016G5239022k580629j871695l442781j931835j411042j989023j641588j407512
4008E8962917j262329j836331j601258l78009j375569j758181J12318j077813
4000D9785745k044409m82241j170026j713186m8049n27055k99897j020077r43656
3991D1537149j287654l54644r23014o98388j100420m79365m3732r51815j84753
3982C5513364l04297o73843m5757r90044q2647m2783k343l68405L3321q49082
3972C2187484o51920k44334K63885k48688j42508J87629m2993n87423k22055l00572
$$ plain form
4032 130586504 123227065 117340469 111638814 106691145 102340772 98380879 94907138 91600833
4024 91600833 88091091 86687047 84306458 82044476 80287423 78781417 76886670 75239022
4016 75239022 72658393 70786698 67343917 65412082 64001040 62012017 60370429 58962917
4008 58962917 57700588 55864257 54262999 53884990 52509421 50751240 50863558 49785745
4000 49785745 47741336 47259095 46089069 44375883 44327834 43800779 43500882 42480805 41537149
3991 41537149 40249495 39894851 38971837 38273449 37173029 36693664 36649932 35698117 35513364
3982 35513364 35209067 34535224 34489467 33499423 33416776 33373993 33371650 33003245 33036566 32187484
3972 32187484 31535564 31291230 31555115 31306427 31163919 31351548 31308555 30721132 30499077 30198505
3962C0198505M22585r7205n11747m45354l40564K30142R5001n3648K69931P56381
3952C0524027k92953o1244k16296P16402O81260M94128o58359p95288Q95400N22467
3942C1809544l50669j34655M97682l72511o48725N61696j37993O34936j29552
3933C1729753K34908p0692j02863m82696O41209j58283r28478m45310K88027k35331
3923C0470244j10502o31433q22934O81801P8810k68053N98863O4075m81995m08160
3913B9170716n16308j141545J79534K45994k03547j8147k92224p70262n80361
3904B6073850N24304m42784j164088r8077l74360k5437O17614n95741J94741k29479
3894B4480543k41226j130099O525j53818k48173l31111n47346l69827J78993R09789
$$ plain form
3962 30198505 30621090 30523885 30012138 29566784 29226220 29456362 29551363 29497715 29767646 30524027
3952 30524027 30231074 30169830 29953534 30669936 31351196 31845324 31186965 30391677 31287077 31809544
3942 31809544 31458875 31324220 31821902 31449391 30800666 31362362 31224369 31859305 31729753
3933 31729753 31964661 31893969 31791106 31308410 31949619 31791336 30862858 30417548 30705575 30470244
3923 30470244 30359742 29728309 28905375 29587176 29665986 29397933 29996796 30060871 29578876 29170716
3913 29170716 28654408 27512863 27692397 27938391 27734844 27716697 27424473 26654211 26073850
3904 26073850 26598154 26155370 24991282 24893205 24518845 24493408 25111022 24515281 24710022 24480543
3894 24480543 24239317 23109218 23115743 22961925 22713752 22382641 21835295 21465468 21644461 22554250
3884B2554250o5248O43592m54296o94972m2736m72159M42163J71969l7672m9718
3874B1995173j88585k04573N6564k95130K62339P47279p16399j99981O6560L97075
3864B1920322k1817j96292q15021J91895K33883J00983r6290l04183n98834M94089
3854B0908735J207065j106047O27291o652o72202J5851O50733m0791n53772k50035
3844B0780176L37225m66346Q39782m08725M16973j61128m31706L14887k33747
3835B0987391P79445Q20467N89678q07090n83261K97159M05701N75384j23683
3826B2941191o59043M05225k26876N91318O40473l61225j9412q79355P58742J86231
3816B3377269j06619Q91327p8133N53505j58592m99986J22321M71799l93195R31426
$$ plain form
3884 22554250 22489002 23132594 22678298 21983326 21940590 21468431 21910594 22082563 22044891 21995173
3874 21995173 21806588 21602015 21658579 21363449 21625788 22373067 21656668 21456687 21523247 21920322
3864 21920322 21898505 21702213 20887192 21079087 21312970 21413953 21317663 21013480 20414646 20908735
3854 20908735 22115800 21009753 21637044 21630392 20958190 20974041 21624774 21583983 21030211 20780176
3844 20780176 21117401 20651055 21490837 21082112 21499085 21337957 20906251 21221138 20987391
3835 20987391 21766836 22587303 23176981 22369891 21786630 22083789 22489490 23064874 22941191
3826 22941191 22282148 22687373 22460497 23051815 23692288 23331063 23311651 22432296 23191038 23377269
3816 23377269 23270650 24161977 24083844 24637349 24478757 23978771 24101092 24572891 24179696 25111122
3806B5111122M2284N32656l46368k22207P52025L95214L917K80508O00573q50440
3796B6299284k17884O28156R37692K22871P77497N70638K27720O59567m163P20373
3786C0821751k44353j82311Q40328J10568o91108L49175P54416m81880O09644
3777C1886230J090777j31597m0948J241299l77130l83081j0M49925Q58792O80877
3767C5275134l80762j78677Q27913N99012J056787Q18638Q47529O58733j59858
3758C9364449J188089J585130J747210J759885J126427J705704K063003Q93658
3750E1433555J555822K554633K826461K782556L221835K917455K942844K951067
3742G3186228K193805L724886L470260L744845K804117K520747L361123J686849
$$ plain form
3806 25111122 25153406 25686062 25339694 25117487 25869512 26264726 26268643 26549151 27149724 26299284
3796 26299284 26081400 26709556 27647248 27870119 28647616 29218254 29445974 30105541 30101378 30821751
3786 30821751 30577398 30395087 31235415 31345983 30654875 31004050 31758466 31276586 31886230
3777 31886230 32977007 32845410 32804462 34045761 33668631 33285550 33285540 33735465 34594257 35275134
3767 35275134 34894372 34715695 35543608 36142620 37199407 38018045 38865574 39524307 39364449
3758 39364449 40552538 42137668 43884878 45644763 46771190 48476894 50539897 51433555
3750 51433555 52989377 55544010 58370471 61153027 64374862 67292317 70235161 73186228
3742 73186228 75380033 79104919 82575179 86320024 89124141 91644888 95006011 96692860
3734I6692860P67815J165564R78142M24792n37100q33136m54737n69518o81736
3725I6952946j599744r36172j350459o38320j648714j892379j348404l285548
3717H4253206k543962l225497k978855l974386l547128l292883l236392m135690
3709E7318413l086369k338895j724758k568665j629706k284757j646549p22020
3701D1316694j652650n19005r04965p16325r91553r12735j28370J83523q18237
3692C4856377j284893j83901l04470k35635n72923r05483m83412J91925N14954
3683C1592539r46208r34123J1121j15196K92614L18496K2659K60484K65731k8611
3673C0739506k55366K18018p54872m28881j061828j7811N37247R22931L11057
$$ plain form
3734 96692860 97460675 98626239 99604381 100029173 99492073 98658937 98204200 97634682 96952946
3725 96952946 95353202 94417030 93066571 92428251 90779537 88887158 87538754 84253206
3717 84253206 81709244 78483747 75504892 71530506 67983378 64690495 61454103 57318413
3709 57318413 54232044 51893149 50168391 47599726 45970020 43685263 42038714 41316694
3701 41316694 39664044 39145039 38240074 37523749 36532196 35619461 35491091 35674614 34856377
3692 34856377 33571484 33387583 33083113 32847478 32274555 31369072 30885660 31077585 31592539
3683 31592539 30646331 29712208 29723329 29608133 29900747 30219243 30241902 30502386 30768117 30739506
3673 30739506 30484140 30702158 29947286 29518405 28456577 28438766 28976013 29898944 30210001
3664C0210001o83161O38776n6880j99368J3521L1459J16263r3359K72202l27489
3654B9921965P686n13398l81226J022431P00845j23054R7725m0295J75754L51737
3644C1220170M18901O68031J98434J36497K42362R3278N31177Q84327K40084L3261
3634C4666522Q65463j70634J070886K11348J57203L69879L98546R82339J702693
3625D0254245M81623K78750J074729J160036P11706Q24519K129651J254972Q74963
3616D9045194M97164O89592J005319L76237M71826J233963m83072O36018J326299
3607E4798540k38213J94676k93265l68383r1062P23978R0583o05188m26601n40558
3597E3244507l4945m3853L81444k04396J135819K36958Q9859N70656J310321l43494
$$ plain form
3664 30210001 29526840 30165616 30108736 29909368 29922889 29954348 30070611 29977252 30249454 29921965
3654 29921965 29929651 29416253 29035027 30057458 30758303 30635249 30732974 30692679 30868433 31220170
3644 31220170 31639071 32307102 32505536 32642033 32884395 32977673 33508850 34393177 34633261 34666522
3634 34666522 35531985 35361351 36432237 36643585 36800788 37170667 37569213 38551552 40254245
3625 40254245 40735868 41014618 42089347 43249383 43961089 44785608 46915259 48170231 49045194
3616 49045194 49542358 50231950 51237269 51613506 52085332 53319295 52836223 53472241 54798540
3607 54798540 54560327 54755003 54461738 54093355 54002293 54726271 54816854 54211666 53785065 53244507
3597 53244507 53209562 53165709 53547153 53342757 54478576 54715534 54805393 55376049 56686370 56342876
3587E6342876O0058J513726R96749K418363J222509J15727J980711J801428J828205
3578F8280352J297399K161189L242262K547569K898359K984269L766327L306500
3570I0484226L193887L289903M269753L750303M144689M071851K844770L616429
3562A19665811L854589M609917M655306M802591M403818M725704M059056M131417
3554A54908209M817184K887251K205991J623767Q84920O0803L88975K18438q68277
3545A67127261j199184r59568j791750k626268j890762p72914j758568j848565
3537A54279682k504389k508061k079181l523757m006327l737873m142329m299690
3529A27478075m675975m702277m448764m843247l853553l825336l879432l827291
$$ plain form
3587 56342876 56402934 57916660 58913409 61331772 62554281 62670008 64650719 66452147 68280352
3578 68280352 69577751 71738940 74981202 77528771 80427130 83411399 87177726 90484226
3570 90484226 93678113 96968016 101237769 104988072 109132761 113204612 116049382 119665811
3562 119665811 123520400 128130317 132785623 137588214 141992032 146717736 150776792 154908209
3554 154908209 159725393 162612644 164818635 166442402 167327322 167388125 167777100 167995538 167127261
3545 167127261 165928077 164968509 163176759 160550491 158659729 157886815 156128247 154279682
3537 154279682 151775293 149267232 147188051 143664294 139657967 135920094 131777765 127478075
3529 127478075 122802100 118099823 113651059 108807812 104954259 101128923 97249491 93422200
3521I3422200l108700l352261k774283k478361k164151k073515k495792j219007
3513G3756130j749008k235967k296047j844621k20453j262508j784131j225390
3505F1138005j168125j842411m84418p30342r91082r53096j215820j333430j163437
3496E1255844m26200r4213j090011j267082j42461j557565m38597o97259P84067
3487D6326523l99931j72307J5363q82346n12994q3403j6893p20081j913565o44592
3477D0995774r6190j228005M86084o55414r99328j321611o30019n73350n8809
3468C5919132l39660p89093q74322k52817l5603o75491n07358n6420j32538j33158
3458C2122672r38861p35393P95851O25440m05596r90429l30296O9773J71764k66406
$$ plain form
3521 93422200 90313500 86961239 84186956 81708595 79544444 77470929 74975137 73756130
3513 73756130 72007122 69771155 67475108 65630487 65410034 64147526 62363395 61138005
3505 61138005 59969880 58127469 57643051 56912709 55921627 54968531 53752711 52419281 51255844
3496 51255844 50829644 50735431 49645420 48378338 48235877 46678312 46239715 45542456 46326523
3487 46326523 45926592 45754285 45769648 44887302 44374308 44290905 44274012 43553931 41640366 40995774
3477 40995774 40899584 39671579 40157663 39502249 38502921 37181310 36551291 35977941 35919132
3468 35919132 35579472 34790379 33916057 33663240 33627637 32952146 32444788 32388368 32255830 32122672
3458 32122672 31183811 30448418 31244269 31869709 31464113 30473684 30143388 30213161 30384925 30118519
3448C0118519o44936L31228K73907l14247l42385R5434K23080r7693n410P60976
3438C0398473K74687j144739K54438P13133N01021N13139q53539l82908J075304
3429C1349009P26025O58091k13387J36110K13245M31147O75623M91792L06131
3420C4773786O48447K15259O20279J108201j99574Q87449Q2447L5328O54989J30058
3410C8956669j00993K53896M8349k54599o6261L19513L28706n30148J80743j35607
3400C9000268k83371K16921l5038J317591O48399R335O64604l1460L79255P57536
3390D2644040o1226M52146j04745J759563J105214j61717J600229R91035J087845
3381D9312384J22268J320737J279733P63439J705412J447919J691552J077772
$$ plain form
3448 30118519 29473583 29804811 30078718 29764471 29422086 29517520 29740600 29642907 29637497 30398473
3438 30398473 30673160 29528421 29782859 30495992 30997013 31510152 30656613 30273705 31349009
3429 31349009 32075034 32733125 32519738 32655848 32869093 33300240 33975863 34467655 34773786
3420 34773786 35422233 35637492 36257771 37365972 37166398 38053847 38136294 38171622 38826611 38956669
3410 38956669 38855676 39109572 39157921 38903322 38837061 39156574 39485280 38955132 39135875 39000268
3400 39000268 38716897 38933818 38898780 40216371 40864770 40874105 41538709 41507249 41886504 42644040
3390 42644040 42582814 43034960 42930215 44689778 45794992 45633275 47233504 48224539 49312384
3381 49312384 49434652 50755389 52035122 52798561 54503973 55951892 57643444 58721216
3373E8721216J650732J833054K186237J779610O10059K369062N20297J328747
3365G0999014N80695J055086J289524J789998P48511M55639L68236O45270M03676
3356G8335649j228103N72796k41594m15677n39055j130861p72120l56317m81292
3347G3743426l35611p2972L2860n82435N90637J68531J428261R56639J385546
3338G7314882R58376L60971K043445J325504J413797K361705K195138K451441
3330I0425259K986980J642345L834028L786181K479631K859098M199571M736177
3322A16949270K438694L176555M590406N304481N178662M200134M009279L544352
3314A49391833L632380L873424L335390K410626K509961K126224K590944K388110
$$ plain form
3373 58721216 60371948 62205002 64391239 66170849 66780908 69149970 69670267 70999014
3365 70999014 71579709 72634795 73924319 75714317 76462828 76918467 77286703 77931973 78335649
3356 78335649 77107546 77680342 77438748 77023071 76484016 75353155 74581035 74224718 73743426
3347 73743426 73407815 73334843 73367703 72785268 73375905 73544436 74972697 75929336 77314882
3338 77314882 78273258 78634229 80677674 82003178 83416975 85778680 87973818 90425259
3330 90425259 93412239 95054584 98888612 102674793 105154424 108013522 112213093 116949270
3322 116949270 119387964 122564519 127154925 132459406 137638068 141838202 145847481 149391833
3314 149391833 153024213 156897637 160233027 162643653 165153614 167279838 169870782 172258892
3306A72258892K973439J926943J618107J723426K081014J910260P85815K615407
3298A87893303J490610P70559R81857o50855j278741j194822j597198j935248
3290A84479465k448933j422512j748273j806830j544883j666671k149543o62172
3282A71029648l92356m49958j462787l25443j685309r45723j351535j620660j518074
3273A61277803j315866j668455k052201j291657k252400k047958o21627j124842
3265A48902797Q4548P36131K32075K375683K015041K030735K749901K524072K683051
3256A64334034L701314N084622N069042M637826N373600N481046O249009P262954
3248B07193447R006578Q186022P736075Q184912P051973M694912K536239l56333
$$ plain form
3306 172258892 175232331 177159274 178777381 180500807 182581821 184492081 185277896 187893303
3298 187893303 189383913 190154472 191136329 190485474 189206733 188011911 186414713 184479465
3290 184479465 182030532 180608020 178859747 177052917 175508034 173841363 171691820 171029648
3282 171029648 170637292 170187334 168724547 168399104 166713795 165768072 164416537 162795877 161277803
3273 161277803 159961937 158293482 156241281 154949624 152697224 150649266 150027639 148902797
3265 148902797 148987345 149723476 149955551 152331234 154346275 156377010 159126911 161650983 164334034
3256 164334034 168035348 173119970 178189012 182826838 188200438 193681484 199930493 207193447
3248 207193447 216200025 224386047 232122122 240307034 247359007 252053919 254590158 254233825
3240B54233825k995620n635892q162601r376652j0566649j0497226j0399073j0158143
3232A86441969r128008p413129o977922n764028n195573l953157k840009l411425
3224A41758718m130265m723618l546556l553796l355557l849525k185991k029447
3216A14383963j166929j536769r2897j613689j257316r49993P70549O72652j088956
3207A08120615p26562n2838N31049k18641j015633j048897n82422k63298m68959
3198A04274414m4713K95300j245415l67878k00815j435864j175884j338637k338395
3189I6422113j979939k794405j898242k946966k778337j860946k602268k172638
3181G7388372k347869j897440j528384k319396k248128j670707n18151p35862
$$ plain form
3240 254233825 251238205 245602313 237439712 228063060 217496411 206999185 196600112 186441969
3232 186441969 177313961 169900832 162922910 157158882 151963309 148010152 145170143 141758718
3224 141758718 137628453 132904835 129358279 125804483 122448926 118599401 116413410 114383963
3216 114383963 113217034 111680265 111587368 109973679 108716363 107766370 108536919 109209571 108120615
3207 108120615 107394053 107341215 107872264 107653623 106637990 105589093 105006671 104743373 104274414
3198 104274414 104229701 104525001 103279586 102911708 102710893 101275029 100099145 98760508 96422113
3189 96422113 94442174 91647769 89749527 86802561 84024224 82163278 79561010 77388372
3181 77388372 75040503 73143063 71614679 69295283 67047155 65376448 64858297 64122435
3173F4122435q48050l35948k79761M24391L60915l35486J79487M12117P69164
3164F4469264O20804k15408P40832n2702Q64832J132413L57013J000044K128947
3155G1046039J429744J793020K598453K385918K080515K191177K642919L702243
3147H9870028L496258M060463M557526N100278N574688M726557N302863N143709
3139A27832370N789197L901407L335172K388814J718739L97735k014265l588469
3131A39760700m060322n928297n943977o878085o679757n700472o391803o235917
3123I1942070n721576m970453m255012m206275l168711l384810l006318k332511
3115F0896404k077033j971885k922986j176463j458194k247328o59763r55212
$$ plain form
3173 64122435 63274385 62938437 62658676 63083067 63443982 63108496 63287983 63700100 64469264
3164 64469264 65090068 64874660 65615492 65562790 66427622 67560035 67917048 68917092 71046039
3155 71046039 72475783 74268803 76867256 79253174 81333689 83524866 86167785 89870028
3147 89870028 93366286 97426749 101984275 107084553 112659241 117385798 122688661 127832370
3139 127832370 133621567 137522974 140858146 143246960 144965699 145363434 143349169 139760700
3131 139760700 135700378 129772081 123828104 116950019 110270262 104569790 98177987 91942070
3123 91942070 86220494 81250041 76995029 72788754 69620043 66235233 63228915 60896404
3115 60896404 58819371 56847486 53924500 52748037 51289843 49042515 48382752 47427540
3107D7427540q97548q80796o63030j133783o38396o51985n04412j291189j227855
3098C9538546l90742k00827p74203q46376m2986p07163L6757m79289j081907j291381
3088C3760429J68660k49366k13399k26987M96158p95622m55991J8398m02827P6319
3078C2175772r25480L42658n71050L26437O90695j617473N7886k29772N42848
3069C0792521p0502r19409R4353P9012N09218Q99974K1087o68858K13537P69088
3059C1720021N66031n92699R51126n63627n705O43232Q07418M44811Q86608O78082
3049C5535298k2521J157361Q14900l46527J465614P06633Q2369J575031Q12315
3040D1780473k34759O65549K98555Q75465J80424m12108o618j393244M83362N40889
$$ plain form
3107 47427540 46529992 45649196 44986166 43852383 43213987 42562002 42057590 40766401 39538546
3098 39538546 39147804 38946977 38172774 37326398 37283412 36576249 36613006 36133717 35051810 33760429
3088 33760429 33929089 33679723 33466324 33239337 33735495 32939873 32483882 32502280 32099453 32175772
3078 32175772 31250292 31592950 31021900 31348337 32039032 30421559 30479445 30249673 30792521
3069 30792521 30722019 29802610 29896963 29975975 30485193 31385167 31406254 30737396 30950933 31720021
3059 31720021 32286052 31693353 32644479 32080852 32075147 32718379 33525797 33970608 34857216 35535298
3049 35535298 35512777 36670138 37485038 37138511 38604125 39310758 39393127 40968158 41780473
3040 41780473 41545714 42211263 42509818 43385283 43565707 43153599 43146981 41753737 42237099 42777988
3030D2777988o65477q38054l50826j440992j834521j124826j720397j232173j2026
3021C3558696p97870k92994j712466k393q72596j041821j88123k20378o98113
3012B7731942m31164j33522L0783m4119k25963k85506n60333k14677n97118J4370
3002B5284693K93067n57317k42592R53512p9968o12918M58764q5563k84784l60952
2992B4765942o3569M28105N53886n69070L05196L44878j671k71040J49204Q62142
2982B6504003N54499j13795L32587n21292r1386J033898J158201j322957L23409
2973B7857167J354051M773Q73833J71146l1852o31810M73823J07371K58784J47753
2963C0585039K41266J33861J44388M03909P45775O46664L53703k53957N02055
$$ plain form
3030 42777988 42112511 41274457 40923631 39482639 37648118 36523292 34802895 33570722 33558696
3021 33558696 32760826 32467832 30755366 30752973 29880377 28838556 28650433 28430055 27731942
3012 27731942 27300778 27167256 27198039 27153920 26927957 26642451 26082118 25867441 25270323 25284693
3002 25284693 25577760 25020443 24777851 25731363 25651395 25038477 25497241 25411678 25126894 24765942
2992 24765942 24702373 25130478 25684364 25115294 25420490 25765368 25763697 25492657 25641861 26504003
2982 26504003 27058502 26944707 27277294 26756002 26664616 27698514 28856715 27533758 27857167
2973 27857167 29211218 29215991 30089824 30260970 30229118 29597308 30071131 30178502 30437286 30585039
2963 30585039 30826305 30960166 31104554 31508463 32254238 32900902 33254605 33000648 33502703
2954C3502703R80527O6204n36793R09847P29855R73265O21267N48858Q02604K42102
2944C8840439k67923K197787R50061O49370P91511P52152J031526Q32027O74990
2935D6451940O97915J496478L47692Q28422R37917O31610M37858L6323M54571
2926E2320726N48371N70769J341009P12313R81973J394813R65248M45312o7259
2917E9213275J742680J073287J305431J082802J529132J806217J963901J479316
2909G1196041J282144K315773K911263J742289K825206K546775K110745J306131
2901H8236367Q00598J303738L74503J035799o50616L55251J834884J654167R91188
2892I5935879K711952L652656J851513K115140M727629L655335M201429L563072
$$ plain form
2954 33502703 34483230 34549434 34012641 34922488 35652343 36625608 37246875 37795733 38598337 38840439
2944 38840439 38572516 40770303 41720364 42369734 43161245 43913397 44944923 45776950 46451940
2935 46451940 47149855 48646333 48994025 49822447 50760364 51391974 51829832 51866155 52320726
2926 52320726 52869097 53439866 54780875 55493188 56475161 57869974 58835222 59280534 59213275
2917 59213275 60955955 62029242 63334673 64417475 65946607 67752824 69716725 71196041
2909 71196041 72478185 74793958 77705221 79447510 82272716 84819491 86930236 88236367
2901 88236367 89036965 90340703 90715206 91751005 91100389 91455640 93290524 94944691 95935879
2892 95935879 98647831 102300487 104152000 106267140 110994769 114650104 118851533 122414605
2884A22414605L577548L175576L527457L863019M772663N205791O476249P146898
2876A60159806Q606897R284373J0113557J1304253J2106070J2111504J1916857
2869B35603317J2901108J4439285J7987451K0821113K5339817L0247328L2693028
2862C90032447L2969997K8748231J8746861N695789q726159j9468841k9548090
2855D18450235l3950434l5116827l3173520k9886476k4895081k2527984j9630038
2848B19269875j6156061j4140105j2135194j0660222r539465r647181q252358
2841A38739289p592773o196058n674315m935778m493381m893360l429309m021016
2833I7503299k901859k906225l167382k081296k969110k500654k050502k195198
$$ plain form
2884 122414605 125992153 129167729 132695186 136558205 141330868 146536659 153012908 160159806
2876 160159806 168766703 178051076 188164633 199468886 211574956 223686460 235603317
2869 235603317 248504425 262943710 280931161 301752274 327092091 357339419 390032447
2862 390032447 423002444 451750675 470497536 476193325 467467166 447998325 418450235
2855 418450235 384499801 349382974 316209454 286322978 261427897 238899913 219269875
2848 219269875 203113814 188973709 176838515 166178293 156638828 146991647 138739289
2841 138739289 131146516 124950458 119276143 114340365 109846984 104953624 101524315 97503299
2833 97503299 94601440 91695215 88527833 86446537 83477427 80976773 78926271 76731073
2825G6731073j653223j51893j679578j652376j813848j074052q43542j010918
2817F6851643j330116j300533m97252j342756j244908m07371n48149K09693o83839
2808E9706412j028040M56939k9870k59177M31242j18545Q92866N94990k30200
2799F0416617K29738J76152J302459Q44957J773127J125754J374675K186749K628511
2790G2058739K987824K069191L737200N065466N043171N437906O041630O560200
2782A09001327P263148O898805N841325L346688j4979l285572o265220p134713
2774A15650809p829833q554800p512243p303850o565379n662280m989874l984314
2766F3248236l532974l871733k752139l068945j956926k237706k334585j183660
$$ plain form
2825 76731073 75077850 74925957 73246379 71594003 69780155 68706103 67862561 66851643
2817 66851643 65521527 64220994 63723742 62380986 61136078 60728707 60180558 60390251 59706412
2808 59706412 58678372 59135311 59105441 58846264 59277506 59158961 60051827 60646817 60416617
2799 60416617 60646355 60822507 62124966 62969923 64743050 65868804 67243479 69430228 72058739
2790 72058739 75046563 77115754 80852954 85918420 90961591 96399497 102441127 109001327
2782 109001327 116264475 123163280 129004605 132351293 132336314 129050742 122785522 115650809
2774 115650809 107820976 99266176 91753933 84450083 77884704 72222424 67232550 63248236
2766 63248236 59715262 55843529 53091390 50022445 48065519 45827813 43493228 42309568
2758D2309568j797326j654390j710393o17192j125460q30989j335018q38282p77890
2749C1622628p14862J69563j342750r58407j296895p72465l68079O3496o25966
2740B5776263r93259o62595k58271j228012n37195m07580n84894Q55038o15966
2731B1343529r56043p31163O48252m77073O5779j189765l26817Q1844j52355o94627
2721A7611561m06739j96854m1495K78935p860J55885n91459K62463J54279j200086
2711A6018630j022687N97175n5881K21923m19173l46429n5194k43707n89724m35498
2701A3669435Q07912J84015j152260o91388K86130N09906k21958q65888K10328
2692A2736232o58932L5919O93534L5123r2815J31105j23461L2315n7237L72039
$$ plain form
2758 42309568 40512242 38857852 37147459 36530267 35404807 34573818 33238800 32400518 31622628
2749 31622628 30907766 31077329 29734579 28776172 27479277 26706812 26338733 26402229 25776263
2740 25776263 24783004 24120409 23862138 22634126 22096931 21689351 21104457 21959495 21343529
2731 21343529 20387486 19656323 20304575 19827502 19893281 18703516 18376699 18458543 18306188 17611561
2721 17611561 17204822 17007968 16966473 17245408 17237548 17393433 16801974 17064437 17218716 16018630
2711 16018630 14995943 15593118 15537237 15759160 15339987 14993558 14938364 14694657 14104933 13669435
2701 13669435 14477347 14661362 13509102 12817714 13103844 13613750 13391792 12525904 12736232
2692 12736232 12077300 12113219 12806753 12841876 12749061 12880166 12756705 12789020 12731783 13103822
2682A3103822q66844n9570J97507j35015o29740o87656M0484o23022M76402p5881
2672A0740487k45032K57198P09925k59016P596m39615n03060o65044p2617m13591
2662I117231O81573O55598j079582M88642N93692l37087o43021k43363k33708
2653H999975J61151l25423j10644N58010O45306o87369j12511K49786K86605J02610
2643I767496r00775P9119m69405J73841j8021p03716K71797K6696K31205O0381
2633H518618o37222M53665l22943k91852L51847K53680J18640q23374m69979Q09486
2623G960566j78154J70443N8538m44963N14935o82616l34932O70171n17806k15907
2613G000275J75364k03309m25495M82104p0310l34746Q82255p591k12583Q6797
$$ plain form
2682 13103822 12236978 12177408 12374915 12239900 11610160 10922504 10962988 10339966 10816368 10740487
2672 10740487 10495455 10752653 11462578 11203562 11211158 10771543 10268483 9603439 9530822 9117231
2662 9117231 9798804 10454402 9374820 9863462 10457154 10120067 9477046 9233683 8999975
2653 8999975 9161126 8835703 8725059 9283069 9928375 9241006 9128495 9378281 9664886 9767496
2643 9767496 8866721 8945840 8476435 8650276 8632255 7928539 8200336 8227032 8458237 8518618
2633 8518618 7881396 8335061 8012118 7720266 8072113 8325793 8444433 7621059 7151080 7960566
2623 7960566 7782412 7952855 8011393 7566430 8081365 7398749 7063817 7733988 7216182 7000275
2613 7000275 7175639 6972330 6546835 7028939 6958629 6623883 7506138 7498547 7285964 7372761
2603G372761L19763O49254j024032l21761Q4179m6226o4494K49006M07005k18295
2593G407160j0737j61588R0567r55259J0174l22725Q6374o0455L19128J43001
2583F545640L56480K18978m14037m46095n36507J022304P92410n43576j07231
2574F888366k40117M61584P21518q88450l5461o09644j5657l27518K3664j16422
2564E861863j95032l01053J38404j09379l36374J97037N17485j24186j04100o7846
2554E476819j144478k36657L99872L95707q2146o35011l1649o85590M73524J566483
2544E496874n74935j146885O41315O25185r59124j68508J51946O33067k01948
2535D496987o84703k49054K11151M045Q2537l23559J134673J01008o10889l01682
$$ plain form
2603 7372761 7692524 8341778 7317746 6995985 7080164 7033938 6969444 7218450 7625455 7407160
2593 7407160 7396423 7234835 7325402 6370143 6380317 6057592 6143966 6083511 6402639 6545640
2583 6545640 6902120 7121098 6707061 6260966 5724459 6746763 7539173 6995597 6888366
2574 6888366 6648249 7109833 7831351 6942901 6907440 6297796 6282139 5954621 5978285 5861863
2564 5861863 5666831 5365778 5504182 5394803 5058429 5255466 5772951 5648765 5544665 5476819
2554 5476819 4332341 4095684 4495556 4891263 4809117 4174106 4142457 3456867 3930391 5496874
2544 5496874 4921939 3775054 4416369 5041554 4082430 3913922 4065868 4698935 4496987
2535 4496987 3812284 3563230 3774381 3778426 3860963 3537404 4672077 4773085 4162196 3860514
2525C860514l41840N7038L92165p81001O61466N81789p10601K97144j55220j05697
2515C755757K43010k46672n18373l76044k34115R42649o19916l19454K47200N99141
2505C473183J35357m08075R938r49083N85156R37501R0615m4585j10738o59395
2495C059874K62640O57880j348718o18281P82752J237731n59739P11040o81458
2486C503721m11162r832R98784m0912j171870P4549K23093L91641n41314K35707
2476C252405N96461n16913o38834l08265J28479O35300p97086m8780M56413K36010
2466B995190k51318j00895J62413J08650n75113q10932Q83308R12946r79258J24023
2456B469014O44386N14981j31773k12614j51927j188680j22887K54851k14346
$$ plain form
2525 3860514 3518674 3575712 3967877 3186876 3848342 4430131 3719530 4016674 3861454 3755757
2515 3755757 3998767 3752095 3233722 2857678 2623563 3566212 2946296 2626842 2874042 3473183
2505 3473183 3608540 3200465 3210403 2261320 2846476 3783977 3874592 3830007 3719269 3059874
2495 3059874 3322514 3980394 2631676 2013395 2796147 4033878 3474139 4185179 3503721
2486 3503721 3092559 3082727 4081511 4040599 2868729 2943278 3166371 3558012 3016698 3252405
2476 3252405 3848866 3331953 2693119 2384854 2513333 3148633 2351547 2302767 2759180 2995190
2466 2995190 2743872 2642977 2805390 2914040 2338927 1527995 2411303 3324249 2344991 2469014
2456 2469014 3113400 3628381 3496608 3283994 3132067 1943387 1820500 2075351 1861005
2447A861005J128425p35745j121277M63074k81254M9893R86016J40840m50587
2438B040390j77588J35167L21934Q03071m90727m71462l2118Q31044R70802j352892
2428B577621m65853M40274k92229N75996j34875q32614n73557J95335j50363N23331
2418A863066Q61047q76793J09367O10412l44573O4506L83075n6m99987N17625
2408B687689J335n85313k75837o28954P24117K69539J28446K15888j50346P5624
2398B462188L04391l87276l17279K59181j68399m72414O1145K7351Q25106M34435
2388C028429l54739L05544q3748k71782O12375k39053k11504K9372o18982L19112
2378B515024M45364r0534J288457L22225K1893k26148M94644J49441l42278J56374
$$ plain form
2447 1861005 2989430 2253685 1132408 1595482 1314228 1364121 2350137 2490977 2040390
2438 2040390 1862802 1997969 2319903 3122974 2632247 2160785 2128667 2959711 3930513 2577621
2428 2577621 2111768 2552042 2259813 2835809 2700934 1868320 1294763 1490098 1339735 1863066
2418 1863066 2724113 1847320 1956687 2567099 2222526 2287032 2670107 2670051 2170064 2687689
2408 2687689 2689024 2103711 1827874 1198920 1923037 2192576 2321022 2536910 2386564 2462188
2398 2462188 2766579 2379303 2062024 2321205 2152806 1680392 1741537 1768888 2593994 3028429
2388 3028429 2673690 2979234 2895486 2623704 3236079 2997026 2785522 2814894 2195912 2515024
2378 2515024 2960388 2869854 4158311 4480536 4502429 4276281 4770925 4920366 4578088 4734462
2368D734462l33184r05298o53825J112216k91324o26678k74428j20903l00854
2359B340184m91983L42374O33855k07546O04258m83696m35227N26407p57397N14951
2349B586180K29162p56997m77679L79218J91087L25115O4651K04234j323398K65018
2339A686591J125568p8896m17975l44940N25536R3132K83111q87329N64167j40319
2329B408646r35645O67325L69657J60461j86237J41463M6792j76695N10717K48959
2319C255443N5638j062596r53673R66970N8744N34656m52020M88603k33245r216
2309B649304O9769r7229j5123o59059K93826L40694Q93769l42082l5188p44330
2299B354351l64397P68834j25179q71611L56727N03432P6565m91126K74055j26886
$$ plain form
2368 4734462 4401278 3495980 2842155 3954371 3663047 3036369 2761941 2641038 2340184
2359 2340184 1848201 2190575 2824430 2616884 3221142 2737446 2302219 2828626 2071229 2586180
2349 2586180 2815342 2058345 1580666 1959884 2150971 2476086 2540737 2744971 1421573 1686591
2339 1686591 2812159 2733263 2315288 1970348 2495884 2589016 2872127 1984798 2548965 2408646
2329 2408646 1473001 2140326 2509983 2670444 2484207 2625670 2672462 2495767 3006484 3255443
2319 3255443 3311081 2248485 1294812 2261782 2320526 2855182 2403162 2891765 2658520 2649304
2309 2649304 2719073 2621844 2606721 1947662 2241488 2582182 3475951 3133869 3098681 2354351
2299 2354351 1989954 2758788 2633609 1761998 2118725 2622157 2698722 2207596 2481651 2354765
2289B354765M69148L94289m44020o68633K46045j72823j141997K27062M79212
2280A743048l90477p5504J073923j22248j49183k19881J20315L01623n38885Q1285
2270A824016J67043n71379L84736L94240J3194J14879k81432O84853m74632O9401
2260B324919K5129O15350j45952L33886k1282o70183P73057j287724r778M61752
2250B399174J53761o1271N9356K74965m46331K61812M3614J54863R40124k23286
2240C556781n15059p85721K05820J78234Q80623L43330n33135J51119K01065P1066
2230C754123k84899m0505m75970j11188r2748N68850q6182L75178j34270M41450
2220C913839m01660L07480Q71036r92104J101316Q97441p21071N833L10040j21073
$$ plain form
2289 2354765 2823913 3218202 2774182 2105549 2351594 2178771 1036774 1263836 1743048
2280 1743048 1352571 1277067 2350990 2228742 2079559 1859678 1979993 2281616 1742731 1824016
2270 1824016 1991059 1419680 1804416 2198656 2211850 2326729 2045297 2730150 2255518 2324919
2260 2324919 2350048 2965398 2819446 3153332 3132050 2461867 3234924 1947200 1937422 2399174
2250 2399174 2552935 2491664 2551020 2825985 2379654 2641466 2685080 2839943 3780067 3556781
2240 3556781 3041722 2256001 2461821 2640055 3520678 3864008 3330873 3481992 3683057 3754123
2230 3754123 3469224 3428719 2952749 2841561 2748813 3317663 3231481 3606659 3472389 3913839
2220 3913839 3512179 3819659 4690695 3698591 4799907 5697348 4976277 4982110 5292150 5171077
2210E171077J80184p8112j72076N1859O43788k68912p59221M66098R99288L77090
2200F611063k05018j64858M22297P25390l34593N3632O2839R18715l8733K71218
2190H321952j83775m4568K58677R5045J02034M84099K8581M01363K2429k34049
2180I251788K3085k58932K39412M77114M01454o72400j06874m05265R92649P13487
2170A0655518r7780k85362J291713L87634L9487l97198M63451L76794K44365K4228
2160A2702850Q59243j05939j07552Q83348l21784P00864Q95440M77459K75000
2151A6258929L20725R44524j27162O77259j9290Q07515Q98736J270639R62497
2142B1994372O43622J430288P97505J681001Q67620O13599K389305J633597M76382
$$ plain form
2210 5171077 5351261 5273149 5101073 5152932 5796720 5527808 4768587 5234685 6233973 6611063
2200 6611063 6406045 6241187 6663484 7388874 7054281 7107913 7170752 8089467 8050734 8321952
2190 8321952 8138177 8093609 8352286 8447331 8549365 9033464 9062045 9463408 9485837 9251788
2180 9251788 9274873 9015941 9255353 9732467 10133921 9461521 9354647 8949382 9942031 10655518
2170 10655518 10557738 10272376 11564089 11951723 11991210 11594012 12057463 12434257 12678622 12702850
2160 12702850 13562093 13456154 13348602 14231950 13910166 14611030 15506470 15983929 16258929
2151 16258929 16579654 17524178 17397016 18074275 18054985 18862500 19761236 21031875 21994372
2142 21994372 22637994 24068282 24865787 26546788 27414408 28028007 30417312 32050909 32527291
2133C2527291K148565K146674N91672J995256Q73034J221096L137930K950691
2125D7592209L228806L850323M811240M717126O188972N444523N460156M570060
2117H5863415N825251O987575R702833J0411505J3827421J6702052K1595181K9416609
2109B00331842L7967898M9320831P0038657P7187907M8619305j8966276o4640177
2102C99859987o1374564n8224597n1775842m1040592l2374767k3686531j7010773
2095A14372321j3350285j0105664p573987n368822m225936m055622n057858m539625
2087F0094522m974909n305089l822965k699420k500584k344085k651546r61622
2079C4834302k139710p40650j271724k220861j922479n03461j195258j256934
$$ plain form
2133 32527291 34675856 36822530 37414202 39409458 40282492 41503588 44641518 47592209
2125 47592209 50821015 54671338 59482578 64199704 70388676 75833199 81293355 85863415
2117 85863415 91688666 98676241 108379074 118790579 132618000 149320052 170915233 200331842
2109 200331842 238299740 287620571 357659228 434847135 483466440 464500164 399859987
2102 399859987 338485423 280260826 228484984 187444392 155069625 131383094 114372321
2095 114372321 101022036 90916372 83342385 77973563 73747627 69692005 64634147 60094522
2087 60094522 55119613 49814524 45991559 43292139 40791555 38447470 35795924 34834302
2079 34834302 32694592 31953942 30682218 28461357 26538878 26035417 24840159 23583225
2071B3583225j623697j083392n05559p86341j147860j443109r3853j13609j523023
2062A5262782k90139m0849o78175m60925o97545k38927p44666K0596p39791j50902
2052A1241459k65163k26608L70483k19382M23226o9379M92144j352805j243545
2043I150430O08183l81558m83265O4561L38812o87107j31q53505m12856q1880
2033G261684P27185j90792p69666L10061M14478m47015o75123n88219J28987N66968
2023F738548o45041p17601J30935k93782j45678o0246k42034L80401j58579m62743
2013D524180m37981n00225Q86798J26592n70558L58503O50175j227231p32344
2004C077909j3922Q5193r66356K63136k2849J78158N76226J00312P27715N90353
$$ plain form
2071 23583225 21959528 20876136 20370577 19584236 18436376 16993267 16899414 16785805 15262782
2062 15262782 14972643 14931794 14253619 13792694 13095149 12856222 12111556 12132152 11392361 11241459
2052 11241459 10976296 10749688 11120171 10900789 11324015 11254636 11746780 10393975 9150430
2043 9150430 9758613 9377055 8893790 8958351 9297163 8610056 8609925 7756420 7343564 7261684
2033 7261684 7988869 7798077 7028411 7338472 7752950 7305935 6630812 6042593 6171580 6738548
2023 6738548 6093507 5375906 5506841 5213059 5067381 5007135 4765101 5145502 4986923 4524180
2013 4524180 4086199 3585974 4472772 4599364 4028806 4387309 5037484 3810253 3077909
2004 3077909 3063987 3149180 2182824 2445960 2423111 2601269 3177495 3277807 4005522 4595875
1994D595875j464854p05018o19037R74760K52588n35702j72548K97261n968J20148
1984B737505M73663P0114Q7815K67390m34454p55977j16965K01427K04442L2126
1974B767086J29242k03542K93820o53599j33609J308O30937r23048N39154J77165
1964B624914k76135n09967N11690L21043J871O2319l29746o97546q29272R05755
1954A784926K57861p78569L28352l52897O39655N70647k53890p66783N16068O78018
1944B623388l51087k05953o72849O76963O26438k41817p5054k50935K01713l28373
1934B002434L0895k15104K35131M79906l59695m43574j06259l0025O54160k85938
1924A961931o95342J50468k23140M79363j012470M89066Q36445o39912m02712
$$ plain form
1994 4595875 3131021 2426003 1806966 2781726 3034314 2498612 2326064 2623325 2617357 2737505
1984 2737505 3211168 3281282 3369097 3636487 3202033 2446056 2329091 2530518 2734960 2767086
1974 2767086 2896328 2692786 2986606 2333007 2199398 2200706 2831643 1908595 2447749 2624914
1964 2624914 2348779 1838812 2350502 2671545 2673416 2735735 2405989 1708443 879171 1784926
1954 1784926 2042787 1264218 1592570 1239673 1879328 2449975 2196085 1429302 1945370 2623388
1944 2623388 2272301 2066348 1393499 2070462 2696900 2455083 2380029 2129094 2330807 2002434
1934 2002434 2033329 1818225 2053356 2533262 2173567 1729993 1623734 1593709 2247869 1961931
1924 1961931 1266589 1417057 1193917 1673280 660810 1149876 1986321 1346409 943697
1915I43697j15623o014K48628j47816r41995J102409J62698m93638j24723N03927
1905A131550j6402M28674o2260k65376L5390n47810J21219L48130r44124J45180
1895C74171M19403M32804k13413l12021O03008K32648l47502p62544m08920J54611
1885A72245R03510M86036q80236J60317l55580m96997M69825j41135J50874p2275
1875C96584J31709M32605n2121l99794K56720k41378n57968K32414M44441O8879
1865G12091K39351q0942j44867J15498M99259n57824J64863j31536o91690l23696
1855a99493K65256K23651q47253m01222J188603Q1800J151515j18229j30227Q32029
1845B046430j247459j83466O47753L65246K08283n84958R67593j02680K96020
$$ plain form
1915 943697 828074 822060 1070688 922872 -19123 1083286 1245984 752346 627623 1131550
1905 1131550 1115148 1543822 1481562 1216186 1251576 703766 824985 1173115 228991 374171
1895 374171 793574 1226378 1012965 700944 1303952 1536600 1189098 426554 17634 172245
1885 172245 1075755 1561791 681555 841872 486292 -10705 459120 317985 468859 396584
1875 396584 528293 960898 908777 508983 765703 524325 -33643 198771 643212 712091
1865 712091 951442 870500 725633 841131 1340390 782566 947429 815893 124203 -199493
1855 -199493 65763 289414 -557839 -959061 229542 311342 1462857 1344628 1214401 2046430
1845 2046430 798971 615505 1263258 1628504 1836787 1251829 2219422 2116742 2412762
1836B412762Q86544M21648p36433o98009r42936p3034L4164j10920k01757j83124
1826H08905j09927m07537j41568J61331M39520k69610P51361j93879K0985j75876
1816H83705n59027J63806K14420k74675J01059K28628l83833p2407n6599K55171
1806E00248K91887q36734j06763K19418p17075m05676O2482L25124j32673O42367
1796a57395K67261j68040j36397l7740J115235N2308k39476p13219K56550N55639
1786G94726r70294J85510J51898l11384M31155K79974l54035M35101n44238j56067
1776e7654K97178j81300P63699l99132p12503O26995N24443K5864l87685n85526
1766h5621J17218m96255M34199N78975j35865l80933m87470J45726L28860J31396
$$ plain form
1836 2412762 3299306 3720954 2984521 2286512 1343576 1270542 1304706 1193786 992029 808905
1826 808905 698978 291441 149873 311204 750724 481114 1232475 1038596 1059581 883705
1816 883705 324678 488484 702904 428229 529288 757916 374083 301676 245077 500248
1806 500248 792135 -44599 -151362 68056 -649019 -1054695 -992213 -667089 -799762 -157395
1796 -157395 109866 -58174 -194571 -232311 882924 935232 695756 -17463 239087 794726
1786 794726 -175568 9942 161840 -149544 281611 561585 207550 642651 98413 -57654
1776 -57654 239524 58224 821923 422791 -289712 337283 861726 887590 499905 -85621
1766 -85621 31597 -464658 -30459 548516 412651 31718 -455752 -310026 18834 150230
1756A50230j59032k99266P20839N26767k70767m06461K23808k64147j51463l03416
1746b32908M79134K71261o94939K47939J72508j64543k45211K17739L77978j05540
1736C23418k67310k21169N23790N99436l54533n4239p7662j53310P35244o57303
1726C96362L21391J79641m98119k64692m36050O06868l40506n9349J193091L0685
1716A129322p41370j06936n53376J42522L93910p207N91044l43778M14604n5278
1706H63457n29212m65386m48653J316844N59339k64901j03291n76324l74898j95881
1696b18906j41931K88455K70128N02150j363512J58842N45133j15366k0700o59632
1686g55339k64981j79106n37591N13484J065284O2402J00014n3289r5506l08841
$$ plain form
1756 150230 -8802 -308068 412771 939538 668771 262310 486118 221971 70508 -232908
1746 -232908 246226 517487 -177452 70487 242995 78452 -166759 50980 428958 323418
1736 323418 56108 -165061 358729 958165 603632 549393 471731 318421 1053665 396362
1726 396362 717753 897394 399275 134583 -301467 305401 -35105 -94454 1098637 1129322
1716 1129322 387952 281016 -272360 -129838 264072 256865 847909 504131 918735 863457
1706 863457 334245 -131141 -579794 737050 1296389 1031488 928197 351873 -23025 -218906
1696 -218906 -360837 -72382 197746 699896 -663616 -504774 40359 -75007 -95707 -755339
1686 -755339 -1020320 -1199426 -1737017 -1223533 -158249 -95847 4167 -49122 -144628 -453469
1676d53469J527799L889p23352J93738L41743l95684L10573m97950j424306L67637
1666g49382N98803l3748M8212q3917r1356P24124j72433m85075j04595P61805
1656D12438J61848j18981J69185k32048k1693j80855k57785J93282O25256j364739
1646f14092j45660k39401O09376J010736L18029K37057j19543o79982K07017K54082
1636H37619r90703m57983K78230O66675L50208k3625n02364N85144J59345K56864
1626A159410p89495o59124m8509J24843N64953P19440l65232k14470k45520k0244
1616B26052l25878J41809K63977m40560J8569L95669r89184j83689L10415J89933
1606c92887K25845L49834k97933k11237J54494N04368k09026j3805m36127M82624
$$ plain form
1676 -453469 1074330 1078219 354867 548605 890348 494664 805237 307287 -1117019 -749382
1666 -749382 -150579 -184327 -136115 -220032 -311388 412736 240303 -244772 -349367 412438
1656 412438 574286 455305 624490 392442 370749 189894 -67891 125391 750647 -614092
1646 -614092 -759752 -999153 -389777 620959 938988 1176045 1056502 376520 583537 837619
1636 837619 -153084 -611067 -332837 333838 684046 660421 158057 743201 902546 1159410
1626 1159410 369915 -289209 -337718 -212875 352078 1071518 706286 491816 246296 226052
1616 226052 -99826 41983 305960 -134600 -116031 279638 -709546 -893235 -582820 -392887
1606 -392887 -167042 182792 -115141 -326378 -171884 332484 123458 109653 -326474 156150
1596A56150J137445L5723o64151P2675J91625P8528j86882p03455M71057Q9599
1586F78314l18567l90533P89431m27112l8912o53518J68323M10246O68919m00334
1576D86257K58979M79749l11734n53403j108502L37991K65819R4644M3582L63211
1566C56593K11079k7079j76812K38721k96764N99392j449476k39437M78815L87611
1556H2643L9308m67402P00582p30532j58166m84586K85571Q72453L04131K85517
1546G29519k80857m81206l09238j99875J5K03693q52405L44620O26436J84018
1536c5280j42918P40412O51962k4878q11969n00486L75389j63002r426K23480
1526C03284K03212p79086P89202k06044k30962j273393N99980L07745k11789j00249
$$ plain form
1596 156150 1293595 1329318 665167 737842 929467 1007995 821113 117658 588715 678314
1586 678314 359747 -30786 758645 331533 292621 -360897 -192574 217672 886591 486257
1576 486257 745236 1224985 913251 359848 -748654 -410663 -144844 -50200 -6618 356593
1566 356593 567672 540593 363781 602502 305738 905130 -544346 -783783 -304968 82643
1556 82643 121951 -345451 355131 -375401 -533567 -1018153 -732582 139871 444002 729519
1546 729519 448662 -32544 -341782 -541657 -541642 -337949 -1190354 -845734 -219298 -35280
1536 -35280 -178198 562214 1214176 1189298 377329 -123157 252232 89230 79804 303284
1526 303284 506496 -272590 516612 310568 79606 -1193787 -593807 -286062 -497851 -598100
1516e98100L14114L88111m3593k68927j53721N76030j86892N61753R3854m85285
1506A97344n00767M53481J45953K53763m02919J27607K44489m35164K83913k51632
1496A16068j018567L36837l50566N49819m76613J7239O24038J68536N01042q47949
1486c80116M6474l14657L93710o5914R9541L30613k00986Q74953m55583l93562
1476f5527M26957J61426l18953q02794K70870l75463j81511j94006L54328l38309
1466a062982P25714P10534j50649p2451j41913K07684o79131K58411M4533K19429
1456E9179J0466J57513M05059J74317L81235r39362L83254p408o01264p70794
1446g47805Q44944K54119l67155n45328l98841Q89947P65353l32196m34683J03740
$$ plain form
1516 -598100 -283986 104125 60532 -208395 -362116 213914 27022 588775 682629 197344
1506 197344 -303423 150058 296011 549774 146855 274462 518951 83787 367700 116068
1496 116068 -902499 -565662 -916228 -366409 -843022 -825783 -201745 -33209 467833 -380116
1486 -380116 -333642 -648299 -254589 -320503 -220962 109651 -91335 783618 328035 -65527
1476 -65527 361430 522856 203903 -598891 -328021 -703484 -884995 -1079001 -724673 -1062982
1466 -1062982 -337268 373266 222617 150166 8253 215937 -463194 -204783 -160250 59179
1456 59179 69645 227158 632217 806534 1187769 248407 631661 624253 22989 -747805
1446 -747805 97139 351258 -15897 -561225 -960066 -70119 695234 363038 -71645 32095
1436C2095m8221K79955M89342k0356m47260j72909l33605M90611O10354k15571
1426F64435j376389n1740L29114j05955k96449N5023J059344M63522m12436m89267
1416a60798J69326k15074j37624Q94658J18567j18893L18067k62313p14085J27653
1406A9484R79892m91459L90704q37992l06094J04850J90917O53938k16451m78337
1396I452l24649j1867K42664Q81986l76287l09336K27528l66217q22024J38796
1386g09954M594R13402n2156R8189L52362q1066l56531l25512p20351P15576J248460
1375A087013j268684j03352J13979k31969J99926q93613l89467N66920J153232
1366B33985N97036j94933n41152M39678q35398l58868N36874J167212L2550p70759
$$ plain form
1436 32095 -16126 263829 753171 732815 285555 112646 -220959 269652 880006 664435
1426 664435 -711954 -763694 -434580 -540535 -836984 -781961 277383 740905 328469 -160798
1416 -160798 8528 -206546 -344170 550488 669055 550162 868229 605916 -108169 19484
1406 19484 999376 507917 898621 60629 -245465 -140615 50302 704240 487789 9452
1396 9452 -315197 -327064 -84400 797586 421299 111963 339491 -26726 -848750 -709954
1386 -709954 -705360 208042 155886 254075 606437 525371 168840 -156672 -877023 -161447 1087013
1375 1087013 -181671 -285023 -171044 -403013 -203087 -1096700 -1486167 -919247 233985
1366 233985 831021 636088 94936 534614 -300784 -659652 -122778 1044434 1076984 306225
1356C06225r48734k1984N81443P38509j33040j43296m94270j87852q9270l96556
1346g88825J71276j27613j7186N8721N8214N98129M71998L20984n45910j47951
1336E1837m21652O91390P43749o13103k10242o60209P39814K86703p03882K35939
1326A40344J59161M08607K52173j1841m92200l35298J47838n67108L39233P0064
1316A10973k58980k17575l85722m9326M12026j88599N28420Q12937J06944K22747
1306A093845K26021o88496l94965P8337J28333l47699k59139q1634N53973P1148
1296C79724q5046p07910j3645J96932L28752J06423J307753j044347l30753k15697
1286g7814p59629N53005j66583M02717K5641l25451J44082K45820L06926K01144
$$ plain form
1356 306225 -642509 -664493 -83050 655459 522419 379123 -115147 -302999 -392269 -788825
1346 -788825 -617549 -745162 -762348 -703627 -645413 -47284 424714 745698 199788 51837
1336 51837 -369815 321575 1065324 452221 241979 -418230 321584 608287 -95595 140344
1326 140344 299505 708112 960285 948444 456244 120946 268784 -298324 40909 110973
1316 110973 -148007 -365582 -751304 -800630 -388604 -577203 -48783 764154 871098 1093845
1306 1093845 1319866 631370 236405 314742 443075 95376 -163763 -245397 308576 379724
1296 379724 294678 -413232 -426877 -229945 98807 205230 1512983 468636 137883 -77814
1286 -77814 -837443 -284438 -451021 -48304 -22663 -348114 -204032 41788 348714 549858
1276E49858M03843q52375k42587j47160r750N54565p23163N3792K00512Q1430
1266a31035N68121J38403j039523O3596K26441j33125Q533N16946M81028m5950
1256F53435O25823k99628r72275k87498p9431j17979Q0041k32432q9968M99650
1246b20262M71021J44832p9129K22575n09923N44075o95589n41877Q79110j08708
1236A06125n1517l79341J37983P47788M9689l86899O93986n60898m09907J67118
1226A14127M61800l6705k36824o51739m88344L98706M43376M83706N54190n02749
1216E39544m92760m01868N23703j12936k59816R49651k60533k13040p3537Q67970
1206A066378J64203j388775l16105O51441n9421n74266n1149P48849K11676l61859
$$ plain form
1276 549858 953701 101326 -141261 -288421 -298171 256394 -466769 -412977 -212465 -131035
1266 -131035 437086 575489 -464034 -400438 -173997 -307122 -298589 218357 699385 653435
1256 653435 1279258 979630 7355 -280143 -359574 -477553 -397512 -629944 -719912 -220262
1246 -220262 250759 395591 316462 539037 29114 573189 -122400 -664277 214833 106125
1236 106125 54608 -324733 -186750 561038 610727 223828 917814 356916 -52991 114127
1226 114127 575927 539222 302398 -349341 -837685 -438979 4397 488103 1042293 539544
1216 539544 46784 -355084 168619 55683 -204133 745518 484985 271945 198408 1066378
1206 1066378 1230581 -158194 -474299 177142 117721 -456545 -507694 241155 452831 90972
1196I0972J54700K23944l66370q2670J7726R44141j191707P7757J9753N01669
1186C89915l29352J48976P69589l13204l90942J20010K88624Q1911j283552Q1379
1176d36646P53341M05080M09055r81385J7757J63948n19394K85055O96180r6850
1166F96141r24576k1687R75850m0056q24830K6850N80661J14233L13276k49397
1156F46465M73303o86609j87870r44178O31210n05605l35138K73968j12243M26944
1146c19753P5859J45870N38943m46723J56317N21391o73643K22472m71485J58212
1136i2540l38126L24201N67623m17736l01406r9593M89186l17665k26555M34564
1126B1953n5840k66072M5239L58091j83321N504M58714N06971n90972o5076l11616
$$ plain form
1196 90972 245672 469616 103246 20576 38302 982443 -209264 -131507 -111754 389915
1186 389915 60563 209539 979128 665924 274982 394992 683616 765527 -518025 -436646
1176 -436646 316695 721775 1130830 149445 167202 331150 -188244 96811 792991 696141
1166 696141 -228435 -250122 725728 685672 -139158 -112308 468353 582586 895862 646465
1156 646465 1119768 433159 245289 -698889 -67679 -573284 -908422 -634454 -746697 -319753
1146 -319753 -243894 -98024 440919 -5804 150513 671904 -1739 220733 -250752 -92540
1136 -92540 -430666 -106465 461158 43422 -257984 -357577 131609 -186056 -412611 21953
1126 21953 -33887 -299959 -254720 103371 -79950 -74446 384268 891239 300267 235191 -76425
1115g6425k95589M40845q6910J0942R3671l56557R66590j04415Q61518L43824
1105A797494r90641j76233j76416k76963q37355j34508L73504l21304M02514N32419
1095A92511J28323l09034r24901l7375K59801O42562K41660j167015J10564k68164
1085a131068P12115J89434q9717K16845k04301L1592n11814K63427Q77397j10789
1075B43121l47313M33126q15682J039728K16695l26601n57240k66420l35479j98330
1065i14395N51287j76103o0691k96976l53777j60154R41631R59782L70526o00762
1055B60368q88556K96077k4173k53207K95087L17056r9556Q2402O13244L20052
1045I18794l12506j95814l14862K47079m14658P45165M72653m01256r5603j45192
$$ plain form
1115 -76425 -372014 68831 -18079 -7137 86534 -270023 696567 592152 1453670 1797494
1105 1797494 806853 630620 454204 177241 -660114 -794622 -421118 -742422 -339908 192511
1095 192511 320834 11800 -913101 -950476 -690675 -48113 193547 -973468 -862904 -1131068
1085 -1131068 -418953 -229519 -319236 -102391 -306692 -275100 -786914 -523487 353910 243121
1075 243121 -104192 328934 -486748 552980 769675 443074 -114166 -380586 -716065 -914395
1065 -914395 -363108 -539211 -599902 -896878 -1250655 -1410809 -469178 490604 861130 260368
1055 260368 -628188 -332111 -356284 -609491 -314404 2652 -96904 -14502 598742 918794
1045 918794 606288 410474 95612 342691 -71967 673198 1145851 744595 648992 503800
1035E03800M78481l28750m09466K72361J7564p79067k26316J92302J22519O93550
1025E36978n20309o39217n98583O15230J69711j06920J86624l50056j52939J90217
1015f69264M5633J102592q2218l81412k13461J86069J05695M38768L82824j022574
1005a07348L88628k01794R9643n51753J70056J38434p3375R68655k8467q17215
995a4536M04903M19538j39018k52295n25016N07403j05349j37759r38044m84244
985a264417P87503J99492P13641o8660o78192L59792L09296j54566K46702k41594
975B08997q8793L97034k96280P12671m98785q18688r5947M81969k00920j57111
965c55853O18468L79586p70834J60946J67508Q9395L33605k28042j26286K0943
$$ plain form
1035 503800 982281 653531 244065 516426 533990 -245077 -471393 -279091 -156572 536978
1025 536978 16669 -622548 -1221131 -605901 -436190 -543110 -356486 -706542 -859481 -669264
1015 -669264 -623631 478961 396743 15331 -198130 -12061 93634 532402 915226 -107348
1005 -107348 281280 79486 179129 -372624 -202568 -64134 -137509 831146 802679 -14536
995 -14536 390367 809905 670887 418592 -106424 400979 295630 157871 -780173 -1264417
985 -1264417 -476914 -277422 436219 367559 -310633 49159 358455 203889 450591 208997
975 208997 120204 517238 220958 933629 434844 -383844 -479791 2178 -198742 -355853
965 -355853 262615 642201 -128633 32313 199821 289216 622821 394779 268493 289436
955B89436k06976j252508k13375J170541N10917q07875O2178M8960J4156K49724
945a34822K93382N9170p42413k9075O98051k43556m87659k36555O53430J72136
935B089k34395k36607N23024q7026j08172N66142l56669q11432K80589R99860
925E37403j09897j65038n80830m60114N53871K67119O34651p46474L54093j208006
915i23222k38661J121934O92092r59908K89025N34358K88120m43617j47202l05815
905i2896K74714N9310K17498l70574m7666r9369p81509N41048m77214Q44229Q6060
894A53631J4554M9484J240018L04836j195120m15435j76607M6942n86537J01179
884d63055k42938m18513O68595K08220K85014J3102j58423j99888J11830P64761
$$ plain form
955 289436 82460 -1170048 -1383423 -212882 298035 -509840 -447662 -398702 -384546 -134822
945 -134822 158560 217730 -524683 -553758 144293 -99263 -586922 -823477 -170047 2089
935 2089 -232306 -468913 54111 -32915 -141087 425055 68386 -743046 -462457 537403
925 537403 427506 262468 -318362 -778476 -224605 42514 677165 -69309 284784 -923222
915 -923222 -1161883 -39949 652143 -307765 -18740 515618 803738 360121 212919 -92896
905 -92896 181818 241128 458626 88052 40386 -58983 -840492 -299444 -776658 67571 153631
894 153631 168185 217669 1457687 1762523 567403 151968 -24639 22303 -564234 -463055
884 -463055 -705993 -1124506 -455911 -247691 37323 50425 -107998 -307886 -196056 568705
874E68705k83455j184681K46874j09587j67792P73544k30704n5688N85840O56656
864G99712j169386Q19803P95970l58784l19209L42289l83943p14644R709r68003
854a146486N36595o68331L0103R97988n426q13954L16427M15574j20983J33073
844c25420q17049R3357R55151K4929k05780k418O9847o25905J077225k67149j26227
833a49439n05369M79349K69087L79859m95133O3148p47822m35386O87916J72625
823b81165N20251L68358L20050Q8945j238360l96721K70814N8058k27119L32713
813a84176j02235L87992p9385j18650Q5063M07543J38028p68270l77224m72044
803a083358J5411J097659J57648K99285r4096o18525O99766r7164l02366n84243
$$ plain form
874 568705 285250 -899431 -652557 -762144 -929936 -156392 -387096 -442784 143056 799712
864 799712 -369674 450129 1246099 887315 568106 910395 526452 -188192 -178483 -1146486
854 -1146486 -609891 -1278222 -1248119 -250131 -255557 -1069511 -753084 -337510 -458493 -325420
844 -325420 -1142469 -1049112 -93961 -69032 -274812 -277230 -207383 -833288 243937 -23212 -149439
833 -149439 -654808 -175459 93628 473487 -21646 41502 -706320 -1141706 -453790 -281165
823 -281165 239086 607444 927494 1016439 -221921 -618642 -347828 -289770 -516889 -184176
813 -184176 -286411 101581 22196 -96454 -11391 396152 534180 -234090 -611314 -1083358
803 -1083358 -1067947 29712 187360 486645 392549 -225976 473790 376626 74260 -509983
793e09983Q60310L61117m62532r41205k50535j67251J404219k37867j63672K57945
783A50546n74630K60158j10472L48663K24245j130338P4792J14296L09512n4253
773c87481k6304K24579J6842P6097K9237N07546k17776m74830j90932L12126k44293
762c75189J60213P51062r23146k67055L14980R5899P09990j48557o59709O5418
752b76094l33775J60368M02539P46919o94676o55653J04498M22918N97388q0537
742C93895L47069K59232o99069n00252r4545M88607M99003o41555m36451O97713
732C13647j4665o00143N49448m67018k98344L3967K78411l3918M78322j60457
722G9250k23057j88965N57483n06697n67891j43893K24897j73555l38603N22148
$$ plain form
793 -509983 350327 711444 248912 -692293 -942828 -1110079 294140 56273 -107399 150546
783 150546 -424084 -163926 -274398 74265 298510 -831828 -757036 -642740 -333228 -387481
773 -387481 -413785 -189206 -172364 -96267 -67030 440516 222740 -252090 -443022 -130896 -375189
762 -375189 -214976 536086 -387060 -654115 -339135 -243236 466754 318197 -341512 -276094
752 -276094 -609869 -449501 -46962 699957 5281 -650372 -545874 -122956 474432 393895
742 393895 740964 1000196 301127 -199125 -293670 194937 693940 52385 -384066 313647
732 313647 298982 -301161 248287 -218731 -517075 -483108 -204697 -238615 239707 79250
722 79250 -143807 -332772 224711 -281986 -849877 -993770 -768873 -942428 -1281031 -758883
712g58883L59582J258224j63899p50577j20725k36810L4783L35953j23660m61819
702f27831L98125L26671N06268K570m28016R31676o80000n1872K41431r7807m92481
691B8734j5156K61500Q14939L6400j019642k19902Q64183L51127p81358m05763
681h4938n41706M46175Q78187o12660m6272Q6933k3255K20596k6155k86404k25898
670b15397O87065k85879j63441M88263m32309n74941K61867L70103j055713K42375
660f78007K93799M13042m83744J82023O2443N38697j3546l14535K50144K17989
650D68305o26684J04313L67965l67418j34564k85293m38784P83231M90640k81601
640H0110L64766L3356n46891n87043L82797j94774O70938k65196M95258r726n41064
$$ plain form
712 -758883 -399301 858923 695024 -55553 -176278 -413088 -378305 -42352 -166012 -627831
702 -627831 -229706 96965 603233 605803 177787 1109463 429463 377591 619022 521215 28734
691 28734 13578 275078 1090017 1126417 106775 -113127 751056 1102183 320825 -84938
681 -84938 -626644 -180469 697718 85058 38786 125719 102464 323060 296905 10501 -215397
670 -215397 471668 185789 22348 510611 78302 -496639 -234772 135331 -920382 -678007
660 -678007 -384208 28834 -454910 -272887 -210444 328253 314707 172 250316 468305
650 468305 -158379 -54066 313899 -53519 -188083 -473376 -912160 -128929 361711 80110
640 80110 444876 478232 -68659 -655702 -272905 -467679 203259 -61937 433321 423595 -117469
629a17469n67912J71768O11868o07708j78828q38801P53031K11192J73704N27643
619A38488j36239L47530j596990J633238L92351l76353l04628N26277q02116n65109
609g43551P13817k2828p63294P83219M99900q56139M05047j06782K98745k15006
599f872M78419k1604j4434r4939j1916l8647j11029j91611l16113J26077L07230
588A04561K73679m9414N52058l24404P413o58145M74765L29026K31809j031051
578h9703L1291P50389m17453k37724j81480J87869k29296J59467k93024p33336
568a053000J096582K10170o11171M60331n82333K55649l284Q78243k64623k41121
558A45443J205211j03888p69016o73877M79246l80079J03564M7316m2809K09449
$$ plain form
629 -117469 -685381 -513613 98255 -509453 -688281 -1527082 -774051 -562859 -389155 138488
619 138488 2249 349779 -1247211 386027 778378 402025 97397 623674 -178442 -743551
609 -743551 -29734 -52562 -815856 -32637 467263 -388876 16171 -90611 208134 -6872
599 -6872 471547 449943 435509 340570 328654 290007 178978 -12633 -328746 -202669 104561
588 104561 378240 328826 880884 556480 563893 -94252 380513 709539 941348 -89703
578 -89703 -58412 691977 274524 36800 -144680 43189 -186107 -26640 -319664 -1053000
568 -1053000 43582 253752 -357419 102912 -479421 -223772 -227056 651187 386564 145443
558 145443 1350654 1246766 477750 -196127 283119 -96960 6604 53920 11111 220560
548B20560l34112l19479m8914j59825Q85757K14314l35183k26931R2702j61504
538a72615K01434J64071l39449j93182L46550L65640m78953K34297p28097N97841
528b463K08978j80329L5509p03858o0533L90122K38118j60063K12004j87664M76732
517B66553Q26602l06053m60931m30165J49092j026978K21898L28851N77840M05356
507E52065j26388k89769p0328q54668P98756J34847l60745j27800K84760K30772
497A71502m00492o86237L7297N14404p7954J84832J54398n38672j47839L01186
487d87575O69803m25413n54607q13227R30608J113640q00223j71720m24688k21687
477a185089J411892J08383j293754K0226j72013J72078K23556M00719L68100L74246
$$ plain form
548 220560 -113552 -433031 -481945 -641770 243987 458301 123118 -103813 -11111 -172615
538 -172615 28819 192890 -146559 -339741 6809 372449 -106504 127793 -600304 -2463
528 -2463 206515 26186 61695 -642163 -702696 -312574 -74456 -234519 -22515 -210179 266553
517 266553 1093155 787102 326171 -103994 45098 -981880 -759982 -431131 146709 552065
507 552065 425677 135908 65580 -789088 9668 144515 -216230 -344030 -59270 171502
497 171502 -228990 -915227 -877930 -363526 -441480 -256648 -102250 -640922 -788761 -487575
487 -487575 182228 -243185 -797792 -1611019 -680411 433229 -366994 -538714 -963402 -1185089
477 -1185089 226803 335186 -958568 -938342 -1110355 -938277 -714721 -314002 54098 428344
467D28344l8555r22332n36462M15273l02749K97110N49595L06096l57990n95246
457g56916n45790O62937M28832j93121R3370P73486j43383j27757Q13429j097636
447i2549p68645N03405J78472p1670l06470n09985L55654L67870M64003m0536
437G9549P3343L59377j192858q67781P36750N56276M68296L44267j98429n76445
427b17655q9082L41484j78016J0800l98185P88990k4302q61158O0922p88989M14423
416i40768Q79990j23352m12034l6120L64909n20101P41583L17453J88702Q5167
406E45429n42563j85326P49411k44835n65909l88964L2793O29698K72253m71738
396a69751n65399R33706J32372l1307J63588K81577J93724j45797n23460K21993
$$ plain form
467 428344 389789 -532543 -1069005 -653732 -956481 -659371 -109776 196320 -161670 -756916
457 -756916 -1302706 -639769 -210937 -404058 -310688 462798 319415 191658 1005087 -92549
447 -92549 -861194 -357789 -179317 -250987 -557457 -1067442 -711788 -343918 120085 79549
437 79549 152892 512269 -680589 -1548370 -811620 -255344 212952 557219 358790 -217655
427 -217655 -306737 34747 -143269 -132469 -530654 258336 234034 -627124 -566202 -1355191 -940768
416 -940768 -60778 -184130 -596164 -632284 -267375 -787476 -45893 271560 460262 545429
406 545429 2866 -182460 566951 322116 -243793 -632757 -599964 29734 301987 -169751
396 -169751 -735150 198556 330928 299621 463209 744786 938510 792713 269253 491246
386D91246m6048R9718n76675j4641R66993m74175J66022K116j46261K15983N31714
375A215992m94499r22751O2094J53655R02072j80215q55930n3951o22763l85519
365a181815N30634k72064M22603P42940k06851N71540K02021o15459m32092J83575
355e4968M9702J5882l20802N36442m98933J00237R37001Q76584k46663j113717
345B80765o84699o96730o310N47989L70307j88186j37131K68172J0699J61687
335g3437j00342L20026m74032K27459o48885N98132K13768j82960l14005k24186
325f58462J037854K00814j48966J09865M43897o59836M10361j20228M9489j22049
315E42739N0744Q7414j22305k9605k90620p76848K46897J70260M44884k22675
$$ plain form
386 491246 445198 544916 -31759 -46400 920593 446418 612440 614556 468295 684278 1215992
375 1215992 721493 -201258 -139164 14491 916563 736348 -119582 -173533 -796296 -1181815
365 -1181815 -651181 -923245 -500642 242298 35447 606987 809008 193549 -238543 -54968
355 -54968 -5266 10616 -310186 226256 -272677 -172440 764561 1641145 1394482 280765
345 280765 -403934 -1100664 -1106974 -558985 -188678 -376864 -513995 -245823 -235124 -73437
335 -73437 -173779 146247 -327785 -100326 -749211 -151079 62689 -120271 -434276 -658462
325 -658462 379392 580206 431240 541105 985002 325166 735527 615299 664788 542739
315 542739 593483 680897 558592 528987 238367 -538481 -291584 -121324 323560 100885
305A00885l68752Q92081p1998j084441N7401N56909P94915k68979j289393N56856
295a24516K62326Q70813n62182n36653L22731K08960q9748j51331K37886p24890
285b86604L32045m83194P72995m59558M45856Q35600l32065p10899L98102j9366
275D92912m11937l22710l57718Q6413M50132L99351l72421M57332j5453l10676
265I5225Q8885l5147K21376k36099k34677J46624o6736M99522K90605k41434j78203
254C49941L24886j15374J25197j02392l52160k72338K92346L33426n27280j14019
244e7767R2453Q49250n81466k23560K80427o59176k36607j15205K73780O72174
234B94303J29455j63048J58162p70030K88001q7017k90597k30232L18371O70192
$$ plain form
305 100885 -267867 624214 552216 -532225 -474824 82085 877000 608021 -681372 -124516
295 -124516 137810 1008623 446441 -90212 232519 441479 351731 200400 438286 -286604
285 -286604 45441 -437753 335242 -124316 321540 1157140 825075 114176 512278 492912
275 492912 80975 -241735 -599453 -513040 -62908 336443 -35978 421354 405901 95225
265 95225 184110 148963 370339 134240 -100437 46187 -20549 478973 769578 528144 349941
254 349941 674827 559453 684650 582258 230098 -42240 250106 583532 56252 -57767
244 -57767 34686 883936 302470 78910 359337 -299839 -536446 -651651 -377871 294303
234 294303 423758 260710 418872 -351158 -63157 -150174 -440771 -671003 -352632 317560
224C17560k75986m16545J66482p9479M43205P41497n68809n8261J88632l04459
214A53837n92023m36810M34574P20846o01103l9274L18045J74743n90994p8677
204e36836L10290M41407r16081p89343R80783N9442j74738L01742J343555j36033
194H84188o66745l85179K98740j046747q6730O38802j73234Q84740L64228n56092
184A55971J664M22265l46907K24418o4883J94847L49261m02890l57596P59291
174I35441K41472m06030j92272m87180l4063J33957k65372j49565M65642k31767
164A0263q84645L88342Q49296p28623J08650J153913J71955p96684j03694m9883
154A18890r0946j01746n18305L66786O82906j091740O1075J015244J82886p7622
$$ plain form
224 317560 41574 -374971 -208489 -287968 155237 896734 327925 269664 458296 153837
214 153837 -438186 -874996 -440422 280424 -320679 -359953 -41908 132835 -458159 -536836
204 -536836 -226546 214861 -701220 -1490563 -509780 -450338 -625076 -323334 1020221 884188
194 884188 217443 -167736 131004 -915743 -1002473 -363671 -536905 347835 712063 155971
184 155971 157635 579900 232993 457411 392528 587375 936636 533746 176150 935441
174 935441 1176913 770883 578611 91431 57368 191325 -74047 -223612 242030 10263
164 10263 -874382 -486040 363256 -365367 -256717 897196 1069151 272467 168773 118890
154 118890 27944 -73802 -592107 -225321 457585 -634155 -573080 442164 625050 547428
144E47428K15092l09560p13317j34800L8446L36386l73235o6265m10719L89763
134d80781N06172K63393q06488J14791M49484n17576O46660K10231j09850n6063
124B19973j39372j14101Q05803n54864l7504j31275l72113j5700n6342L13831
114h1664o32540J42051L24971K01487N45708j06496l47863p13953P1019Q90024
104B92744k18541m75163n57789K38719N49398l56637R68891L2054j09148L11800
94F76328K88244M202J85296m4515n83482j1511p30679q37306R56974P09391p5498
83E37444m42949j39487R6606m22485n46080L99672N71470j25548J8834k45464
73b97987M8304k07563L8357R32898k48364n12749K19024L60460o38151l08245
$$ plain form
144 547428 762520 452960 -260357 -395157 -356711 -20325 -393560 -459825 -870544 -480781
134 -480781 25391 288784 -517704 -402913 46571 -471005 175655 385886 276036 219973
124 219973 80601 -33500 772303 217439 179935 48660 -323453 -339153 -395495 -81664
114 -81664 -714204 -572153 -247182 -45695 500013 393517 45654 -668299 -597280 292744
104 292744 74203 -400960 -958749 -720030 -170632 -527269 441622 473676 364528 676328
94 676328 964572 968774 1154070 1109555 526073 514562 -216117 -1053423 -96449 612942 537444
83 537444 94495 -44992 51614 -370871 -916951 -517279 54191 -71357 -52523 -297987
73 -297987 -249683 -457246 -418889 514009 265645 -247104 -28080 332380 -305771 -614016
63f14016O89312L02985M0878L35739l81185n53281k07967K7837O46925K02784
53D90011k61924k62254M51840m14172P2871m92481r602M40433n41509L79494R34708
42G87415n58767n18748j7167J32463j39756j09593J87003M26844J78542o57691
32b89455N196K54904m27997P20817J39644J13349m51641j32354P1421M5824k55250
21b05542L09275L06299j71635m0806n80527K5081m7046k60140O97100L54518l3792
10C52785m7073l12379j06549M76259n72354l21234K65216L03644j01719m97400
0e60804
$$ plain form
63 -614016 75296 378281 419159 754898 373713 -179568 -387535 -359698 287227 490011
53 490011 228087 -34167 417673 3501 76372 -416109 -425711 14722 -526787 -147293 787415
42 787415 228648 -290100 -307267 -174804 -314560 -424153 -237150 189694 368236 -289455
32 -289455 -284259 -29355 -457352 263465 403109 516458 64817 -67537 3884 49708 -205542
21 -205542 103733 410032 238397 197591 -382936 -357855 -404901 -665041 32059 386577 352785
10 352785 305712 -6667 -113216 363043 -209311 -530545 -265329 38315 -63404 -560804
0 -560804
$$ Imaginary data points
##PAGE= N=2
##DATA TABLE= (X++(I..I)), XYDATA
$$ [...]
##END NTUPLES=NMR SPECTRUM
##END=
