##TITLE=1H_CG-1165
 CDCl3+DMSO
 8 sc, 
 27.10.2022
##JCAMPDX= 6.0         $$ Bruker NMR JCAMP-DX V2.0
##DATA TYPE= NMR SPECTRUM
##DATA CLASS= NTUPLES
##ORIGIN= UXNMR, Bruker Analytische Messtechnik GmbH
##OWNER= root
$$ XWIN-NMR		Version 3.5
$$ Thu Oct 27 14:15:49 2022 Russian Standard Time (UT+4h)  she@DPX200
##.OBSERVE FREQUENCY= 200.1313499994
##.OBSERVE NUCLEUS= ^1H
##.ACQUISITION MODE= SIMULTANEOUS
##.ACQUISITION SCHEME= undefined
##.AVERAGES= 8
##.DIGITISER RES= 18
##SPECTROMETER/DATA SYSTEM= spect
##.PULSE SEQUENCE= zg30
##.SOLVENT NAME= CDCl3
##.SHIFT REFERENCE= (INTERNAL, CDCl3, 0, 15.8549)
##AUDIT TRAIL= $$ (NUMBER, WHEN, WHO, WHERE, WHAT)
$$ ##TITLE= Audit trail, XWIN-NMR		Version 3.5
$$ ##JCAMPDX= 5.01
$$ ##ORIGIN= Bruker BioSpin GmbH
$$ ##OWNER= she
$$ F:/spectra/data/she/nmr/H-F/1/pdata/1/auditp.txt
$$ ##AUDIT TRAIL=  $$ (NUMBER, WHEN, WHO, WHERE, WHAT)
(   1,<2022-10-27 14:14:49.00 +0400>,<she>,<DPX200>,
      <created by zg, POWCHK disabled, PULCHK disabled
       configuration hash MD5:
       00 E9 B6 7A A2 85 ED C7 34 08 36 98 17 FE 4E 26
       data hash MD5: 16K
       FC 6D A4 25 11 27 30 73 58 AB 35 C9 FA 1B 8D 9C>)
(   2,<2022-10-27 14:14:51.37 +0400>,<she>,<DPX200>,
      <Start of raw data processing
       efp BC_mod = 2 LB = 0.24 FT_mod = 6 PKNL = 1 PHC0 = -18396.86 PHC1 = 14.8007 SI = 16K 
       data hash MD5: 16K
       1A 3C 58 03 1B CD 0C D9 E2 5C B4 98 21 B9 39 44>)
(   3,<2022-10-27 14:15:05.73 +0400>,<she>,<DPX200>,
      <pk PHC0 = -0.7427477 PHC1 = 2.2 
       data hash MD5: 16K
       45 A9 91 B7 B4 1F 91 6D 26 0C D3 F0 11 77 F1 32>)
(   4,<2022-10-27 14:15:08.87 +0400>,<she>,<DPX200>,
      <abs ABSG = 5 
       data hash MD5: 16K
       1D C7 84 53 4C AD A2 9C 07 4B 48 53 BD B2 EE 67>)
$$ ##END=
$$ 
$$ hash MD5
$$ 8E 76 81 1D CD C7 F7 21 46 B5 72 AA 16 58 CF 10
##$RELAX= 
##$RELAX= 
##$RELAX= 
##$RELAX= 
##$RELAX= 
##$RELAX= 
$$ Bruker specific parameters
$$ --------------------------
##$DU= <F:/spectra>
##$EXPNO= 1
##$NAME= <H-F>
##$PROCNO= 1
##$TYPE= <nmr>
##$USER= <she>
##$AMP= (0..31)
100 100 100 100 100 100 100 100 100 100 100 100 100 100 100 100 100 100 
100 100 100 100 100 100 100 100 100 100 100 100 100 100 
##$AQSEQ= 0
##$AQ_mod= 1
##$AUNM= <au_zg>
##$AUTOPOS= <>
##$BF1= 200.13
##$BF2= 200.13
##$BF3= 200.13
##$BF4= 200.13
##$BF5= 200.13
##$BF6= 200.13
##$BF7= 200.13
##$BF8= 200.13
##$BYTORDA= 1
##$CFDGTYP= 0
##$CFRGTYP= 5
##$CHEMSTR= <none>
##$CNST= (0..31)
1 1 145 1 1 1 1 1 1 1 1 1 1 1 1 1 1 1 1 1 1 1 1 1 1 1 1 1 1 1 1 1 
##$CPDPRG= <>
##$CPDPRG1= <>
##$CPDPRG2= <>
##$CPDPRG3= <>
##$CPDPRG4= <mlev>
##$CPDPRG5= <mlev>
##$CPDPRG6= <mlev>
##$CPDPRG7= <mlev>
##$CPDPRG8= <mlev>
##$CPDPRGB= <>
##$CPDPRGT= <>
##$D= (0..31)
0 1.2 0 0 0 0 0 0 0 0.06 0 0.03 0 0 0 0 0.0002 0 0 0 0 0 0 0 0 0 0 0 0 
0 0 0 
##$DATE= 1666865688
##$DBL= (0..7)
120 120 120 120 120 120 120 120 
##$DBP= (0..7)
150 150 150 150 150 150 150 150 
##$DBP07= 0
##$DBPNAM0= <>
##$DBPNAM1= <>
##$DBPNAM2= <>
##$DBPNAM3= <>
##$DBPNAM4= <>
$$ [...]
##$SUBNAM3= <"">
##$SUBNAM4= <"">
##$SUBNAM5= <"">
##$SUBNAM6= <"">
##$SUBNAM7= <"">
##$SUBNAM8= <"">
##$SUBNAM9= <"">
##$SW= 18.0517283424941
##$SWIBOX= (0..15)
0 0 2 0 0 0 0 0 0 0 0 0 0 0 0 0 
##$SW_h= 3612.71676300578
##$TD= 16384
##$TD0= 1
##$TE= 0
##$TE2= 300
##$TE3= 300
##$TEG= 300
##$TL= (0..7)
0 120 120 120 120 120 120 120 
##$TP= (0..7)
150 150 150 150 150 150 150 150 
##$TP07= 0
##$TPNAME0= <>
##$TPNAME1= <>
##$TPNAME2= <>
##$TPNAME3= <>
##$TPNAME4= <>
##$TPNAME5= <>
##$TPNAME6= <>
##$TPNAME7= <>
##$TPOAL= (0..7)
0.5 0.5 0.5 0.5 0.5 0.5 0.5 0.5 
##$TPOFFS= (0..7)
0 0 0 0 0 0 0 0 
##$TUNHIN= 0
##$TUNHOUT= 0
##$TUNXOUT= 0
##$USERA1= <user>
##$USERA2= <user>
##$USERA3= <user>
##$USERA4= <user>
##$USERA5= <user>
##$V9= 5
##$VALIST= <valist>
##$VCLIST= <CCCCCCCCCCCCCCC>
##$VD= 0
##$VDLIST= <DDDDDDDDDDDDDDD>
##$VPLIST= <PPPPPPPPPPPPPPP>
##$VTLIST= <TTTTTTTTTTTTTTT>
##$WBST= 1024
##$WBSW= 4
##$XGAIN= (0..3)
0 0 0 0 
##$XL= 0
##$YL= 0
##$YMAX_a= 67912
##$YMIN_a= -104286
##$ZGOPTNS= <>
##$ZL1= 120
##$ZL2= 120
##$ZL3= 120
##$ZL4= 120
##$ABSF1= 15.94411
##$ABSF2= -2.107743
##$ABSG= 5
##$ABSL= 3
##$ALPHA= 0
##$AQORDER= 0
##$ASSFAC= 0
##$ASSFACI= 0
##$ASSFACX= 0
##$ASSWID= 0
##$AUNMP= <proc_1d>
##$AZFE= 0.1
##$AZFW= 0.1
##$BCFW= 0
##$BC_mod= 2
##$BYTORDP= 0
##$COROFFS= 0
##$CY= -3
##$DATMOD= 1
##$DC= 0
##$DFILT= <>
##$DTYPP= 0
##$F1P= 0
##$F2P= 0
##$FCOR= 1
##$FTSIZE= 16384
##$FT_mod= 6
##$GAMMA= 0
##$GB= 0
##$INTBC= 1
##$INTSCL= 3.70164e-10
##$ISEN= 128
##$LB= 0.24
##$LEV0= 0
##$LPBIN= 0
##$MAXI= 10000
##$MC2= 0
##$MEAN= 0
##$ME_mod= 0
##$MI= 1.114404
##$NCOEF= 0
##$NC_proc= -7
##$NLEV= 6
##$NOISF1= 3.799351
##$NOISF2= 2.8
##$NSP= 0
##$NTH_PI= 0
##$NZP= 0
##$OFFSET= 15.85487
##$PC= 1
##$PHC0= -18397.6
##$PHC1= 17.0007
##$PH_mod= 1
##$PKNL= yes
##$PPARMOD= 0
##$PSCAL= 0
##$PSIGN= 0
##$REVERSE= no
##$SF= 200.129983323142
##$SI= 16384
##$SIGF1= 3
##$SIGF2= 2
##$SINO= 5.538805
##$SIOLD= 16384
##$SREGLST= <1H.CDCl3>
##$SSB= 0
##$STSI= 16384
##$STSR= 0
##$SW_p= 3612.71676300578
##$SYMM= 0
##$S_DEV= 0
##$TDeff= 16384
##$TDoff= 0
##$TI= <>
##$TILT= no
##$TM1= 0
##$TM2= 0
##$TOPLEV= 0
##$USERP1= <user>
##$USERP2= <user>
##$USERP3= <user>
##$USERP4= <user>
##$USERP5= <user>
##$WDW= 1
##$XDIM= 16384
##$YMAX_p= 317073305
##$YMIN_p= -522681
$$ End of Bruker specific parameters
$$ ---------------------------------
##NTUPLES= NMR SPECTRUM
##VAR_NAME=  FREQUENCY,     SPECTRUM/REAL,   SPECTRUM/IMAG
##SYMBOL=    X,             R,               I
##VAR_TYPE=  INDEPENDENT,   DEPENDENT,       DEPENDENT
##VAR_FORM=  AFFN,          ASDF,            ASDF
##VAR_DIM=   16384,         16384,           16384
##UNITS=     HZ,            ARBITRARY UNITS, ARBITRARY UNITS
##FACTOR=    0.220516191357247, 1,           1
##FIRST=     3173.03483717598, 0,            0
##LAST=      -439.681925829805, 0,           0
##MIN=       -439.681925829805, -522681,     0
##MAX=       3173.03483717598, 317073305,    0
$$ Real data points
##PAGE= N=1
##DATA TABLE= (X++(R..R)), XYDATA
$$ [...]
8567A7258761K230341L006241M002500M728343M675277M277695K563464L99644
8559D3142266j854045l876428m391500m842832m038564l197772k493768j717429
8551A6729928j450391j036787q43310l12299m32862m67201k89267j51246l17932
8542A1428633K30148L9544k16361J68037K30049K99560K56856N30785P73719J017508
8532A4758478Q50281J039464J556327J800551K285008L129053M002851M976995
8524C4399008N634844N167799M069032J961340r62311m004373n097814o122377
8516C5045148n805840m522649l625001k836028k042482j825704j656563j165801
8508A1565080j131982n68903p81241m73941m40861n38450m26338m97432m44182
$$ y = [17258761, 19489102, 22495343, 26497843, 31226186, 35901463, 40179158, 42742622, 43142266, 41288221, 37411793, 33020293, 28177461, 24138897, 20941125, 18447357, 16729928, 15279537, 14242750, 13399440, 13087141, 12654279, 12187078, 11897811, 11746565, 11428633, 11658781, 11698325, 11481964, 11650001, 11880050, 12179610, 12436466, 12967251, 13740970, 14758478, 15608759, 16648223, 18204550, 20005101, 22290109, 25419162, 29422013, 34399008, 40033852, 45201651, 49270683, 51232023, 50269712, 46265339, 41167525, 35045148, 29239308, 24716659, 21091658, 18255630, 16213148, 14387444, 12730881, 11565080, 10433098, 9864195, 9082954, 8609013, 8168152, 7629702, 7203364, 6705932, 6261750]
8499F261750l41973k53170k26632j25438l44199k69730k75192O2820k69411m21196
8489C797629j43422j70798K9108k01378l27592J2464j13341J79588k29500l09342
8479B523416K88105q2279k91397j69992j0315J12497J94862q2523o7261k75160
8469B139953j62867M1978J54046j00916n8248l8881j01300l5995J89320j67627
8459A859463j25271L0064r4691J47947K34234o375k58757l9326O811j15447j06423
8448A532229R334P2631j97735m5592M0439j31939o0116O0597O978M2790o6036
8437A263580j03395J26269J03306O0928M8247j80969p1688M8492l24661m9349
8427I20760J44959J40124k7531j11518L7700k19399m6970j0686m316N0398Q8278
$$ y = [6261750, 5919777, 5666607, 5439975, 5314537, 4970338, 4700608, 4425416, 4488236, 4218825, 3797629, 3654207, 3483409, 3512517, 3311139, 2983547, 2996011, 2882670, 3062258, 2832758, 2523416, 2811521, 2729242, 2437845, 2267853, 2257538, 2370035, 2564897, 2482374, 2415113, 2139953, 1977086, 2019064, 2173110, 2072194, 2013946, 1975065, 1873765, 1837770, 2027090, 1859463, 1734192, 1764256, 1669565, 1817512, 2051746, 2045371, 1786614, 1747288, 1754099, 1638652, 1532229, 1541563, 1614194, 1416459, 1370867, 1411306, 1279367, 1219251, 1279848, 1286826, 1329616, 1263580, 1160185, 1286454, 1389760, 1450688, 1498935, 1317966, 1246278, 1294770, 970109, 920760, 1065719, 1205843, 1178312, 1066794, 1104494, 885095, 838125, 827439, 823123, 873521, 961799]
8416I61799J6721n9057q0215O4103k8285O3902m7107R4400m9705j17024J13800
8405I33332J24401j89474j0958N1994N1009J4494n4602l8549j15738k846K11475
8394I74538J09070j57924J60727k0079j45056J12542L7828P6304J19794r9339
8384A168405P386R4177n3951q1750j24109O4232L4088r0486r2117K02297O8159
8373A196331j83307K35173m3848Q6353J03483J12356j97285j08096J10852J0673
8363A322685j3260l3851J4374j12696j84318k9939J0631J80448K60021m4524K5736
8352A395307K03706n880J66189O4131M4815j55023Q5349o1754J72783l8062j96030
8341A675531P2539Q7838J16019k34444k7669k5492L4991J63719k31926O7670L8208
$$ y = [961799, 978520, 919463, 839248, 903351, 875066, 938968, 891861, 986261, 936556, 819532, 933332, 1057733, 868259, 857301, 909295, 960304, 974798, 920196, 881647, 765909, 763063, 974538, 1083608, 925684, 1086411, 1066332, 921276, 1033818, 1071646, 1147950, 1267744, 1168405, 1175791, 1269968, 1216017, 1134267, 1010158, 1074390, 1108478, 1017992, 925875, 1128172, 1196331, 1013024, 1248197, 1204349, 1290702, 1394185, 1506541, 1309256, 1201160, 1312012, 1322685, 1309425, 1275574, 1289948, 1177252, 992934, 962995, 973626, 1154074, 1414095, 1369571, 1395307, 1599013, 1593133, 1759322, 1823453, 1868268, 1713245, 1798594, 1736840, 1909623, 1871561, 1675531, 1748070, 1835908, 1951927, 1717483, 1689814, 1664322, 1699313, 1863032, 1631106, 1698776, 1736984]
8330A736984P0218J79799J00000l17720j62899J33951K06902P3139j12207m2065
8320A866102L8420K46862M2770J20385J1075n2243O8029R4532J58623m0724R8612
8309B652443J33012O7091L95369L33889J4076K15362p703K09948J83627o8493
8299D128621k8032l80632k34369M2031j17309P7421P2223K4765J43671K16434
8289C944824P0234k09777j54981l58773j6257k61096p0335k23674p2821J78392
8279B825736j68488n708K31678l2879P4622n3362N8799m6584K33883L4754P1430
8268C223881L0368k30311j545J66854K79213K22112J97063L04367J42905m383
8258D330524k6272p7105k31518j34784j03499j54918J70924P7816k06694K81433
$$ y = [1736984, 1807202, 1987001, 2087001, 1769281, 1606382, 1740333, 1947235, 2020374, 1908167, 1866102, 1904522, 2151384, 2194154, 2314539, 2325614, 2273371, 2341400, 2435932, 2594555, 2553831, 2652443, 2785455, 2852546, 3247915, 3581804, 3595880, 3811242, 3803539, 4013487, 4197114, 4128621, 4100589, 3719957, 3485588, 3527619, 3410310, 3487731, 3559954, 3584719, 3728390, 3944824, 4015058, 3805281, 3650300, 3291527, 3275270, 3014174, 2943839, 2720165, 2647344, 2825736, 2657248, 2651540, 2883218, 2850339, 2924961, 2871599, 2930398, 2883814, 3117697, 3152451, 3223881, 3254249, 3023938, 3022393, 3189247, 3468460, 3690572, 3887635, 4192002, 4334907, 4330524, 4304252, 4227147, 3995629, 3860845, 3757346, 3602428, 3773352, 3851168, 3644474, 3925907]
8248C925907J30125j16768K0395M7004j00812m18019k56826K3459K69532m3120
8238C480877k09768L4350J58646l4798m5257M6072J18449m6655J1086k29387r3928
8227C189687K21495J73370L6701m6816J33049m7652j31045k0427j19149K68072
8217C657285k1769O3853L6998j6428J43934J67200M899m1672L07363J81642k04795
8206D278510K34857L36901K3832l1276K13407J66568J23519J99045K11927K56430
8196F013720L40275K46192m7229M13961j259875j7244J080657N91552M06257L87847
8186H156113O56047M24219P89908N95666Q76113R15985J015845J351920J657966
8177A6439782K266053K912310L303098L789995L640632K063786m3957j875000
$$ y = [3925907, 4056032, 3939264, 3959659, 4006663, 3905851, 3487832, 3231006, 3254465, 3523997, 3480877, 3271109, 3305459, 3464105, 3429307, 3384050, 3430122, 3548571, 3501916, 3513002, 3283615, 3189687, 3411182, 3584552, 3621253, 3574437, 3707486, 3659834, 3528789, 3508362, 3389213, 3657285, 3635516, 3699369, 3736367, 3719939, 3863873, 4031073, 4035972, 3994300, 4301663, 4483305, 4278510, 4513367, 4850268, 4874100, 4842824, 5056231, 5222799, 5346318, 5545363, 5757290, 6013720, 6353995, 6600187, 6552958, 6966919, 5707044, 5689800, 6770457, 7362009, 7768266, 8156113, 8812160, 9236379, 10026287, 10621953, 11498066, 12414051, 13429896, 14781816, 16439782, 18705835, 21618145, 24921243, 28711238, 32351870, 34415656, 34371699, 32496699]
8169C2496699k357774k322324j392833n97895N87686J493000K057051K305120
8161C2268730J656019J318k114987l302285l693256l352232k638710j981444j434381
8152A5408772j286419q25773l20982n95624k15562k51976J04281j37577M7249
8143A1926389L97469L58655M86950P44040Q73276J516768J966932K295995K645530
8134B3212004K926617K182539N72750j162375k025175k204228j806631j078371
8126B0617130m67997N04061J567897J693987J675090Q33289r08677k505032l258278
8117A9751470l150861k620829j913053j591463j053646j098344j021693o83633
8109F617948k73057n34769l24360l91434k07652l71308n13326k09636l11718j78182
$$ y = [32496699, 30138925, 27816601, 26423768, 25825873, 26413559, 27906559, 29963610, 32268730, 33924749, 33926067, 31811080, 28508795, 24815539, 21463307, 18824597, 16843153, 15408772, 14122353, 13296580, 12975598, 12379974, 12164412, 11912436, 12016717, 11879140, 11926389, 12323858, 12682513, 13169463, 13913503, 14786779, 16303547, 18270479, 20566474, 23212004, 26138621, 28321160, 28893910, 27731535, 25706360, 23502132, 21695501, 20617130, 20149133, 20653194, 22221091, 23915078, 25590168, 26423457, 25514780, 23009748, 19751470, 16600609, 13979780, 12066727, 10475264, 9421618, 8323274, 7301581, 6617948, 6344891, 5810122, 5485762, 5094328, 4886676, 4515368, 4002042, 3792406, 3480688, 3302506]
8099C302506j03033n6225p4296R9529l06409k69829l5365j87506q3091j53022
8089B133259j28986j70771J15961o0848j66029k8924j59429J02150J5216j9469
8079A632130l8364J05165l25743k31128J15028N7585j17052r9136j38380p0631
8069H89474k1426J71851J89711k45699j44578j24276J12582J7362j07480j6979
8059G20542k01231k3476L3253o5983k8593M8282J8980K6762r6420m241P258j79356
8047B55777P4957Q4302k7543O302q4173n3403l5117J04394j3628j64468J83830
8036C31230n4235m4458j12061j42320R3891N2365j29950L023N6864j425p3929
8025b1005J96822Q6441j45358l5981p770Q3412R6425L6851l8105k52333m9420
$$ y = [3302506, 3199473, 3143248, 3068952, 3168481, 2862072, 2592243, 2556878, 2369372, 2286281, 2133259, 2004273, 1833502, 1949463, 1888615, 1722586, 1693662, 1534233, 1636383, 1651599, 1632130, 1593766, 1698931, 1373188, 1142060, 1257088, 1314673, 1197621, 1098485, 960105, 889474, 868048, 1039899, 1229610, 983911, 839333, 715057, 827639, 845001, 737521, 720542, 519311, 495835, 529088, 463105, 434512, 482794, 501774, 528536, 432116, 427875, 435133, 255777, 330734, 415036, 387493, 393795, 309622, 256219, 221102, 325496, 311868, 147400, 331230, 276995, 232537, 120476, -21844, 72047, 124412, -5538, -2515, 54349, 52924, -21005, 175817, 262258, 116900, 80919, 73149, 156561, 252986, 289837, 251732, -601, -50021]
8014e0021j63096m9716K03452K06396r201j42483M8066M000j26277Q9733Q5793
8003I6646O8094J6357Q4228j74886J5105l4734j02829o4962P0937R3011o3393
7992C574k8721N1501m3789J1414J91752j09498P5762r3856N2643j35723O5070
7981D0129J41677j17991J32145j83873M2092Q261l8142p0512J5800J7304j68359
7970a81469q3838j05539K81668J7952R0499N8015j98339m6420O7483L1860m5518
7959a13646J9462n9841N9741L2804k2077K09945j82532p5586j1519R1120P3491
7948B1362j08496J08183j739r7004J08874r9955R6410n1843m2806j08537N708
7937a69843q2442K16557J04313j80072p5254p9054J58503P3343o0416j07510K21840
$$ y = [-50021, -213117, -262833, -59381, 147015, 137814, -4669, 43397, 47397, -78880, 10853, 96646, 164740, 181097, 265325, 90439, 105544, 70810, -32019, -96981, -26044, 66967, 3574, -25147, 26354, -17435, -6021, 185731, 76233, 151995, 58139, 110782, -24941, 40129, 181806, 63815, 195960, 12087, 54179, 62440, 24298, -46214, -30414, -13110, -181469, -265307, -370846, -89178, -71226, 19273, 77288, -121051, -167471, -99988, -68128, -113646, -94184, -154025, -94284, -61480, -83557, 126388, -56144, -131730, -143249, -52129, 21362, -87134, 21049, 19310, -77694, 31180, -68775, 27635, -24208, -67014, -175551, -169843, -252285, -35728, 68585, -111487, -186741, -265795, -107292, -33949, -94365, -201875, 19965]
7926A9965q2886M1841J01140j48774j29232L73J94000j25670j27790K96030j41593
7915a02596N1824J58499k2179j64971k70986K67679M3731j24365J0247J79313
7905B6196J3758j96305J72887n5847j20453q2695m490Q9653K5684j35368N5343
7894b11637j822P7617j4377l0293p1757J18J55466r2950J02758j5269o0248J3436
7882a48958J55384j44062q8107j2166J53032N4142J7254k9636j19634Q9104M5967
7871b7680j1047q7150O2996J12527q4176q425j17064M4305q2308j51323J8039
7860c31306J26674L38456j03121M9860j61763j40098K19444j86577j34165j5325
7850c37921M3353L00614q3846n0845j32860J42019L9759j14762j9139o5397p0583
$$ y = [19965, -62921, -21080, 80060, -68714, -197946, -197573, -3573, -129243, -257033, 38997, -102596, -50772, 107727, 85548, -79423, -350409, -82730, -38999, -163364, -153117, 26196, 39954, -156351, 16536, -39311, -159764, -242459, -246949, -157296, -131612, -266980, -211637, -213459, -135842, -150219, -180512, -252269, -252151, -96685, -189635, -86877, -102146, -162394, -148958, 6426, -137636, -225743, -237909, -84877, -30735, -13481, -43117, -162751, -73647, -27680, -38727, -125877, -62881, 49646, -34530, -42955, -160019, -115714, -198022, -349345, -331306, -204632, 133824, 30703, 80563, -81200, -221298, -1854, -188431, -322596, -337921, -294568, 6046, -77800, -128645, -261505, -119486, -79727, -194489, -213628, -279025, -349608]
7839c49608L9690J44387J3976K06419j15807P0098L3099j17647j23984R9474j3913
7828a13816J36412m64k17599P6485j9327N4190l0353j34501J92877P9797j69099
7817a45398j9394M0102J29094K7704j2320J47690j15871j53993K76483j34116
7807C9981l8874j05171J02222O3081j90137m6253j11002P3887J17814J35368J43886
7796A84802n3342m6201l5877j52420m5600k5201J38783O0357j32851P9768J16475
7785H8693j03912j18761K6724K34495k37874J673j39076K1565K16007j07326P9631
7774c8161J1383k15903J2820N9988O7937L7309q5310K69609o7877j77616j4010
7763a39831m102M6461J54958q0819J28897k7549j80212j8920N8187M6839r7688
$$ y = [-349608, -309918, -165531, -151555, 54864, -60943, 9155, 42254, -75393, -199377, -99903, -113816, 22596, 22132, -195467, -118982, -138309, -84119, -114472, -248973, -56096, 23701, -145398, -164792, -124690, 4404, 32108, 19788, 167478, 51607, -102386, 174097, 39981, 1107, -104064, -1842, 61239, -128898, -175151, -286153, -212266, -94452, 40916, 184802, 131460, 85259, 49382, -103038, -148638, -173839, -35056, 25301, -107550, -27782, 88693, -15219, -133980, -107256, 127239, -110635, -108962, -248038, -226473, -10466, -117792, -38161, -26778, -242681, -229861, -169873, -101936, -64627, -149937, 119672, 51795, -125821, -139831, -143933, -97472, 57486, -23333, 105564, 78015, -102197, -121117, -62930, -16091, -113779]
7752a13779M0328J7544K4134J55m6320O8191j87585j01818R2203P5060J17258
7741a4629R7322K5180P4311j67326N0435l9901r604R2353j42208O3604L4678j12736
7729d8521k2333j49056J57425J57913j88076P9767J54205M9860j07019k4223k36193
7718a76251j63120K22351J16621m9336j07253L2425Q3087K0622l8830r5394n4003
7707b09081J6292J00220k8347J08320l2040k09074P5518k2410J74608L2204j91006
7696a84796P6500J1633n9574j56908O8113J97178K8410j64684M4077p54N7944
7685h2861R1114j20804M747l1258o6485J33854j59857J77853Q6233l23610K6936
7674b64138P5804J11285J59198j1158r3472r6952M3490N8791J84687k06394l2991
$$ y = [-113779, -73451, -55907, -31773, -31618, -77938, -9747, -197332, -299150, -206947, -131887, -14629, 82693, 107873, 182184, 14858, 65293, 25392, 15788, 108141, -34067, 29537, 64215, -48521, -70854, -219910, -62485, 95428, -92648, -12881, 141324, 191184, 84165, 59942, -176251, -339371, -117020, -399, -49735, -156988, -124563, -41476, -20854, -59684, -155078, -209081, -192789, -92569, -120916, -12596, -44636, -253710, -178192, -200602, -25994, 6210, -184796, -108296, -96663, -156237, -313145, -245032, -47854, -19444, -184128, -140051, -140805, -82861, 8253, -112551, -107804, -139062, -205547, -71693, -231550, -53697, 32536, -291074, -264138, -188334, -77049, 82149, 70991, -22481, -119433, -75943, -17152, 167535, -38859, -71850]
7663g1850J84219j90159J37164Q8995j33484k82568J38962J76445j03927j17867
7653a74070Q0781o594M3702l7523J29433R3182k02920n9682j37292R8677N9326
7642a12980j22200J95486Q06j65365R6638m0021j0624K4696P395J0865R4266J7250
7630c788k5525n2897n6416J00213n8325q8201J74090j82133j24657J75276j07143
7619b49506l9901K04454J38169n3875j70167k1736P7035o8429P7883Q964R9398
7608B289o5650k04722L2399j7205N1179j6798J34869j17349J02760j51124J5674
7597b33678M2818l2552j0837N3490j86384J67397J25088k4287L4213K6914j16428
7586a54246q7814r5513J55741r252q7401P6877K3054J76379m3274J75718m9369
$$ y = [-71850, 112369, -77790, 59374, 148369, 14885, -267683, -128721, 47724, -56203, -174070, -93289, -99883, -56181, -93704, 35729, 128911, -74009, -133691, -270983, -172306, -112980, -235180, -39694, -38888, -204253, -107615, -147636, -158260, -133564, -126169, -115304, -21038, -3788, -29313, -82210, -138626, -38413, -96738, -184939, -10849, -192982, -317639, -142363, -249506, -289407, -84953, 53216, -659, -170826, -192562, -115527, -183956, -106073, -97109, 2289, -63361, -268083, -235684, -252889, -201710, -218508, -83639, -200988, -98228, -249352, -233678, -190860, -223412, -234249, -180759, -367143, -199746, -74658, -98945, -64732, -37818, -154246, -242060, -337573, -181832, -191084, -278485, -201608, -178554, -2175, -45449, 130269, 80900]
7575H0900k43845L0885P1056j24633K37113l4653O5166k26478K0815O0782l7J84580
7563A21651K2573j95589J40046o3671n0549j05162j0176J14146r5319N8835m5632
7552a08847o4359K02497l3974k27170m8122J9084J01058O7256k7170j55768l308
7541b78823O1230j07825Q0804j20970K09839r462J82430j44970J74611m8785j91753
7530a93674N1029K6106P7961O7969Q0206j00438J7353k01961J64221m8854q3937
7519a44019O5010m8789N945J0324K6267M0212J27270j41274k08986n1037J29573
7508a89504J92831n4761n5003j51520j9345M6905M3006q419J55210J8617m8927
7497g0910J34613J8774k01535Q451J6621J54245j43784j34604J36356n4271J4302
$$ y = [80900, -162945, -132060, -61004, -185637, 51476, 16823, 81989, -144489, -123674, -62892, -62929, 121651, 144224, -51365, 88681, 25010, -25539, -130701, -140877, -26731, -122050, -63215, -108847, -173206, 29291, -4683, -231853, -279975, -260891, -159833, -92577, -119747, -275515, -278823, -217593, -325418, -244614, -365584, -155745, -165207, 17223, -127747, 46864, -1921, -193674, -142645, -116539, -38578, 29391, 109597, 9159, 26512, -175449, -11228, -60082, -144019, -79009, -127798, -121853, -111529, -85262, -45050, 82220, -59054, -268040, -319077, -189504, 3327, -51434, -106437, -257957, -277302, -230397, -187391, -195810, -40600, -21983, -70910, 63703, 82477, -119058, -110607, -93986, 60259, -83525, -218129, -81773, -136044, -121742]
7486a21742j48875M0763N5453q7829r3334J88449n8376j08395R5005J42216O8561
7475b8104j02464m2061k67550K4817J48220K33825l5838J57066k8555k16240j22744
7464b79628J51332j7606L21633q2973o0661j07155o1553Q9069q5306O920m2560
7453a68488k8086K08104K52561K6232j08084m6774k08056p3787P3960k44014J6801
7442b99631J23087J8120j51445K25452R4469j22454J03309K2017n801M5743q7213
7431c4347r0737M0831J55433Q639j45762k8529l0917p329J39891K7085O3123R5367
7419A92748k3148N3158q2839j99256M1105Q3094k6028L676N2839k8547n9782j20855
7407a13835r3301J27073J43232N9026m8577k36843J56018K6774K7026Q5036j60666
$$ y = [-121742, -270617, -229854, -174401, -262230, -355564, -167115, -225491, -333886, -238881, -96665, -28104, -130568, -172629, -440179, -415362, -267142, -33317, -69155, 87911, 59356, -156884, -279628, -128296, -145902, 175731, 92758, 32097, -75058, -136611, -47542, -132848, -125928, -168488, -196574, 11530, 264091, 290323, 182239, 135465, -72591, -146378, -72418, -316432, -299631, -176544, -158424, -309869, -84417, 10052, -112402, -9093, 12924, 7123, 52866, -34347, -125084, -84253, 71180, 79819, -65943, -94472, -125389, -132718, 7173, 34258, 97381, 192748, 169600, 222758, 139919, -59337, -18232, 64862, 38834, 42510, 95349, 66802, 7020, -113835, -207136, -80063, 63169, 122195, 73618, -163225, -7207, 19567, 46593, 131629, -29037]
7396b9037Q5973J48120j7777l24232r097M4494m9641Q0048J14396o8902n6656
7385h2311j9450r9022K8936l2379M7616P3746M2638j09679o8091p8807L42371
7374D5568k48214j75272K01085J29466j44849J9933O3198n9468J8867J67101n0014
7363c2599k14331K1397P5861q167J74249Q6773o0564p7899o7931J79824l1279
7352D5334j06331M6450N7204K5823j41149O607J11039p0882n2694M6562K43489
7341B11452K2635j20027p6545j37517m5682K88568p7914r5403k3169j1959P3727
7330H166j28163j56997J45159O7306k9696O7302Q8317j19105p3128q3008J65808
7319d8039n935j44804J93459k04514R3534Q1525K3481L6028n3869J85932r5543
$$ y = [-29037, 56936, 205056, 187279, -136953, -146050, -101556, -151197, -71149, 43247, -25655, -82311, -101761, -200783, -171847, -204226, -156610, -82864, -40226, -149905, -217996, -296803, 45568, -202646, -377918, -176833, -47367, -192216, -172283, -109085, -168553, -149686, 17415, -32599, -246930, -225533, -149672, -157839, 16410, 103183, 42619, -35280, -103211, 76613, 45334, -60997, -14547, 42657, 68480, -72669, -66062, 44977, -25905, -78599, -32037, 211452, 234087, 114060, 37515, -100002, -145684, 142884, 64970, -30433, -53602, -65561, 8166, -119997, -276994, -131835, -64529, -94225, -26923, 61394, -57711, -130839, -213847, -48039, -53974, -198778, -5319, -209833, -116299, -34774, -11293, 24735, -29134, 156798, 61255]
7308F1255j3516k02799p4226K32202J28850j86652m1220J211n0419P4387N9510
7297a1417j47098L0268J3635J54245M9926k21034K25425j85786k4895R3829j07911
7286a30813o2612J93015J02739M1734j86797j05454N6000M6348p1220J20332J26816
7275A30088r6701q9285o1402L7905r1772R2896n4439J13817J47603p2466r5433
7264c9189K951K0918j38619Q0385O0124J07108M3185l35722p3109J89427j52739
7253b35280J84882p8454O2531O121m1651K22454O8415j74107k0273N6462l8153
7242A2947P4281p5675N3648k6789q0849n8490P8259k08728K3965r7067J6417J55582
7230a32499l4373J34510N2095k165K23605r1770r2356J29929K5066J06536j44636
$$ y = [61255, 47739, -155060, -229286, 2916, 131766, -54886, -96106, -94895, -145314, -70927, -11417, -158515, -128247, -114612, 39633, 89559, -131475, 93950, -91836, -116731, -22902, -130813, -193425, -410, 102329, 144063, -42734, -148188, -92188, -45840, -117060, 3272, 130088, 33387, -55898, -117300, -79395, -171167, -78271, -132710, -18893, 128710, 56244, -39189, -36238, -15320, -153939, -73554, -13430, 93678, 136863, -198859, -271968, -82541, -235280, -50398, -128852, -66321, -60200, -101851, 120603, 189018, 14911, -5362, 51100, 12947, 87228, 11553, 65201, 38412, -42437, -100927, -22668, -231396, -207431, -304498, -288081, -132499, -166872, -32362, 19733, 17568, 241173, 149403, 57047, 186976, 212042, 318578, 173942]
7219A73942l23870p2467J05917M90205p7394k22700K9881N2043j15985r0313L3454
7208a7287J34863J52166n3631N3845R4374K66729O4079r2731M264j72966m9401
7197C84304J0810K4793L743L69637L7082k14395k24197r958J45347L4007J65704
7186G26877j09847L1646o0843k27922K8918j46236j6320J40448k59967l5826k1674
7175D9254k7621q3396j4850R82J63128K6759O0357l3712P8699M6067R247j16704
7163A58210L3757n5725j45595J01433j5838j10602J4250J63052R1033q080j58006
7152F7889L6014N6270J01646K244k50943M6712N1236j15374p2982L09p3261M0348
7140a09892r2469K0801K95436N6091j32614l7870J46214q5049m3152q6231o9920
$$ y = [173942, -149928, -222395, -116478, 373727, 296333, 73633, 103514, 155557, 39572, -50741, -17287, 117576, 269742, 216111, 269956, 364330, 631059, 695138, 602407, 606671, 433705, 384304, 395114, 419907, 423650, 793287, 830369, 615974, 391777, 381819, 527166, 561173, 726877, 617030, 648676, 587833, 359911, 388829, 242593, 226273, 366721, 106754, 70928, 49254, 21633, -61763, -76613, -75631, 87497, 114256, 174613, 140901, 219600, 265667, 274914, 158210, 191967, 136242, -9353, 92080, 76242, -34360, -20110, 142942, 233975, 225895, 67889, 103903, 160173, 261819, 264063, 13120, 59832, 111068, -4306, -77288, -76979, -150240, -109892, -202361, -181560, 113876, 169967, 37353, -517, 145697, 60648, 17496, -68735, -138655]
7129a38655K99558o7492j31625J4785l143O8702J0656J98552j9374q1445q8980
7118F1539j34288k67084J50900M7440K2977Q2377L918J13113J4182q4059J03623
7107A14638K3683l4273n6498K2785k9925j87052J74101J22878p921k05597k29128
7096b92309l225P5652j3937J58929N0501J04156o5528o713J38621o1503J03722
7085A88366j19328k57950L4202j02555J78401Q771k812j8859P6161N6725j19942
7074g8820o0245J52408k2066j94584L7365M76763P0315l50172k69847J64913J62469
7063H8499p9920K5797n7279J84165j15418K4409J0849J51433K49827j38595k60950
7052H2817j92067P058J70627j3110m5620r7033K44851K24459j60588P9102n8156
$$ y = [-138655, 160903, 93411, -38214, -23429, -26572, 42130, 52786, 251338, 231964, 150519, 61539, -72749, -339833, -188933, -141493, -118516, -36139, -32221, 80892, 95074, 11015, 114638, 138321, 104048, 47550, 70335, 40410, -146642, 27459, 150337, 142416, -63181, -292309, -295534, -219882, -233819, -74890, -24389, 79767, 14239, 7526, 146147, 84644, 188366, 69038, -188912, -154710, -257265, -78864, -70093, -72905, -91764, -15603, 41122, -78820, -139065, 13343, -8723, -203307, -165942, 310821, 381136, 30964, -238883, -73970, 88499, 8579, 34376, -22903, 161262, 45844, 70253, 81102, 232535, 482362, 343767, 82817, -109250, -102192, 68435, 55325, 9705, -87328, 157523, 381982, 221394, 300496, 242340]
7041B42340j23124o1786j15273r0711J3809L10907K0381R9631K6242j81566k74954
7030a34104R0881K02283M3469J8530j06778J82013M2250p760k0812k32550J83681
7019B61103j70732m1840K968J28537j45863J23154J64404J6329L3182o4889Q0915
7008C87268J95811j14038j45697J77860J30531L6831p613K24594R9639R7551K30151
6997A312888K92170J75353K07488J07055p3668j00963j167k11149j54247k82678
6987A271082l35280k13764J63119l07163j19319J08017j1646j79735k0595m2124
6977C12592k0563L1421j16382J31860j89479j74326K3260J14048k2576n9862J3170
6966D3163J9248J31272k6643M6594k387j67782o7275P7296K12602j00773j88023
$$ y = [242340, 119216, 57430, -57843, -148554, -134745, 176162, 196543, 296174, 322416, 140850, -134104, -43223, 159060, 202529, 221059, 114281, 296294, 338544, 330784, 309972, 77422, 261103, 90371, 48531, 51499, 180036, 34173, 157327, 321731, 338060, 371242, 306353, 387268, 583079, 469041, 323344, 501204, 631735, 668566, 660953, 885547, 985186, 1082737, 1312888, 1605058, 1780411, 1987899, 2094954, 2021286, 1920323, 1919156, 1708007, 1553760, 1271082, 935802, 722038, 885157, 577994, 458675, 566692, 555046, 375311, 354716, 312592, 292029, 323450, 207068, 338928, 149449, -24877, -1617, 112431, 89855, 29993, 43163, 62411, 193683, 167040, 213634, 211247, 43465, -23810, 53486, 266088, 165315, -22708]
6955b2708Q1712j02496K6801q9273m8942p6574J72281p6073K641L28504n6291
6944A39582j02806J07556j69904o6079J14709r7340J13928R7808J57155L8812
6934C33421J06216o4601j66472J2105j24867o6590Q7710l3915J17243n0374J94708
6923C44584j15370j73885j1079k69395L0804K20803K0596r7268r3927p977J68098
6912A5984K3815l0007k9904Q1443N0698j16686r0993K9903P8408p3472R3418m3576
6900a0969J37715l041o8556J27480K3665m2858r5568J44012j28335k22154j2926
6889a51535K6528J82970Q6834j08647j3723J07172j04720o8442N282Q1354J20591
6878A63664j3670J00541o2221j417m9002k50417q1220j4690J45052J35724P8108
$$ y = [-22708, 59004, -43492, -16691, -105964, -154906, -231480, -59199, -135272, -132631, 195873, 139582, 36776, 144332, -25572, -91651, 23058, -74282, 39646, 137454, 294609, 333421, 439637, 375036, 208564, 220669, 95802, 29212, 116922, 83007, 200250, 149876, 344584, 229214, 55329, 44250, -225145, -194341, 26462, 47058, -50210, -144137, -152114, 15984, 39799, 9792, -20112, 61331, 112029, -4657, -95650, -65747, 12661, -60811, 32607, -10969, 126746, 123705, 55149, 182629, 206294, 163436, 67868, 211880, 83545, -138609, -151535, -125007, 57963, 144797, 36150, 22427, 129599, 24879, -43563, -38281, 43073, 163664, 149994, 250535, 188314, 186897, 137895, -112522, -193742, -208432, -63380, 72344, 150452]
6867A50452J14797j1162o7450j33692l3347J16514k4919P8641j76505j95799P3624
6856a08846J13558J03448q2638j91577J029J85736J04023p1238M2745q1618j02920
6845h8298J26441l8328J28467p8766L6688j03397k3053M5710J38271J52630k89389
6834F976M9895R6495P6245l4243j07850o9641K0953l1139j36021m9083J56949
6823b0464K7575Q7560l0786j90931K5871p4163J3822Q2179J83924j37879o8531
6812a01823J8070p9211K21896M4561j01472O0007j64236R2825n0146k0400J95231
6801A15302N5673L486j70383j15706r2499J23801K16657P136j15471q8599K3948
6790c6655j3207N6705m3733N0789R4670j67393j19643J48662O8160l4505j21651
$$ y = [150452, 265249, 254087, 186637, 52945, 19598, 136112, 111193, 189834, 13329, -182470, -108846, 4712, 108160, 25522, -166055, -165026, 20710, 124733, 53495, 96240, 14622, -88298, 38143, -185, 128282, 49516, 86204, -17193, -40246, 5464, 143735, 296365, 6976, 56871, 153366, 229611, 195368, 87518, 17877, 38830, 7691, -128330, -177413, -20464, 7111, 94671, 63885, -127046, -101175, -175338, -161516, -79337, 104587, -33292, -101823, -83753, -162964, 58932, 103493, 2021, 62028, -102208, -9383, -59529, -79929, 115302, 170975, 174461, 4078, -111628, -204127, -80326, 136331, 143467, 27996, -60603, -36655, -49862, 6843, -36890, 13899, 108569, -58824, -178467, -29805, 38355, 3850, -117801]
6779a17801J89070J55607n6385k62771l2531J74272j54994J21880L8064Q7586
6769A41997N1001j4934J59149j04821R0704L8842l41186m3210J47904r1189j00966
6758f6709M0967j308M2357q4292k3303K7788O6841j7073j961J61738K9553p8352
6746I6246k19695J3728l0732M7812O8224J03443j55910n122o4348m8158K59637
6735F5125o0791n177p211p916r1926J72084R3326j58745N4777l6796o1440k5572
6723g0262l9264n0787Q0438J16997j12783J5490R9360j61164p5767K28516n2120
6712b1346Q0967o9664j9909M1731L2392j84897L08302j56784m1873J10638l7249
6701D2308p1570K382r2351p9452O6634k4883k8051K44184P2270j9842k25932j1577
$$ y = [-117801, 71269, 226876, 170491, -92280, -124811, 49461, -105533, 16347, 54411, 141997, 192998, 178064, 337213, 232392, 323096, 361938, 20752, -22458, 125446, 34257, -66709, -25742, -27050, 15307, -68985, -92288, -64500, 2341, -14732, -16693, 145045, 174598, 96246, -123449, -109721, -140453, -92641, -24417, 79026, -76884, -82006, -146354, -194512, 65125, 4334, -843, -8054, -15970, -107896, 64188, 157514, -1231, 53546, 16750, -44690, -70262, -109526, -160313, -79875, 37122, -75661, -60171, 39189, -121975, -197742, 30774, -21346, 59621, -10043, -29952, 11779, 44171, -140726, 167576, 10792, -31081, 79557, 42308, -29262, -26880, -119231, -198683, -132049, -156932, -184983, 59201, 131471, 111629, -114303, -125880]
6689a25880N4319J68770N7790j69761p2061J86519M8246K0614m0039j36410O376
6678a517j34713J05930J37720O579q8678O5894P4405k7161J767Q6917J749P0215
6666B99107j39843j36291j83860L46510j63246m6533j7317j36384J24017J26786
6656G2946k28218j80879L5091J18600J02646Q5841k84661l9848J67988J97672
6646D7178j27131J52662J01077J49339j89992l7509L6606j83198k3122L9277J81977
6635A47164J41026j60451p2595q4334K34356Q3062l84209M2711r1402L6284J9768
6624h8620O4606J40633j07980l4594R0525K0019o8782n9142j32161J96538J90542
6613B11584N9215l6831j11959k4144N9879o6422j31148M9295l997N7355J02514
$$ y = [-125880, -71561, 97209, 154999, -14762, -86823, 99696, 147942, 168556, 128517, -7893, -1517, -136230, -30300, 107420, 113999, 25321, 91215, 165620, 138459, 140226, 227143, 228892, 299107, 159264, 22973, -160887, 185623, 22377, -24156, -41473, -177857, -53840, 72946, -155272, -336151, -301060, -182460, -79814, 6027, -278634, -318482, -150494, 47178, -79953, 72709, 173786, 323125, 133133, 95624, 132230, -50968, -74090, -34813, 147164, 288190, 127739, 55144, -29190, 205166, 288228, -95981, -53270, -144672, -108388, -88620, -24014, 116619, 8639, -25955, 64570, 84589, 15807, -43335, -175496, 21042, 211584, 270799, 233968, 122009, 97865, 157744, 91322, -39826, 9469, 5472, 62827, 165341]
6602A65341j15962p2892O2436j32812J04675n4198J03747Q8710j50711L1637J04048
6591A34019p9820R9587k11255O825m8528J72932R5467K1872J54234j0590l5048
6580B99695j36769j37569J06822l2107J05016j48144j80604P8828R8826j15592
6570f1598l2702J62269P6683k672q639Q1905K4920p4411r49n0997L8237j5298
6558A36748j15548o0262m3403j59303K82771R4307p3562Q400j01814J92335K59093
6547D19762n8559j35475j5m9853O168j80596J46020j4380q9896P7804m9475k25444
6535a53939K10888p788L4269p1660J10195P9579k90643K84385k9870k7268J017
6524A39165r3433J08039j27607N7041N9316j95266l630K08618K352J2528L0955
$$ y = [165341, 49379, -23513, 38923, -93889, 10786, -43412, 60335, 149045, -1666, 29971, 134019, 54199, 153786, -57469, -50644, -99172, 73760, 169227, 191099, 345333, 334743, 299695, 162926, 25357, 132179, 100072, 205088, 56944, -123660, -44832, 53994, -61598, -94300, 67969, 144652, 141980, 133341, 215246, 240166, 165755, 164806, 113809, 152046, 136748, 21200, -39062, -82465, -241768, 41003, 135310, 61748, 70148, -31666, 160669, 419762, 361203, 225728, 225713, 175860, 182028, 1432, 147452, 133072, 43176, 120980, 71505, -153939, 56949, 49161, 83430, 11770, 121965, 201544, -89099, 195286, 165416, 138148, 139165, 45732, 153771, 26164, 83205, 142521, -52745, -56375, 152243, 154595, 167123, 198078]
6513A98078J18809J4055q2838k09227j13623K15558n8497j55831Q4692K19N7601
6502F8996J16226J28708P3125j56959k8386L3351J24281j45085j08249J4813p9011
6491D1810k6593j7271J01604J05356J02771k92165n7713K34804l3722Q4962j83059
6480F0784L1217n7757j4383J45225n7314J05560n2621k46467o2952K32574J59540
6469B43406N8872p1914j10505R6934j15854j18289J46144n7689O4191J8117N8072
6458B11485k9925j20453J60075n9846n6739J12090K67625l9357k32569n2227j12686
6447D7473L8590p8314J96169J30406j20102k11787j5416K48629M4465r6968M1544
6436B24689r2088k17056K34222p2050J115L0960j71454L01668L3790j66114M3220
$$ y = [198078, 316887, 330942, 248104, 38877, -74746, 140812, 82315, -73516, 11176, 11395, 68996, 185222, 313930, 387055, 230096, 201710, 235061, 359342, 214257, 106008, 120821, 41810, 15217, -2054, 99550, 204906, 307677, 15512, -42201, 192603, 158881, 243843, 60784, 92001, 34244, 19861, 165086, 107772, 213332, 160711, -85756, -148708, 83866, 243406, 302278, 230364, 119859, 216793, 100939, -17350, 128794, 71105, 135296, 153413, 211485, 181560, 61107, 221182, 161336, 104597, 216687, 484312, 444955, 212386, 160159, 47473, 86063, 7749, 203918, 334324, 214222, 2435, -12981, 235648, 280113, 183145, 224689, 132601, -84455, 149767, 77717, 78832, 109792, -61662, 240006, 273796, 107682, 150902]
6425A50902j00465n5179J58474J77963K4324J7272r0517n1461K4908K5085k22083
6414E9223j05196J97089Q5471m2242N0581J80165l49438L9919J21435o3903j00698
6403G2406J5019p1407J1656k931j71315l2385P5836K94734R1347j64515o9955
6392D8490Q2975K463j9148k2237r8513J26618L8418J15229J10972l65979p2383
6381e3095L9076M6838P4128N5738K02456n5412j17526n6218j39014J51946j03786
6370D5131k98796K7439R0158J43855R6756k12832J35753q360N7418m5814J19452
6359A50160N3916Q1901r6539J3014N4504j86540k7930J07946K61657P746J00747
6348E20582m4411j9822p5027J4049K1434k36324J4298J63975j4237P2774j39427
$$ y = [150902, 50437, -4742, 153732, 331695, 356019, 373291, 282774, 231313, 256221, 281306, 59223, -45973, 151116, 236587, 194345, 244926, 425091, 75653, 115572, 237007, 173104, 72406, 87425, 16018, 27674, 24743, -146572, -178957, -103121, 191613, 282960, 118445, 48490, 131465, 133928, 114780, 92543, -5970, 120648, 159066, 274295, 385267, 19288, -53095, -14019, 32819, 106947, 162685, 365141, 309729, 192203, 135985, -3029, 148917, 45131, -253665, -226226, -136068, 7787, 104543, -108289, 27464, 19104, 76522, 30708, 150160, 204076, 285977, 189438, 202452, 256956, 70416, 42486, 150432, 412089, 419835, 520582, 476171, 456349, 381322, 395371, 416805, 180481, 194779, 358754, 344517, 417291, 277864]
6337B77864J44871J65673j86376K24067k82941k96721O0793M593J20421J73257
6327D05501M0725q4655O5831j91281k280j5769R8216O0020j0206j47605k54139
6316c5642K89136J35100j10124P4860j51387k1356K93256J60331p6863p0500K4216
6305E11027J90179k66164k30930P3464N1303k43420N9082K65986j31228m7767
6295B31532J07165j1171n2100q0262k10662J50879O844J23608J4530j3963j09010
6284A57390J3718K11954l21j05149O2153R5833M2540k8646N2585o0007R8762N2428
6272E93240n7942R0461k00910k04232K57544J8429J2504R3170k66030j34731j69763
6261C1740J8049L4360M12067j33713j11382J1924P8632K92031j32648R2655k44598
$$ y = [277864, 422735, 588408, 402032, 626099, 343158, 46437, 107230, 111823, 232244, 405501, 446226, 361571, 427402, 236121, 233841, 218072, 316288, 376308, 366102, 218497, -35642, 253494, 388594, 278470, 353330, 201943, 180587, 473843, 634174, 557311, 486811, 511027, 701206, 435042, 204112, 277576, 328879, 85459, 144541, 410527, 279299, 231532, 338697, 327526, 275426, 195164, -15498, 135381, 142225, 265833, 280363, 266400, 157390, 171108, 383062, 382741, 277592, 339745, 435578, 478118, 449472, 502057, 442050, 540812, 593240, 535298, 625759, 424849, 220617, 478161, 496590, 509094, 602264, 336234, 201503, 31740, 49789, 84149, 496216, 362503, 251121, 263045, 341677, 633708, 501060, 593715, 349117]
6250C49117j04898J23206p9997N9906J06475q7240J04438L3723J5306p4996j96992
6239B48048J55772M3387j19733J90956M5026q6735r9000Q9061J24048j25125N4392
6228E20097j63739P1480L7076j12744R5212O7865M0181J29770o740j32056q3875
6217D62527J9037p3569k63309R8935J49217K4304o8402P8167m7487N1369Q8966
6206E19755o2614J30176N8867j80480r2675J09450R9464j4542k77668l8164j81445
6195G0124K12700L04252l5932j1823J11273k19288l0992J94707j5248J4242Q9447
6184F83462l43721L8791J20678l996J00956N175n8497j29822K44378J12272l6943
6173G32733j96973j05041r6907J33236K1758K1804o0902M3472Q6866L8825R4826
$$ y = [349117, 244219, 367425, 287428, 347334, 453809, 366569, 471007, 504730, 520036, 445040, 248048, 403820, 447207, 327474, 518430, 563456, 476721, 377721, 466782, 590830, 465705, 520097, 356358, 427838, 464914, 352170, 447382, 515247, 555428, 685198, 678458, 546402, 462527, 481564, 407995, 144686, 243621, 392838, 417142, 348740, 426907, 379420, 430789, 519755, 457141, 587317, 646184, 465704, 373029, 482479, 581943, 567401, 289733, 251569, 70124, 282824, 587076, 551144, 539321, 650594, 431306, 400314, 595021, 579773, 594015, 683462, 339741, 378532, 499210, 495214, 596170, 601345, 542848, 413026, 657404, 769676, 732733, 535760, 430719, 333812, 467048, 488806, 510610, 449708, 493180, 580046, 618871, 713697]
6162G13697M0072J45104J1696q8103k45028J47882J0836j42432j46283N9801K47206
6151G54448p1623N4743O9710L04926p0101k45609L3216J17694j0917j31968N1844
6140H56363q6421L6040K72432j026j0283m9699n3336j25504J96524J79258m2092
6129A172256k7134j83058j45727m5331J39071k6181j98861K29233L4619R6626
6119A045513L0684O8117K19269J00979p2307k86738l7755Q9210J13073P5870q0283
6108A265632K56206L56606j90490j65049k48523J11601J2097M3615o1364o3816
6098A316515l1428M8948K85098p2415j31945J43675J93536p6929j32162q8021
6088A454872K64709N2078N6956R7746k02115j3712J09316K9897N388J61083m383
$$ y = [713697, 753769, 898873, 910569, 822466, 577438, 725320, 736156, 593724, 447441, 507242, 754448, 682825, 737568, 807278, 1112204, 1042103, 796494, 829710, 947404, 936487, 804519, 856363, 769942, 805982, 1078414, 1077388, 1067105, 1017406, 964070, 838566, 1035090, 1214348, 1172256, 1145122, 962064, 816337, 771006, 910077, 883896, 685035, 914268, 948887, 1045513, 1076197, 1144314, 1363583, 1464562, 1392255, 1105517, 1067762, 1156972, 1270045, 1345915, 1265632, 1521838, 1878444, 1687954, 1522905, 1274382, 1385983, 1398080, 1441695, 1380331, 1316515, 1285087, 1334035, 1619133, 1546718, 1414773, 1558448, 1751984, 1675055, 1542893, 1454872, 1719581, 1771659, 1828615, 1926361, 1724246, 1710534, 1819850, 1849747, 1855135, 2016218, 2011835]
6077B011835j26479L2079K12263N7529J6866J20391J33989M762M1593O8990o1416
6066B512402P2527k3776j7749L61334j17728O5617K2243p5852R1863J14679J38573
6055C144133J66443J09794k38945J47362N9736J4483K25476K88155q9192J09234
6045C936679K02861J58160N1921J53322K2110J34997K46836K01825J0058J6645
6035E135414J47922L24148P9383n0243M05532J75216L54828L94563J53168J47196
6025G267127M07721L42811N16962M84195P69523Q93825N11760P54182J108092
6016A3056198R96221J183969J885023K196024K831054L246858K934808J920541
6008C0250696l05622j994675k634779k697072k095548j515125j054916o11989
$$ y = [2011835, 1885356, 1917435, 2129698, 2187227, 2204093, 2324484, 2458473, 2463235, 2504828, 2573818, 2512402, 2584929, 2561153, 2543404, 2904738, 2787010, 2852627, 2874870, 2799018, 2890881, 3005560, 3144133, 3310576, 3420370, 3181425, 3328787, 3388523, 3403006, 3628482, 3916637, 3827445, 3936679, 4139540, 4297700, 4349621, 4502943, 4525053, 4660050, 4906886, 5108711, 5118769, 5135414, 5283336, 5607484, 5686867, 5636624, 6042156, 6217372, 6572200, 6966763, 7119931, 7267127, 7674848, 8017659, 8534621, 9018816, 9788339, 10682164, 11193924, 11948106, 13056198, 14052419, 15236388, 17121411, 19317435, 22148489, 25395347, 28330155, 30250696, 29945074, 27950399, 25315620, 22618548, 20523000, 19007875, 17952959, 17340970]
6000A7340970n19540o50068m88823p7688J49278L20715K66662M82384O19320Q90077
5990A8333287J009405J066451J719180K107423K088298K334916K823167L402761
5982C4884888M468354N882957P649915R064672R659748P388639J742880o205487
5974G4536566j0244445r657011q158444o052743m474741l556542l201120k270205
5966B6921315j715667r91940q56753m06204k69774k44690J61987J81674L47736
5957B3127684Q05806J080545J236827J878241K147048K208510L065637M115890
5949C9666188N505465O882307Q569000R553640P982503L273095m671741j0186928
5941F6573529j0676203r147484o949035n336905m146221l327678k727793k270257
$$ y = [17340970, 16821430, 16171362, 15682539, 15604851, 15754129, 16074844, 16341506, 16823890, 17443210, 18333287, 19342692, 20409143, 22128323, 24235746, 26324044, 28658960, 31482127, 34884888, 39353242, 45236199, 52886114, 61950786, 71610534, 78999173, 80742053, 74536566, 64292121, 54635110, 46476666, 40423923, 35949182, 32392640, 29191520, 26921315, 25205648, 24213708, 23356955, 22950751, 22680977, 22436287, 22598274, 22779948, 23127684, 23933490, 25014035, 26250862, 28129103, 30276151, 32484661, 35550298, 39666188, 45171653, 52053960, 60622960, 70176600, 78159103, 81432198, 76760457, 66573529, 55897326, 46749842, 39800807, 34463902, 30317681, 26990003, 24262210, 21991953]
5933B1991953j725052j232857j073885j037819o43947k63247m78704l39224l09520
5924A4887698J81410K06226K01075N15370L44989Q13703J144035J134615J671484
5915B1100605K460316K734416K378138J295167j122587k833267l667085l115824
5907A9229879k732102j950780j770799j203584j140481r91361q57066p22390l63843
5898G497473k55365k53647m36361l41927j89986k50871k26897k06702l78928j57084
5888D799705j93689j52005k80122j22180j43368j41504r4635j12934k46486j90573
5878C122209n7656l9275n0401P6968j71830j35018k27373M2281Q3769j51256k43545
5867B248873L4431J06881j30057N0437j69477j22563m5333n8660P2259o0925J42293
$$ y = [21991953, 20266901, 19034044, 17960159, 16922340, 16278393, 16015146, 15536442, 15197218, 14887698, 15069108, 15275334, 15476409, 15991779, 16336768, 17150471, 18294506, 19429121, 21100605, 23560921, 26295337, 28673475, 29968642, 28846055, 26012788, 22345703, 19229879, 16497777, 14546997, 12776198, 11572614, 10432133, 9440772, 8583706, 7861316, 7497473, 7242108, 6988461, 6552100, 6210173, 6020187, 5769316, 5542419, 5335717, 4956789, 4799705, 4606016, 4454011, 4173889, 4051709, 3908341, 3766837, 3672202, 3559268, 3312782, 3122209, 3064553, 3025278, 2974877, 3051845, 2880015, 2744997, 2517624, 2559905, 2643674, 2492418, 2248873, 2283304, 2390185, 2260128, 2310565, 2141088, 2018525, 1973192, 1914532, 1986791, 1925866, 2068159]
5856B068159r5519p2992j4707O1267k4445j87899k61422k8281K97655m5080j10114
5845A586622L7256l2655J4278j0033Q153n6030R1915M7425J48326p8853M7451
5834A803855m3555j48976K40512j11358j61802K06902L01768J78528N7844K99373
5824B623091J77969j10907J83223N4386j66759l70668j77235j03245k79549j51998
5814A678308L626r2113K2033N2148o5339J15785J00803r5339k1709P3439m2405
5803A729237q5633K22952J06793J17883j35303J5064o3575k37725j36189O4211
5793A597715j77542j67509Q4913J29005J27435P8780k250M8707r0977j50293J81814
5782A659798p5643j58504J02663L08896P5297J13580j12263J82557J86742J42369
$$ y = [2068159, 1972640, 1899648, 1884941, 1946208, 1921763, 1733864, 1472442, 1444161, 1741816, 1696736, 1586622, 1623878, 1591223, 1605501, 1595468, 1603621, 1547591, 1639506, 1686931, 1835257, 1756404, 1803855, 1760300, 1611324, 1851836, 1740478, 1578676, 1785578, 2087346, 2265874, 2323718, 2623091, 2801060, 2690153, 2873376, 2927762, 2761003, 2390335, 2213100, 2109855, 1830306, 1678308, 1681934, 1589821, 1611854, 1664002, 1598663, 1714448, 1815251, 1719912, 1698203, 1771642, 1729237, 1643604, 1866556, 1973349, 2091232, 1955929, 1970993, 1907418, 1669693, 1533504, 1597715, 1420173, 1252664, 1337577, 1466582, 1594017, 1672797, 1670547, 1719254, 1628277, 1477984, 1659798, 1584155, 1425651, 1528314, 1837210, 1912507, 2026087, 1913824, 2096381, 2283123, 2425492]
5772B425492P0349K01190L95140R9601j07983J78342l80631k70469k23737k1273
5762B366021j57682j00910j70016k9102J20619J522j117j93333j69469l0569K55905
5751A891869k82254J69315J29641K44429p1990L2448J82617K18886O149K6339
5741B547449n7564l130J8169M19329J87649J427q386k30310j18290k77203k14770
5730B264370j33828j32288j94764j77355J17910L6026J1349q6598q4583J13918
5720A734157K1258k89479j88817K34185J32564q7626J38109l8090Q5552q3248
5710A658565k2950J47673p1555K26976l0111r0583Q5191O193r0281j80059k70621
5699A368438N8594J43047O8816q8722O8709l5208k12819k1809L2629M9306K20388
$$ y = [2425492, 2495841, 2697031, 3092171, 3191772, 3083789, 3262131, 2881500, 2611031, 2387294, 2366021, 2208339, 2107429, 1937413, 1908311, 2028930, 2030452, 2029335, 1836002, 1666533, 1635964, 1891869, 1609615, 1778930, 1908571, 2153000, 2081010, 2113458, 2296075, 2514961, 2521110, 2547449, 2489885, 2486755, 2504924, 2924253, 3111902, 3113329, 3104943, 2874633, 2756343, 2479140, 2264370, 2130542, 1998254, 1803490, 1626135, 1744045, 1780071, 1791420, 1704822, 1620239, 1734157, 1755415, 1465936, 1277119, 1511304, 1643868, 1556242, 1694351, 1656261, 1741813, 1658565, 1635615, 1783288, 1711733, 1938709, 1908598, 1818015, 1903206, 1909399, 1819118, 1639059, 1368438, 1427032, 1570079, 1638895, 1550173, 1618882, 1583674, 1370855, 1349046, 1381675, 1430981, 1651369]
5688A651369k14859R6160N1683O4764q4133R1456J14828k7078j92000k39290K30468
5677A543368J94711J08123Q1846P6625r4641K15489L2702K7914Q2428n8258K6789
5666B237096P0504K3433R524M8569J24434R2904L4713P9961k83698j30354M042
5655B311128O6793K01100J44382n640k13330n3508J94831M5241J2767k0065j21716
5644B561983j2160k9263J25832J14410N464n4192p0569J57K4069R9129J16686
5633B881546J19056l6633j67797k5048K8552M4905K17514l0921l675P3379J62169
5622C263047M8361J8925L0874l7777J66172J85168o6490k5008q871K85630K66722
5611D126753p9099q4433R3828n2995q0716R226l4247J27668L06820Q4540j19026
$$ y = [1651369, 1436510, 1532670, 1584353, 1649117, 1564984, 1656440, 1771268, 1744190, 1552190, 1312900, 1543368, 1738079, 1846202, 1928048, 2004673, 1910032, 2125521, 2158223, 2186137, 2268565, 2210307, 2237096, 2307600, 2331033, 2340557, 2389126, 2513560, 2606464, 2641177, 2721138, 2437440, 2307086, 2311128, 2377921, 2579021, 2723403, 2717763, 2504433, 2450925, 2645756, 2690997, 2703764, 2683699, 2561983, 2549823, 2520560, 2646392, 2760802, 2766266, 2712074, 2641505, 2641662, 2665731, 2764860, 2881546, 3000602, 2963969, 2796172, 2771124, 2799676, 2844581, 3062095, 3031174, 3027499, 3100878, 3263047, 3311408, 3330333, 3361207, 3323430, 3489602, 3674770, 3608280, 3583272, 3574401, 3860031, 4126753, 4047654, 3963221, 4057049, 4004054, 3923338, 3932564, 3898317, 4025985, 4332805, 4417345, 4298319]
5600D298319M8394P402K73946J21571P0882O273n3124J60819Q6529J76779N9412
5589E257202j68264J30299J01196J99170J99907M72914K18262N4417K65582L75540
5579G106225J56426J9772O7900n5133O4756K83013R2840M74351K97636O6704L3405
5568H607895l9022K75080J46250J50031J20686K02871L11822K22109J88225n4832
5558A0131115p9250J44762M00568K64085n9762K96505K36694J63604R1528Q9577
5548A1679426J57757N76127N98044L01825N37909N75281M34052O17313L86775
5539A5864509J61014M09724P26314J062912P04137P00613R28110Q93070O37338
5530B2087741O90811P60939J070173R94230J070569R58237R86586J252871J361149
$$ y = [4298319, 4346713, 4354115, 4628061, 4749632, 4820514, 4826787, 4773663, 4934482, 5021011, 5197790, 5257202, 5088938, 5219237, 5320433, 5519603, 5719510, 6192424, 6410686, 6465103, 6730685, 7106225, 7262651, 7282423, 7350323, 7295190, 7359946, 7642959, 7735799, 8210150, 8507786, 8574490, 8607895, 8568873, 8843953, 8990203, 9140234, 9260920, 9463791, 9775613, 9997722, 10185947, 10131115, 10051865, 10196627, 10597195, 10861280, 10801518, 11098023, 11334717, 11498321, 11589849, 11679426, 11837183, 12413310, 13011354, 13313179, 13851088, 14426369, 14860421, 15477734, 15864509, 16025523, 16435247, 17161561, 18224473, 18928610, 19629223, 20557333, 21450403, 22087741, 22778552, 23539491, 24609664, 25603894, 26674463, 27632700, 28619286, 29872157, 31233306]
5521C1233306J419310J625423K038339J771732K011778K604352L340925L852138
5513D9897303M859845N968622P178758Q165512R043052J0041336J2439885J6240714
5505A23835027K2398554K9894245L7745545M3531381M0338693J9329860j9046378
5498B98026927m6847809m8966607l9034988k8777811k1374578j6179559j2816527
5491H4029048j0558640q577110o570070n149454m008627l265382l067828k874090
5483C9957847k490051k068813j889593j590920j446271j199114p79756r37927
5475B7555402r01076k26775l70301o72217l73778m43094n70362k03950K13776
5466B4007625K70627O15517M80473l41650j032896j443294j743355j481452j095209
$$ y = [31233306, 32652616, 34278039, 36316378, 38088110, 40099888, 42704240, 46045165, 49897303, 54757148, 60725770, 67904528, 76070040, 85113092, 95154428, 107594313, 123835027, 146233581, 176127826, 213873371, 257404752, 297743445, 317073305, 298026927, 251179118, 202212511, 163177523, 134399712, 113025134, 96845575, 84029048, 73470408, 64893298, 58323228, 53173774, 49165147, 45899765, 42831937, 39957847, 37467796, 35398983, 33509390, 31918470, 30472199, 29273085, 28493329, 27555402, 26654326, 26427551, 26057250, 25385033, 25011255, 24568161, 23997799, 23793849, 24007625, 24278252, 24893769, 25374242, 25032592, 23999696, 22556402, 20813047, 19331595, 18236386]
5457A8236386k78644K0012K1393M20553J0966n46124j118980j287883j242113
5448A4235566r08370o39496o05669n79105o33300n71443j67141j67843k04820
5439I758379j39087k5762k55091j30592n2849l21622k93205n28427o26762n19533
5429F865449j76525j32027n7646j64155k15966k24170k67221j82234k40102j78401
5419E027002l03079j11228N5943K7642k87757j52257j15217j04147k9358j13932
5409C893612k40282k4255j40254m22422k0728k697J08995J77629p5699j84142
5399C069757l7747k4516J10540j39851j29593J32238n6701l75242K12020l9653
5389B721252k78679j97457j13090j55642N3060N7086J99921J14328j10278j6264
$$ y = [18236386, 17957742, 17977754, 17999147, 18419700, 18430666, 17884542, 16765562, 15477679, 14235566, 13327196, 12687700, 12082031, 11502926, 10869626, 10298183, 10131042, 9963199, 9758379, 9619292, 9593530, 9338439, 9207847, 9154998, 8833376, 8540171, 8011744, 7384982, 6865449, 6688924, 6556897, 6499251, 6335096, 6119130, 5894960, 5627739, 5445505, 5205403, 5027002, 4723923, 4612695, 4668638, 4696280, 4408523, 4256266, 4141049, 4036902, 4007544, 3893612, 3653330, 3629075, 3488821, 3066399, 3045671, 3042974, 3151969, 3329598, 3253899, 3069757, 3032010, 3007494, 3118034, 2978183, 2848590, 2980828, 2924127, 2548885, 2760905, 2721252, 2442573, 2245116, 2132026, 1976384, 2029444, 2086530, 2286451, 2400779, 2290501, 2274237]
5379B274237k49990l7246j09179J38343Q5186l7980p0377O8598N1972j32025r6875
5368A884664j28507j61286m4057J88856K0880q0246K01958j21254j85128n4089
5358A521791J13662k500j71625r2953P0416j63002q2029K17291J809O1896P6811
5347A551567J32096p0030M7307k188q7219J99415j70829j65452j92450j55086
5337A087131J97109k38565M3688J87133J9442q1166j49435r4120p1992O0263J46124
5326A105612J65632J0741J65349N7065j24582k64690N4236j27808j2913O5518
5316A094160p6702q16q6770J89152J9420n2999n3392J4264J29774p6869J82984
5305A282206l6547j23972J24000n8135J57045j32171l01756j2770J42887q515
$$ y = [2274237, 2024247, 1987001, 1877822, 2016165, 2101351, 2063371, 1992994, 2061592, 2113564, 1981539, 1884664, 1756157, 1594871, 1550814, 1739670, 1760550, 1680304, 1882262, 1761008, 1575880, 1521791, 1635453, 1632953, 1461328, 1368375, 1438791, 1275789, 1193760, 1411051, 1412860, 1474756, 1551567, 1683663, 1613633, 1660940, 1658752, 1571533, 1770948, 1600119, 1434667, 1242217, 1087131, 1284240, 1045675, 1089363, 1276496, 1295938, 1214772, 1065337, 971217, 899225, 959488, 1105612, 1271244, 1281985, 1447334, 1504399, 1379817, 1115127, 1169363, 1041555, 1028642, 1094160, 1017458, 1016642, 929872, 1119024, 1138444, 1085445, 1032053, 1046317, 1176091, 1099222, 1282206, 1245659, 1121687, 1245687, 1187552, 1344597, 1212426, 910670, 897900, 1040787, 1032272]
5295A032272O0173N0898k1354l15568j9385J21393j3934j40883K1644J67785r019
5284I34022j30533n2524K09523J28877N3132k46297o5148j39173j01623M0521
5274F30777J12123l1183j71748n6632J95690N5485O8029p197J3835M601j53005
5263F60775J9451n3118N6740O6253k21460K79562N5094o141l6722J63678j47348
5252H36764j25030j64381q4772M1359L2980R3297n3531K089l9756J41170M9107
5241G29296L863j22990O8287R0690o5116m0861r3168j26896K2210J01765j76843
5230C90237J43717K85000k27113K4585o1501P403o7595k1710N6390J11183n8882
5219E81714J37204j56822J37152P5568o815P6791K2722j47413j00120R5644P4479
$$ y = [1032272, 1092445, 1143343, 1121989, 806421, 787036, 908429, 894495, 753612, 775256, 943041, 934022, 803489, 750965, 960488, 1089365, 1142497, 896200, 831052, 691879, 590256, 630777, 742900, 711717, 539969, 483337, 679027, 734512, 802541, 795344, 809179, 813780, 660775, 680226, 627108, 683848, 750101, 528641, 808203, 863297, 857156, 820434, 984112, 836764, 711734, 547353, 462581, 503940, 536920, 630217, 576686, 578775, 539019, 680189, 729296, 733159, 610169, 678456, 769146, 704030, 663169, 570001, 443105, 465315, 567080, 390237, 533954, 818954, 591841, 616426, 554925, 562328, 494733, 473023, 529413, 640596, 581714, 718918, 562096, 699248, 774816, 768001, 844792, 867514, 720101, 619981, 715625, 790104]
5208G90104J26165j01068m8678P1028M9277J28405j12925q2424j62068j31542
5198E26274J27416J17978n0299K80434K6868j56557q7605N385j9055N0485J36059
5187I57383J155K4359j4209J34056l4552J31530M8542J78568M9838R6618J54155
5176A727443J16477L37675N2871k408q0265k19716j45595r2739k2346q8852j52750
5165A429795j69781o1336O9054m4589j46881j50234J11680P9108K6213J33828
5155A276857O1632N1395j51271q5740q850J10359m282j116L8970k2977l2709O0572
5143A292840n2734K209L7621j28440N0331K63040J08687k6670q8798J19400N7438
5132A634924k89377j85390N8143M6417J66790P2758r0619j37523j28010O5811
$$ y = [790104, 916269, 815201, 766523, 837551, 886828, 1015233, 902308, 819884, 657816, 526274, 653690, 771668, 721369, 1001803, 1028671, 872114, 784509, 789894, 770839, 821324, 957383, 958538, 982897, 968688, 1102744, 1068192, 1199722, 1248264, 1426832, 1476670, 1573288, 1727443, 1843920, 2181595, 2234466, 2232058, 2151793, 1932077, 1786482, 1693743, 1671397, 1582545, 1429795, 1260014, 1198678, 1267732, 1223143, 1076262, 926028, 1037708, 1116816, 1143029, 1276857, 1338489, 1389884, 1238613, 1152873, 1144023, 1254382, 1250100, 1248984, 1287954, 1264977, 1232268, 1292840, 1240106, 1242315, 1279936, 1151496, 1201827, 1464867, 1573554, 1546884, 1458086, 1577486, 1634924, 1345547, 1160157, 1218300, 1264717, 1431507, 1504265, 1413646, 1276123, 1148113, 1213924]
5122A213924J00212O2357j71610R5232M65732J21847K40984J92000K06194J49570
5112B676442K39641J4599K87385P8094j07332M4804k39624j11441l01092k42376
5102B339100m07350j26241p480k47783j54040J53804j2021q1252j1927j25158
5092A319652j06532k19542R496p72K6003M6968q1433k35642K31379j50331M2863
5081H82109o0123j74835K4354R578r2195n1044K32592J53943O3493j12523N7629
5070I32978M6799m2661J79816n4832j36042J11190n1502J36913l85145j10558
5060F26956N621j25650J85005M1374r7554M9846P0407j70448l4173J16357K0745
5049F88486L6758J40073R4338L9670L9858j51745N783K1838k2065p4406r214n731
$$ y = [1213924, 1314136, 1376493, 1204883, 1300115, 1765847, 1887694, 2128678, 2320678, 2526872, 2676442, 2916083, 2930682, 3218067, 3296161, 3188829, 3233633, 2994009, 2882568, 2581476, 2339100, 1931750, 1805509, 1798029, 1550246, 1396206, 1550010, 1537989, 1456737, 1444810, 1319652, 1213120, 993578, 1003074, 1002302, 1028305, 1075273, 993840, 758198, 989577, 839246, 882109, 821986, 647151, 671505, 681083, 588888, 537844, 770436, 924379, 987872, 875349, 932978, 979777, 937116, 1116932, 1062100, 926058, 1037248, 985746, 1122659, 737514, 626956, 632577, 506927, 691932, 733306, 635752, 685598, 756005, 585557, 551384, 667741, 688486, 725244, 865317, 959655, 999325, 1039183, 887438, 893221, 915059, 892994, 818588, 809374, 803643]
5037H03643l2429j87853R0083k6601p5076l8892J35792Q3438K791R2778k2977
5026H24697j46470O3552k7455q174J19757J07861j13008R865J19307N3985k09822
5015G94095J67577k0926q6618O8386j3366o8009p0773k8551M1940j7652j80038
5004E86065K17334j08739N8606J85387n5150k36139m3948P836J04127o8232J79033
4993H26180r1426k3896L2272Q2271r7152M1485P2371O527o0137J02696Q6010j19182
4981H58019J5819p8592N5809j92020Q7614n6434l1493R9637J02869L8670J6435
4970I16333j45823l3354J37077j42175K54836P4945m1973J48298j59668j41278
4960H67218n018J69789j42740M4896J86933j40771r0141J59164j26536N5996J12863
$$ y = [803643, 771214, 583361, 673444, 646843, 571767, 532875, 668667, 752105, 754896, 847674, 824697, 678227, 741779, 714324, 706150, 825907, 933768, 820760, 830625, 949932, 1003917, 794095, 961672, 940746, 854128, 922514, 909148, 841139, 770366, 741815, 783755, 766103, 586065, 803399, 694660, 753266, 938653, 883503, 647364, 603416, 611252, 715379, 647147, 826180, 734754, 710858, 743130, 825401, 728249, 769734, 842105, 848632, 788495, 891191, 977201, 858019, 873838, 795246, 851055, 659035, 746649, 690215, 658722, 758359, 861228, 899898, 916333, 770510, 737156, 874233, 732058, 986894, 1061839, 1019866, 1168164, 1008496, 867218, 862200, 1031989, 889249, 934145, 1121078, 980307, 890166, 1049330, 922794, 978790, 1091653]
4949A091653k11161n4720k06860J88647K65502o7386Q7571j3038j58700j5362
4939I06146r0173K96527j8330k17343j21461q2705K20510j9979j51950P2865m3501
4928G50606J44510o8740j47314P4719K14471K30702j46284k67560K2131j01768
4918G05473J14958L0584N6749J47362q90J2676O9563J44402k54822J0560Q6098
4907A122713q5841r3297N646J23686R5037M163j22074j52751K09155j87297p2083
4896H47057P1155L0574J09179J70266j23331O7118J74536j10776l7726j89326
4886A008726J78121j0105p2750J23301J64897O1M6462l0394N7777j9812k9799
4875A416485J69060j51295k12064n7869J00177n0294k0121q3285K06968K81730
$$ y = [1091653, 880492, 825772, 618912, 807559, 1073061, 1005675, 1093246, 1080208, 921508, 906146, 815973, 1112500, 1094170, 876827, 755366, 672661, 893171, 873192, 721242, 794107, 750606, 895116, 826376, 679062, 753781, 968252, 1198954, 1052670, 785110, 807241, 705473, 820431, 851015, 907764, 1055126, 1054236, 1066912, 1136475, 1280877, 1026055, 1036615, 1122713, 1036872, 943575, 949221, 1072907, 1167944, 1172107, 1050033, 897282, 1106437, 919140, 847057, 918212, 948786, 1057965, 1228231, 1104900, 1172018, 1346554, 1235778, 1198052, 1008726, 1186847, 1176742, 1103992, 1227293, 1392190, 1392251, 1438713, 1408319, 1466096, 1446284, 1416485, 1585545, 1434250, 1222186, 1164317, 1264494, 1214200, 1194079, 1110794, 1317762, 1599492]
4865A599492M038j15678n9930L1495m4263N9175j33616N0728O9579P263p9462
4854A388821P6767L322j22143O432N1587J1359M4767L1447J41399R8465j46611
4843A585612l5000m5643R8488p1224k62972j5179L43062J33487j09671j22984
4833A497976N1793k5941O8180M2831q7421J46513K7294j03019n9298k3632J22175
4822A657451K5929M5089J54272j98013k8810Q8277n9761J66474j17033K5100J03400
4811A862375j13979j40168j23768K00149O5123j13580J50203J97792J36780q6055
4801B034872j03r7778M41L8597j00797n22r5482o2328K4350M6644J5864K45897
4789B049655p0678O7155m6325j98162O9805R0159L9339J03680p7375j03582L2773
$$ y = [1599492, 1603530, 1487852, 1427922, 1459417, 1415154, 1474329, 1340713, 1391441, 1461020, 1468283, 1388821, 1465588, 1468910, 1346767, 1353199, 1404786, 1416145, 1460912, 1492359, 1633758, 1732223, 1585612, 1550612, 1504969, 1603457, 1532233, 1269261, 1254082, 1597144, 1730631, 1620960, 1497976, 1549769, 1523828, 1592008, 1634839, 1547418, 1693931, 1721225, 1618206, 1558908, 1535276, 1657451, 1683380, 1728469, 1882741, 1684728, 1655918, 1744195, 1684434, 1850908, 1733875, 1758975, 1862375, 1748396, 1608228, 1484460, 1684609, 1749732, 1636152, 1786355, 1984147, 2120927, 2034872, 2034769, 1936991, 1937432, 1976029, 1875232, 1874710, 1779228, 1716900, 1741250, 1787894, 1803758, 2049655, 1978977, 2046132, 1999807, 1801645, 1871450, 1961609, 2000948, 2104628, 2027253, 1923671, 1956444]
4778A956444K02528o5709j36724K26567r3730O6647l7236l6634J46715o8265j13286
4767B047317J10846R3153p0467k3583j06007N4534J85456j22128K2233J87998
4757B379352l1621p1766q598J29929j16992N2677n1570j79487J54898K25526K02763
4746B685111k41757p0595J86309k00620L4725J90781j32033J94957J85434M3668
4736B875980j278K31559J98802L22031K06583L0254J76104J8858l06525k56015
4726C496353k74548j67665o493j12475J17026J26595j18338J0805j29962j80457
4716B760841K49825K3438k53450M0534J53319P9607j33248r7673R30Q444k8529
4705B804038J11823J22024o56K45814m2789m0383n8079J92100l5639p8213m8730
$$ y = [1956444, 2158972, 2093263, 1956539, 2183106, 2089376, 2156023, 2118787, 2082153, 2228868, 2160603, 2047317, 2158163, 2251316, 2180849, 2157266, 2051259, 2105793, 2291249, 2169121, 2191354, 2379352, 2347731, 2275965, 2267367, 2397296, 2280304, 2332981, 2281411, 2101924, 2256822, 2482348, 2685111, 2443354, 2372759, 2559068, 2358448, 2393173, 2583954, 2451921, 2646878, 2832312, 2875980, 2874702, 3106261, 3305063, 3627094, 3833677, 3863931, 4040035, 4058893, 3752368, 3496353, 3221805, 3054140, 3047647, 2935172, 3052198, 3178793, 3060455, 3071260, 2941298, 2760841, 3010666, 3034104, 2780654, 2821188, 2974507, 3054114, 2920866, 2823193, 2824123, 2832567, 2804038, 2915861, 3037885, 3037229, 3283043, 3240254, 3199871, 3141792, 3333892, 3298253, 3220040, 3171310]
4694C171310K08434n969j64783l147O1106m8174K1486j13198l8004K11683O1189
4683C361933q6085p1606n6596p6987O4913J79001j40768j65536P1755O3927J34714
4672C278665J09689O9325j85831K02237L7965k0201O2450j08436k2368M0408j01669
4661C362234j36472P0068j8345k3660N116M2146J10476J2301j2306j10053Q801
4650C310306N0420L26794j98117k19986k1306Q1852R1273N5454J1094R6937J13067
4639C697788j19952M341R7184j0857j22217k4717Q8472L3898r821m8717j3519
4628C571883Q6722j95682R7654J15452K51120l4514M4320j3515J33219k09001
4618C847658q9173M5921m1452J82592j5994j3649J74323J66940o9603J92674P8870
$$ y = [3171310, 3379744, 3373775, 3208992, 3205845, 3266951, 3218777, 3240263, 3127065, 3089061, 3300744, 3361933, 3275848, 3204242, 3147646, 3070659, 3135572, 3314573, 3173805, 3008269, 3080024, 3143951, 3278665, 3388354, 3457679, 3271848, 3474085, 3512050, 3491849, 3554299, 3445863, 3423495, 3463903, 3362234, 3225762, 3295830, 3277485, 3253825, 3258941, 3301087, 3411563, 3423864, 3411558, 3301505, 3310306, 3360726, 3687520, 3489403, 3269417, 3248111, 3329963, 3421236, 3476690, 3487784, 3584721, 3697788, 3577836, 3582177, 3679361, 3668504, 3546287, 3521570, 3610042, 3643940, 3634119, 3585402, 3571883, 3658605, 3462923, 3560577, 3676029, 3927149, 3892635, 3936955, 3923440, 4056659, 3847658, 3758485, 3804406, 3762954, 3945546, 3929552, 3915903, 4090226, 4257166, 4187563, 4380237, 4459107]
4607D459107q0438j20031k5707R6952J57669O1444k9840q9830n126n9298o2715
4596D302187r4932L309L0166P0613M3084k4303N4630O9863j36650j10570J44510
4585D351907J27687j85179r5476J7487j7117N6208J6733J3011R6289r3435P0128
4574D358243J51287q9684P5449J86771O1037K2647O1485N2029J38942k1303j29803
4563D867100r754Q8229j23274L3803K2433j1629J6322M9411Q5273K61770J52612
4552E432296o1985K0030j15976j15762J05789J66950M0243j87524j62114J70218
4542E292165K36473N0695r0634Q8067J97318K05592n2521O6989r9590j6850J84184
4531F061888J08647M2442J15074o8106K73886J29945J63485J18085P0840M5877
$$ y = [4459107, 4378669, 4258638, 4232931, 4329883, 4487552, 4548996, 4519156, 4429326, 4424200, 4364902, 4302187, 4207255, 4210564, 4240730, 4311343, 4354427, 4330124, 4384754, 4454617, 4317967, 4207397, 4351907, 4479594, 4294415, 4198939, 4216426, 4199309, 4255517, 4272250, 4285261, 4381550, 4288115, 4358243, 4509530, 4419846, 4495295, 4682066, 4743103, 4765750, 4827235, 4879264, 5018206, 4996903, 4867100, 4857346, 4945575, 4822301, 4856104, 4878537, 4866908, 4883230, 4932641, 5017914, 5279684, 5432296, 5370311, 5390341, 5274365, 5158603, 5264392, 5431342, 5471585, 5284061, 5121947, 5292165, 5528638, 5579333, 5488699, 5576766, 5774084, 5979676, 5927155, 5994144, 5894554, 5877704, 6061888, 6170535, 6212977, 6328051, 6259945, 6533831, 6663776, 6827261, 6945346, 7016186, 7062063]
4521G062063L4862M43972K15267J48267k1290J38840K43512j39971J44447L08286
4511H578255J18446L60635J40565J64151n827J04603O8085L6275J77810L46335
4501A0089333J78595R9249J11779L40037K222K94745K37026J42640J32454P3466
4491A1701546K28371J88351J71558K41273K07700K05916M92639M06975N49572
4482A4393901N88056N32156L33537N86466L98159N24434N91600P22016Q05723
4473A9476048Q84416P51343Q13696R66473J010297R39017Q04543R22873J036462
4464B7605168J022329J281437J122535J241233J734469J557365J667719K140782
4456C9373037K431779K686303L214005L726404M554607N429866O597988P937857
$$ y = [7062063, 7096925, 7540897, 7756164, 7904431, 7883141, 8021981, 8265493, 8125522, 8269969, 8578255, 8696701, 9057336, 9197901, 9362052, 9356225, 9460828, 9528913, 9565188, 9742998, 10089333, 10267928, 10367177, 10478956, 10818993, 10821215, 11115960, 11352986, 11495626, 11628080, 11701546, 11929917, 12118268, 12289826, 12531099, 12738799, 12944715, 13437354, 13844329, 14393901, 14981957, 15514113, 15847650, 16434116, 16832275, 17356709, 17948309, 18670325, 19476048, 20360464, 21111807, 21925503, 22891976, 23902273, 24841290, 25645833, 26568706, 27605168, 28627497, 29908934, 31031469, 32272702, 34007171, 35564536, 37232255, 39373037, 41804816, 44491119, 47705124, 51431528, 55986135, 61416001, 68013989, 75951846]
4448G5951846Q846089J0432995J3229307J6804949K1687235K7732540L3036368
4441B07721329L5149842K9998820J3378217j0785564l1594666l9078545l5521895
4434A69267538k8242679k1721714j7254566j3840276j1350398r090165p121782
4427F0645958n170490m111188l519749k836974l030558k966414k483406k350008
4419C4177171j967145j958156j627170j220101j153876j259551j448247j249233
4411B2293692j018005j038545r11414p53947p93491p04221p07295n10214m38093
4402A5418467m57105m70500n78680n17538n16157n34884j99675j53942j96661
4393A1793325p433k98675k41206k28947k35027j61958l93604l99300l46194l4875
$$ y = [75951846, 84797935, 95230930, 108460237, 125265186, 146952421, 174684961, 207721329, 242871171, 272869991, 286248208, 275462644, 243867978, 204789433, 169267538, 141024859, 119303145, 102048579, 88208303, 76857905, 67767740, 60645958, 55475468, 51364280, 47844531, 45007557, 41976999, 39010585, 36527179, 34177171, 32210026, 30251870, 28624700, 27404599, 26250723, 24991172, 23542925, 22293692, 21275687, 20237142, 19325728, 18571781, 17778290, 17074069, 16366774, 15856560, 15418467, 14961362, 14490862, 13912182, 13394644, 12878487, 12343603, 12143928, 11989986, 11793325, 11785892, 11487217, 11246011, 11017064, 10782037, 10620079, 10226475, 9827175, 9480981, 9446106]
4383I446106p0893k11740j30994l4890l76310m40187l47637m2949r8302J30650
4373G822854k05150k52384q4127k27928J13136L3246p3722k38889j86001K3721
4363F724756P2655J66064L7133K36079J51782J80610J10789R3103l2096j0922
4353G729953R7098L03378L75772j15993o0210j34225k38385j35413p3905p2691
4343G675379J03663J55073j0696j74704L143j37266k45043o1597k22061k33827
4333F852064J59060n6611k36690m11442l45682m19346k03666j57358j34172l84545
4323D661612k12995r9179k88225j05000q9149j25107j31318k36110n1937j42890
4313C179702k15539J9649j5796k9565r4195o1197N3407j51261l9463M8318j06652
$$ y = [9446106, 9375213, 9163473, 9032479, 8997589, 8621279, 8181092, 7833455, 7790506, 7692204, 7822854, 7617704, 7365320, 7281193, 7053265, 7166401, 7199647, 7125925, 6887036, 6701035, 6724756, 6797411, 6963475, 7000608, 7236687, 7388469, 7569079, 7679868, 7772971, 7740875, 7729953, 7827051, 8130429, 8506201, 8390208, 8329998, 8195773, 7957388, 7821975, 7748070, 7675379, 7779042, 7934115, 7923419, 7748715, 7751858, 7614592, 7369549, 7307952, 7085891, 6852064, 7011124, 6954513, 6717823, 6306381, 5960699, 5541353, 5337687, 5180329, 5046157, 4661612, 4448617, 4349438, 4061213, 3956213, 3867064, 3741957, 3610639, 3374529, 3322592, 3179702, 2964163, 2983812, 2968016, 2938451, 2844256, 2783059, 2836466, 2685205, 2645742, 2694060, 2587408]
4302B587408L7426n7078j67217O4333J48410P5390k54122k91544J21463K3763
4292B288232o3176o0581K8986M5485k82484j2022J5489m9985r1073p2236j13721
4281A632914K3170P9496j14806j33674J5749q5602J26139j44137j84982J55157
4271A369424K7504K76135r3468J7806j07866L1635L60805o150l17793l507K79648
4260A834173j2360j44805k41686M6791O3505k8375k4965r9740R9266J66148j83194
4249A474758p1342K27493N7153J59751n4281l12963o362J84184L3656q8637j37561
4238A465849K3454Q4879J16422q8573j67097L4942j51637R8550J69135L432l6729
4227A552627k2436q5173M1300k7681k69300N8561N9350R7144j34624J6751j40519
$$ y = [2587408, 2624834, 2567756, 2400539, 2464872, 2613282, 2688672, 2434550, 2143006, 2264469, 2288232, 2225056, 2164475, 2193461, 2238946, 1956462, 1944440, 1959929, 1909944, 1818871, 1746635, 1632914, 1656084, 1735580, 1620774, 1487100, 1502849, 1417247, 1543386, 1399249, 1214267, 1369424, 1396928, 1673063, 1579595, 1597401, 1489535, 1521170, 1881975, 1875825, 1558032, 1554525, 1834173, 1821813, 1677008, 1435322, 1482113, 1545618, 1517243, 1492278, 1392538, 1491804, 1657952, 1474758, 1403416, 1630909, 1688062, 1847813, 1793532, 1480569, 1474207, 1658391, 1692047, 1603410, 1465849, 1489303, 1574182, 1690604, 1602031, 1434934, 1469876, 1318239, 1416789, 1585924, 1589356, 1552627, 1530191, 1445018, 1486318, 1458637, 1189337, 1247898, 1307248, 1404392, 1269768, 1286519, 1146000]
4216A146000L7006k02514J95117J38412J53889J32353j4798k60923j13834l19769
4206H90939l7532K09884J27650N553L8679n3664j06472M4549L6624j13916j00420
4195I41874M6931J00839K46940k5018k57736j68007J12746L7809J76438K07926
4185A420742n3243j32152J11479k83265J74015J80838j03677J25894J89658j3047
4175A617242j800K9917J89427j04993K29857J83335K4181L01929J10921J00178
4165B680194L01710K57894J08821l3513K36280N239q8708j4690J83569O5558j24490
4154C577864J45379r8246k19217j69313k43220o4953L9164M7828J59986P6775
4144C252047j19974l73756l23823m6022j53275j47251j18044j35308k27540j2608
$$ y = [1146000, 1183006, 980492, 1175609, 1314021, 1467910, 1600263, 1585465, 1324542, 1210708, 890939, 853407, 1063291, 1190941, 1196494, 1235173, 1181509, 1075037, 1119586, 1156210, 1042294, 941874, 988805, 1089644, 1336584, 1311566, 1053830, 885823, 998569, 1036378, 1212816, 1420742, 1367499, 1235347, 1346826, 1063561, 1237576, 1418414, 1314737, 1440631, 1630289, 1617242, 1615442, 1645359, 1834786, 1729793, 1959650, 2142985, 2167166, 2469095, 2580016, 2680194, 2981904, 3239798, 3348619, 3315106, 3551386, 3556625, 3467917, 3453227, 3636796, 3702354, 3577864, 3723243, 3624997, 3405780, 3236467, 2993247, 2928294, 2967458, 3015286, 3175272, 3252047, 3132073, 2758317, 2434494, 2388472, 2235197, 2087946, 1969902, 1834594, 1607054, 1594446]
4134A594446k05831J36119K5227j17461J17772L3355j01260k4989k0873J0711
4124A447216N1119L3147N4338m59562M47L11051j79053J63249J65090k27768k48629
4113A110645L5448Q8419o9622K08863J05582l2335j40483L806j8245K7122K4493
4102A343693M1989j1184J80740R8940r4846j61580K62649j4412j37610J46746
4092A655125j3539L7634P2507K5674K4721K5542K4412O105O1051K36277m7518
4081B107991M9803L62658K01865k0616K72452M50082M04320M39878M80844L37773
4071E087050P94366N72198K07628J27473k80054o2516l0917o01798o53040o24987
4061D535403n66471k36866k79060k01550j67837j3189j33299k72533k88523j71522
$$ y = [1594446, 1388615, 1524734, 1549961, 1432500, 1550272, 1583627, 1482367, 1457378, 1436505, 1447216, 1498335, 1531482, 1585820, 1126258, 1126705, 1437756, 1258703, 1421952, 1587042, 1359274, 1110645, 1146093, 1234512, 1164890, 1373753, 1479335, 1447000, 1306517, 1310323, 1292078, 1319200, 1343693, 1385682, 1374498, 1555238, 1654178, 1559332, 1397752, 1660401, 1645989, 1508379, 1655125, 1641586, 1679220, 1751727, 1777401, 1802122, 1827664, 1852076, 1858181, 1919232, 2155509, 2107991, 2157794, 2520452, 2722317, 2701701, 2974153, 3424235, 3828555, 4268433, 4749277, 5087050, 5881416, 6453614, 6661242, 6788715, 6508661, 6446145, 6415228, 5813430, 5160390, 4535403, 3968932, 3732066, 3453006, 3251456, 3083619, 3070430, 2937131, 2664598, 2376075, 2204553]
4051B204553j59282k14826k35889k44355L9263j02839j06382K64009j04674n3761
4041A285817r0884j41705L3725m0649R9018O9394j10451j74658K15067Q4512m7183
4030A182003k06484k09204p165j38819J60031P6578J14662k98771J05955M3956
4020H22742R3162J00951j798r9011j7416O7538J1879J2399o8183J77058o2318
4009A037003j53041l9939J09431K12400l2518j47382m3761K00496N5022P3344
3999A271055j37435j0292K64676k716K5617j11647q264J3163M32800p2676K30664
3988A894945L24754K87250L17516K95656K86939L45288M93878N87271J50952J96445
3978E180894j15958n05680l82801l51607n48832m24700l99185m16995k98481j51838
$$ y = [2204553, 2045271, 1830445, 1594556, 1350201, 1389464, 1286625, 1180243, 1444252, 1339578, 1285817, 1194933, 1053228, 1086953, 1046304, 1145322, 1214716, 1104265, 929607, 1144674, 1229186, 1182003, 975519, 766315, 759150, 620331, 780362, 856940, 971602, 672831, 778786, 822742, 915904, 1016855, 1015057, 916046, 898630, 966168, 978047, 990446, 922263, 1099321, 1037003, 883962, 844023, 953454, 1165854, 1133336, 985954, 942193, 1142689, 1197711, 1271055, 1133620, 1123328, 1388004, 1385288, 1410905, 1299258, 1290994, 1304157, 1736957, 1664281, 1894945, 2219699, 2506949, 2824465, 3120121, 3407060, 3752348, 4246226, 4833497, 4984449, 5180894, 5064936, 4559256, 4176455, 3824848, 3276016, 2851316, 2452131, 2035136, 1736655, 1584817]
3968A584817L01207N2235k49245k20417j26798Q995j48330k86383k4171O343L648
3957I01901J08699M4552l54225o3020P4692L8736n3945R2382J03565M0505j62826
3946G71016K5558j08869l8097M1661j62945o9841K358O4774N4924K9881j57738
3935D52682o8186j3818p2324J87277M8633R6625J8788N5201j09214r3189J98413
3924G00888k8401j16576J07514j94487j05493j1443M1590Q7739o3322m0701j04114
3913B73194Q2652K15298J04912j35937J68589n8543k4450M2606O9489L7656k07928
3902E67538l0176J5125j93117L2188Q561K42172Q0221j07169n9211M0o7317J05489
3890E94344P2607l280q1189J43301J89290J02965p0710l6087k4782q6849J45816
$$ y = [1584817, 1886024, 1938259, 1689014, 1468597, 1341799, 1350794, 1202464, 916081, 891910, 898253, 901901, 1010600, 1055152, 700927, 637907, 712599, 751335, 697390, 789772, 893337, 933842, 771016, 796574, 687705, 649608, 691269, 528324, 458483, 460841, 525615, 580539, 610420, 452682, 384496, 370678, 298354, 485631, 534264, 630889, 649677, 704878, 595664, 502475, 700888, 672487, 555911, 663425, 468938, 363445, 352002, 393592, 481331, 418009, 377308, 273194, 355846, 571144, 676056, 540119, 708708, 650165, 625715, 668321, 737810, 775466, 567538, 537362, 552487, 359370, 391558, 400119, 642291, 722512, 615343, 556132, 556172, 488855, 594344, 666951, 663671, 582482, 725783, 915073, 1018038, 947328, 911241, 886459, 799610, 945426]
3879I45426K60561L1416P181N5514j65512j34114j28926J77289j7308J55637P7455
3868A264619j33634K0230k84149N3610J23179k4312J36100j5367J62585J43599
3858A446460J47015J27842J38772k9185q407R9319M79294M37898J74759K03305
3848C217072m00463k01389j24650j56462j84639R1074J25555J32328J79131J01285
3838B778842K61024K66127L25802L45793O02575O96516J035427J649870J862014
3829I823990J747756J282435l37602k028088k087963j784727j366516q23076m09274
3820D016935m18320o43148k49303m43616k34777j1922n3440j26199r7894j97812
3810A540504J5779j84375p2390m7485j48007n1329K46j17261r9139O0729J64888
$$ y = [945426, 1205987, 1237403, 1244584, 1300098, 1134586, 1000472, 871546, 1048835, 1031527, 1187164, 1264619, 1130985, 1151215, 867066, 920676, 1043855, 1019543, 1155643, 1140276, 1302861, 1446460, 1593475, 1721317, 1860089, 1830904, 1822497, 1921816, 2401110, 2839008, 3013767, 3217072, 2816609, 2615220, 2490570, 2334108, 2149469, 2240543, 2366098, 2498426, 2677557, 2778842, 3039866, 3305993, 3631795, 3977588, 4580163, 5276679, 6312106, 7961976, 9823990, 11571746, 12854181, 12516579, 10488491, 8400528, 6615801, 5249285, 4426209, 4016935, 3598615, 2955467, 2706164, 2262548, 2027771, 2015849, 1962409, 1836210, 1738316, 1540504, 1556283, 1371908, 1299518, 1252033, 1104026, 1052697, 1052943, 935682, 836543, 897272, 1062160]
3799A062160j06867k49456j30111J39165r1229q3860J01262P2435p1339j39510
3789E02650N5698j22069J05225J30037p9428n4464L1236J57991M7540m53415o7130
3778B53871L9052L76016p8565j83651J96701j06413P5499P5252k8954j01879M8325
3767E65254j64134m2458N5831q9559j04360J4310o8363Q3326M3785r9990n5496
3756A38146j26719P4854Q8037j40870O7494K0617j35658K11821j09960n3030J9576
3745E4308J35001O7995l17465K71110L8418k90219N8889K30174j06278n8527M8456
3734A31862k5770K25482j39501r0746L8761J15823j02340N4528L584o9322n7207
3723H5154j12219O2035J67280j11839L4597q0658K9806J94955m8391j4978n6662
$$ y = [1062160, 955293, 705837, 575726, 714891, 623662, 539802, 641064, 713499, 642160, 502650, 558348, 436279, 541504, 671541, 592113, 537649, 568885, 726876, 774416, 321001, 253871, 292923, 668939, 590374, 406723, 603424, 497011, 572510, 647762, 618808, 516929, 565254, 401120, 358662, 414493, 324934, 220574, 234884, 166521, 249847, 293632, 193642, 138146, 11427, 86281, 174318, 33448, 100942, 121559, -14099, 197722, 87762, 34732, 54308, 189309, 257304, -60161, 210949, 249367, -40852, 18037, 248211, 141933, 83406, 131862, 106092, 331574, 192073, 101327, 140088, 255911, 153571, 208099, 211683, 142361, 85154, -27065, 34970, 202250, 90411, 125008, 44350, 74156, 269111, 220720, 205742, 149080]
3712A49080J21222q2405J60344O3249r0662j74185j34677J45951N8389o1416l1021
3701A23869K7222l6412M5010k5633J35263j19805O888J58853K1803j61362j46319
3690B9377r2162N4068L79855k8446j02407R8838p8954k03058J4812J40471J7753
3679B30147k5596R352K380n5791N9553m4264K25309k8764j22787k49542Q1566
3668H1563M6672k3119R0281r683K272M2537n0908k36464r2551L16475J00609j97942
3656F9742k05551K4080J65931l2464J52341J16432m5050k768N7922j79780q7018
3645C3817j28218p3633J39332J21404J79905Q6106j59720k4149J53921m4692m2190
3634B41883O892R6563j06539q277N8318j00086J92016K7367l8793k97086J12627
$$ y = [149080, 270302, 187897, 348241, 411490, 320828, 146643, 11966, 157917, 216306, 154890, 123869, 151091, 114679, 159689, 134056, 269319, 149514, 156402, 315255, 337058, 175696, 29377, -62785, -8717, 371138, 342692, 240285, 339123, 260169, 57111, 71923, 212394, 230147, 204551, 213903, 216283, 160492, 220045, 175781, 401090, 372326, 249539, -3, 81563, 128235, 105116, 195397, 185714, 187986, 230523, 179615, -56849, -149400, 167075, 267684, 69742, -135809, -111729, 54202, 21738, 174079, 290511, 245461, 242693, 300615, 120835, 33817, -94401, -168034, -28702, 92702, 272607, 358713, 198993, 174844, 328765, 284073, 241883, 248775, 345338, 238799, 230522, 288840, 188754, 380770, 408137, 369344, 72258, 184885]
3623A84885l3758k3969Q0113L54443k1882N9543j25045P5180o3023r715j36157
3612C40615K2903K9373j13069j25777O564K67228k1208M1182m5222j80888J53920
3601C75621J56886l641o3453j18598J22880j70298k4642R3333J23395Q0986j26432
3590D46037K3230K10840j05805J26214L20081Q3654m1194l08729j38265j54231
3580D61832o5146J9161J44518l2419p230k2986q7920o2081M2059J25578O1897
3569E77263L9070k23971Q0294l3145j16707o6747K51257K07847l1883n7037L1510
3558F57751P1845p041K9887j2559J15719q4714m7616j1241l15298J74672N7730
3547F29135j14139p3040k1831j26507N8176P6668n8718p3214J3312r2924P0433
$$ y = [184885, 151127, 127158, 207271, 561714, 539832, 599375, 474330, 549510, 486487, 476772, 340615, 363518, 392891, 279822, 154045, 160609, 427837, 406629, 447811, 402589, 221701, 375621, 532507, 528866, 465413, 346815, 469695, 299397, 274755, 368088, 491483, 572469, 446037, 469267, 680107, 574302, 700516, 1020597, 1104251, 1063057, 754328, 616063, 461832, 396686, 415847, 560365, 527946, 520716, 497730, 409810, 347729, 389788, 515366, 577263, 616333, 392362, 472656, 439511, 322804, 256057, 507314, 715161, 683278, 626241, 657751, 729596, 722555, 752442, 739883, 855602, 770888, 723272, 712031, 396733, 571405, 629135, 514996, 441956, 420125, 293618, 351794, 428462, 369744, 296530, 309842, 216918, 287351]
3536B87351J58096j7735k6194P2535j61723K11156K13892p3526j42496J99591
3526G20947j1118j29716j06275o4754J98468p4753k04290J18813P9304R9741J52005
3515G78372o3624k27289j01615j12430J41653J09574k0214Q5693P6518O074R8556
3504G71268k6433j77482P991M1559j27845J15790J11642N3161j62297K09581O1063
3493H77998j79923J04009m8418p0576j91505Q5680J72859M7141j78112L11045
3483I30198L5213O153l6109q7952m0808o9898o3936R3357j18446j17298K61625
3472G92099J7267J70862Q8627j16356N5355o5397J15718J4740P2792L3026Q4381
3461A263114K867j09289q1808K06312J59911J07937k5444k72750j84994J07552
$$ y = [287351, 445447, 427712, 401518, 474053, 312330, 523486, 737378, 663852, 521356, 720947, 709829, 580113, 473838, 409084, 607552, 532799, 328509, 447322, 526626, 626367, 778372, 714748, 487459, 385844, 273414, 415067, 524641, 504427, 590120, 666638, 672712, 771268, 744835, 567353, 575344, 616903, 489058, 604848, 716490, 769651, 607354, 816935, 877998, 698075, 802084, 753666, 683090, 491585, 577265, 750124, 797265, 619153, 930198, 965411, 971564, 935455, 847503, 806695, 736797, 672861, 766218, 647772, 530474, 792099, 809366, 980228, 1068855, 952499, 1007854, 942457, 1058175, 1072915, 1145707, 1178733, 1263114, 1265981, 1156692, 1074884, 1281196, 1441107, 1549044, 1523600, 1250850, 1065856, 1173408]
3451A173408R8524J62604k52310J7438J10476J73816K2730J55061m1640k67871
3441A352236q3359J70354K5150n5638L63404K02283j05269q1388M7581L017P9643
3430A918014L9952R0241q03J27630l657j50393M0408N7385O9018r33J04439O2511
3418B353812j98051O2539Q432J14523J11336K82629m4816n6011Q3259j249k57920
3407B458483J00078j0105j8006K73941J45499K8398J71784J15495r6596K51674
3397C420645K43098M7193O9491L4589K07735K7277m412J41187J02822P796M8689
3386D346110J91335K74097J56126N2303L07078K43727R3357J12512K22819K02528
3376F201992m7943K55687M08326J39550K12346J27741L17839K07336K26149J12489
$$ y = [1173408, 1271932, 1434536, 1182226, 1199664, 1310140, 1483956, 1506686, 1661747, 1620107, 1352236, 1268877, 1439231, 1464381, 1408743, 1772147, 1974430, 1869161, 1787773, 1835354, 1838371, 1918014, 1957966, 2048207, 2047404, 2175034, 2171377, 2020984, 2061392, 2118777, 2187795, 2186862, 2291301, 2353812, 2155761, 2218300, 2226732, 2341255, 2452591, 2735220, 2690404, 2634393, 2717652, 2716403, 2458483, 2558561, 2548456, 2530450, 2804391, 2949890, 2978288, 3150072, 3265567, 3168971, 3420645, 3663743, 3710936, 3780427, 3815016, 4022751, 4050028, 4045616, 4186803, 4289625, 4297421, 4346110, 4537445, 4811542, 4967668, 5019971, 5327049, 5570776, 5664133, 5776645, 5999464, 6201992, 6154049, 6409736, 6818062, 6957612, 7169958, 7297699, 7615538, 7822874, 8049023, 8161512]
3366H161512K59076J37978L22339N29872K54682M34770L67093M06107J09229K32120
3356A1214778N56030K88005K96828M08863N24098P79399Q36911M90655N53525
3347A5949092R72495J279892J425198J583486J973405K245255K477015K677748
3339C0583586L131674L752541N040600O924471Q863746J0554386J0652875P880700
3331H7384579J859816o805323j1751615j0045019p452697n361081m158164l116767
3323D0553729k253528j975150j221052n61152r7484J15799K74387m8700L76216
3314C5163065Q37941J145906J925307K901956L399724L666903M004107N046268
3306E8091177O364301Q404023J1904710J5604329J9493181K1620154J8092684
$$ y = [8161512, 8420588, 8558566, 8880905, 9410777, 9665459, 10100229, 10467322, 10873429, 10982658, 11214778, 11770808, 12058813, 12355641, 12764504, 13288602, 14068001, 14904912, 15395567, 15949092, 16921587, 18201479, 19626677, 21210163, 23183568, 25428823, 27905838, 30583586, 33715260, 37467801, 42508401, 49432872, 58296618, 68851004, 79503879, 87384579, 89244395, 82439072, 70687457, 60642438, 53189741, 47828660, 43670496, 40553729, 38300201, 36325051, 35103999, 34542847, 34445363, 34561162, 34835549, 34786849, 35163065, 36001006, 37146912, 39072219, 41974175, 45373899, 49040802, 53044909, 58091177, 64455478, 72859501, 84764211, 100368540, 119861721, 141481875, 159574559]
3299A59574559P316174j2145912k4866056k2990605j7198761j2718603r504415
3292F7466381p589717o206846m795111l720668k299668j794043j353654j165565
3284C8541109j590263j596956j077997q03664m23250N961O68549R21148J376270
3275C6020907J694808K370701L197717M660052O344537Q017558R081107Q392014
3267G9779401M294487l264459j0448766j1768894r401614o921193n501096m391457
3259C2376409l358024k830440k332352j677580j200390j143389j106932j235401
3251A7491901j330062q56609r82118r71770p18331n47008l75523o83751n09662
3242A0517067m89104n83225m98730k37244l69952l38182m67803k73066j25066
$$ y = [159574559, 166890733, 154744821, 129878765, 106888160, 89689399, 76970796, 67466381, 59876664, 53669818, 48874707, 45154039, 42854371, 41060328, 39706674, 38541109, 36950846, 35353890, 34275893, 33472229, 33048979, 33054940, 33723489, 34644637, 36020907, 37715715, 40086416, 43284133, 47944185, 54288722, 62306280, 71387387, 79779401, 84073888, 80809429, 70360663, 58591769, 49190155, 42268962, 36767866, 32376409, 29018385, 26187945, 23855593, 22178013, 20977623, 19834234, 18727302, 17491901, 16161839, 15305230, 14323112, 13351342, 12633011, 12086003, 11710480, 11026729, 10517067, 10027963, 9444738, 8946008, 8708764, 8338812, 8000630, 7532827, 7259761, 7134695]
3233G134695k45271m31389K1738l05434l10963j17184k10599j71929k07787k07224
3223D948653L9039k65595L8027j22018j14247J98356J9079l06387k53838j06099
3213D074970J1369k86151k92647K094j09023n3424j66771l6310j24275k0471J15298
3202C114659m947K3370L5018k38891L1901J2138q1563L9980M3012j52872N2831
3191B874636p4942N8512k61736j54917o136j50379j01970N1834J61510j39025
3181B257387j76581j12870l401O004O9426j10269l4824J22198M1642L7423n9479
3170B036656k3L9478J12412l8021j21877J62080J48120j73895Q812O1801K35o1776
3158B174002l05101Q1378j11206p7322l3855k02740N9361J37743N3434m9603J15258
$$ y = [7134695, 6889424, 6458035, 6479773, 6174339, 5863376, 5746192, 5535593, 5363664, 5155877, 4948653, 4987692, 4722097, 4760124, 4638106, 4523859, 4722215, 4741294, 4434907, 4181069, 4074970, 4086339, 3800188, 3507541, 3509635, 3400612, 3347188, 3180417, 3144107, 3019832, 2999361, 3114659, 3109712, 3133082, 3168100, 2929209, 2961110, 2973248, 2891685, 2931665, 2974677, 2821805, 2874636, 2799694, 2858206, 2596470, 2441553, 2435417, 2285038, 2183068, 2234902, 2396412, 2257387, 2080806, 1967936, 1964535, 1970539, 2039965, 1929696, 1894872, 2017070, 2058712, 2096135, 2036656, 2036633, 2076111, 2188523, 2150502, 2028625, 2190705, 2338825, 2164930, 2173742, 2235543, 2235778, 2174002, 1868901, 1950279, 1839073, 1761751, 1727896, 1525156, 1584517, 1722260, 1775694, 1726091, 1841349]
3147A841349K37k45460l3049K32439J22977j08917j21567J11699L15301K16728
3137B331737j62534o283r0518l9603K99151k10722k08546J8431j59967j55022
3127A616124R4111n6401O4791Q1517q9849l5557j73297L1995p1116k83208k7246
3116A151864K12792p510r9113j99669P5395K9784P9760O4556R1866m03029J2741
3105A009437K23220N0802K6577k9450j05297m4022J28942R062j42732j60165O6305
3094A032679j14114J64901J04724K1940L0300J08024k07161k33771P2051j58277
3084H21296R5346L247r3076l906m6432N2341k02163P0427k77054J0030K48668
3073F78724p2342l8489R5638j01600J01648k5602P3227J25307j2531q2486j3161
$$ y = [1841349, 1841586, 1596126, 1563077, 1795516, 1918493, 1809576, 1688009, 1799708, 2115009, 2331737, 2169203, 2162920, 2072402, 2032799, 2331950, 2121228, 1912682, 1931113, 1771146, 1616124, 1710235, 1653834, 1718625, 1800142, 1710293, 1674736, 1501439, 1533434, 1462318, 1179110, 1151864, 1364656, 1357146, 1258033, 1058364, 1133759, 1163543, 1243303, 1307859, 1399725, 996696, 1009437, 1232657, 1283459, 1310036, 1280586, 1175289, 1131267, 1260209, 1269271, 1126539, 966374, 1032679, 918565, 1083466, 1188190, 1210130, 1240430, 1348454, 1141293, 907522, 979573, 821296, 916642, 919889, 826813, 822907, 776475, 828816, 626653, 697080, 420026, 430056, 678724, 606382, 567893, 663531, 561931, 663579, 637977, 711204, 836511, 823980, 741494, 728333]
3062G28333K19935J43089j11806j46993r3267K9761n7313Q34P4784j03691m9894
3051F33772J82929J7453k61390Q8711J19196j05377J49064q5172J7800j9201K5302
3040G63087O9113j57031j39143J89384P2030j79589k27111R423K12397l4437k0731
3029E57392J52014K7497j6659j16475k2642J96313J12548l9085m4416J4488j8669
3018H02306k38905J11542m8573K37236R1783K5292J06627O1619K11865q7839j95153
3007A077800j41088J23772k63370P2118p5969P6217l1947l4014j31934Q8689j38278
2996F21996J17129r513j74649k05319M7475o6529P5466L2960p5608j78201J05205
2985B90412R6718L3136J57587O2824O9280K5269r3882P8502M9558j58046j0550
$$ y = [728333, 948268, 1091357, 979551, 832558, 739291, 769052, 711739, 712573, 787357, 683666, 633772, 816701, 834154, 572764, 661475, 780671, 675294, 824358, 739186, 756986, 737785, 763087, 832200, 675169, 536026, 725410, 797440, 617851, 390740, 400163, 612560, 578123, 557392, 709406, 736903, 720244, 603769, 581127, 777440, 889988, 850903, 806487, 820975, 802306, 563401, 674943, 626370, 863606, 955389, 980681, 1087308, 1148927, 1360792, 1272953, 1077800, 936712, 1060484, 797114, 869232, 793263, 869480, 837533, 803519, 671585, 760274, 621996, 739125, 729612, 554963, 349644, 397119, 330590, 406056, 439016, 363408, 185207, 290412, 387130, 420266, 577853, 640677, 709957, 735226, 641344, 719846, 769404, 611358, 600808]
2974F00808R2478k70679k99240J48791K15814j2876j04676n1940j6463J6153j14694
2963B03476J19807k2702j23509j91455n8569J32772K3201J95938P6779j49122
2953B06616j32272l6909P772J81552M8062J5952k5023j32895P8845R365k06767
2942A4298o7431k412J24121J33847o4085N376r774n1372m9953J2182p2960K81489
2930B53326j12789p2105P2026L1233m0714R7761j41418l9634J0502k14004n6167
2919b11983J89847K55178j06522K9910j65756l6337J20021R2343M4695q5903o0391
2908F5102j97911o932o5536K06502J18966K1456j17904J19057o1607k1752k39174
2897a79733M6924L28670n5030j57284K48609K3040j30667K0446p109M6821j6604
$$ y = [600808, 693286, 422607, 123367, 272158, 487972, 475096, 370420, 318480, 302017, 318170, 203476, 323283, 300581, 177072, -14383, -72952, 59820, 83021, 278959, 355738, 206616, 74344, 37435, 45207, 226759, 274821, 290773, 265750, 132855, 211700, 221065, 14298, -53133, -55545, 68576, 202423, 138338, 143714, 133940, 82568, 32615, 44797, -28163, 253326, 140537, 68432, 140458, 171691, 130977, 228738, 87320, 47686, 58188, -155816, -211983, -22136, 233042, 126520, 156430, -9326, -45663, 74358, 166701, 211396, 125493, 65102, -132809, -139741, -205277, 1225, 120191, 141647, 23743, 142800, 81193, 59441, -179733, -132809, 195861, 140831, -16453, 232156, 255196, 124529, 144975, 137866, 184687, 168083]
2886A68083q8723j09904M6382j73376J55786J15162q9255K65765j56975k0215
2876A12730R2906j11771P0525J96164k6661k0540o8960j11439o6360J78888q4322
2865A61160j23664K5188j36606q4883L5594K53405P6414r9980k66318J40458o5172
2854h4404M2362J29185K6466L563o2121K27860M5680j66963n090l6134J78938
2843B99342k3045j85921m3765n6103Q9168P7850M6867m9456j29038R7074m8575
2832G4398J32086j37J67799j58950o3761k0876m9037P8928j26325j54251J06927
2821a3199Q1181N2789L3357N6559M7712r6375m6867J5798j0358J22570j33068
2810A10099N5647j77282J08529m6639R9353J25219N5571j36827k58718K28358
$$ y = [168083, 79360, -30544, 15838, -157538, -1752, 113410, 24155, 289920, 132945, 112730, 205636, 93865, 164390, 360554, 333893, 313353, 244393, 132954, 66594, 245482, 161160, 37496, 62684, -73922, -158805, -123211, 130194, 206608, 106628, -159690, -19232, -84404, -42042, 87143, 113609, 117172, 55051, 282911, 328591, 161628, 156538, 120404, 299342, 276297, 90376, 46611, -9492, 79676, 157526, 204393, 154937, 25899, 122973, 74398, 206484, 206347, 374146, 215196, 151435, 130559, 81522, 160450, 34125, -120126, -13199, 67982, 120771, 154128, 210687, 258399, 162024, 115157, 130955, 120597, 243167, 110099, 165746, -11536, 96993, 50354, 149707, 274926, 330497, 193670, -65048, 163310]
2800A63310j73237J49959J55124j75399R741J139r5626m0496O9270J1745l8910
2789C6620J44298O3074o3367l6624Q3416R9691k2310l37451J17785j49619J40187
2778G5700O3439q1638P1323p9028j10770J16412P320N9389j2397R9680Q487k37202
2766a9285R3502Q4408o8925R0230n8749L745m6241J53753n8920p8937L2161m5632
2754H1110P7264k5577j8709J38910j51439j0831J6441r3565n3592J02000r5994
2743c3982P264J9426o577J39433m4384m3553k23278J44875P9961j08629l7126
2732a06570J97622j08540M5171o1167Q8363p3174j28828P4946L6948q4082K057
2721a17254N4903J15252K1406O1125j20176P8749L4897j89258P4145J22932k01745
$$ y = [163310, -9927, 140032, 295156, 119757, 129498, 130637, 35011, -5485, 63785, 75530, 36620, 180918, 243992, 180625, 144001, 227417, 327108, 304798, -32653, 85132, -64487, 75700, 139139, 57501, 128824, 49796, -60974, 55438, 62758, 122147, 109750, 209430, 217917, -19285, 74217, 158625, 89700, 179930, 121181, 124926, 78685, 232438, 173518, 94581, 126742, 81110, 158374, 132797, 114088, 252998, 101559, 90728, 107169, 13604, -39988, 62012, -33982, -26718, -7292, -13869, 125564, 81180, 37627, -185651, -40776, 39185, -69444, -106570, 91052, -17488, 27683, -33484, 54879, -18295, -147123, -72177, -35229, -119311, -117254, -62351, 52901, 74307, 135432, 15256, 94005, 128902, -60356, 13789, 136721, -65024]
2710f5024K465J04974p4502m7412K81804j08473j89483K46390j28261j49974q4377
2699b11873K01548J5665k8040p7792r4307k3406J31335q7283J97470K9691J4623
2688F7631O415o7442o6825j48540k67027J71098R1478J4974J31201l1748R9365
2677E80j12233j4802J07097J11732j27591l0750O8295L3612l7022N2324p3415
2666b2173j74825J00592j22323K40072J06603k05915K2937j91102Q6294J350K45741
2655H7251J50957j12901o3344q0484r2421J36237N9391K6996j97444Q8755o9024
2644f6031k10234P390O6100J86907q952k25948K00262J77852m6799k83820j13952
2633c17225K00523j74339J30890J39601k37429K4219J26114O4232N3872j11177
$$ y = [-65024, -62559, 42415, -32087, -79499, 202305, 93832, -95651, 150739, 22478, -127496, -211873, -10325, 5340, -22700, -100492, -194799, -218205, -86870, -174153, 23317, 53008, 67631, 74046, 6604, -60221, -208761, -475788, -304690, -213212, -198238, -67037, -98785, 580, -111653, -126455, -19358, 92374, -35217, -65967, 2328, 35940, -1082, 51242, -22173, -196998, -96406, -218729, 21343, 127946, -77969, -55032, -246134, -159840, -158490, 87251, 238208, 125307, 61963, -18521, -110942, 25295, 84686, 111682, -85762, 2993, -66031, -276265, -268875, -202775, -15868, -24820, -250768, -50506, 127346, 80547, -203273, -317225, -116702, -291041, -160151, -20550, -257979, -233760, -107646, -43414, 10458, -100719]
2623a00719M8551L2396r8195Q2416K1658j49516J86314j55026J62993J21921k04585
2612e1792K7988O5533k60725J76840O2713J05978N5395k00526N7414n938j27849
2601i4969N4243r0721p0581l0341J02478J64452k49023J76613P5798k52861k74716
2590d89628L798K57801j9749J03757o9888p95J19226M9170q1417Q5237R8969l2530
2578B3951k05173j73172J02841Q4520m9500P5669N3467m7305l1046Q9430p2538
2567a48856j33532J60545k8666M9199q3726L2713k9827J19316J48309j59634l9527
2556a13686J6917l6616P2571j33297J51005o8042J06466J6227m626r4855O5522
2545b2414j00517l5879R8908j18165q6884q167J90169r1853n7539R058J4701j40620
$$ y = [-100719, -52168, -19772, -117967, -35551, -13893, -163409, 22905, -132121, 30872, 152793, -51792, -23804, 41729, -218996, -42156, 20557, 126535, 181930, -18596, 38818, 32880, -94969, -40726, -131447, -202028, -232369, -129891, 34561, -214462, -37849, 37949, -214912, -489628, -485830, -228029, -247778, -144021, -213909, -214704, -95478, -46308, -127725, -42488, 56481, 23951, -181222, -354394, -251553, -167033, -216533, -140864, -87397, -134702, -165748, -76318, -148856, -282388, -121843, -150509, -101310, -185036, -152323, -182150, -62834, 85475, -74159, -113686, -96769, -133385, -60814, -194111, -43106, -111148, -4682, 11545, 6919, -87936, -22414, -122931, -158810, -59902, -178067, -264951, -273118, -82949, -174802, -232341, -223283, -208582, -349202]
2533c49202M9170J00399N7318k3809j5608r0317J62466P6891j00516J07743J88240
2522A62775j19231J1315N3411l2591j5185J6590j79384P8763Q9343k0814l5780
2511I212p4019m7252j00674K00788P3973q2677J2113o5062R4851L5951j87679
2500a30475j0381R568L9247J4076q8101j19963J17871M3260K4491M46M9354Q8983
2488C8376K253j76097O6048L0622N4912p7726o2730m9127p8588M3801J26566k4538
2476a06228L4229P9428p9294J6537j73178m8269J32J57775M3149j15305Q3838
2465a07186P8375K29176j2366k45858n0088L7634J24673K6441l35720j3654O4527
2454b04046M2749o6784l579J12501N4422q3855j7027m2511M3664q557J38592p6103
$$ y = [-349202, -300032, -199633, -142315, -166124, -181732, -272049, -109583, -32692, -133208, -25465, 162775, 43544, 54859, 108270, 75679, 60494, 77084, -102300, -23537, 65806, 44992, 9212, -64807, -112059, -212733, -11945, 62028, -20649, -8536, -73598, 21253, 57204, -130475, -140856, -131288, -92041, -77965, -166066, -286029, -168158, -124898, -100407, -99961, -50607, 38376, 40629, -135468, -69420, -38798, 16114, -61612, -124342, -173469, -252057, -208256, -81690, -106228, -71999, 7429, -71865, -55328, -228506, -276775, -276643, -118868, -75719, -191024, -107186, -28811, 200365, 187999, -57859, -107947, -70313, 54360, 80801, -254919, -268573, -204046, -161297, -228081, -231660, -119159, -64737, -148592, -165619, -208130, -164466, -173023, -34431, -110534]
$$ [...]
##END NTUPLES=NMR SPECTRUM
##END=
