##TITLE=1H_CG-1164
 CDCl3
 8 sc, 
 20.10.2022
##JCAMPDX= 6.0         $$ Bruker NMR JCAMP-DX V2.0
##DATA TYPE= NMR SPECTRUM
##DATA CLASS= NTUPLES
##ORIGIN= UXNMR, Bruker Analytische Messtechnik GmbH
##OWNER= root
$$ XWIN-NMR		Version 3.5
$$ Thu Oct 20 14:39:52 2022 Russian Standard Time (UT+4h)  she@DPX200
##.OBSERVE FREQUENCY= 200.1313499994
##.OBSERVE NUCLEUS= ^1H
##.ACQUISITION MODE= SIMULTANEOUS
##.ACQUISITION SCHEME= undefined
##.AVERAGES= 8
##.DIGITISER RES= 18
##SPECTROMETER/DATA SYSTEM= spect
##.PULSE SEQUENCE= zg30
##.SOLVENT NAME= CDCl3
##.SHIFT REFERENCE= (INTERNAL, CDCl3, 0, 15.7205)
##AUDIT TRAIL= $$ (NUMBER, WHEN, WHO, WHERE, WHAT)
$$ ##TITLE= Audit trail, XWIN-NMR		Version 3.5
$$ ##JCAMPDX= 5.01
$$ ##ORIGIN= Bruker BioSpin GmbH
$$ ##OWNER= she
$$ F:/spectra/data/she/nmr/H-F/1/pdata/1/auditp.txt
$$ ##AUDIT TRAIL=  $$ (NUMBER, WHEN, WHO, WHERE, WHAT)
(   1,<2022-10-20 14:38:24.06 +0400>,<she>,<DPX200>,
      <created by zg, POWCHK disabled, PULCHK disabled
       configuration hash MD5:
       00 E9 B6 7A A2 85 ED C7 34 08 36 98 17 FE 4E 26
       data hash MD5: 16K
       39 07 0E 95 C7 D6 C5 22 CC ED 19 2A 2B 50 01 58>)
(   2,<2022-10-20 14:38:41.82 +0400>,<she>,<DPX200>,
      <Start of raw data processing
       efp BC_mod = 2 LB = 0.24 FT_mod = 6 PKNL = 1 PHC0 = -18033.69 PHC1 = 10.4007 SI = 16K 
       data hash MD5: 16K
       2C 28 F5 7A CD 08 1E CD A5 74 1E 90 4E B1 96 E2>)
(   3,<2022-10-20 14:39:07.95 +0400>,<she>,<DPX200>,
      <pk PHC0 = 2.700287 PHC1 = -3.6 
       data hash MD5: 16K
       99 C3 01 95 48 8C 04 89 B9 6A D6 4C F7 DD C6 63>)
(   4,<2022-10-20 14:39:11.10 +0400>,<she>,<DPX200>,
      <abs ABSG = 5 
       data hash MD5: 16K
       68 D9 59 52 C5 16 49 49 E9 70 5A 5D FA A2 4F 88>)
$$ ##END=
$$ 
$$ hash MD5
$$ E9 BB C2 6B C7 D5 27 31 B3 DE 65 D0 D8 53 80 8F
##$RELAX= 
##$RELAX= 
##$RELAX= 
##$RELAX= 
##$RELAX= 
##$RELAX= 
$$ Bruker specific parameters
$$ --------------------------
##$DU= <F:/spectra>
##$EXPNO= 1
##$NAME= <H-F>
##$PROCNO= 1
##$TYPE= <nmr>
##$USER= <she>
##$AMP= (0..31)
100 100 100 100 100 100 100 100 100 100 100 100 100 100 100 100 100 100 
100 100 100 100 100 100 100 100 100 100 100 100 100 100 
##$AQSEQ= 0
##$AQ_mod= 1
##$AUNM= <au_zg>
##$AUTOPOS= <>
##$BF1= 200.13
##$BF2= 200.13
##$BF3= 200.13
##$BF4= 200.13
##$BF5= 200.13
##$BF6= 200.13
##$BF7= 200.13
##$BF8= 200.13
##$BYTORDA= 1
##$CFDGTYP= 0
##$CFRGTYP= 5
##$CHEMSTR= <none>
##$CNST= (0..31)
1 1 145 1 1 1 1 1 1 1 1 1 1 1 1 1 1 1 1 1 1 1 1 1 1 1 1 1 1 1 1 1 
##$CPDPRG= <>
##$CPDPRG1= <>
##$CPDPRG2= <>
##$CPDPRG3= <>
##$CPDPRG4= <mlev>
##$CPDPRG5= <mlev>
##$CPDPRG6= <mlev>
##$CPDPRG7= <mlev>
##$CPDPRG8= <mlev>
##$CPDPRGB= <>
##$CPDPRGT= <>
##$D= (0..31)
0 1.2 0 0 0 0 0 0 0 0.06 0 0.03 0 0 0 0 0.0002 0 0 0 0 0 0 0 0 0 0 0 0 
0 0 0 
##$DATE= 1666262303
##$DBL= (0..7)
120 120 120 120 120 120 120 120 
##$DBP= (0..7)
150 150 150 150 150 150 150 150 
##$DBP07= 0
##$DBPNAM0= <>
##$DBPNAM1= <>
##$DBPNAM2= <>
##$DBPNAM3= <>
##$DBPNAM4= <>
$$ [...]
##$SUBNAM3= <"">
##$SUBNAM4= <"">
##$SUBNAM5= <"">
##$SUBNAM6= <"">
##$SUBNAM7= <"">
##$SUBNAM8= <"">
##$SUBNAM9= <"">
##$SW= 18.0517283424941
##$SWIBOX= (0..15)
0 0 2 0 0 0 0 0 0 0 0 0 0 0 0 0 
##$SW_h= 3612.71676300578
##$TD= 16384
##$TD0= 1
##$TE= 0
##$TE2= 300
##$TE3= 300
##$TEG= 300
##$TL= (0..7)
0 120 120 120 120 120 120 120 
##$TP= (0..7)
150 150 150 150 150 150 150 150 
##$TP07= 0
##$TPNAME0= <>
##$TPNAME1= <>
##$TPNAME2= <>
##$TPNAME3= <>
##$TPNAME4= <>
##$TPNAME5= <>
##$TPNAME6= <>
##$TPNAME7= <>
##$TPOAL= (0..7)
0.5 0.5 0.5 0.5 0.5 0.5 0.5 0.5 
##$TPOFFS= (0..7)
0 0 0 0 0 0 0 0 
##$TUNHIN= 0
##$TUNHOUT= 0
##$TUNXOUT= 0
##$USERA1= <user>
##$USERA2= <user>
##$USERA3= <user>
##$USERA4= <user>
##$USERA5= <user>
##$V9= 5
##$VALIST= <valist>
##$VCLIST= <CCCCCCCCCCCCCCC>
##$VD= 0
##$VDLIST= <DDDDDDDDDDDDDDD>
##$VPLIST= <PPPPPPPPPPPPPPP>
##$VTLIST= <TTTTTTTTTTTTTTT>
##$WBST= 1024
##$WBSW= 4
##$XGAIN= (0..3)
0 0 0 0 
##$XL= 0
##$YL= 0
##$YMAX_a= 159964
##$YMIN_a= -122121
##$ZGOPTNS= <>
##$ZL1= 120
##$ZL2= 120
##$ZL3= 120
##$ZL4= 120
##$ABSF1= 15.73256
##$ABSF2= -2.319289
##$ABSG= 5
##$ABSL= 3
##$ALPHA= 0
##$AQORDER= 0
##$ASSFAC= 0
##$ASSFACI= 0
##$ASSFACX= 0
##$ASSWID= 0
##$AUNMP= <proc_1d>
##$AZFE= 0.1
##$AZFW= 0.1
##$BCFW= 0
##$BC_mod= 2
##$BYTORDP= 0
##$COROFFS= 0
##$CY= -3
##$DATMOD= 1
##$DC= 0
##$DFILT= <>
##$DTYPP= 0
##$F1P= 0
##$F2P= 0
##$FCOR= 1
##$FTSIZE= 16384
##$FT_mod= 6
##$GAMMA= 0
##$GB= 0
##$INTBC= 1
##$INTSCL= 3.70164e-10
##$ISEN= 128
##$LB= 0.24
##$LEV0= 0
##$LPBIN= 0
##$MAXI= 10000
##$MC2= 0
##$MEAN= 0
##$ME_mod= 0
##$MI= 1.114404
##$NCOEF= 0
##$NC_proc= -8
##$NLEV= 6
##$NOISF1= 3.799351
##$NOISF2= 2.8
##$NSP= 0
##$NTH_PI= 0
##$NZP= 0
##$OFFSET= 15.72045
##$PC= 1
##$PHC0= -18030.99
##$PHC1= 6.8007
##$PH_mod= 1
##$PKNL= yes
##$PPARMOD= 0
##$PSCAL= 0
##$PSIGN= 0
##$REVERSE= no
##$SF= 200.130010224007
##$SI= 16384
##$SIGF1= 3
##$SIGF2= 2
##$SINO= 5.538805
##$SIOLD= 16384
##$SREGLST= <1H.CDCl3>
##$SSB= 0
##$STSI= 16384
##$STSR= 0
##$SW_p= 3612.71676300578
##$SYMM= 0
##$S_DEV= 0
##$TDeff= 16384
##$TDoff= 0
##$TI= <>
##$TILT= no
##$TM1= 0
##$TM2= 0
##$TOPLEV= 0
##$USERP1= <user>
##$USERP2= <user>
##$USERP3= <user>
##$USERP4= <user>
##$USERP5= <user>
##$WDW= 1
##$XDIM= 16384
##$YMAX_p= 324686044
##$YMIN_p= -1252035
$$ End of Bruker specific parameters
$$ ---------------------------------
##NTUPLES= NMR SPECTRUM
##VAR_NAME=  FREQUENCY,     SPECTRUM/REAL,   SPECTRUM/IMAG
##SYMBOL=    X,             R,               I
##VAR_TYPE=  INDEPENDENT,   DEPENDENT,       DEPENDENT
##VAR_FORM=  AFFN,          ASDF,            ASDF
##VAR_DIM=   16384,         16384,           16384
##UNITS=     HZ,            ARBITRARY UNITS, ARBITRARY UNITS
##FACTOR=    0.220516191357247, 1,           1
##FIRST=     3146.1338995394, 0,             0
##LAST=      -466.582863466385, 0,           0
##MIN=       -466.582863466385, -1252035,    0
##MAX=       3146.1338995394, 324686044,     0
$$ Real data points
##PAGE= N=1
##DATA TABLE= (X++(R..R)), XYDATA
$$ [...]
$$ plain form
6142 -335206 -295575 -683609 -560018 -431631 -586743 -79713 -141557 -251406 -372592 118987
6132 118987 434844 342331 -3578 -238746 -320479 -431796 -705250 -437447 223262 309984
6122 309984 267255 231171 161182 -244765 -104824 217420 339067 168958 -277331 -396242
6112 -396242 -72916 -255122 -231526 -121918 -354241 -425394 -434151 -241276 -204482 -500699 -715362
6101 -715362 -445420 25001 66085 -80434 -34751 -139542 298139 203940 -355627 -131492
6091 -131492 8797 227068 305400 382454 -28879 412259 572610 205872 87013 22445
6081 22445 23800 53965 -246294 -23143 -357820 -245826 250474 187735 229864 -66345 145955
6070 145955 286198 580562 591931 443400 105795 -218886 88853 555486 438979 -108444
$$ packed form
6142c35206L9631l88034J23591J28387j55112N07030o1844j09849j21186M91579
6132A18987L15857r2513l45909k35168q1733j11317k73454K67803O60709Q6722
6122C09984m2729l6084o9989m05947J39941L22244J21647j70109m46289j18911
6112c96242L23326j82206K3596J09608k32323p1153q757J92875L6794k96217k14663
6101g15362K69942M70421M1084j46519M5683j04791M37681r4199n59567K24135
6091a31492J40289K18271P8332P7054m11333M41138J60351l66738j18859o4568
6081B2445J355L0165l00259K23151l34677J11994M96300o2739M2129k96209K12300
6070A45955J40243K94364J1369j48531l37605l24681L07739M66633j16507n47423
$$ plain form
6060 -108444 322943 458256 1001432 1014020 473726 422754 484265 174102 451121 408236
6050 408236 430680 289464 454426 284245 570165 501941 66326 297950 -8215 34077
6040 34077 359367 284355 136853 497952 367346 669883 532918 669278 704071 470561
6030 470561 421180 1184238 1151148 1033354 1238885 1301797 1462280 1484224 1605026 1078534
6020 1078534 617252 1005273 1161726 983312 1121655 978241 1200747 919404 331830 802226
6010 802226 601350 873410 819669 494276 838752 928628 505155 295089 396466 572355
6000 572355 987765 503781 603721 1269220 1254804 1470262 1261539 1132286 1262149 1233139
5990 1233139 1306928 1492334 1182313 1197787 1439489 1348186 1600955 1381111 1529783 1066942
$$ packed form
6060a08444M31387J35313N43176J2588n40294n0972O1511l10163K77019m2885
6050D08236K2444j41216J64962j70181K85920o8224m35615K31624l06165M2292
6040C4077L25290p5012j47502L61099j30606L02537j36965J36360L4793k33510
6030D70561m9381P63058l3090j17794K05531O2912J60483K1944J20802n26492
6020A078534m61282L88021J56453j78414J38343j43414K22506k81343n87574M70396
6010H02226k00876K72060n3741l25393L44476Q9876m23473k10066J01377J75889
6000E72355M15410m83984R9940O65499j4416K15458k08723j29253J29863k9010
5990A233139P3789J85406l10021J5474K41702r1303K52769k19844J48672m62841
$$ plain form
5980 1066942 909688 1271296 980204 997151 1451156 1360180 1249275 1086106 1274243 1708536
5970 1708536 1555443 1739703 1551262 1147808 1650565 1680727 1947077 1667272 1291156 1797540
5960 1797540 2078519 2413345 2328549 2008286 2382847 2333121 2377783 1574680 1386661 1416931
5950 1416931 1298914 1141417 1368498 1505637 1418850 1335242 858191 1030993 917377 1174139
5940 1174139 1551529 1810479 1549705 1673150 1605863 1836962 2068507 1708111 1702848 1534812
5930 1534812 1340120 1796958 1871104 2240061 1932438 1699051 1933019 1930419 1417149 1346366
5920 1346366 1432681 1532981 1246243 1060617 1340915 1183057 1056588 1109693 1006528 1501092
5910 1501092 1508085 1177198 1269220 969607 783536 1115062 1445724 1676684 1615978 1858359
$$ packed form
5980A066942j57254L61608k91092J6947M54005r0976j10905j63169J88137M34293
5970A708536j53093J84260j88441m03454N02757L0162K66350k79805l76116N06384
5960A797540K80979L34826q4796l20263L74561m9726M4662q03103j88019L0270
5950A416931j18017j57497K27081J37139q6787q3608m77051J72802j13616K56762
5940A174139L77390K58950k60774J23445o7287K31099K31545l60396n263j68036
5930A534812j94692M56838P4146L68957l07623k33387K33968k600n13270p0783
5920A346366Q6315J00300k86738j85626K80298j57858j26469N3105j03165M94564
5910A501092O993l30887R2022k99613j86071L31526L30662K30960o0706K42381
$$ plain form
5900 1858359 1680243 1804367 1838359 1840509 2023960 1922590 2242382 2124294 1823696 1643939
5890 1643939 1588644 1654451 1803309 1624966 2160296 1843141 1726214 1288007 1011695 1559865
5880 1559865 1671928 1709832 1597067 1696079 1677771 1840813 1604003 2041929 1932810 1673405
5870 1673405 1896889 1728707 1713192 1975685 1863873 1477941 1588533 2030111 1850917 1387582
5860 1387582 1582332 1751694 1793798 2142934 1861541 1649650 1251485 876486 1064437 654286
5850 654286 795507 1005348 1575265 1668830 1480747 601542 972148 1543363 1623932 1897758
5840 1897758 1606560 1592023 1374896 1095990 1156042 972324 1158490 1474566 963240 1027602
5830 1027602 1257039 1147026 1345381 1132098 823329 1096049 1338544 1052648 1475484 1398202
$$ packed form
5900A858359j78116J24124L3992K150J83451j01370L19792j18088l00598j79757
5890A643939n5295O5807J48858j78343N35330l17155j16927m38207k76312N48170
5880A559865J12063L7904j12765R9012j8308J63042k36810M37926j09119k59405
5870A673405K23484j68182j5515K62493j11812l85932J10592M41578j79194m63335
5860A387582J94750J69362M2104L49136k81393k11891l98165l74999J87951m10151
5850F54286J41221K09841N69917R3565j88083q79205L70606N71215Q0569K73826
5840A897758k91198j4537k17127k78906O0052j83718J86166L16076n11326O4362
5830A027602K29437j10013J98355k13283l08769K72720K42495k85896M22836p7282
$$ plain form
5820 1398202 1270258 1269559 917539 726591 961708 796154 1207293 1392949 884818 647507
5810 647507 810505 691912 811306 891760 557124 693224 928172 863774 844192 667068
5800 667068 600420 535443 617614 729521 276719 615692 712716 770667 954952 801110 660943
5789 660943 477781 21561 249099 306998 675378 1065440 874920 957536 815877 159352
5779 159352 108242 186194 143066 609432 827918 594662 1060423 312962 476397 808423
5769 808423 1131802 556399 545038 528426 205174 875431 796150 826301 685035 419681
5759 419681 302750 573992 659961 532857 201833 283702 -46541 63666 590417 752467
5749 752467 850183 443864 638291 339284 256927 640400 626193 1020128 599295 719189
$$ packed form
5820A398202j27944o99l52020j90948K35117j65554M11139J85656n08131k37311
5810F47507J62998j18593J19394Q0454l34636J36100K34948o4398j9582j77124
5800F67068o6648o4977Q2171J11907m52802L38973R7024N7951J84285j53842j40167
5789F60943j83162m56220K27538N7899L68380L90062j90520Q2616j41659o56525
5779A59352n1110P7952m3128M66366K18486k33256M65761p47461J63435L32026
5769H08423L23379n75403j1361j6612l23252O70257p9281L0151j41266k65354
5759D19681j16931K71242Q5969j27104l31024Q1869l30243J10207N26751J62050
5749G52467R7716m06319J94427k99007q2357L83473j4207L93935m20833J19894
$$ plain form
5739 719189 816926 973648 388502 184993 593035 489804 38688 237693 341590 289919
5729 289919 68132 178479 588353 174427 465075 479114 1286322 1386362 1088789 960653
5719 960653 1573126 1794027 1374346 1201624 1490443 1597856 1142334 1087316 584316 590242
5709 590242 397724 44365 316381 889862 1184680 741787 682957 739994 686830 658018
5699 658018 638051 1316904 1255660 1021247 1196450 1614295 1343900 1216064 1407911 840432
5689 840432 45045 -26384 -84056 896609 952733 957823 945786 1022522 883684 364500 498651
5678 498651 1054604 1240044 1044012 1055223 808421 829468 609683 1262411 1142539 1307250
5668 1307250 1508007 1329210 1544241 2016112 2154921 1699005 1426159 1540413 1400268 1283784
$$ packed form
5739G19189R7737J56722n85146k03509M08042j03231m51116J99005J03897n1671
5729B89919k21787J10347M09874m13926K90648J4039Q07208J00040k97573j28136
5719I60653O12473K20901m19681j72722K88819J07413m55522n5018n03000N926
5709E90242j92518l53359K72016N73481K94818m42893n8830N7037n3164k8812
5699F58018j9967O78853o1244k34413J75203M17845k70395j27836J91847n67479
5689H40432p95387p1429n7672R80665N6124N090j2037P6736j38838n19184J34151
5678D98651N55953J85440j96032J1211k46802K1047k19785O52728j19872J64711
5668A307250K00757j78797K15031M71871J38809m55916k72846J14254j40145j16484
$$ plain form
5658 1283784 1138364 1463900 1422263 1391490 1045283 722703 991858 1083020 1550173 1493566
5648 1493566 1054528 599269 794907 1230008 1291061 1223473 1253010 1808732 1807923 1779343 1999223
5637 1999223 2271387 1710839 846574 1079142 1230956 1167284 1230101 1011099 1152110 1240581
5627 1240581 1311199 1341933 1374470 1400239 1490820 1080657 1520094 1619061 1016071 966631 1662630
5616 1662630 1636158 930241 988124 1249882 1395165 1251778 1314752 1427869 1873152 2065351
5606 2065351 1806113 1264193 1749414 1815585 1673232 1758369 1913140 2170474 1933135 1404832
5596 1404832 1116783 1173994 1303541 1517418 1446458 1450324 1237202 1112570 1326144 1382488
5586 1382488 1740700 1700818 1528122 1555752 1928997 1957391 1973609 1677456 1703336 1674669 1370703
$$ packed form
5658A283784j45420L25536m1637l0773l46207l22580K69155R1162M67153n6607
5648A493566m39038m55259J95638M35101O1053o7588K9537N55722q09k8580K19880
5637A999223K72164n60548q64265K32568J51814o3672O2817k19002J41011Q8471
5627A240581P0618L0734L2537K5769R0581m10163M39437R8967o02990m9440O95999
5616A662630k6472p05917N7883K61758J45283j43387O2974J13117M45283J92199
5606B065351k59238n41920M85221O6171j42353Q5137J54771K57334k37339n28303
5596A404832k88049N7211J29547K13877p0960L866k13122j24632K13574N6344
5586A382488L58212l9882j72696K7630L73245K8394J6218k96153K5880k8667l03966
$$ plain form
5575 1370703 1712183 2015938 1856752 1612603 1646558 1989275 1839372 2357644 2096108 1788605
5565 1788605 2197345 2220086 1815780 1873450 1676606 1718239 2153915 2061672 2403030 1766544
5555 1766544 1668254 2656736 2588351 2317670 2216162 2334861 2375575 2587547 2656947 2569311
5545 2569311 2842192 2648247 2738564 2194826 2473714 2740277 2768250 2446210 2135600 2178790
5535 2178790 2658628 2598308 2590712 2373483 2760677 3062278 3215099 3239986 2954676 2893424
5525 2893424 3129467 3156047 3112375 3057005 2955943 3120552 3360562 3179320 3551473 3892471
5515 3892471 3595635 3099274 3196010 3606073 3667841 3785556 3703933 4158473 4080810 3997951
5505 3997951 3728134 3772023 3725036 4162931 4278861 3894429 3810143 4247233 4279522 4182340
$$ packed form
5575A370703L41480L03755j59186k44149L3955L42717j49903N18272k61536l07503
5565A788605M08740K2741m04306N7670j96844M1633M35676r2243L41358o36486
5555A766544r8290R88482o8385k70681j01508J18699M0714K11972O9400q7636
5545B569311K72881j93945R0317n43738K78888K66563K7973l22040l10610M3190
5535B178790M79838o0320p596k17229L87194L01601J52821K4887k85310o1252
5525B893424K36043K6580m3672n5370j01062J64609K40010j81242L72153L40998
5515C892471k96836m96361R6736M10063O1768J17715q1623M54540p7663q2859
5505C997951k69817M3889m6987M37895J15930l84432q4286M37090L2289r7182
$$ plain form
5495 4182340 4098802 4468467 4019895 3707503 3553763 3387207 3301105 3482684 3311512 3469895
5485 3469895 3503138 3945323 3965859 4123005 4115071 3937865 3816589 3973046 4652215 4321214
5475 4321214 4006559 3509309 3851190 3803581 3831927 3868476 4111508 4148474 3755897 3681372
5465 3681372 3480101 3037827 3193132 3513109 3456748 3215695 3322830 3127165 3198472 3410072
5455 3410072 3573548 3741756 3603112 3752403 3649518 3322331 3185079 3393745 3286824 3746361
5445 3746361 4053367 3824011 3826696 3440879 3206506 3047704 2853664 3012254 3517695 2884534
5435 2884534 2760336 3049851 3229797 2897318 3354231 3382402 3201719 3064776 2821672 2868550
5425 2868550 2724329 2888763 3308703 2788110 2621405 2302125 2706721 2781801 2313019 1855382
$$ packed form
5495D182340q3538L69665m48572l12392j53740j66556q6102J81579j71172J58383
5485C469895L3243M42185K0536J57146p934j77206j21276J56457O79169l31001
5475D321214l14655m97250L41881m7609K8346L6549K43032L6966l92577p4525
5465C681372k01271m42274J55305L19977n6361k41053J07135j95665P1307K11600
5455C410072J63476J68208j38644J49291j02885l27187j37252K08666j06921M59537
5445C746361L07006k29356K685l85817k34373j58802j94040J58590N05441o33161
5435B884534j24198K89515J79946l32479M56913K8171j80683j36943k43104M6878
5425B868550j44221J64434M19940n20593j66705l19280M04596P5080m68782m57637
$$ plain form
5415 1855382 1714258 2479044 2523223 2360621 2555993 2673532 2587895 2879235 3248367 3083062
5405 3083062 2775492 2633754 2656980 3187113 2888777 2389502 2883732 3532768 3447194 3146919
5395 3146919 3052419 2896565 2953109 3702661 3185366 3104717 3081887 3096477 3653909 3938127
5385 3938127 3741420 3466934 4072489 3988662 4271316 4902046 5083074 5633314 6447409 7586161
5375 7586161 8591684 9919205 11105381 11364768 11078731 9748897 7769813 7301233 6179708
5366 6179708 5242383 5182104 4930111 4710301 4878389 4412242 4389051 4656233 4235812 4277007
5356 4277007 5208112 5682964 6022682 6444042 7617620 8888669 11044780 12629703 13021947
5347 13021947 12760832 11226454 9165871 7386304 6169151 4918228 4603140 4546387 4224742
$$ packed form
5415A855382j41124P64786M4179j62602J95372J17539q5637K91340L69132j65305
5405C083062l07570j41738K3226N30133k98336m99275M94230O49036q5574l00275
5395C146919r4500j55854N6544P49552n17295q0649k2830J4590N57432K84218
5385C938127j96707k74486O05555q3827K82654O30730J81028N50240Q14095J138752
5375G586161J005523J327521J186176K59387k86037j329834j979084m68580j121525
5366F179708r37325o0279k51993k19810J68088m66147k3191K67182m20421M1195
5356D277007R31105M74852L39718M21360J173578J271049K156111J584923L92244
5347A3021947k61115j534378k060583j779567j217153j250923l15088n6753l21645
$$ plain form
5338 4224742 4378606 4880390 3734854 2792766 2335767 2448343 3274433 3429869 3038002
5329 3038002 2973618 2714988 2704478 2250406 2356668 2403107 2169838 2443882 1921889 1950231
5319 1950231 1939589 2376504 2305193 2009809 2032381 1929283 2038384 1896159 1438154 1678386
5309 1678386 1675972 1741150 2238457 2067267 1940779 1953301 1617379 1282402 1713062 1468116
5299 1468116 1321593 1448078 1996388 1629657 1604634 2106101 1352957 1848670 2309085 1652206
5289 1652206 1860417 1974067 1460821 1367548 1749147 1860660 2042084 1913696 1618992 1721527
5279 1721527 1573023 1539555 1495284 1100222 1360138 1628289 1176918 1201374 1377261 1593321
5269 1593321 1453245 1123999 1235840 1275198 1496352 1776388 1516850 1644446 1906880 2129800
$$ packed form
5338D224742J53864N01784j145536r42088m56999J12576Q26090J55436l91867
5329C038002o4384k58630j0510m54072J06262M6439k33269K74044n21993K8342
5319A950231j0642M36915p1311k95384K2572j03098J09101j42225m58005K40232
5309A678386k414O5178M97307j71190j26488J2522l35922l34977M30660k44946
5299A468116j46523J26485N48310l66731k5023N01467p53144M95713M60415o56879
5289A652206K08211J13650n13246r3273L81599J11513J81424j28388k94704J02535
5279A721527j48504l3468m4271l95062K59916K68151m51371K4456J75887K16060
5269A593321j40076l29246J11841L9358K21154K80036k59538J27596K62434K22920
$$ plain form
5259 2129800 1878405 1794839 1957862 1851506 1830025 2396095 2468655 1847755 1517727 1524407
5249 1524407 1876472 1797462 1745137 1504891 1720775 1837504 1688454 2004101 1978507 1902272
5239 1902272 1772673 1841567 1765219 1568390 1527675 1449584 1518289 1520064 1153075 1342231 1457350
5228 1457350 1307699 1046068 940178 1229223 538449 1191013 1424492 1719606 1032627 754826
5218 754826 1189059 1375767 1209443 1047859 1330790 1770651 1394250 945595 1360007 1818257
5208 1818257 1510704 1214575 1552536 1433033 1323020 912052 1174546 1900518 1554749 1065870
5198 1065870 1139837 1203700 1384482 1749013 1529137 1501452 1209562 1162464 1671963 1946052
5188 1946052 1795758 1495358 1139157 1006296 1128231 1300857 1940268 1995858 1772192 1202369
$$ packed form
5259B129800k51395q3566J63023j06356k1481N66070P2560o20900l30028O680
5249A524407L52065p9010n2325k40246K15884J16729j49050L15647k5594p6235
5239A902272j29599O8894p6348j96829m0715p8091O8705J775l66989J89156J15119
5228A457350j49651k61631j05890K89045o90774O52564K33479K95114o86979k77801
5218G54826M34233J86708j66324j61584K82931M39861l76401m48655M14412M58250
5208A818257l07553k96129L37961j19503j10013m10968K62494P25972l45769m88879
5198A065870P3967O3863J80782L64531k19876k7685k91890m7098N09499K74089
5188A946052j50294l00400l56201j32861J21935J72626O39411N5590k23666n69823
$$ plain form
5178 1202369 1462509 1679913 1844612 2044753 2136188 1954145 1757483 1589810 1376393 1244509
5168 1244509 906421 1234051 1520925 1453350 1197218 1027849 1243863 808342 1500503 1705095
5158 1705095 1567434 1189327 1712403 1169065 1293310 1864041 2052001 2092452 1864449 1482174
5148 1482174 1740778 1761304 1473095 1478831 1310835 1658969 1648815 1666608 1313532 1204012
5138 1204012 1400672 1996865 1801787 1909562 2085801 1755208 1797054 1333910 1264184 1353215
5128 1353215 1522116 1494030 1494106 1379408 1149277 1507383 2118089 2030705 1567174 1693827 1743201
5117 1743201 1826730 2068902 1981454 1937429 1564160 1263429 1551763 1651756 1894429 2012632
5107 2012632 1894770 2012694 2450406 2795856 2700122 2640162 3099126 2766475 2469956 2096505
$$ packed form
5178A202369K60140K17404J64699K00141R1435j82043j96662j67673k13417j31884
5168A244509l38088L27630K86874o7575k56132j69369K16014m35521O92161K04592
5158A705095j37661l78107N23076n43338J24245N70731J87960M0451k28003l82275
5148A482174K58604K0526k88209N736j67996L48134j0154J7793l53076j09520
5138A204012J96660N96193j95078J07775J76239l30593M1846m63144o9726Q9031
5128A353215J68901k8086P6j14698k30131L58106O10706q7384m63531J26653M9374
5117A743201Q3529K42172q7448m4025l73269l00731K88334R9993K42673J18203
5107B012632j17862J17924M37712L45450r5734n9960M58964l32651k96519l73451
$$ plain form
5097 2096505 2086475 2048435 2619773 2464884 2783389 2913968 3020411 3089491 3249850 3179833
5087 3179833 2960829 2806884 3239596 3050555 3014135 3244013 3349124 3784422 3490743 3704368
5077 3704368 3894652 4361408 4314116 4276444 4591069 4796390 4639232 4809381 4779432 4800161
5067 4800161 4752324 4267420 4416633 4998600 4313862 4175550 4594961 4741151 4901767 4765933
5057 4765933 4185469 3987447 4060204 4149448 4177624 3780992 3632127 4168845 4438558 4088813
5047 4088813 3734663 3628980 3662265 3540178 2975743 2781691 2433928 2413292 2495114 2157128
5037 2157128 3151435 3175798 2751912 2739004 3570464 3116669 2618005 2855197 2781722 2289543
5027 2289543 2474579 2831221 2369032 2074873 2534815 2566858 1966891 1863244 2048944 2380959
$$ packed form
5097B096505j0030l8040N71338j54889L18505J30579J06443O9080J60359p0017
5087C179833k19004j53945M32712j89041l6420K29878J05111M35298k93679K13625
5077C704368J90284M66756m7292l7672L14625K05321j57158J70149k9949K0729
5067D800161m7837m84904J49213N81967o84738j38312M19411J46190J60616j35834
5057D765933n80464j98022P2757Q9244K8176l96632j48865N36718K69713l49745
5047D088813l54150j05683L3285j22087n64435j94052l47763k0636Q1822l37986
5037B157128R94307K4363m23886j2908Q31460m53795m98664K37192p3475m92179
5027B289543J85036L56642m62189k94159M59942L2043n99967j03647J85700L32015
$$ plain form
5017 2380959 2481865 2654740 2345722 2152819 2026222 2049864 2071388 2012821 1566277 2016864
5007 2016864 1888523 1444009 1421957 1559106 1573337 1951842 2340039 2522743 2850750 2405822
4997 2405822 2618130 2450073 1839293 2064670 2256664 2515377 2011355 1829640 1843261 1966842
4987 1966842 2041695 1599365 1663427 1405693 1589168 1544214 1202408 1118415 1687910 1566722
4977 1566722 1441328 1965017 2492211 2179459 1799126 2263386 2558739 2544567 2210727 2411905
4967 2411905 2585935 2779568 2282125 2486490 2265877 1636190 1772697 2058300 2098700 2073238
4957 2073238 1644302 1509750 1324957 1941367 1830325 1262538 1500028 2241427 2150509 2020307
4947 2020307 2250057 1748101 2118764 2123782 1996251 1264185 1536758 1786101 1715025 1739993
$$ packed form
5017B380959J00906J72875l09018j92903j26597K3642K1524n8567m46544M50587
5007B016864j28341m44514k2052J37149J4231L78505L88197J82704L28007m44928
4997B405822K12308j68057o10780K25377J91994K58713n04022j81715J3621J23581
4987A966842P4853m42330O4062k57734J83475m4954l41806q3993N69495j21188
4977A566722j25394N23689N27194l12752l80333M64260K95353j4172l33840K01178
4967B411905J74030J93633m97443K04365k20613o29687J36507K85603M0400k5462
4957B073238m28936j34552j84793O16410j11042n67787K37490P41399r0918j30202
4947B020307K29750n01956L70663N018j27531p32066K72573K49343p1076K4968
$$ plain form
4937 1739993 1976360 1941940 1974798 2146075 2130281 1638529 2052886 2274941 2251262 2410807
4927 2410807 2148492 1863382 2101211 2250233 2346760 2273225 1929981 1716669 2271374 2556445
4917 2556445 2189812 1588927 1718133 2071675 1825190 1766995 1607349 1172689 1264946 1528982
4907 1528982 2137968 2406290 1864299 2025506 1896703 2197751 2449761 2141653 1634542 1743932
4897 1743932 1722742 1835706 2023269 2480824 2627292 2902991 2385881 2289101 2619892 2910856
4887 2910856 2781493 2397842 2433884 2565599 2062654 1889736 2304158 2613690 2709137 2838631
4877 2838631 2738384 2493839 2452288 2217356 2572120 3378834 3236431 2633274 2710817 2817492
4867 2817492 2269292 2385060 2412851 2603951 2879650 2662629 2619551 2541426 2448119 2484105
$$ packed form
4937A739993K36367l4420L2858J71277j5794m91752M14357K22055k3679J59545
4927B410807k62315k85110K37829J49022R6527p3535l43244k13312N54705K85071
4917B556445l66633o00885J29206L53542k46485n8195j59646m34660R2257K64036
4907A528982O08986K68322n41991J61207j28803L01048K52010l08108n07111J09390
4897A743932k1190J12964J87563M57555J46468K75699n17110r6780L30791K90964
4887B910856j29363l83651L6042J31715n02945j72918M14422L09532R5447J29494
4877B838631j00247k44545m1551k34932L54764Q06714j42403o03157P7543J06675
4867B817492n48200J15768K7791J91100K75699k17021m3078p8125r3307L5986
$$ plain form
4857 2484105 2453858 2147082 2223683 2222247 2892048 2854982 2729539 2832223 2506627 2140249
4847 2140249 2911094 2884514 2314987 2899081 3169632 3244538 3480062 3719383 3583530 3355758
4837 3355758 3107717 3100896 3367083 3906346 3802573 3753469 3840549 3915253 4290871 4128287
4827 4128287 4104289 4056841 4341207 4267574 4614822 4584977 5015532 5262555 5290414 5171118
4817 5171118 4908011 4920226 5397130 5554295 5452294 5250482 5291733 6085135 6477832 6935129
4807 6935129 7363279 7691927 8922583 10302631 12415270 15118332 17998247 21756380 25756497
4798 25756497 27781773 27623708 24973994 20746292 16826383 13762025 11679314 9953749
4790 9953749 9228824 8348357 8206621 7675585 7448754 7156277 7077705 6208333 5782789 6406640
$$ packed form
4857B484105l0247l06776P6601j436O69801l7066j25443J02684l25596l66378
4847B140249P70845k6580n69527N84094K70551P4906K35524K39321j35853k27772
4837C355758k48041o821K66187N39263j03773m9104Q7080P4704L75618j62584
4827D128287k3998m7448K84366p3633L47248k9845M30555K47023K7859j19296
4817E171118k63107J2215M76904J57165j02001k01812M1251P93402L92697M57297
4807F935129M28150L28648J230656J380048K112639K703062K879915L758133M000117
4798B5756497K025276j58065k649714m227702l919909l064358k082711j725565
4790I953749p24925q80467j41736n31036k26831k92477p8572q69372m25544O23851
$$ plain form
4780 6406640 5939285 5892623 6111100 6128587 5554092 5501755 5482662 5338286 6135574 6322158
4770 6322158 6140335 6054773 6569139 6585775 6302931 5702963 5905317 5633687 5629518 5828929
4760 5828929 5729633 5651180 5304114 5375338 6109249 6674943 6201837 6212883 6639133 7545725
4750 7545725 8009890 9024188 9087117 9132453 9848649 9828786 9039162 8676080 9034111 9203116
4740 9203116 9873496 10575238 11573267 13611361 16286747 19185416 22296643 25773220 27248646
4731 27248646 27123186 26693953 23749056 19826769 17004690 14415356 12075362 10339640
4723 10339640 8826248 7828919 7564742 6946560 6722507 6334428 5924325 5012438 5023296
4714 5023296 4784151 5095025 4979002 4485779 4672010 4621615 4277191 4527506 4938972 4492748
$$ packed form
4780F406640m67355m6662K18477J7487n74495n2337j9093j44376P97288J86584
4770F322158j81823q5562N14366J6636k82844n99968K02354k71630m169J99411
4760E828929r9296p8453l47066P1224P33911N65694m73106J1046M26250R06592
4750G545725M64165J014298O2929M5336P16196j9863p89624l63082L58031J69005
4740I203116O70380P01742R98029K038094K675386K898669L111227L476577J475426
4731B7248646j25460m29233k944897l922287k822079k589334k339994j735722
4723A0339640j513392r97329k64177o18182k24053l88079m10103r11887J0858
4714E023296k39145L10874j16023m93223J86231n0395l44424K50315M11466m46224
$$ plain form
4704 4492748 4087573 3692756 3777345 3702221 3688957 2967266 3493672 3706478 3555936 3448988
4694 3448988 3391542 3213951 3032194 2981489 3054909 3380489 3087907 3208258 3864333 3852428
4684 3852428 3413189 3508604 3344195 2877500 3097759 3127321 3214455 3465848 3441430 3255434
4674 3255434 3483412 2841001 2677149 3172464 3285143 3326648 3633094 3560156 3468812 3229552
4664 3229552 2997621 3662537 4087291 3322870 3635367 3550021 3372364 3686688 3262452 3533354
4654 3533354 3582305 3721734 3286684 3506112 3998397 3902513 3834936 3717877 3889935 4042995
4644 4042995 3618839 3617699 4012727 3911867 4371372 3845698 3360648 3463136 3776928 3875028
4634 3875028 3842789 3890812 4055644 4327758 4624529 4940222 4249791 4208418 4298071 4216258
$$ packed form
4704D492748m05175l94817Q4589p5124j3264p21691N26406K12806j50542j06948
4694C448988n7446j77591j81757n0705P3420L25580k92582J20351O56075j1905
4684C852428m39239R5415j64409m66695K20259K9562Q7134K51393k4418j85996
4674C255434K27978o42411j63852M95315J12679M1505L06446p2938r1344k39260
4664C229552k31931O64916M24754p64421L12497q5346j77657L14324m24236K70902
4654C533354M8951J39429m35050K19428M92285r5884o7577j17059J72058J53060
4644D042995m24156j140L95028j00860M59505n25674m85050J02488L13792R8100
4634C875028l2239M8023J64832K72114K96771L15693o90431m1373Q9653q1813
$$ plain form
4624 4216258 4303973 4740761 5053410 4767874 4414762 4422708 4150427 4739397 4959763 5004830
4614 5004830 4886498 4790505 4780101 4909839 4985028 5103771 5141810 4951831 5080305 5292688
4604 5292688 5036659 4257144 3973981 4282901 4794428 4844068 4657359 4550722 4321772 4539798
4594 4539798 4517178 4497873 4560759 4371997 4819165 4524305 4850751 4785096 4617419 4453471
4584 4453471 4812564 5010368 4767149 5231195 5864672 6850941 6741352 6837382 7216830 7487452
4574 7487452 7130042 6667149 6400151 6161910 5988467 6697733 6691474 7070912 7879584 8202533
4564 8202533 7838447 7118769 7073226 6930194 6538781 6492051 6649600 6697898 7168592 7640757
4554 7640757 7950200 7837191 7599414 7271025 6955834 6997538 6977385 7306568 7003066 7598805
$$ packed form
4624D216258Q7715M36788L12649k85536l53112P946k72281N88970K20366M5067
4614E004830j18332r5993j0404J29738P5189J18743L8039j89979J28474K12383
4604E292688k56029p79515k83163L08920N11527M9640j86709j06637k28950K18026
4594D539798k2620j9305O2886j88762M47168k94860L26446o5655j67677j63948
4584D453471L59093J97804k43219M64046O33477R86269j09589R6030L79448K70622
4574G487452l57410m62893k66998k38241j73443P09266o259L79438Q08672L22949
4564H202533l64086p19678m5543j43032l91413m6730J57549M8298M70694M72165
4554G640757L09443j13009k37777l28389l15191M1704k0153L29183l03502N95739
$$ plain form
4544 7598805 7797682 7949618 8203238 7993637 7751291 7163668 6567889 6439012 6359549 5674018
4534 5674018 5620378 5873135 5874115 5561223 5654882 5304082 5298048 5716460 6250427 5741395 5743940
4523 5743940 6276702 6453729 6107773 6468786 6557119 6412731 6761605 6764487 6823212 6453509
4513 6453509 6401737 6699436 7098913 7322641 7082185 7137093 7079650 7101374 7320802 7624394
4503 7624394 7272862 7277846 6970005 7497965 7766718 7934429 7328864 6628113 7085788 7244909
4493 7244909 7194641 7013208 7515095 7468943 7314768 7892417 8003147 7818196 7735929 7619528
4483 7619528 7328605 7604535 7860234 8436347 8462921 7931107 8411422 8010002 7862011 8258408
4473 8258408 8276282 7990664 7804353 7838371 7887120 7981778 8105637 7909263 8065721 7967395
$$ packed form
4544G598805J98877J51936K53620k09601k42346n87623n95779j28877p9463o85531
4534E674018n3640K52757R80l12892R3659l50800o034M18412N33967n09032K545
4523E743940N32762J77027l45956L61013Q8333j44388L48874K882N8725l69703
4513F453509n1772K97699L99477K23728k40456N4908n7443K1724K19428L03592
4503G624394l51532M984l07841N27960K68753J67711o05565p00751M57675J59121
4493G244909n0268j81433N01887m6152j54175N77649J10730j84951q2267j16401
4483G619528k90923K75930K55699N76113K6574n31814M80315m01420j47991L96397
4473H258408J7874k85618j86311L4018M8749R4658J23859j96374J56458r8326
$$ plain form
4463 7967395 7850334 8087822 8129368 8667060 8537045 8718806 9629858 9938340 10220278 10600605
4453 10600605 11736753 12245550 12898840 13856492 14359174 14538423 14357399 12906781 11673614
4444 11673614 11140602 10177908 9683435 9490964 9282501 9105913 9133280 8743137 8154462 8436676
4434 8436676 8225550 7864393 7401998 7011616 7217155 7154745 7161685 7516147 7011570 6684132
4424 6684132 7052427 6615957 6715965 6510471 6499864 6813336 6992730 7017126 6719601 7403783
4414 7403783 7432115 6866507 6945295 6954799 6763344 6652279 6533240 6763434 6635061 6349373
4404 6349373 6446022 6509914 6412027 6484838 6829979 6798065 6365069 6217910 6720917 6652534 6654376
4393 6654376 6866694 6511344 6346800 6171326 6541347 6599037 6626980 6531826 6723656 6649097
$$ packed form
4463G967395j17061K37488M1546N37692j30015J81761R11052L08482K81938L80327
4453A0600605J136148N08797O53290R57652N02682J79249j81024j450618j233167
4444A1673614n33012r62694m94473j92471k08463j76588K7367l90143n88675K82214
4434H436676k11126l61157m62395l90382K05539o2410O940L54462n04577l27438
4424F684132L68295m36470J00008k05494j0607L13472J79394K4396k97525O84182
4414G403783K8332n65608P8788R504j91455j11065j19039K30194j28373k85688
4404F349373R6649O3892r7887P2811L45141l1914m32996j47159N03007o8383J842
4393F654376K12318l55350j64544j75474L70021N7690K7943r5154J91830p4559
$$ plain form
4383 6649097 7120685 7309018 7013867 6355111 6265681 6668014 6753614 7579258 6989609 6896629
4373 6896629 6713985 6924266 6780755 6495492 6177864 5809419 6086245 6487058 6642669 6359768
4363 6359768 6524483 6608204 6557894 6459112 6824762 7322334 7545038 7559000 6825519 6421268
4353 6421268 6739213 6676663 6804349 6664812 6193203 6202197 5930138 5814327 5931454 5913483
4343 5913483 6202186 5758504 5927601 5987954 5987853 6241369 5678373 6161031 5864230 5774285
4333 5774285 6089055 6059586 6615541 6599006 6698476 6269898 5925575 5865931 5889141 5760210
4323 5760210 5592666 5605781 5663986 5740316 5914608 5858222 5361731 5454493 5132800 5339599
4313 5339599 5686520 5659222 5645112 5597567 5728304 5411795 5389609 5098571 5253575 5385443
$$ packed form
4383F649097M71588J88333k95151o58756q9430M02333Q5600Q25644n89649r2980
4373F896629j82644K10281j43511k85263l17628l68445K76826M00813J55611k82901
4363F359768J64715Q3721n0310r8782L65650M97572K22704J3962p33481m04251
4353F421268L17945o2550J27686j39537m71609Q994k72059j15811J17127j7971
4343E913483K88703m43682J69097O0353j01K53516n62996M82658k96801q9945
4333E774285L14770k9469N55955j6535R9470m28578l44323n9644K3210j28931
4323E760210j67544J3115N8205P6330J74292n6386m96491R2762l21693K06799
4313E339599L46921k7298j4110m7545J30737l16509k2186k91038J55004J31868
$$ plain form
4303 5385443 5326622 5497122 5862421 6124981 6009103 6186415 6496500 6338056 6083309 6484733
4293 6484733 6683862 6754733 6852392 6776623 7211172 7978847 8700567 9572771 10499875 11575597
4283 11575597 12181318 12930381 12459639 11073567 10015696 9214682 8213117 7961865 7500077
4274 7500077 7225885 7668395 7473522 7282479 7491282 7394232 7100817 6792095 6429892 6373443
4264 6373443 6588878 7195561 7470493 7460550 7793083 7861661 9008438 10003017 11057844 11287370
4254 11287370 10037259 8771807 8366480 7919986 7644604 8237443 7963948 7651486 7339436
4245 7339436 7541094 6761511 6541894 6862562 7304495 7837266 7535700 7685439 7413258 7432662
4235 7432662 7497554 7732083 7837886 8318600 8558095 8547447 8645411 8359953 8215231 8521936
$$ packed form
4303E385443n8821J70500L65299K62560j15878J77312L10085j58444k54747M01424
4293F484733J99129P0871R7659p5769M34549P67675P21720Q72204R27104J075722
4283A1575597O05721P49063m70742j386072j057871q01014j001565k51252m61788
4274G500077k74192M42510j94873j91043K08803r7050k93415l08722l62203n6449
4264F373443K15435O06683K74932r943L32533O8578J146777R94579J054827K29526
4254A1287370j250111j265452m05327m46494k75382N92839k73495l12462l12050
4245G339436K01658p79583k19617L20668M41933N32771l01566J49739k72181J9404
4235G432662O4892K34529J05803M80714K39495j0648R7964k85458j44722L06705
$$ plain form
4225 8521936 8625265 8884985 8819916 8512678 8551430 8702865 8479904 9070734 9482200 9628996
4215 9628996 10220750 9704054 9675656 9851929 9653878 10000702 10442818 10451326 10685964 10219123
4205 10219123 10277124 10491327 10410301 11066920 11094577 11100538 11682245 11552703 12033040 12073608
4195 12073608 12377307 12309347 12648348 12898852 13371974 13457765 13828019 14138663 14693372 14989659
4185 14989659 15634635 16081685 16163803 16613221 17502254 18823382 19179768 20190168 21890630
4176 21890630 23456260 26162092 30135147 35394668 42552607 50801669 58159450 60154105
4168 60154105 55624699 47479596 39927725 34899345 31108880 28057869 26098565 24812195
4160 24812195 23574430 22153793 20657396 19201968 17426427 16204409 15111916 14341319
$$ packed form
4225H521936J03329K59720o5069l07238L8752J51435k22961N90830M11466J46796
4215I628996N91754n16696k8398J76273j98051L46824M42116Q508K34638m66841
4205A0219123N8001K14203q1026O56619K7657N961N81707j29542M80337M0568
4195A2073608L03699o7960L39001K50504M73122Q5791L70254L10644N54709K96287
4185A4989659O44976M47050Q2118M49418Q89033J321128L56386J010400J700462
4176B1890630J565630K705832L973055N259521P157939Q249062P357781J994655
4168F0154105m529406q145103p551871n028380l790465l051011j959304j286370
4160B4812195j237765j420637j496397j455428j775541j222018j092493p70597
$$ plain form
4152 14341319 13625532 12766114 12369176 12291494 12034030 11220807 11012949 10863742 11310318 11228038
4142 11228038 9980091 9623473 9741270 9633835 9018102 8796662 9223001 9239744 9208377 8809632
4132 8809632 8897732 8527669 8725252 8747078 8770379 8530637 8912918 9310792 9314915 9989514
4122 9989514 10950022 11308085 10961892 10369796 9667475 9033769 8784983 8828002 8320827 7711683
4112 7711683 6708855 6866401 7416041 7146274 7101226 7119009 6717763 6500975 6887728 6076853
4102 6076853 5951541 6107180 6065700 5981712 5669182 5608865 5662195 5763162 5452016 5562187
4092 5562187 5549283 5573966 5372961 5360451 4979672 5112518 5435506 4921173 4628345 4486113
4082 4486113 4607115 4515002 4913178 4837645 4218141 4740543 5205174 4734248 4378908 4524338
$$ packed form
4152A4341319p15787q59418l96938p7682k57464q13223k07858j49207M46576q2280
4142A1228038j247947l56618J17797j07435o15733k21440M26339J6743l1367l98745
4132H809632Q8100l70063J97583K1826K3301k39742L82281L97874M123O74599
4122I989514R60508L58063l46193n92096p02321o33706k48786M3019n07175o09144
4112G711683j002828J57546N49640k69767m5048J7783m01246k16788L86753q10875
4102F076853j25312J55639m1480q3988l12530o0317N3330J00967l11146J10171
4092E562187j2904K4683k01005j2510l80779J32846L22988n14333k92828j42232
4082D486113J21002r2113L98176p5533o19504N22402M64631m70926l55340J45430
$$ plain form
4072 4524338 4748649 4601536 4508720 4496133 5046732 4604736 4593037 4333696 4265015 4166253
4062 4166253 4125036 3677434 4086310 4246338 4420610 4148203 4009568 4169824 3857656 4058891
4052 4058891 3973626 3987601 3831988 4196755 4004917 3941966 4301875 4414848 4024424 4084346
4042 4084346 4148979 4057203 3972482 3923803 3890448 3557411 3892466 4232844 3754576 3753291 3720660
4031 3720660 3916558 3561637 3857982 3852505 3987779 3993975 3893271 3986284 4025984 3931294 3844099
4020 3844099 3880575 4346604 4434579 4606540 4252521 4296054 4160029 4244638 4684225 4405717
4010 4405717 3981476 4238696 4229282 4602348 4231193 4275594 4284135 4600211 4670432 4860161 5289816
3999 5289816 5387694 5663416 5470613 5220329 4833192 5058800 4974055 4853659 4993827 5694538
$$ packed form
4072D524338K24311j47113r2816j2587N50599m41996j1699k59341o8681r8762
4062D166253m1217m47602M08876J60028J74272k72407j38635J60256l12168K01235
4052D058891q5265J3975j55613L64767j91838o2951L59909J12973l90424N9922
4042D084346O4633r1776q4721m8679l3355l33037L35055L40378m78268j285l2631
4031C720660J95898l54921K96345n477J35274O196j00704R3013L9700r4690q7195
4020C844099L6476M66029Q7975J71961l54019M3533j36025Q4609M39587k78508
4010D405717m24241K57220r414L73066l71155M4401Q541L16076P0221J89729M29655
3999E289816R7878K75722j92803k50284l87137K25608q4745j20396J40168P00711
$$ plain form
3989 5694538 5625737 5392169 5384961 5203336 4830673 4672480 4784208 4954463 5360961 5339929
3979 5339929 5285941 5451368 5828297 5894073 5842647 5676345 5660024 6259313 6178581 6012683
3969 6012683 5177982 5165642 5269385 5358547 5874983 6094313 6088970 5805674 5402042 5726881
3959 5726881 5473187 5863716 6392080 6142671 5873577 5788889 6272458 6382110 6056157 5953436
3949 5953436 6518712 6543493 6146524 6168332 5934604 5920738 6009983 5781688 6084096 6026628
3939 6026628 6199908 6728162 6226520 6206935 6432380 6712853 6291878 6322180 6578035 6301011
3929 6301011 5813849 6202078 6753859 6390328 5522189 5727261 5992862 6082144 6432109 6173981
3919 6173981 6119630 6047144 6395692 6714925 6877903 6697157 6780237 6592061 6219151 6527686
$$ packed form
3989E694538o8801k33568p208j81625l72663j58193J11728J70255M06498k1032
3979E339929n3988J65427L76929O5776n1426j66302j6321N99289q0732j65898
3969F012683q34701j2340J03743Q9162N16436K19330n343k83296m03632L24839
3959E726881k53694L90529N28364k49409k69094q4688M83569J09652l25953j02721
3949E953436N65276K4781l96969K1808k33728j3866Q9245k28295L02408n7468
3939F026628J73280N28254n01642j9585K25445K80473m20975L0302K55855k77024
3929F301011m87162L88229N51781l63531q68139K05072K65601Q9282L49965k58128
3919F173981n4351p2486L48548L19233J62978j80746Q3080j88176l72910L08535
$$ plain form
3909 6527686 6513419 6836966 6758963 6543322 6850714 6923862 6434529 6409988 6429633 6692056
3899 6692056 6782603 6735692 7444169 7429649 6956794 6851008 7039154 6766953 6901119 7071046
3889 7071046 7034966 7052137 6878310 6891916 6774685 7138402 7520907 7455920 7147848 7367796
3879 7367796 7671378 7492164 7443329 7281700 7278970 7373323 7281091 6835895 7069584 7590942
3869 7590942 7619097 8088703 8245014 7783050 7801393 7622479 7607197 8268059 8486769 8068354
3859 8068354 8013340 7811852 7348510 7630062 8008812 8414182 8190707 7599523 7737122 7816383
3849 7816383 8022683 7856541 7770422 7572690 8246407 8004599 8284130 8226246 8263592 8646117
3839 8646117 8856439 8400788 8701543 8762485 8716476 8722674 7873148 8296908 8370206 8781664
$$ packed form
3909F527686j4267L23547p8003k15641L07392P3148m89333k4541J9645K62423
3899F692056R0547m6911P08477j4520m72855j05786J88146k72201J34166J69927
3889G071046l6080J7171j73827J3606j17231L63717L82505o4987l08072K19948
3879G367796L03582j79214m8835j61629k730R4353r2232m45196K33689N21358
3869G590942K8155M69606J56311m61964J8343j78914j5282O60862K18710m18415
3859H068354n5014k01488m63342K81552L78750M05370k23475n91184J37599P9261
3849G816383K06300j66142q6119j97732O73717k41808K79531n7884L7346L82525
3839H646117K10322m55651L00755O0942m6009O198q49526M23760P3298M11458
$$ plain form
3829 8781664 9126009 9073148 8898286 8782012 8938154 9262982 9241391 9848496 9679921 9636124
3819 9636124 10014154 9459348 9729982 10314655 10150877 10800005 11592720 12110624 12440995 12732857
3809 12732857 12704966 12344937 12187036 11880598 11673527 11079013 11024100 11242753 10750925 10904544
3799 10904544 10948549 10504781 10771593 10741209 10872872 10473445 10501688 10653915 11121318 11506346
3789 11506346 10775117 10750304 11603178 12418731 12102375 12235417 12712999 13447287 13552107 13752811
3779 13752811 13904534 13896106 13559270 12930123 12829028 12458000 11826439 11617285 11354863 11435736
3769 11435736 11641438 11769992 11815214 11794302 11949138 12239045 12149308 12064042 12495492 12484457
3759 12484457 12469752 12388737 12775728 13037157 12522459 12964066 12960517 12682208 12596820 12951965
$$ packed form
3829H781664L44345n2861j74862j16274J56142L24828k1591O07105j68575m3797
3819I636124L78030n54806K70634N84673j63778O49128P92715N17904L30371K91862
3809A2732857k7891l60029j57901l06438k07071n94514n4913K18653m91828J53619
3799A0904544M4005m43768K66812l0384J31663l99427K8243J52227M67403L85028
3789A1506346p31229k4813Q52874Q15553l16356J33042M77582P34288J04820K00704
3779A3752811J51723q428l36836o29147j01095l71028o31561k09154k62422Q0873
3769A1435736K05702J28554M5222k0912J54836K89907q9737q5266M31450j1035
3759A2484457j4705q1015L86991K61429n14698M41607l549k78309q5388L55145
$$ plain form
3749 12951965 13365696 13056933 12574611 13096264 13230969 13359196 13568864 13587227 13581913 13253451
3739 13253451 13788531 13598104 13721382 13933491 14189185 13789111 13671958 13862428 14345029
3730 14345029 14637450 14777993 15116008 15327649 14914224 14922231 15568339 15983321 16124229 16033125
3720 16033125 16581274 16726832 16945462 17667334 18662553 18996260 19283675 19557885 20005814
3711 20005814 20185827 20090044 20218781 19631097 19123691 18964833 18685695 18545617 18384962 17985877
3701 17985877 18228348 18580144 18742497 18312188 18621190 18706728 19132099 19790605 19811013 19863005
3691 19863005 19774199 19867998 19942721 20146780 20324874 19821494 20026371 20350930 20458991 20510600
3681 20510600 20395715 20983486 20972013 20889365 20786139 20937235 21027369 21160228 21064670 21528860
$$ packed form
3749A2951965M13731l08763m82322N21653J34705J28227K09668J8363n314l28462
3739A3253451N35080j90427J23278K12109K55694m00074j17153J90470M82601
3730A4345029K92421J40543L38015K11641m13425Q007O46108M14982J40908r1104
3720A6033125N48149J45558K18630P21872R95219L33707K87415K74210M47929
3711B0005814J80013r5783J28737n87684n07406j58858k79138j40078j60655l99085
3701A7985877K42471L51796J62353m30309L09002Q5538M25371O58506K0408N1992
3691A9863005q8806R3799P4723K04059J78094n03380K04877L24559J08061N1609
3681B0510600j14885N87771j1473q2648j03226J51096R0134J32859r5558M64190
$$ plain form
3671 21528860 21746511 21926313 21538530 21384891 21854594 22108493 22353210 22805984 22909894
3662 22909894 22724970 22937492 22763427 23161850 23874126 24628887 25495876 25636309 25658744 26496868
3652 26496868 26704048 26411827 25434196 24700706 24759973 24272000 24506341 24496075 24349874 23981658
3642 23981658 24048934 24402690 24349386 24601402 25075432 24917437 24412169 24369477 24990640 25151250
3632 25151250 24406670 24453572 24571549 24866791 25074284 25055093 25246656 25280033 25709445 25705305
3622 25705305 25476553 26018461 25583212 25414127 25759216 25602039 25289751 25685912 26074867
3613 26074867 26002980 26224567 25954010 25542679 26050510 26609682 26556375 26368310 26478889 27083938
3603 27083938 27257076 27062341 27453346 27621468 27696548 27742247 27820774 27728219 27999270 28651277
$$ packed form
3671B1528860K17651J79802l87783j53639M69703K53899K44717M52774J03910
3662B2909894j84924K12522j74065L98423P12276P54761Q66989J40433K2435Q38124
3652B6496868K07180k92221r77631p33490N9267m87973K34341j0266j46201l68216
3642B3981658O7276L53756n3304K52016M74030j57995n05268m2692O21163J60610
3632B5151250p44580M6902J17977K95242K07493j9191J91563L3377M29412m140
3622B5705305k28752N41908m35249j69085L45089j57177l12288L96161L88955
3613B6074867p1887K21587k70557m11331N07831N59172n3307j88065J10579O05049
3603B7083938J73138j94735L91005J68122P5080M5699P8527r2555K71051O52007
$$ plain form
3593 28651277 28576900 28733968 28545429 28852583 29283240 29832652 29993125 30142127 30523892 31089939
3583 31089939 31501536 31566115 31799856 32055315 32871757 32914591 32793964 33388514 34163813 34554402
3573 34554402 35296888 35441953 36027295 36484436 36882923 37158592 37652435 38607727 39228840
3564 39228840 39592377 40133271 40164566 40392512 40557263 41090509 41700794 41641222 42204434 42153381
3554 42153381 41665134 41783772 41610245 41952732 41775656 41020686 40630948 40118098 39573380
3545 39573380 39227457 39006072 38498134 38459727 37904692 37276073 36893542 36506861 36402218 36328018
3535 36328018 35967263 35851394 35736742 35374699 34848173 34291214 34220047 34013539 33560685 33387305
3525 33387305 33325483 33051690 32664469 32749091 32127560 32265465 31899785 31791308 31819190 31641711
$$ packed form
3593B8651277p4377J57068j88539L07154M30657N49412J60473J49002L81765N66047
3583C1089939M11597O4579K33741K55459Q16442M2834j20627N94550P75299L90589
3573C4554402P42486J45065N85342M57141L98487K75669M93843R55292O21113
3564C9228840L63537N40894L1295K27946J64751N33246O10285n9572N63212n1053
3554D2153381m88247J18638j73527L42487j77076p54970l89738n12850n44718
3545C9573380l45923k21385n07938l8407n55035o28619l82531l86681j04643p4200
3535C6328018l60755j15869j14652l62043n26526n56959p1167k06508m52854j73380
3525C3387305o1822k73793l87221Q4622o21531J37905l65680j08477K7882j77479
$$ plain form
3515 31641711 31466316 30679045 30696456 30992215 31277652 31082010 31124595 31024169 30572685 30913673
3505 30913673 30844796 30596213 30760013 30571446 30570348 30561621 30202715 30509023 30813403 30814837 30358666
3494 30358666 30183193 30423136 30342834 30276818 30616026 30773362 30137088 30151049 30612664 30171968
3484 30171968 29823911 30112548 30559988 30735320 30699685 30555994 30665579 30984667 30514417 30113009
3474 30113009 30785467 30881165 30613661 30670700 31136677 31165363 30816867 30589144 30920725 30976948
3464 30976948 31113843 30855297 30428468 31166630 31684623 31862614 32108710 31840267 31648177
3455 31648177 32158745 31858691 31711379 32370167 32244917 31923354 32414852 33024237 33269879
3446 33269879 32648083 32321455 32116104 32279399 32322721 32918396 33183026 32751047 32882430 33274028
$$ packed form
3515C1641711j75395p87271J7411K95759K85437j95642M2585j00426m51484L40988
3505C0913673o8877k48583J63800j88567j098q727l58906L06308L04380J434m56171
3494C0358666j75473K39943q0302o6016L39208J57336o36274J3961M61615m40696
3484C0171968l48057K88637M47440J75332l5635j43691J09585L19088m70250m01408
3474C0113009O72458R5698k67504N7039M65977K8686l48496k27723L31581N6223
3464C0976948J36895k58546m26829P38162N17993J77991K46096k68443j92090
3455C1648177N10568l00054j47312O58788j25250l21563M91498O09385K45642
3446C3269879o21796l26628k05351J63295M3322N95675K64630m31979J31383L91598
$$ plain form
3436 33274028 33227760 33441198 33896510 34466280 34098410 34001825 34372895 34701280 34946058 35249861
3426 35249861 35752143 36563213 36465262 36423973 36136484 35772368 35764425 35615294 36272657 36528175
3416 36528175 37086372 37284643 37783186 38125071 38314919 38849459 39184085 39173895 39169693 38948370
3406 38948370 38543816 38658542 38457604 38179236 38904808 39248442 39092746 39693460 40276161
3397 40276161 40399013 40250574 39917163 40204882 40457701 40667834 40959086 40632061 40525803
3388 40525803 41082823 41722118 42336096 42490143 42048055 42139873 42082526 42313540 42817283 42813121
3378 42813121 43395614 43656063 43446170 43910793 44149795 44392096 45516592 45841558 46775683
3369 46775683 47404858 47917482 49309992 50551374 51778157 52423846 53119757 53673011 52993906
$$ packed form
3436C3274028m6268K13438M55312N69770l67870r6585L71070L28385K44778L03803
3426C5249861N02282Q11070r7951m1289k87489l64116p943j49131O57363K55518
3416C6528175N58197J98271M98543L41885J89848N34540L34626j0190m202k21323
3406C8948370m04554J14726k00938k78368P25572L43634j55696O00714N82701
3397D0276161J22852j48439l33411K87719K52819K10133K91252l27025j06258
3388D0525803N57020O39295O13978J54047m42088R1818n7347K31014N03743m162
3378D2813121N82493K60449k09893M64623K39002K42301J124496L24966R34125
3369D6775683O29175N12624J392510J241382J226783O45689O95911N53254o79105
$$ plain form
3360 52993906 52244922 52048311 51926236 51534451 51483138 52246287 52615255 52434013 52084980 51798099
3350 51798099 52469212 52893658 53974723 54506113 54309456 54932182 55211849 55943438 56274123
3341 56274123 57083217 57897198 58178304 58464397 59323860 60116238 60953813 61453940 62026902
3332 62026902 62845774 63522416 64450567 65864265 66873381 67469366 68226582 68930785 69894706
3323 69894706 70733580 71350166 71825695 72439452 73087722 74469537 75442117 76649160 77852315
3314 77852315 78511142 79013219 79933930 80707071 81732283 83853327 84783160 85545720 86856696
3305 86856696 87782180 89365349 90243338 91354074 92181820 93602334 94962702 96601412 98006583
3296 98006583 99260603 100620475 102119374 104056168 105125910 107271178 110162605 113110331
$$ packed form
3360E2993906p48984j96611j22075l91785n1313P63149L68968j81242l49033k86881
3350E1798099O71113M24446J081065N31390j96657O22726K79667P31589L30685
3341E6274123Q09094Q13981K81106K86093Q59463P92378Q37575N00127N72962
3332F2026902Q18872O76642R28151J413698J009116N95985P57216P04203R63921
3323F9894706Q38874O16586M75529O13757O48270J381815R72580J207043J203155
3314G7852315O58827N02077R20711P73141J025212K121044R29833P62560J310976
3305H6856696R25484J583169Q77989J110736Q27746J420514J360368J638710J405171
3296I8006583J254020J359872J498899J936794J069742K145268K891427K947726
$$ plain form
3288 113110331 115129264 117786192 120664034 123629647 126834993 129936399 131936459 134117737
3280 134117737 135749851 138229014 140682338 142744573 146006131 149682379 153185456 156983544
3272 156983544 161212161 167031709 173787793 180806715 188448161 196986494 206581076 217043252
3264 217043252 228295974 240946659 253942139 267567143 281540197 294535154 306388332
3257 306388332 315911442 322767944 324686044 321513526 311831067 296392926 277675912 258790313
3249 258790313 241106520 226167498 213419048 201035026 190594366 181759388 174111363
3242 174111363 167078608 160517319 154828096 149498890 144229430 139417590 135290791 131845228
3234 131845228 128751063 125857970 123190879 120786251 118206767 115552018 113276986 111003744
$$ packed form
3288A13110331K018933K656928K877842K965613L205346L101406K000060K181278
3280A34117737J632114K479163K453324K062235L261558L676248L503077L798088
3272A56983544M228617N819548O756084P018922P641446Q538333R594582J0462176
3264B17043252J1252722J2650685J2995480J3625004J3973054J2994957J1853178
3257C06388332R523110O856502J918100l172518r682459j5438141j8717014j8885599
3249B58790313j7683793j4939022j2748450j2384022j0440660q834978p648025
3242A74111363p032755o561289n689223n329206n269460m811840m126799l445563
3234A31845228l094165k893093k667091k404628k579484k654749k275032k273242
$$ plain form
3226 111003744 108997666 106974113 105250638 103228460 100876697 99645813 98190156 95920559
3218 95920559 94404398 92366021 91034940 89253187 87280107 85617431 84290761 82993587
3210 82993587 81803683 80798033 79715258 78405084 77217422 75762108 74760994 74080382
3202 74080382 73256301 72561210 71890822 70841943 70011082 69925696 68809902 67696838 67526165
3193 67526165 67026039 66141332 65675740 65172403 64151516 62844020 62376651 61833318 61398063
3184 61398063 60946054 59762550 59426156 59203420 58813125 58054244 57046648 56306480 56007102
3175 56007102 55726344 55162585 55149292 54216133 53439771 53083214 52809161 52610258 52689042 52181483
3165 52181483 50972372 50932240 51204973 51090289 50653788 50239604 50756418 50433806 49892313
$$ packed form
3226A11003744k006078k023553j723475k022178k351763j230884j455657k269597
3218I5920559j516161k038377j331081j781753j973080j662676j326670j297174
3210H2993587j189904j005650j082775j310174j187662j455314j001114o80612
3202G4080382q24081o95091o70388j048879q30861q5386j115794j113064j70673
3193F7526165n00126q84707m65592n03337j020887j307496m67369n43333m35255
3184F1398063m52009j183504l36394k22736l90295p58881j007596p40168k99378
3175E6007102k80758n63759j3293r33159p76362l56557k74053j98903P8784n07559
3165E2181483j209111m0132K72733j14684m36501m14184N16814l22612n41493
$$ plain form
3156 49892313 49427028 48980121 48569396 48308056 47994407 47497900 47144558 46909688 46780470
3147 46780470 45937147 45595498 45505331 44955218 44499536 44414131 43980585 43864449 43450711 43142685
3137 43142685 43045239 42221086 41895094 41941202 41813302 41765737 41493207 41554017 41689301 41108825
3127 41108825 40975347 40956301 40862778 39990039 40007493 39766534 39624175 39522828 38958034 38469040
3117 38469040 38576752 38754039 38247784 37861335 37781478 37192298 37352993 37453398 37264973 37079773
3107 37079773 36603630 36569342 36796218 36587436 36358925 36351207 36317899 36024256 36053810 36124630
3097 36124630 35652481 35710389 36341570 35764628 35795818 35800030 35342058 35355902 35053734 35102737
3087 35102737 34591265 34222547 34412193 34239262 33824995 34165939 33654321 33238699 33424177
$$ packed form
3156D9892313m65285m46907m10725k61340l13649m96507l53342k34870j29218
3147D6780470q43323l41649r0167n50113m55682q5405m33546j16136m13738l08026
3137D3142685r7446q24153l25992M6108j27900m7565k72530O0810J35284n80476
3127D1108825j33478j9046r3523q72739J7454k40959j42359j01347n64794m88994
3117C8469040J07712J77287n06255l86449p9857n89180J60695J00405j88425j85200
3107C7079773m76143l4288K26876k08782k28511p718l3308k93643K9554P0820
3097C6124630m72149N7908O31181n76942L1190M212m57972J3844l02168M9003
3087C5102737n11472l68718J89646j72931m14267L40944n11618m15622J85478
$$ plain form
3078 33424177 33381236 32897888 32895603 32762836 32677648 32404027 32430882 32243326 32587409 32477232
3068 32477232 32142094 31868222 32228564 32188122 31865810 31888715 31385361 31636833 31353248 31493100
3058 31493100 31636087 31600656 31618184 31231647 31056318 31136520 31144206 31186267 31047726 30609093
3048 30609093 30703351 30924009 30389815 30156367 30413569 30514037 30476586 30225878 29965251 29997406
3038 29997406 29913963 30016236 29907117 29992966 30413738 30583002 30583522 30450018 30580716 30963509
3028 30963509 31326566 31179462 31213166 31308049 31820048 31123832 31827553 32539885 32747863 32714829
3018 32714829 33351415 33589535 33574398 33583051 33363045 34259886 34979370 35115193 35331095 35717447
3008 35717447 35927901 36779867 37122376 36854308 37067630 37477258 37265635 37749439 38036082
$$ packed form
3078C3424177m2941m83348k285j32767q5188k73621K6855j87556L44083j10177
3068C2477232l35138k73872L60342m0442l22312K2905n03354K51472k83585J39852
3058C1493100J42987l5431J7528l86537j75329Q0202P686M2061j38541m38633
3048C0609093R4258K20658n34194k33448K57202J00468l7451k50708k60627L2155
3038B9997406q3443J02273j09119Q5849M20772J69264N20j33504J30698L82793
3028C0963509L63057j47104L3704R4883N11999o96216P03721P12332K07978l3034
3018C2714829O36586K38120j5137Q653k20006Q96841P19484J35823K15902L86352
3008C5717447K10454Q51966L42509k68068K13322M09628k11623M83804K86643
$$ plain form
2999 38036082 38392398 38913745 39661311 40327640 40118714 40875314 41488770 42151390 42681949
2990 42681949 43301915 44318409 44888836 45557191 45672178 46497021 46590208 46769231 46608152
2981 46608152 47008756 47777030 47795800 48087543 48141985 48505366 48648132 48852634 49174628 49701850
2971 49701850 50265888 50781042 51386465 51919901 52908765 53736569 54685059 55045225 56146311
2962 56146311 57626027 58154229 59053519 60408899 61422870 62476673 63497118 64923259
2954 64923259 66250121 67690431 69586867 71178082 73066129 75320531 77123209 78418284
2946 78418284 79290275 80735452 81843884 82275117 83557786 84125240 84467234 84585969 84589737
2937 84589737 85218345 86352342 87715426 88756204 89993120 90898555 92238221 93265189
$$ packed form
2999C8036082L56316N21347P47566O66329k08926P56600O13456O62620N30559
2990D2681949O19966J016494N70427O68355J14987Q24843R3187J79023j61079
2981D6608152M00604P68274J8770K91743N4442L63381J42766K04502L21994N27222
2971D9701850N64038N15154O05423N33436R88864Q27804R48490L60166J101086
2962E6146311J479716N28202Q99290J355380J013971J053803J020445J426141
2954F4923259J326862J440310J896436J591215J888047K254402J802678J295075
2946G8418284Q71991J445177J108432M31233J282669N67454L41994J18735L768
2937H4589737O28608J133997J363084J040778J236916R05435J339666J026968
$$ plain form
2929 93265189 95330591 97264904 99775927 102563879 104872796 108041246 112334696 117112230
2921 117112230 121811834 126981566 133208434 139403541 144279847 147336775 148441759 146602342
2913 146602342 143113138 138739461 133740528 128923087 124522272 120890468 118248746 117464987
2905 117464987 116406567 115188384 115306883 116173744 117277444 118272132 119959315 122161962
2897 122161962 124417315 127485774 129791559 131792388 133627142 134794352 136820667 138576627
2889 138576627 139345896 139849708 139957665 138911677 135536084 132146280 127527708 123295267
2881 123295267 119357970 114554595 110046052 106477794 103528949 101376837 99509461 98152663
2873 98152663 96530545 95423810 95164132 95271619 95409807 94519579 93959135 93114449 92057219
$$ packed form
2929I3265189K065402J934313K511023K787952K308917L168450M293450M777534
2921A17112230M699604N169732O226868O195107M876306L056928J104984j839417
2913A46602342l489204m373677m998933m817441m400815l631804k641722p83759
2905A17464987j058420j218183J18499Q66861J103700R94688J687183K202647
2897A22161962K255353L068459K305785K000829J834754J167210K026315J755960
2889A38576627P69269N03812J07957j045988l375593l389804m618572m232441
2881A23295267l937297m803375m508543l568258k948845k152112j867376j356798
2873I8152663j622118j106735k59678J07487J38188q90228n60444q44686j057230
$$ plain form
2864 92057219 90756706 88567693 86335457 83866732 81313446 78805169 76435725 73924395
2856 73924395 71241979 68727668 66625666 64636962 62072978 60658800 59606895 57475131
2848 57475131 55539203 54135455 53260612 52628620 51382750 50211591 49600934 48808797 48126209
2839 48126209 47108779 46532587 45986644 45312910 44210452 43172593 42015141 40774468 39830551
2830 39830551 39038049 38524371 37671432 36790052 36392446 36062028 35719030 35101334 34476251
2821 34476251 33617967 32814420 32072277 31364379 30977280 30710558 29257347 28568253 28900426
2812 28900426 28319344 27853550 27531831 26761058 26358595 25913036 25481239 25469412 25055555 25016384
2802 25016384 24688167 24144315 23763605 23563081 22791311 21854720 21752169 21674633 21096073 20735802
$$ packed form
2864I2057219j300513k189013k232236k468725k553286k508277k369444k511330
2856G3924395k682416k514311k102002j988704k563984j414178j051905k131764
2848E7475131j935928j403748q74843o31992j245870j171159o10657p92137o82588
2839D8126209j017430n76192n45943o73734j102458j037859j157452j240673r43917
2830C9830551p92502n13678q52939q81380l97606l30418l42998o17696o25083
2821C4476251q58284q03547p42143p07898l87099k66722j453211o89094L32173
2812B8900426n81082m65794l21719p70773m02463m45559m31797j1827m13857l9171
2802B5016384l28217n43852l80710k00524p71770r36591j02551p7536n78560l60271
$$ plain form
2792 20735802 20190952 19771901 19273046 18948835 18442557 18396961 17847189 17565603 17731375 17476049
2782 17476049 17267808 16935069 16123339 16118955 15861980 15405132 15357784 15076005 14410108 14238034
2772 14238034 14576679 14482995 13937409 13761889 13888627 13809393 13661463 13327056 13126401 12579015
2762 12579015 12382834 12273398 11673832 11356208 11511174 11417203 11437276 10667616 10175365 10252696
2752 10252696 10228108 10576238 10248524 9936045 9844627 9726900 9381311 9292594 9123467 9031065
2742 9031065 9010888 8759863 8686564 8811432 8299271 7872452 7540396 7465313 7780236 7719897
2732 7719897 7662067 7304364 6977815 7299152 7451734 7175854 6772340 6717616 6841941 7120691
2722 7120691 6888474 6667800 6557024 6270958 5554125 5478131 5565686 5190528 5707149 5965676
$$ packed form
2792B0735802n44850m19051m98855l24211n06278m5596n49772k81586J65772k55326
2782A7476049k08241l32739q11730m384k56975m56848m7348k81779o65897j72074
2772A4238034L38645r3684n45586j75520J26738p9234j47930l34407k00655n47386
2762A2579015j96181j09436n99566l17624J54966r3971K0073p69660m92251P7331
2752A0252696k4588L48130l27714l12479r1418j17727l45589q8717j69127r2402
2742I031065k0177k51025p3299J24868n12161m26819l32056p5083L14923o0339
2732G719897n7830l57703l26549L21337J52582k75880m03514n4724J24325K78750
2722G120691k32217k20674j10776k86066p16833p5994Q7555l75158N16621K58527
$$ plain form
2712 5965676 5706198 5699243 5492575 5709318 5335161 5404530 5574261 5495421 5474370 5551643 5932349
2701 5932349 5711578 5694514 5256655 5344440 5384148 5670205 5377881 5493367 5097901 4879317
2691 4879317 5025363 4794722 4916025 4747981 4922051 4754774 4606204 4498592 4246170 4208067
2681 4208067 4303493 4415809 4507497 4250237 4248455 4423366 3987602 4206109 3676073 3520240
2671 3520240 3689908 3828372 3902990 3940511 3569446 3588260 3731923 3461930 3614442 3304787
2661 3304787 2858801 2738961 3087299 3249322 2892698 3558269 3570356 3221863 3225463 3006363
2651 3006363 3031185 3136235 3403060 3275537 3184516 3080390 2975213 3107806 3287022 3416531
2641 3416531 3246089 3068743 3481021 3440683 2989850 2817026 3150008 3102399 3021078 3065656
$$ packed form
2712E965676k59478o955k06668K16743l74157O9369J69731p8840k1051P7273L80706
2701E932349k20771j7064m37859Q7785L9708K86057k92324J15486l95466k18584
2691D879317J46046k30641J21303j68044J74070j67277j48570j07612k52422l8103
2681D208067R5426J12316R1688k57260j782J74911m35764K18507n30036j55833
2671C520240J69668J38464P4618L7521l71065J8814J43663k69993J52512l09655
2661C304787m45986j19840L48338J62023l56624O65571J2087l48493L600k19100
2651C006363K4822J05050K66825j27523r1021j04126j05177J32593J79216J29509
2641C416531j70442j77346M12278m0338m50833j72824L32982m7609q1321M4578
$$ plain form
2631 3065656 2904767 3193615 3234309 3384369 2828303 2997560 2799861 2693362 2358483 2551421
2621 2551421 2681135 2632171 2635389 1893164 2616901 3666609 3096711 2098852 2225538 2105461
2611 2105461 2244971 1746816 1889157 2495312 2880362 2732294 2425205 2529995 2862005 2806334
2601 2806334 2793454 2636715 2906171 2700524 2891605 2363427 2146172 2500572 2155007 2247262
2591 2247262 2173998 1873678 2109421 2434651 2317793 2452919 2374656 2182338 2420406 2005018
2581 2005018 2354818 2169090 1711810 2007465 2100839 2156250 1621743 1707860 1841270 1479499
2571 1479499 1082260 1322512 1312443 1083376 1047378 1762428 2244725 2159393 1429066 869935
2561 869935 982667 1260480 1195413 1328227 1496830 1238267 1476890 1739082 1405897 1457882
$$ packed form
2631C065656j60889K88848M0694J50060n56066J69257j97699j06499l34879J92938
2621B551421J29714m8964L218p42225P23737J049708n69898r97859J26686j20077
2611B105461J39510m98155J42341O06155L85050j48068l07089J04790L32010n5671
2601B806334j2880j56739K69456k05647J91081n28178k17255L54400l45565R2255
2591B247262p3264l00320K35743L25230j16858J35126p8263j92318K38068m15388
2581B005018L49800j85728m57280K95655R3374N5411n34507Q6117J33410l61771
2571A479499l97239K40252j0069k29067l5998P15050M82297q5332p30327n59131
2561H69935J12732K77813o5067J32814J68603k58563K38623K62192l33185N1985
$$ plain form
2551 1457882 1066407 963954 943988 1116824 876813 761143 1128931 1048506 1014228 1166851
2541 1166851 1046954 1105114 997587 715987 773877 501136 832777 794788 532197 652443
2531 652443 881272 853886 1586265 1314309 557898 363177 754912 861121 718504 1300253
2521 1300253 1236180 689842 1022181 1125181 1139414 907155 457576 768711 675257 789134
2511 789134 1214468 926402 883414 770718 721473 408488 584981 638830 426234 582625
2501 582625 461727 252097 836237 1120107 872801 905959 963758 1225707 972378 674214
2491 674214 536524 822279 760091 638141 428176 514002 556295 378015 585332 475322
2481 475322 644282 60924 481637 1055277 203232 190319 415671 1026036 824105 327002
$$ packed form
2551A457882l91475j02453j9966J72836k40011j15670L67788q0425l4278J52623
2541A166851j19897N8160j07527k81600N7890k72741L31641l7989k62591J20246
2531F52443K28829k7386P32379k71956p56411j94721L91735J06209j42617N81749
2521A300253o4073n46338L32339J03000J4233k32259m49579L11135r3454J13877
2511G89134M25334k88066m2988j12696m9245l12985J76493N3849k12596J56391
2501E82625j20898k09630N84140K83870k47306L3158N7799K61949k53329k98164
2491F74214j37690K85755o2188j21950k09965Q5826M2293j78280K07317j10010
2481D75322J68960n83358M20713N73640q52045j2913K25352O10365k01931m97103
$$ plain form
2471 327002 694866 623927 522392 796137 550101 1002043 795246 471916 319366 176059
2461 176059 495364 834434 979134 512374 240455 150277 90342 400812 464162 450993
2451 450993 360998 287742 285482 362119 559393 533235 441830 601641 505265 455040 658394
2440 658394 423238 562185 211563 229676 482557 744155 320241 -11550 123311 12112
2430 12112 363008 640398 869689 557621 295793 -25394 -56704 7809 224744 308142
2420 308142 618884 52644 -384664 99859 109568 351051 325050 -35072 -244951 18523
2410 18523 -228631 132050 433782 420515 121176 136804 264449 11960 -92051 84846
2400 84846 205333 5256 -190328 -345136 -116858 -264886 648181 654025 150192 241209
$$ packed form
2471C27002L67864p0939j01535K73745k46036M51942k06797l23330j52550j43307
2461A76059L19305L39070J44700m66760k71919r0178n9935L10470O3350j3169
2451D50993q9995p3256k260P6637J97274k6158r1405J59811r6376n0225K03354
2440F58394k35156J38947l50622J8113K52881K61598m23914l31791J34861j11199
2430A2112L50896K77390K29291l12068k61828l21187l1310O4513K16935Q3398
2420C08142L10742n66240m37308M84523R709K41483k6001l60122k09879K63474
2410A8523k47154L60681L01732j3267k99339J5628J27645k52489j04011J76897
2400H4846J20487k00077j95584j54808K28278j48028R13067N844n03833R1017
$$ plain form
2390 241209 -36709 -322254 -350710 -57019 681565 661595 721420 810723 625210 286771
2380 286771 834751 903997 504308 389793 250524 264266 -114360 369277 190195 158886
2370 158886 353505 -121225 -223606 -298937 -471708 -854421 -752285 -276944 30362 640902
2360 640902 525426 127224 16526 113936 151285 52010 -85456 -42888 -607441 -575764 73661
2349 73661 344377 350611 99961 49030 228559 32797 -384620 -1252035 -1080150 -717659
2339 -717659 -276735 -103419 -130553 -719523 -652988 -317859 -241891 -151394 -22460 200971
2329 200971 121756 -121144 -462168 387848 219468 276710 319102 141575 144204 -251338 166063
2318 166063 315526 61729 155298 -325135 104959 -20261 11859 295721 385170 683029
$$ packed form
2390B41209k77918k85545k8456K93691P38584j9970N9825Q9303j85513l38439
2380B86771N47980O9246l99689j14515j39269J3742l78626M83637j79082l1309
2370A58886J94619m74730j02381p5331j72771l82713J02136M75341L07306O10540
2360F40902j15476l98202j10698R7410L7349r9275j37466M2568n64553L1677O49425
2349G3661K70716O234k50650n0931J79529j95762m17417q67415J71885L62491
2339g17659M40924J73316k7134n88970O6535L35129P5968R0497J28934K23431
2329B00971p9215k42900l41024Q50016j68380N7242M2392j77527K629l95542M17401
2318A66063J49463k53797R3569m80433M30094j25220L2120K83862Q9449K97859
$$ plain form
2308 683029 379894 63063 527277 866859 -62133 -112908 -270697 -288180 -336947 -304725
2298 -304725 -210330 -262281 -183739 -60428 -194914 -229149 -75350 -14050 61754 55158 -131734
2287 -131734 231708 642467 897783 932934 677070 448904 -107464 -149534 -41328 -26493
2277 -26493 178883 439185 584703 42422 -51856 149504 -44131 -367049 -438952 629755
2267 629755 434490 310430 361541 222528 257275 395858 673634 610405 626650 518653
2257 518653 854147 736521 365573 661950 853541 1234408 1107886 613968 309790 223430
2247 223430 265470 88678 25862 32383 -31641 248688 699943 478670 279976 -31065 -141918
2236 -141918 -133871 27827 279581 14881 269715 882584 713651 428113 66192 490995
$$ packed form
2308F83029l03135l16831M64214L39582r28992n0775j57789j7483m8767L2222
2298c04725R4395n1951P8542J23311j34486l4235J53799O1300P5804o596j86892
2287a31734L63442M10759K55316L5151k55864k28166n56368m2070J08206J4835
2277b6493K05376K60302J45518n42281r4278K01360j93635l22918p1903J068707
2267F29755j95265j24060N1111j39013L4747J38583K77776o3229J6245j07997
2257E18653L35494j17626l70948K96377J91591L80867j26522m93918l04178q6360
2247B23430M2040j76792o2816O521o4024K80329M51255k21273j98694l11041j10853
2236a41918Q047J61698K51754k64700K54834O12869j68933k85538l61921M24803
$$ plain form
2226 490995 706716 459153 528387 330986 788331 908672 872167 354636 385974 162651
2216 162651 692673 1623895 1331388 1097470 1047326 1142638 831065 934766 1071775 1365143
2206 1365143 989200 740814 1068192 792275 1051246 1048545 1140443 748873 733785 650365
2196 650365 557865 1452427 1646560 1661792 1487506 2136409 2573502 2661719 2256916 2039127
2186 2039127 2176022 1862530 2376975 2579502 2520073 2698115 2683344 2491135 2790646 2546458
2176 2546458 2406788 2761415 2769774 3103813 2746515 2662942 3158838 3114575 3354024 3346251 3027798
2165 3027798 3234923 3543455 3896202 3870537 4353634 4559788 4303883 4465876 4720239 5496521
2155 5496521 5403756 5498320 5582046 6158426 6456014 5949994 6299156 6505792 6975121 7504054
$$ packed form
2226D90995K15721k47563O9234j97401M57345J20341l6505n17531L1338k23323
2216A62651N30022R31222k92507k33918n0144R5312l11573J03701J37009K93368
2206A365143l75943k48386L27378k75917K58971k701R1898l91570j5088q3420
2196F50365r2500Q94562J94133J5232j74286O48903M37093Q8217m04803k17789
2186B039127J36895l13492N14445K02527n9429J78042j4771j92209K99511k44188
2176B546458j39670L54627Q359L34039l57298q3573M95896m4263K39449p773l18453
2165C027798K07125L08532L52747k5665M83097K06154k55905J61993K54363P76282
2155E496521r2765R4564Q3726N76380K97588n06020L49162K06636M69329N28933
$$ plain form
2145 7504054 7535370 8019890 8565258 8910451 9307369 9839348 10745838 11556987 12045052 12636275
2135 12636275 13494575 14527252 15762424 17643879 19070227 20224366 20833478 21299739 22917664
2126 22917664 24836409 28190816 33458868 40338235 49579281 62310170 79522431 101532285
2118 101532285 128336990 156240258 170150666 148759875 111681357 84387883 65776695
2111 65776695 53818827 44404984 37225662 32043621 27966599 24776750 23181017 21658579
2103 21658579 20522077 19612690 18868650 17447700 15228427 13072665 12273700 11215706 10608885
2094 10608885 10053013 9639369 8880222 8673075 8089040 7508880 6532333 5915813 5541717
2085 5541717 4852016 5153148 4818377 4686718 4473749 4445323 3918130 3988011 3822215 3540346
$$ packed form
2145G504054L1316M84520N45368L45193L96918N31979R06490Q11149M88065N91223
2135A2636275Q58300J032677J235172J881455J426348J154139O09112M66261J617925
2126B2917664J918745L354407N268052O879367R241046J2730889J7212261K2009854
2118A01532285K6804705K7903268J3910408k1390791l7078518k7293474j8611188
2111F5776695j1957868r413843p179322n182041m077022l189849j595733j522438
2103B1658579j136502r09387p44040j420950k219273k155762p98965j057994o06821
2094A0608885n55872m13644p59147k07147n84035n80160r76547o16520l74096
2085E541717o89701L01132l34771j31659k12969k8426n27193O9881j65796k81869
$$ plain form
2075 3540346 3648182 3114344 3279866 3773004 3581119 3018493 2391587 2540942 2772154 2254365
2065 2254365 2285412 1871059 1994247 2176366 2013072 2406537 2743825 2375194 2115511 1323682
2055 1323682 1457083 1817061 1647182 2040753 1894241 2170535 1397433 1382648 1142253 1800886
2045 1800886 1934753 1766535 1845354 1630427 1187558 663785 710314 737770 763071 722811
2035 722811 814103 539898 555271 834823 855777 426527 179145 269175 606187 836435
2025 836435 581223 894995 997633 620516 402112 569211 991883 893284 526972 758283
2015 758283 706156 207407 464610 845570 416181 348276 631070 1108398 1121662 396554
2005 396554 426988 534753 671446 798524 594208 698884 635514 468713 385271 344958
$$ packed form
2075C540346J07836n33838J65522M93138j91885n62626o26906J49355K31212n17789
2065B254365L1047m14353J23188J82119j63294L93465L37288l68631k59683p91829
2055A323682J33401L59978j69879L93571j46512K76294p73102j4785k40395O58633
2045A800886J33867j68218P8819k14927m42869n23773M6529K7456K5301m0260
2035G22811R1292k74205J5373K79552K0954m29250k47382R0030L37012K30248
2025H36435k55212L13772J02638l77117k18404J67099M22672r8599l66312K31311
2015G58283n2127m98749K57203L80960m29389o7905K82794M77328J3264p25108
2005C96554L0434J07765J36693J27078k04316J04676o3370j66801q3442m0313
$$ plain form
1995 344958 846688 617101 239453 88226 144112 562114 -30024 -369619 -75961 31679
1985 31679 -15436 532939 912623 805691 397427 -67995 81676 601583 630533 516528
1975 516528 201658 172780 618672 767767 317622 403126 471099 448498 498242 76766 62428
1964 62428 -15086 -148112 -182119 -23192 71901 -73057 51602 330652 362230 144337 32299
1953 32299 70639 155103 39914 171550 320141 -446417 -153542 -90974 -301433 -379038 -179256
1942 -179256 -112218 -15867 302412 -21992 -247623 -373745 -537035 -116320 6223 127481
1932 127481 -50534 -390281 -709189 -209489 201451 230638 241961 -186906 -516192 -168916
1922 -168916 356624 439803 348824 314986 88867 -201644 -27157 -263948 -420170 -258841
$$ packed form
1995C44958N01730k29587l77648j51227N5886M18002n92138l39595K93658J07640
1985C1679m7115N48375L79684j06932m08264m65422J49671N19907K8950j14005
1975E16528l14870k8878M45892J49095m50145Q5504O7973k2601M9744m21476j4338
1964F2428p7514j33026l4007J58927R5093j44958J24659K79050L1578k17893j12038
1953C2299L8340Q4464j15189J31636J48591p66558K92875O2568k10459p7605J99782
1942a79256O7038R6351L18279l24404k25631j26122j63290M20715J22543J21258
1932A27481j78015l39747l18908M99700M10940K9187J1323m28867l29286L47276
1922a68916N25540Q3179r0979l3838k26119k90511J74487k36791j56222J61329
$$ plain form
1912 -258841 224192 133989 89115 -1353 349852 19541 59316 425037 634588 499697
1902 499697 284017 218892 -216020 -183975 -285910 -3651 -238534 -325608 -94956 117152
1892 117152 69934 -282966 59209 -205721 -789414 -152654 -68969 169224 209874 -261101
1882 -261101 385355 538311 664583 41077 -233777 -44292 -249999 -204666 122747 -171057
1872 -171057 -119486 216568 123895 -91106 -618417 -435600 -71706 -14286 646208 831757
1862 831757 170027 -211427 84826 148202 65287 81014 46017 91816 91607 261863 255603
1851 255603 348267 8401 69461 508385 774179 611425 445484 28769 491215 387311
1841 387311 255783 446142 512551 70463 -196260 162364 -220410 -72333 209109 -534375
$$ packed form
1912b58841M83033r0203m4874r0468L51205l30311L9775L65721K09551j34891
1902D99697k15680o5125m34912L2045j01935K82259k34883q7074K30652K12108
1892A17152m7218l52900L42175k64930n83693O36760Q3685K38193M0650m70975
1882b61101O46456J52956J26272o23506k74854J89485k05707M5333L27413k93804
1872a71057N1571L36054r2673k15001n27311J82817L63894N7420O60494J85549
1862H31757o61730l81454K96253O3376q2915J5727l4997M5799k09J70256o260
1851B55603R2664l39866O1060M38924K65794j62754j65941m16715M62446j03904
1841C87311j31528J90359O6409m42088k66723L58624l82774J48077K81442p43484
$$ plain form
1831 -534375 -411753 -29105 -255570 14499 550982 456339 237831 475940 127641 -201040
1821 -201040 266262 138951 -52662 -38990 185176 -175578 -67472 51997 -135863 -491617
1811 -491617 -647647 -344866 -50724 13036 22323 194951 -158404 -291666 -210450 -209474 -599760
1800 -599760 6364 421685 211853 -271168 -341893 -217717 -28708 293154 129972 -274194
1790 -274194 41125 471954 459867 269321 236479 200591 -150823 -274382 98735 -66698
1780 -66698 -549346 -324553 -234059 114155 -30354 -230642 167144 -128601 -69724 176534
1770 176534 -499619 -664054 -645453 -290611 260595 322722 335831 -50221 561581 429173
1760 429173 179560 190642 -342881 -327024 -226303 8341 -31967 460701 575948 -217189
$$ packed form
1831e34375J22622L82648k26465K70069N36483r4643k18508K38109l48299l28681
1821b01040M67302j27311j91613J3672K24166l60754J08106J19469j87860l55754
1811d91617j56030L02781K94142O3760R287J72628l53355j33262Q1216R76l90286
1800e99760O06124M15321k09832m83021p0725J24176J89009L21862j63182m04166
1790b74194L15319M30829j2087j90546l2842l5888l51414j23559L73117j65433
1780f6698m82648K24793R0494L48214j44509k00288L97786k95745N8877K46258
1770A76534o76153j64435J8601L54842N51206O2127J3109l86052O11802j32408
1760D29173k49613J1082n33523J5857J00721K34644m0308M92668J15247p93137
$$ plain form
1750 -217189 -270458 -691433 -648003 145636 703680 82443 -351083 -515269 59751 -54319
1740 -54319 262378 1001524 669669 433779 150523 203879 -23458 44077 -281833 -725523
1730 -725523 59124 123968 244014 344194 -349010 -218290 -168591 -715922 -699600 -44703
1720 -44703 -12140 -678563 -125849 312718 564727 72599 -8246 264185 116454 -385373
1710 -385373 -377295 -270056 -147021 -61981 97763 98404 -130402 -223853 -322269 -509488 -86937
1699 -86937 -39206 -556822 -784453 -698970 -443147 -5357 432438 70683 -121869 134619
1689 134619 -263853 -244473 -42122 -376831 -229104 -11019 189599 -71959 335708 324186
1679 324186 774293 149057 451505 148087 -158527 249512 32738 115687 383960 107752
$$ packed form
1750b17189n3269m20975M3430P93639N58044o21237m33526j64186N75020j14070
1740e4319L16697P39146l31855k35890k83256N3356k27337O7535l25910m43690
1730g25523P84647O4844J20046J00180o93204J30720M9699n47331J6322O54897
1720d4703L2563o66423N52714M38567K52009m92128q0845K72431j47731n01827
1710c85373Q078J07239J23035Q5040J59744O41k28806r3451r8416j87219M22551
1699h6937M7731n17616k27631Q5483K55823M37790M37795l61755j92552K56488
1689A34619l98472J9380K02351l34709J47727K18085K00618k61558M07667j1522
1679C24186M50107o25236L02448l03418l06614M08039k16774Q2949K68273k76208
$$ plain form
1669 107752 595142 458330 439493 50623 185358 -115095 -303883 120404 213408 723528
1659 723528 564165 -73661 -461550 -202148 301244 -160556 -11594 133059 -367707 -264698
1649 -264698 -83064 -217989 -44813 145142 702251 584899 157318 193382 -192034 -355918
1639 -355918 87993 478047 542118 294798 -169506 -265621 -345144 -215203 132434 388388
1629 388388 237624 -24583 35399 -33409 -70139 51086 127747 59061 161562 -135479 -126219
1618 -126219 81665 -186487 188411 199382 166208 83506 -273940 -500712 -329526 -512028
1608 -512028 -678309 -715130 9846 -96365 -126396 -233848 -155664 -70710 165510 114931 -348534
1597 -348534 -138770 -368991 -205202 454760 206148 -168711 195597 398925 466690 863914
$$ packed form
1669A07752M87390j36812j8837l88870J34735l00453j88788M24287R3004N10120
1659G23528j59363o37826l87889K59402N03392m61800J48962J44653n00766J03009
1649b64698J81634j34925J73176J89955N57109j17352m27581L6064l85416j63884
1639c55918M43911L90054O4071k47320m64304r6115p9523J29941L47637K55954
1629C88388j50764k62207N9982o8808l6730J21225P6661o8686J02501k97041R260
1618a26219K07884k68152L74898J0971l3174q2702l57446k26772J71186j82502
1608e12028j66281l6821P24976j06211l0031j07452P8184Q4954K36220n0579m63465
1597c48534K09764k30221J63789O59962k48612l74859L64308K03328O7765L97224
$$ plain form
1587 863914 447767 92044 33324 -33504 103044 44543 -225558 111571 -59331 -556697
1577 -556697 -385526 134814 47657 -30251 201618 706080 477479 682193 290523 -109426
1567 -109426 41498 100867 143680 554871 668506 52081 -60519 -247717 80281 374296
1557 374296 196379 193928 414924 194354 187387 72152 -33215 -631308 -808584 -777141 -307142
1546 -307142 17468 -253111 78497 104730 -547737 -458719 -357553 -661999 -70247 183655
1536 183655 -99419 315518 565106 70982 72249 -369086 -121647 -281325 -603049 -518628
1526 -518628 -239045 -31486 68027 109062 16180 -186623 179227 557273 -368292 -370590 -151902
1515 -151902 -431548 170721 192872 313050 85351 139866 829125 644910 328755 509785
$$ packed form
1587H63914m16147l55723n8720o6828J36548n8501k70101L37129j70902m97366
1577e56697J71171N20340q7157p7908K31869N04462k28601K04714l91670l99949
1567a09426J50924N9369M2813M11191J13635o16425j12600j87198L27998K94015
1557C74296j77917k451K20996k20570o967j15235j05367n98093j77276L1443M69999
1546c07142L24610k70579L31608K6233o52467Q9018J01166l04446N91752K53902
1536A83655k83074M14937K49588m94124J267m41335K47439j59678l21724Q4421
1526e18628K79583K07559R9513M1035r2882k02803L65850L78046r25565k298K18688
1515a51902k79646O02269K2151J20178k27699N4515O89259j84215l16155J81030
$$ plain form
1505 509785 541395 281485 -29743 -68827 -437914 -219055 200470 -133814 -563945 -173736
1495 -173736 -129806 -471708 107769 180219 -169519 -274706 159804 -144019 -530029 -232090
1485 -232090 -5655 -39158 35123 -40421 426651 74953 -121620 142292 131395 -341697
1475 -341697 49127 137545 128300 108071 -91095 -200372 -168765 -188390 -67905 38862 225469
1464 225469 56576 -412149 -830725 -676018 -66814 -10438 -29003 408976 -905 257615
1454 257615 135549 -19973 -103665 -142076 9370 -305429 -193560 73252 -101571 423627
1444 423627 -269808 -816711 -14907 -7274 -594082 -511469 -261502 -299024 -26129 114437
1434 114437 298774 470642 66325 76862 -51738 -33023 384658 319657 78371 80855 -203749
$$ packed form
1505E09785L1610k59910l11228l9084l69087K18859M19525l34284m30131L90209
1495a73736M3930l41902N79477P2450l49738j05187M34510l03823l86010K97939
1485b32090K26435l3503P4281p5544M67072l51698j96573K63912j0897m73092
1475c41697L90824Q8418r245k0229j99166j09277L1607j9625J20485J06767J86607
1464B25469j68893m68725m18576J54707O09204N6376j8565M37979m09881K58520
1454B57615j22066j55522q3692l8411J51446l14799J11869K66812j74823N25198
1444D23627o93435n46903Q01804P633n86808Q2613K49967l7522K72895J40566
1434A14437J84337J71868m04317J0537j28600J8715M17681o5001k41286K484k84604
$$ plain form
1423 -203749 -135934 -142708 -22855 450158 42982 -152595 -8863 26698 -297542 -82464
1413 -82464 -123279 -59926 -187060 -209979 99893 65642 -382281 9606 147815 -205474 -116489
1402 -116489 -466538 -345640 152719 215585 396072 70603 131580 -217044 -297160 -77764
1392 -77764 -88747 -129520 -461327 -166077 295790 103147 113609 -370590 -312045 -247147 -283120
1381 -283120 -18627 68643 -13890 -83214 -74064 -249389 236128 549990 -146970 -22304 -596370
1370 -596370 -436824 -351881 -258419 -224171 -313234 46987 92785 178347 71728 183595 45907
1359 45907 -65043 -199049 -475276 -214412 -277413 -58071 17467 240596 -199113 -63071
1349 -63071 135484 -55601 -290304 14285 120252 -175142 -325151 202055 565388 302070
$$ packed form
1423b03749O7815o774J19853M73013m07176j95577J43732L5561l24240K15078
1413h2464m0815O3353j27134k2919L09872l4251m47923L91887J38209l53289Q8985
1402a16489l50049J20898M98359O2866J80487l25469O0977l48624q0116K19396
1392g7764j0983m0773l31807K95250M61867j92643J0462m84199N8545O4898l5973
1381b83120K64493Q7270q2533o9324R150j75325M85517L13862o96960J24666n74066
1370e96370J59546Q4943R3462L4248q9063L60221M5798Q5562j06619J11867j37688
1359D5907j10950j34006k76227K60864o3001K19342P5538K23129m39709J36042
1349f3071J98555j91085k34703L04589J05967k95394j50009N27206L63333k63318
$$ plain form
1339 302070 172140 -215993 -400745 -576842 -532145 -142159 -468855 -674092 -583163 -854241
1329 -854241 -152378 40199 133759 148266 99211 -289637 -85530 132198 -394411 -381199
1319 -381199 99138 516396 658765 102513 507303 460618 446459 46816 -221269 -65379
1309 -65379 -26896 168354 430761 579755 170422 -5072 -517635 -414327 249605 313248
1299 313248 465514 -251466 -613164 -597761 -330730 3622 -355973 -128430 -303524 -152636
1289 -152636 62146 -126495 -227857 -465469 -578276 -285321 -44793 548470 251462 -533264
1279 -533264 -237529 -141204 -255997 -428277 -162816 167781 109023 -210477 71379 340881
1269 340881 508001 106458 127444 203522 557138 395171 263719 -77523 -157017 210027
$$ packed form
1339C02070j29930l88133j84752j76097M4697L89986l26696k05237R0929k71078
1329h54241P01863J92577R3560J4507m9055l88848K04107K17728n26609J3212
1319c81199M80337M17258J42369n56252M04790m6685j4159l99643k68085J55890
1309f5379L8483J95250K62407J48994m09333j75494n12563J03308O63932O3643
1299C13248J52266p16980l61698J5403K67031L34352l59595K27543j75094J50888
1289a52636K14782j88641j01362k37612j12807K92955K40528N93263k97008p84726
1279e33264K95735R6325j14793j72280K65461L30597n8758l19500K81856K69502
1269C40881J67120m01543K0986P6078L53616j61967j31452l41242p9494L67044
$$ plain form
1259 210027 273846 -227594 72333 -13725 -54987 -61282 431097 -42143 -521997 -515361 -316696
1248 -316696 -100482 -254753 -232948 -551537 -204562 -322255 -133380 -14260 -258403 -153166
1238 -153166 361976 -103425 -374859 -380423 50858 126965 476838 388651 -275604 -702320
1228 -702320 -695470 -479734 -269937 606763 295055 26881 -173904 -148561 122742 106435
1218 106435 656604 444973 416644 821270 452233 -264584 -3035 298955 147752 -218199
1208 -218199 29496 251785 155483 -11559 4001 455962 322397 16373 -139552 -273128
1198 -273128 -377157 -306520 -376580 -435092 -173060 -199740 -254789 -303925 -20794 -587343 -403532
1187 -403532 -520884 -221618 325610 145134 -88270 -376707 -176872 323019 196447 121806
$$ packed form
1259B10027O3819n01440K99927q6058m1262o295M92379m73240m79854O636J98665
1248c16696K16214j54271K1805l18589L46975j17693J88875J19120k44143J05237
1238a53166N15142m65401k71434n564M31281P6107L49873q8187o64255m26716
1228g02320O850K15736K09797Q76700l11708k68174k00785K5343K71303j6307
1218A06435N50169k11631k8329M04626l69037p16817K61549L01990j51203l65951
1208b18199K47695K22289r6302j67042J5560M51961j33565l06024j55925j33576
1198b73128j04029P0637p0060n8512K62032k6680n5049m9136K83131n66549J83811
1187d03532j17352K99266N47228j80476k33404k88437J99835M99891j26572p4641
$$ plain form
1177 121806 -211977 -471487 -140673 93056 -184293 -322951 -569803 -80830 285594 -575439
1167 -575439 -436583 -141901 -62404 107545 -145777 -97750 167574 92231 223330 115760
1157 115760 98104 155801 258267 -95789 -34090 -432 7799 238807 309278 -222134 -291151
1146 -291151 214270 422592 550328 623451 674187 502412 412582 192966 79364 228605
1136 228605 236165 43225 -90804 19204 289408 117716 -155513 -577019 -415811 -84521
1126 -84521 -28404 180799 416567 49279 104154 228523 3712 -245924 -565563 214475
1116 214475 744742 604857 128767 42898 31213 -122149 -207275 -35011 -9028 -309501
1106 -309501 140904 176760 93480 -423435 -350069 -57508 -163047 195128 609412 -98714
$$ packed form
1177A21806l33783k59510L30814K33729k77349j38658k46852M88973L66424q61033
1167e75439J38856K94682P9497J69949k53322M8027K65324p5343J31099j07570
1157A15760j7656N7697J02466l54056O1699L3658Q231K31008P0471n31412o9017
1146b91151N05421K08322J27736P3123N0736j71775q9830k19616j13602J49241
1136B28605P560j92940j34029J10008K70204j71692k73229m21506J61208L31290
1126h4521N6117K09203K35768l67288N4875J24369k24811k49636l19639P80038
1116B14475N30267j39885m76090q5869j1685j53362q5126J72264K5983l00473
1106c09501M50405L5856q3280n16915P3366K92561j05539L58175M14284p08126
$$ plain form
1096 -98714 -261076 -472821 -334163 -42287 -228076 -140614 -361556 -506560 -374768 -161590
1086 -161590 -571299 -26681 148680 355663 437065 -115240 44531 -134997 -294860 306224
1076 306224 81720 -105452 66380 283609 -197157 -438743 -362850 -213822 131704 167980
1066 167980 7648 -525747 -387377 -53745 -375513 -108634 -367321 30042 62579 -183582
1056 -183582 -162725 365751 61409 99793 645800 315179 513931 156914 194722 -128908
1046 -128908 -528161 -7242 240378 611961 417878 187433 102040 -381148 -648874 -550776
1036 -550776 -679646 -331680 75922 -5941 -160330 -371174 -558942 -85473 6127 -23497
1026 -23497 454106 817874 607981 97515 -213583 -14702 207329 301457 159030 188947
$$ packed form
1096i8714j62362k11745J38658K91876j85789Q7462k20942j45004J31792K13178
1086a61590m09709N44618J75361K06983Q1402n52305J59771j79528j59863O01084
1076C06224k24504j87172J71832K17229m80766k41586P5893J49028L45526L6276
1066A67980j60332n33395J38370L33632l21768K66879k58687L97363L2537k46161
1056a83582K0857N28476l04342L8384N46007l30621J98752l57017L7808l23630
1046a28908l99253N20919K47620L71583j94083k30445q5393m83188k67726R8098
1036e50776j28870L47966M07602q1863j54389k10844j87768M73469R1600k9624
1026b3497M77603L63768k09893n10466l11098J98881K22031R4128j42427K9917
$$ plain form
1016 188947 186483 142601 376404 419272 347791 540532 417377 -246567 -406722 -579949 -487932
1005 -487932 -406197 -261609 -25625 206142 -382635 -1024778 -502334 161847 -213309 -101047
995 -101047 14325 -231658 -312692 -452255 204966 421775 206570 -107026 -26485 468807
985 468807 699298 216648 -192193 -129041 -16307 192867 -229482 -693159 -190511 238073
975 238073 212659 440832 -304203 258735 366501 198812 64016 342066 127229 279900
965 279900 504771 -27340 -444574 -185829 -269109 -291145 -277685 314210 629735 1867
955 1867 -186448 6703 -153789 -172603 254377 228819 -108599 371462 367889 402122 801779
944 801779 354447 388646 518338 357854 422552 166787 138189 -129595 -511263 133161
$$ packed form
1016A88947k464m3882K33803M2868p1481J92741j23155o63944j60155j73227R2017
1005d87932Q1735J44588K35984K31767n88777o42143N22444O64181l75156J12262
995a01047J15372k45983q1034j39563O57221K16809k15205l13596Q0541M95292
985D68807K30491m82650m08841O3152J12734K09174m22349m63677N02648M28584
975B38073k5414K28173p45035N62938J07766j67689j34796K78050k14837J52671
965B79900K24871n32111m17234K58745q3280k2036J3460N91895L15525o27868
955A867j88315J93151j60492j8814M26980k5558l37418M80061l573L4233L99657
944H01779m47332L4199J29692j60484O4698k55765k8598k67784l81668O44424
$$ plain form
934 133161 488782 150465 81429 29271 -182755 -557197 -106413 37168 -90916 -195750
924 -195750 -447962 77281 6840 -215232 -139665 -40596 -163485 257719 392619 760916
914 760916 184414 339961 228189 197941 34702 77346 25477 -147958 24082 -651180
904 -651180 -590434 349689 729210 202504 -272465 111301 190877 229753 123375 313527
894 313527 742403 287217 -286388 -973437 -144282 224726 303639 668116 448697 121501
884 121501 232326 72931 -58171 -108271 -372855 459468 644953 494646 155885 472864
874 472864 800637 465827 -436141 -564722 -502354 -385011 -156722 156751 53399 133923
864 133923 540688 651570 -15152 22933 -281777 -234808 -195955 -244238 -186964 -260640 -294802
$$ packed form
934A33161L55621l38317o9036n2158k12026l74442M50784J43581j28084j04834
924a95750k52212N25243p0441k22072P5567R9069j22889M21204J34900L68297
914G60916n76502J55547j11772l0248j63239M2644n1869j73435J72040o75262
904f51180O0746R40123L79521n26706m74969L83766P9576L8876j06378J90152
894C13527M28876m55186n73605o87049Q29155L69008P8913L64477k19419l27196
884A21501J10825j59395j31102n0100k64584Q32323J85485j50307l38761L16979
874D72864L27773l34810r01968j28581O2368J17343K28289L13473j03352Q0524
864A33923M06765J10882o66722L8085l04710M6969L8853m8283N7274p3676l4162
$$ plain form
853 -294802 -412838 260571 374627 512049 -52617 -25124 85307 315562 354140 -154179
843 -154179 -89216 93358 -615300 -195070 -331769 -420255 -285285 -115221 -244233 -194678
833 -194678 -192212 -188610 -164384 209582 -22968 -759958 -445310 -242357 525783 413276 -284356
822 -284356 -503054 308916 118667 551787 837976 293842 11143 343508 133957 -98182
812 -98182 -66753 -99551 67601 -233417 -13501 532284 724969 205404 371040 293385 -364691
801 -364691 -201029 30711 -480174 -372757 -10076 142285 -8809 -259746 -99371 251695
791 251695 -94499 394172 158470 -103753 -121829 -20344 75457 -563141 -511728 -591343 -493865
780 -493865 -498402 -950100 -757512 -11132 123767 312549 -125381 299171 252506 346452 685103
$$ packed form
853b94802j18036O73409J14056J37422n64666K7493J10431K30255L8578n08319
843a54179O4963J82574p08658M20230j36699q8486J34970J70064j29012M9555
833a94678K466L602K4226L73966k32550p36990L14648K02953P68140j12507o97632
822b84356k18698Q11970j90249M33120K86189n44134k82699L32365k09551k32139
812i8182L1429l2798J67152l01018K19916N45785J92685n19565J65636p7655o58076
801c64691J63662K31740n10885J07417L62681J52361j51094k50937J60375L51066
791B51695l46194M88671k35702k62223j8076J01485R5801o38598N1413p9615R7478
780d93865m537m51698J92588P46380J34899J88782m37930M24552m6665R3946L38651
$$ plain form
769 685103 144520 -221903 131885 456659 372437 -50776 -258721 181462 19919 502198
759 502198 331156 -214376 96343 184765 -190756 -169740 10345 753682 925010 634097
749 634097 227311 281369 629531 270922 -160851 25217 -12345 143735 -78067 -321849
739 -321849 -63190 -33689 -430316 -242331 -507305 -272068 118353 93345 159023 -87131
729 -87131 -348999 -16815 129010 -95524 93129 609210 362238 -129355 -174199 -112361
719 -112361 -20983 -418808 156466 207766 8013 -5076 3105 -208753 -863934 -706408 -87276
708 -87276 132532 423579 -124488 -376877 -146534 -568101 -294544 156006 660507 1002983
698 1002983 497859 380554 205311 45491 -13413 308277 374353 301073 -139195 140499
$$ packed form
769F85103n40583l66423L53788L24774q4222m23213k07945M40183j61543M82279
759E02198j71042n45532L10719Q8422l75521K1016J80085P43337J71328k90913
749F34097m06786N4058L48162l58609m31773J86068l7562J56080k21802k43782
739c21849K58659K9501l96627J87985k64974K35237L90421k5008O5678k46154
729h7131k61868L32184J45825k24534J88653N16081k46972m91593m4844O1838
719a12361R1378l97825N75274N1300j99753j3089Q181k11858o55181J57526O19132
708h7276K19808K91047n48067k52389K30343m21567K73557M50550N04501L42476
698A002983n05124j17305j75243j59820n8904L21690O6076p3280m40268K79694
$$ plain form
688 140499 -78375 -95234 414303 134229 -87929 -181611 -204313 -68268 -20133 -108338 142707
677 142707 -302484 79718 356320 518878 447146 173522 329504 782199 364854 279362
667 279362 1756 111710 537099 -154557 -43640 -317799 62091 240460 138916 224185
657 224185 -190295 -79420 350025 -169076 -58431 -263552 8692 -132065 -299217 -212787
647 -212787 -312391 -174600 118605 -5749 102506 200217 25793 -162684 -189241 -25570
637 -25570 -264011 140452 -24138 -241196 -247876 -155681 140246 -238909 80742 50658 -166576
626 -166576 -511221 -530336 -298466 10749 52569 -162529 301126 179584 251767 252805 -68966
615 -68966 111278 561537 765549 750965 -56349 5032 -423766 27723 506152 703024
$$ packed form
688A40499k18874j6859N09537k80074k22158r3682k2702J36045M8135q8205K51045
677A42707m45191L82202K76602J62558p1732k73624J55982M52695m17345q5492
667B79362k77606J09954M25389o91656J10917k74159L79890J78369j01544Q5269
657B24185m14480J10875M29445n19101J10645k05121K72244j40757j67152Q6430
647b12787r9604J37791K93205j24354J08255R7711j74424j88477k6557J63671
637b5570k38441M04463j64590k17058o680R2195K95927l79155L19651l0084k17234
626a66576l44645j9115K31870L09215M1820k15098M63655j21542P2183J038l21771
615f8966J80244M50259K04012j4584q07314O1381m28798M51489M78429J96872
$$ plain form
605 703024 520371 -73305 104269 186781 391615 -136585 -303499 87018 313547 176676
595 176676 -162387 -233127 -551428 130088 -141071 63046 362132 73852 -39497 -653684
585 -653684 -65215 51515 -298230 220965 58160 -308058 -31112 11884 47674 135724
575 135724 158780 -365250 -523216 -407618 -95769 -665048 -448856 -186140 -72559 64934
565 64934 344085 83778 -59039 -21128 -41755 295629 308012 697511 395109 254377 257044
554 257044 68563 -183875 -259269 50921 103909 19666 143614 -13557 -228096 -280921 -63844
543 -63844 -191548 -226804 -67356 338831 -367363 -597438 -576379 -246160 -363966 -237279
533 -237279 -45549 -101272 -12389 -355800 -809372 -588395 482553 199284 -435611 11183
$$ packed form
605G03024j82653n93676J77574Q2512K04834n28200j66914L90517K26529j36871
595A76676l39063p0740l18301O81516k71159K04117K99086k88280j13349o14187
585f53684N88469J16730l49745N19195j62805l66218K76946M2996L5790Q8050
575A35724K3056n24030j57966J15598L11849n69279K16192K62716J13581J37493
565F4934K79151k60307j42817L7911k0627L37384J2383L89499l02402j40732K667
554B57044j88481k52438p5394L10190N2988q4243J23948j57171k14539n2825K17077
543f3844j27704l5256J59448M06187p06194k30075K1059L30219j17806J26687
533b37279J91730n5723Q8883l43411m53572K20977J070948k83269o34895M46794
$$ plain form
523 11183 273332 -119528 -191120 261740 -208214 -276154 -167077 182510 97763 -133891 72592
512 72592 269247 317905 402446 330749 492104 79028 -135709 418339 333705 178703 81554
501 81554 209901 270991 -261663 -147046 -252374 -287317 13129 -656563 -119807 91480
491 91480 -251952 -697780 -98737 235273 124640 51329 15078 111815 417353 300360 14148
480 14148 -206097 -255475 -397291 -176690 7738 -9559 -336991 -896501 -710672 -462838
470 -462838 -334027 -425954 -504201 12252 -126278 -225667 -455424 -329535 -296138 -83635 -54514
459 -54514 1059 -367466 -403788 -274756 218062 60855 61789 643064 240484 -230140 -306535
448 -306535 -100231 -18056 174070 -143018 -152345 151174 327707 -266893 -426130 -588789
$$ packed form
523A1183K62149l92860p1592M52860m69954o7940J09077L49587q4747k31654K06483
512G2592J96655M8658Q4541p1697J61355m13076k14737N54048q4634j55002r7149
501H1554J28347O1090n32654J14617j05328l4943L00446o69692N36756K11287
491I1480l43432m45828N99043L34010j10633p3311l6251R6737L05538j16993k86212
480A4148k20245m9378j41816K20601J84428j7297l27432n59510J85829K47834
470d62838J28811r1927p8247N16453j38530r9389k29757J25889L3397K12503K9121
459e4514N5573l68525l6322J29032M92818j57207R34N81275m02580m70624p6395
448c06535K06304Q2175J92126l17088r327L03519J76533n94600j59237j62659
$$ plain form
438 -588789 -582611 -535671 -139314 358775 297603 76412 80730 96139 110791 134029 -263191
427 -263191 -41265 16936 437105 919909 553349 109979 138520 -14764 -124663 150936
417 150936 488827 -57736 -596195 -691131 -526560 -519112 -530707 -169398 -123438 194097 -144753
406 -144753 -446150 -265446 -279693 -17584 -76513 -62570 -186115 -494873 -110591 -302643
396 -302643 -486423 -192798 5953 305457 127726 -212843 289294 548062 -100603 -607285
386 -607285 -55111 -283765 -359854 -258973 -425988 -290002 -249499 -55495 -37107 -265247
376 -265247 -477919 -217107 128908 17417 -135957 -586863 49120 89606 -113929 -468077
366 -468077 -632299 -343623 -295678 -292264 -176248 391 -69915 142152 40140 96091 50565
$$ packed form
438e88789O178M6940L96357M98089o1172k21191M318J5409J4652K3238l97220
427b63191K21926N8201M20169M82804l66560m43370K8541j53284j09899K75599
417A50936L37891n46563n38459r4936J64571P448j1595L61309M5960L17535l38850
406a44753l01397J80704j4247K62109n8929J3943j23545l08758L84282j92052
396c02643j83780K93625J98751K99504j77731l40569N02137K58768o48665n06682
386f07285N52174k28654p6089J00881j67015J35986M0503J94004J8388k28140
376b65247k12672K60812L46015j11491j53374m50906O35983M0486k03535l54148
366d68077j64222K88676M7945L414J16016J76639p0306K12067j02012N5951m5526
$$ plain form
355 50565 -149941 -111958 -5212 -277104 -476320 -659552 -432944 -243943 -240088 -350200 -339125
344 -339125 23387 -242982 -187010 -441723 -215797 156917 -266474 -785164 -455547 -138255
$$ packed form
355E0565k00506L7983J06746k71892j99216j83232K26608J89001L855j10112J1075
344c39125L62512k66369N5972k54713K25926L72714m23391n18690L29617L17292
$$ [...]
##END NTUPLES=NMR SPECTRUM
##END=
