##TITLE=1H_CG-1164-5
 CDCl3
 8 sc, 
 25.10.2022
##JCAMPDX= 6.0         $$ Bruker NMR JCAMP-DX V2.0
##DATA TYPE= NMR SPECTRUM
##DATA CLASS= NTUPLES
##ORIGIN= UXNMR, Bruker Analytische Messtechnik GmbH
##OWNER= root
$$ XWIN-NMR		Version 3.5
$$ Tue Oct 25 14:21:01 2022 Russian Standard Time (UT+4h)  she@DPX200
##.OBSERVE FREQUENCY= 200.1313499994
##.OBSERVE NUCLEUS= ^1H
##.ACQUISITION MODE= SIMULTANEOUS
##.ACQUISITION SCHEME= undefined
##.AVERAGES= 8
##.DIGITISER RES= 18
##SPECTROMETER/DATA SYSTEM= spect
##.PULSE SEQUENCE= zg30
##.SOLVENT NAME= CDCl3
##.SHIFT REFERENCE= (INTERNAL, CDCl3, 0, 15.7326)
##AUDIT TRAIL= $$ (NUMBER, WHEN, WHO, WHERE, WHAT)
$$ ##TITLE= Audit trail, XWIN-NMR		Version 3.5
$$ ##JCAMPDX= 5.01
$$ ##ORIGIN= Bruker BioSpin GmbH
$$ ##OWNER= she
$$ F:/spectra/data/she/nmr/H-F/1/pdata/1/auditp.txt
$$ ##AUDIT TRAIL=  $$ (NUMBER, WHEN, WHO, WHERE, WHAT)
(   1,<2022-10-25 14:20:00.09 +0400>,<she>,<DPX200>,
      <created by zg, POWCHK disabled, PULCHK disabled
       configuration hash MD5:
       00 E9 B6 7A A2 85 ED C7 34 08 36 98 17 FE 4E 26
       data hash MD5: 16K
       AA 89 E1 FE 5C 7D 8C 4B 24 FF 6B FE 79 E9 BE 52>)
(   2,<2022-10-25 14:20:02.53 +0400>,<she>,<DPX200>,
      <Start of raw data processing
       efp BC_mod = 2 LB = 0.24 FT_mod = 6 PKNL = 1 PHC0 = -18041.07 PHC1 = 18.4007 SI = 16K 
       data hash MD5: 16K
       61 E0 A6 D2 31 9E E5 8A 0F 81 1E 11 3A E2 ED 7F>)
(   3,<2022-10-25 14:20:17.17 +0400>,<she>,<DPX200>,
      <pk PHC0 = 3.000742 PHC1 = -3.2 
       data hash MD5: 16K
       4D 97 EB CB 04 73 68 01 5B 45 87 72 EE 4A 40 25>)
(   4,<2022-10-25 14:20:20.40 +0400>,<she>,<DPX200>,
      <abs ABSG = 5 
       data hash MD5: 16K
       4D 4D C7 48 D8 AD DB 26 3C 5F 54 D3 71 16 AE D6>)
$$ ##END=
$$ 
$$ hash MD5
$$ 3D AE 38 13 13 BE BF FD F4 BE 0F C0 10 96 99 61
##$RELAX= 
##$RELAX= 
##$RELAX= 
##$RELAX= 
##$RELAX= 
##$RELAX= 
$$ Bruker specific parameters
$$ --------------------------
##$DU= <F:/spectra>
##$EXPNO= 1
##$NAME= <H-F>
##$PROCNO= 1
##$TYPE= <nmr>
##$USER= <she>
##$AMP= (0..31)
100 100 100 100 100 100 100 100 100 100 100 100 100 100 100 100 100 100 
100 100 100 100 100 100 100 100 100 100 100 100 100 100 
##$AQSEQ= 0
##$AQ_mod= 1
##$AUNM= <au_zg>
##$AUTOPOS= <>
##$BF1= 200.13
##$BF2= 200.13
##$BF3= 200.13
##$BF4= 200.13
##$BF5= 200.13
##$BF6= 200.13
##$BF7= 200.13
##$BF8= 200.13
##$BYTORDA= 1
##$CFDGTYP= 0
##$CFRGTYP= 5
##$CHEMSTR= <none>
##$CNST= (0..31)
1 1 145 1 1 1 1 1 1 1 1 1 1 1 1 1 1 1 1 1 1 1 1 1 1 1 1 1 1 1 1 1 
##$CPDPRG= <>
##$CPDPRG1= <>
##$CPDPRG2= <>
##$CPDPRG3= <>
##$CPDPRG4= <mlev>
##$CPDPRG5= <mlev>
##$CPDPRG6= <mlev>
##$CPDPRG7= <mlev>
##$CPDPRG8= <mlev>
##$CPDPRGB= <>
##$CPDPRGT= <>
##$D= (0..31)
0 1.2 0 0 0 0 0 0 0 0.06 0 0.03 0 0 0 0 0.0002 0 0 0 0 0 0 0 0 0 0 0 0 
0 0 0 
##$DATE= 1666693199
##$DBL= (0..7)
120 120 120 120 120 120 120 120 
##$DBP= (0..7)
150 150 150 150 150 150 150 150 
##$DBP07= 0
##$DBPNAM0= <>
##$DBPNAM1= <>
##$DBPNAM2= <>
##$DBPNAM3= <>
##$DBPNAM4= <>
$$ [...]
##$SUBNAM3= <"">
##$SUBNAM4= <"">
##$SUBNAM5= <"">
##$SUBNAM6= <"">
##$SUBNAM7= <"">
##$SUBNAM8= <"">
##$SUBNAM9= <"">
##$SW= 18.0517283424941
##$SWIBOX= (0..15)
0 0 2 0 0 0 0 0 0 0 0 0 0 0 0 0 
##$SW_h= 3612.71676300578
##$TD= 16384
##$TD0= 1
##$TE= 0
##$TE2= 300
##$TE3= 300
##$TEG= 300
##$TL= (0..7)
0 120 120 120 120 120 120 120 
##$TP= (0..7)
150 150 150 150 150 150 150 150 
##$TP07= 0
##$TPNAME0= <>
##$TPNAME1= <>
##$TPNAME2= <>
##$TPNAME3= <>
##$TPNAME4= <>
##$TPNAME5= <>
##$TPNAME6= <>
##$TPNAME7= <>
##$TPOAL= (0..7)
0.5 0.5 0.5 0.5 0.5 0.5 0.5 0.5 
##$TPOFFS= (0..7)
0 0 0 0 0 0 0 0 
##$TUNHIN= 0
##$TUNHOUT= 0
##$TUNXOUT= 0
##$USERA1= <user>
##$USERA2= <user>
##$USERA3= <user>
##$USERA4= <user>
##$USERA5= <user>
##$V9= 5
##$VALIST= <valist>
##$VCLIST= <CCCCCCCCCCCCCCC>
##$VD= 0
##$VDLIST= <DDDDDDDDDDDDDDD>
##$VPLIST= <PPPPPPPPPPPPPPP>
##$VTLIST= <TTTTTTTTTTTTTTT>
##$WBST= 1024
##$WBSW= 4
##$XGAIN= (0..3)
0 0 0 0 
##$XL= 0
##$YL= 0
##$YMAX_a= 107785
##$YMIN_a= -182190
##$ZGOPTNS= <>
##$ZL1= 120
##$ZL2= 120
##$ZL3= 120
##$ZL4= 120
##$ABSF1= 15.74909
##$ABSF2= -2.302759
##$ABSG= 5
##$ABSL= 3
##$ALPHA= 0
##$AQORDER= 0
##$ASSFAC= 0
##$ASSFACI= 0
##$ASSFACX= 0
##$ASSWID= 0
##$AUNMP= <proc_1d>
##$AZFE= 0.1
##$AZFW= 0.1
##$BCFW= 0
##$BC_mod= 2
##$BYTORDP= 0
##$COROFFS= 0
##$CY= -3
##$DATMOD= 1
##$DC= 0
##$DFILT= <>
##$DTYPP= 0
##$F1P= 0
##$F2P= 0
##$FCOR= 1
##$FTSIZE= 16384
##$FT_mod= 6
##$GAMMA= 0
##$GB= 0
##$INTBC= 1
##$INTSCL= 3.70164e-10
##$ISEN= 128
##$LB= 0.24
##$LEV0= 0
##$LPBIN= 0
##$MAXI= 10000
##$MC2= 0
##$MEAN= 0
##$ME_mod= 0
##$MI= 1.114404
##$NCOEF= 0
##$NC_proc= -7
##$NLEV= 6
##$NOISF1= 3.799351
##$NOISF2= 2.8
##$NSP= 0
##$NTH_PI= 0
##$NZP= 0
##$OFFSET= 15.73257
##$PC= 1
##$PHC0= -18038.07
##$PHC1= 15.2007
##$PH_mod= 1
##$PKNL= yes
##$PPARMOD= 0
##$PSCAL= 0
##$PSIGN= 0
##$REVERSE= no
##$SF= 200.130007798612
##$SI= 16384
##$SIGF1= 3
##$SIGF2= 2
##$SINO= 5.538805
##$SIOLD= 16384
##$SREGLST= <1H.CDCl3>
##$SSB= 0
##$STSI= 16384
##$STSR= 0
##$SW_p= 3612.71676300578
##$SYMM= 0
##$S_DEV= 0
##$TDeff= 16384
##$TDoff= 0
##$TI= <>
##$TILT= no
##$TM1= 0
##$TM2= 0
##$TOPLEV= 0
##$USERP1= <user>
##$USERP2= <user>
##$USERP3= <user>
##$USERP4= <user>
##$USERP5= <user>
##$WDW= 1
##$XDIM= 16384
##$YMAX_p= 513765694
##$YMIN_p= -813023
$$ End of Bruker specific parameters
$$ ---------------------------------
##NTUPLES= NMR SPECTRUM
##VAR_NAME=  FREQUENCY,     SPECTRUM/REAL,   SPECTRUM/IMAG
##SYMBOL=    X,             R,               I
##VAR_TYPE=  INDEPENDENT,   DEPENDENT,       DEPENDENT
##VAR_FORM=  AFFN,          ASDF,            ASDF
##VAR_DIM=   16384,         16384,           16384
##UNITS=     HZ,            ARBITRARY UNITS, ARBITRARY UNITS
##FACTOR=    0.220516191357247, 1,           1
##FIRST=     3148.5592956563, 0,             0
##LAST=      -464.157467349477, 0,           0
##MIN=       -464.157467349477, -813023,     0
##MAX=       3148.5592956563, 513765694,     0
$$ Real data points
##PAGE= N=1
##DATA TABLE= (X++(R..R)), XYDATA
$$ [...]
$$ plain form
7077 9001358 8463063 7898512 7817548 7686355 7321705 6988864 6591567 6443613 6100300 6049045
7067 6049045 6009770 5459515 5259664 5163752 4940500 4617609 4366811 4385492 3669441 3428250
7057 3428250 3696414 3811750 3388453 3111678 3266439 3116595 3108481 3156636 3081942 2989176
7047 2989176 3050222 2989809 2580735 2866007 2661017 2626674 2478309 2494775 2596939 2545794
7037 2545794 2069414 1816464 2062927 1980534 2024167 1861564 1901012 1625349 1658412 1647211
7027 1647211 1366231 1441474 1466922 1736513 1659507 1313273 1428526 1555988 1516536 1289562
7017 1289562 1263910 766968 1179844 1567822 1473067 1220290 996948 1001942 1009021 737512 1042104
7006 1042104 1051397 1133863 1054544 846048 960037 732548 751707 929085 902574 747510 860591
$$ packed form
7077I001358n38295n64551q0964j31193l64650l32841l97297j47954l43313n1255
7067F049045l9275n50255j99851r5912k23252l22891k50798J8681p16051k41191
7057C428250K68164J15336m23297k76775J54761j49844q114M8155p4694r2766
7047B989176O1046o0413m09074K85272k04990l4343j48365J6466J02164n1145
7037B545794m76380k52950K46463q2393M3633j62603L9448k75663L3063j1201
7027A647211k80980P5243K5448K69591p7006l46234J15253J27462l9452k26974
7017A289562k5652m96942M12876L87978r4755k52777k23342M994P079k71509L04592
7006A042104R293Q2466p9319k08496J13989k27489J9159J77378k6511j55064J13081
$$ plain form
6995 860591 965010 951728 1019945 889735 504920 643090 1079300 779936 356226 726976
6985 726976 543268 424141 456915 290972 77203 252748 475079 639824 1101092 872442
6975 872442 871285 683861 680951 545609 404993 483782 406212 316222 278958 641233 438387
6964 438387 583881 483838 326655 237459 414306 714381 531608 550696 585162 318487
6954 318487 396260 139963 236290 83353 72339 171717 403755 129213 -203716 90034
6944 90034 113910 139964 278841 297538 167589 119710 -47934 118608 172260 114944 176660
6933 176660 -110312 108915 353318 308663 491911 438448 527225 704699 649087 708925 436472
6922 436472 502869 555080 292403 584833 282313 84253 38565 239821 295738 218033 216005
$$ packed form
6995H60591J04419j3282O8217j30210l84815J38170M36210k99364m23710L70750
6985G26976j83708j19127L2774j65943k13769J75545K22331J64745M61268k28650
6975H72442j157j87424k910j35342j40616P8789p7570q9990l7264L62275k02846
6964D38387J45494j00043j57183q9196J76847L00075j82773J9088L4466k66675
6954C18487P7773k56297R6327j52937j1014R9378K32038k74542l32929K93750
6944I0034K3876K6054J38877J8697j29949m7879j67644J66542N3652n7316O1716
6933A76660k86972K19227K44403m4655J83248n3463Q8777J77474n5612N9838k72453
6922D36472O6397N2211k62677K92430l02520j98060m5688K01256N5917p7705k028
$$ plain form
6911 216005 204079 -1800 132881 52531 -56438 -149797 265128 241158 219811 177402 361015
6900 361015 366869 156682 425914 305368 55365 -23939 153778 151077 296930 22281 216938
6889 216938 283486 -92721 -210707 140016 287337 112834 -29129 -211475 -86526 200235
6879 200235 331023 183249 138572 105880 -314246 -249350 -132505 -45657 162550 87242 -170541
6868 -170541 -79704 22131 168603 87764 -122792 -179757 -434588 -196047 -18687 -183907
6858 -183907 -248372 -103427 -135971 54816 106515 -32356 -60032 219763 56267 -241843
6848 -241843 -173556 -121799 -62849 -163742 -300788 -31087 12940 -7301 -241420 -232755 -395851
6837 -395851 -159013 25306 -235307 -237448 167232 166055 -205718 -177901 10602 107583 -62650
$$ packed form
6911B16005j1926k05879J34681q0350j08969r3359M14925k3970k1347m2409J83613
6900C61015N854k10187K69232j20546k50003p9304J77717k701J45853k74649J94657
6889B16938O6548l76207j17986L50723J47321j74503j41963j82346J24949K86761
6879B00235J30788j47774m4677l2692m20126O4896J16845Q6848K08207p5308k57783
6868a70541R0837J01835J46472q0839k10556n6965k54831K38541J77360j65220
6858a83907o4465J44945l2544J90787N1699j38871k7676K79795j63496k98110
6848b41843O8287N1757N8950j00893j37046K69701M4027k0241k34119Q665j63096
6837c95851K36838J84319k60613k141M04680j177l71773K7817J88503R6981j70233
$$ plain form
6826 -62650 24908 -197914 47928 6028 -89535 99779 100198 40955 21413 44546 -14840 128492
6814 128492 23259 -327359 -257315 -518132 -487944 -55211 -41663 100153 -24166 -99853
6804 -99853 -107534 -339950 -255199 21673 18238 -374622 -369208 -152811 175019 361573 429258
6793 429258 -47606 -87781 32481 269110 458379 152803 -44316 -257074 33156 211835
6783 211835 225127 190165 243071 322551 358261 9746 -172468 225581 -24048 166816 259677
6772 259677 191504 143361 -72420 -184157 -240373 -200882 -80058 -279367 -160849 -195147 -177278
6761 -177278 66959 188763 126806 -338777 -113877 -46439 -196671 -81758 88730 261798
6751 261798 163853 -70910 -71716 -468991 -284672 -122066 -294902 -430313 -214105 -49094
$$ packed form
6826f2650Q7558k22822K45842m1900r5563J89314M19n9243j9542K3133n9386J43332
6814A28492j05233l50618P0044k60817L0188M32733J3548J41816j24319p5687
6804i9853p681k32416Q4751K76872l435l92860N414K16397L27830J86554O7685
6793D29258m76864m0175J20262K36629J89269l05576j97119k12758K90230J78679
6783B11835J3292l4962N2906P9480L5710l48515j82214L98049k49629J90864R2861
6772B59677o8173m8143k15781j11737n6216L9491J20824j99309J18518l4298J7869
6761a77278K44237J21804o1957m65583K24900O7438j50232J14913J70488J73068
6751B61798r7945k34763q06l97275J84319J62606j72836j35411K16208J65011
$$ plain form
6741 -49094 -152680 35756 -118152 16942 -13767 137138 333209 239671 490803 604666
6731 604666 292330 386438 134003 50210 -162626 -147596 -23828 -147979 -95812 -105682 173161
6720 173161 467293 374664 356743 119819 274321 485333 485239 768503 707280 719806 326804
6709 326804 566165 756945 1068747 1076858 766444 613513 789780 639816 281876 319947
6699 319947 516385 319567 126036 163338 281379 300408 199384 43506 27 180376
6689 180376 188255 16303 1027 131343 -2296 -43433 -109293 192794 290098 163597 206184
6678 206184 -17482 47658 131773 251350 -16952 -68376 -90328 94545 102339 -141823 13228
6667 13228 177634 199385 167640 193703 153723 278002 142750 -55803 182135 212219 266160
$$ packed form
6741d9094j03586J88436j53908J35094l0709J50905J96071r3538K51132J13863
6731F04666l12336R4108k52435q3793k12836J5030J23768j24151N2167r870K78843
6720A73161K94132r2629j7921k36924J54502K11012r4K83264o1223J2526l93002
6709C26804K39361J90780L11802Q111l10414j52931J76267j49964l57940L8071
6699C19947J96438j96818j93531L7302J18041J9029j01024j55878m3479J80349
6689A80376P879j71952j5276J30316j33639m1137o5860L02087R7304j26501M2587
6678B06184k23666O5140Q4115J19577k68302n1424k1952J84873P794k44162J55051
6667A3228J64406K1751l1745K6063l9980J24279j35252j98553K37938L0084N3941
$$ plain form
6656 266160 271587 458649 495610 342830 125304 39524 369918 379957 395415 195536 245282
6645 245282 511037 433177 311200 200297 165533 146270 64961 445 13628 231312 -14285
6634 -14285 -147540 274563 301429 516060 429753 251881 102492 6837 64806 -36532 -9161
6623 -9161 114462 175550 -54659 63990 -184235 34822 35322 -87725 137568 -80590 61360
6612 61360 348191 238901 161745 29687 17860 79508 379632 221290 312969 338033 403730
6601 403730 183272 -67491 247367 165645 -174520 78073 106435 -89415 169780 236210
6591 236210 187223 166174 224266 181505 55119 -60926 24151 223455 314506 327244 -69239
6580 -69239 -67852 -53773 104801 256765 116043 95442 50076 -59400 -62777 -30072 -49149
$$ packed form
6656B66160N427J87062L6961j52780k17526q5780L30394J0039J5458j99879M9746
6645B45282K65755p7860j21977j10903l4764j9263q1309o4516J3183K17684k45597
6634a4285j33255M22103K6866K14631q6307j77872j49389r5655N7969j01338K7371
6623i161J23623O1088k30209J18649k48225K19057N00j23047K25293k18158J41950
6612F1360K86831j09290p7156j32058j1827O1648L00124j58342R1679K5064O5697
6601D03730k20458k50763L14858q1722l40165K52593K8362j95850K59195O6430
6591B36210m8987k1049N8092m2761j26386j16045Q5077J99304R1051J2738l96483
6580f9239J387J4079J58574J51964j40722k0601m5366j09476l377L2705j9077
$$ plain form
6569 -49149 -87404 -222108 58717 107317 110930 72280 87847 203320 531974 698495 504921
6558 504921 209597 161542 106307 -41478 22769 64046 83602 348386 94599 151230 241900
6547 241900 119313 -85633 -358300 14568 115010 -8024 46079 -178432 20975 232655
6537 232655 53592 -200464 -236827 -213021 -88792 18878 -116143 -121984 -216826 -166466 -191115
6526 -191115 -97782 277270 -12063 -173275 -252591 -14928 -86782 -261367 -363065 -204960
6516 -204960 -102110 -273732 -199403 -280944 -43294 -1837 -288681 -205047 -38903 -146936
6506 -146936 -90155 106296 224492 52611 892 -107132 -307677 -237872 -108911 256297
6496 256297 136787 -156761 33354 11061 318911 363008 205054 73195 50368 -98077
$$ packed form
6569d9149l8255j34704K80825M8600L613l8650J5567J15473L28654J66521j93574
6558E04921k95324m8055n5235j47785O4247M1277J9556K64784k53787N6631R0670
6547B41900j22587k04946k72667L72868J00442j23034N4103k24511J99407K11680
6537B32655j79063k54056l6363K3806J24229J07670j35021n841r4842N0360k4649
6526a91115R3333L75052k89333j61212p9316K37663p1854j74585j01698J58105
6516b04960J02850j71622P4329q1541K37650M1457k86844Q3634J66144j08033
6506a46936N6781J96451J18196j71881n1719j08024k00545O9805J28961L65208
6496B56297j19510k93548J90115k2293L07850M4097j57954j31859k2827j48445
$$ plain form
6486 -98077 -73032 230290 160661 -100457 34185 434150 450537 266914 -24112 53854 239325
6475 239325 182022 -84094 -95736 147555 288743 460 -209634 -17602 -25862 61221 -52240
6464 -52240 -190198 -406673 -365495 -192863 -5279 -349105 -464701 -460996 -166602 45273
6454 45273 -18616 -140064 111396 103900 76251 76352 -228395 -262576 291499 264332 279218 -15620
6442 -15620 -160553 11347 107796 399985 244860 322563 190676 -58820 21249 136041
6432 136041 237514 424720 433253 567702 339657 252075 411471 464544 296494 97712
6422 97712 29350 432140 96018 115017 163520 343838 455431 382919 -56773 -241136 224943
6411 224943 330523 -34693 193530 190194 416143 286543 212725 224697 78572 222501
$$ packed form
6486i8077K5045L03322o9629k61118J34642L99965J6387j83623k91026P7966J85471
6475B39325n7303k66116j1642K43291J41188k88283k10094J92032q260Q7083j13461
6464e2240j37958k16475M1178J72632J87584l43826j15596L705K94394K11875
6454D5273o3889j21448K51460p496k7649J01l04747l4181N54075k7167J4886k94838
6442a5620j44933J71900R6449K92189j55125P7703j31887k49496Q0069J14792
6432A36041J01473J87206Q533J34449k28045q7582J59396N3073j68050j98782
6422I7712o8362M02790l36122J8999M8503J80318J11593p2512m39692j84363M66079
6411B24943J05580l65216K28223l336K25949j29600p3818J1972j46125J43929
$$ plain form
6401 222501 47982 -87385 15678 242859 39892 120137 71531 -324141 21823 199590
6391 199590 261295 457256 308665 107301 151749 371962 84035 139659 62194 153279 -22700
6380 -22700 -166364 -79338 -85181 116734 561279 332025 30865 390786 279326 89005
6370 89005 200707 369859 397078 575875 708560 392819 119448 39780 152109 -108982
6360 -108982 84279 359152 422834 617028 447980 334968 563930 711677 743565 563676
6350 563676 509988 691557 405380 319813 137400 243814 474498 551270 589581 656552 659595
6339 659595 569257 521526 443587 257788 507667 658301 373906 394394 747173 555381
6329 555381 242103 777279 478264 422510 442189 32107 -23035 232519 612051 441833
$$ packed form
6401B22501j74519j35367J03063K27181k02967Q0245m8606l95672L45964J77767
6391A99590O1705J95961j48591k01364M4448K20213k87927N5624p7465R1085j75979
6380b2700j43664Q7026n843K01915M44545k29254l01160L59921j11460j90321
6370H9005J11702J69152K7219J78797J32685l15741k73371p9668J12329k61091
6360a08982J93261K74873O3682J94194j69048j13012K28962J47747L1888j79889
6350E63676n3688J81569k86177q5567j82413J06414K30684P6772L8311O6971L043
6339F59595r0338m7731p7939j85799K49879J50634k84395K0488L52779j91792
6329E55381l13278N35176k99015n5754J9679m10082n5142K55554L79532j70218
$$ plain form
6319 441833 198419 282461 240071 129968 42203 144650 344784 322878 472222 479970 624388
6308 624388 623377 578763 620195 496719 752431 642334 769449 669887 355442 192551 518769
6297 518769 623273 586255 460775 638021 486478 226838 553036 599594 560607 876457
6287 876457 800235 1041589 1029450 808281 877752 882436 811214 478540 732614 443781 671645
6276 671645 916469 888263 558747 578745 628575 685811 859763 1013911 892265 922857 1021485
6265 1021485 1073609 974345 770338 1117521 922667 1025494 1084139 898754 1125951 761606
6255 761606 811473 832779 670830 949945 1062120 1175796 987837 888125 916180 1098883
6245 1098883 1036201 1154215 1208775 1296473 1280061 1083581 953932 936574 1108928 933548
$$ packed form
6319D41833k43414Q4042m2390j10103q7765J02447K00134k1906J49344P748J44418
6308F24388j011m4614M1432j23476K55712j10097J27115r9562l14445j62891L26218
6297E18769J04504l7018j25480J77246j51543k59640L26198M6558l8987L15850
6287H76457p6222K41354j2139k21169O9471M684p1222l32674K54074k88833K27864
6276F71645K44824k8206l29516J9998M9830N7236J73952J54148j21646L0592R8628
6265A021485N2124r9264k04007L47183j94854J02827N8645j85385K27197l64345
6255G61606M9867K1306j61949K79115J12175J13676j87959r9712K8055J82703
6245A098883o2682J18014N4560Q7698j6412j96480j29649j7358J72354j75380
$$ plain form
6235 933548 949450 1077688 1095206 1170013 1320060 1472234 1393262 1631641 1699763 1950257 2058265
6224 2058265 1944983 1483560 1306166 1293760 1478200 1545600 1292566 1205618 1236376 1206452
6214 1206452 1158085 1256210 1113729 1382343 1185687 950942 1223599 1587457 1435230 1741973
6204 1741973 1900892 1841473 1721123 1590961 1439344 1528956 1461231 1372864 1608805 1474292
6194 1474292 1290238 1173237 1106311 1324241 1340315 943859 1078117 1056934 1053268 1059546 1255779
6183 1255779 1371294 1113250 1132443 813370 942148 1024100 1059489 1090072 1201875 1193900 1094797
6172 1094797 815009 1109935 1052031 924836 948147 837132 1005247 1175925 1092762 1028114
6162 1028114 954722 929286 1114362 983847 1149417 1351407 1308355 1148144 1203581 1184652
$$ packed form
6235I33548J5902J28238J7518P4807J50047J52174p8972K38379O8122K50494J08008
6224B058265j13282m61423j77394j2406J84440O7400k53034q6948L0758k9924
6214A206452m8367R8125j42481K68614j96656k34745K72657L63858j52227L06743
6204A741973J58919n9419j20350j30162j51617Q9612o7725q8367K35941j34513
6194A474292j84054j17001o6926K17930J6074l96456J34258k1183l666O278J96233
6183A255779J15515k58044J9193l19073J28778Q1952L5389L0583J11803p975r9103
6172A094797k79788K94926n7904j27195K3311j11015J68115J70678q3163o4648
6162A028114p3392k5436J85076j30515J65570K01990m3052j60211N5437j8929
$$ plain form
6152 1184652 1282047 1355745 1481399 1503390 1258252 1363941 1593508 1433430 1586704 1667191
6142 1667191 1803193 2030640 2085502 1798954 1543997 1638763 1556974 1293708 1490778 1620081
6132 1620081 1595152 1869303 2078930 1714451 1859650 1690041 1522352 1493016 1402815 1672082
6122 1672082 1819305 1888194 1878705 1982372 2100453 1962474 2173431 2413845 2349302 2629503
6112 2629503 2558422 2188967 2155733 2322749 2112181 2220225 2374110 2388365 2471911 2564496
6102 2564496 2464513 2881255 3033453 3090807 2927447 2667751 2766893 2683031 2867854 2805193
6092 2805193 2568205 2617269 2736044 2863863 2963320 2885904 2871573 3044461 2757508 2577892
6082 2577892 2694724 2544544 2513910 2418952 2188847 2305468 2352168 2455608 2815899 3053416
$$ packed form
6152A184652R7395P3698J25654K1991k45138J05689K29567j60078J53274Q0487
6142A667191J36002K27447N4862k86548k54957R4766q1789k63266J97070J29303
6132A620081k4929K74151K09627l64479J45199j69609j67689k9336r0201K69267
6122A672082J47223O8889r489J03667J18081j37979K10957K40414o4543K80201
6112B629503p1081l69455l3234J67016k10568J08044J53885J4255Q3546R2585
6102B564496r9983M16742J52198N7354j63360k59696R9142q3862J84823o2661
6092B805193k36988M9064J18775J27819R9457p7416j4331J72888k86953j79616
6082B577892J16832j50180l0634r4958k30105J16621M6700J03440L60291K37517
$$ plain form
6072 3053416 3033157 2717274 2745272 2805246 2928260 2897676 2639394 2720842 3013110 2969722 3241369
6061 3241369 3289377 3301686 3081505 3101878 3285993 3992686 3984085 4035070 4300002 4187628 4173072
6050 4173072 4198394 3924163 3681648 4230686 4494940 4348716 4079785 4219529 4451262 4940078
6040 4940078 4984065 4476602 4022173 4237371 4558652 4508272 4640154 4470220 4201657 4012292
6030 4012292 4136732 4243669 4291644 4173812 4075701 4147941 4198811 4286594 4708908 4931170
6020 4931170 4818203 4981047 4940237 4953574 4970030 4978993 5071894 5339480 5133434 5184462 5536782
6009 5536782 5640949 5898598 5824899 5876695 6092801 5950594 5876255 5839418 6147756 6287044
5999 6287044 6164274 6551023 6853573 6949088 6963628 7040694 7308466 7376852 7878102 8097100
$$ packed form
6072C053416k0259l15883K7998N9974J23014l0584k58282Q1448K92268m3388K71647
6061C241369M8008J2309k20181K0373J84115P06693q601N0985K64932j12374j4556
6050D173072K5322k74231k42515N49038K64254j46224k68931J39744K31733M88816
6040D940078M3987n07463m54429K15198L21281n0380J31882j69934k68563j89365
6030D012292J24440J06937M7975j17832r8111P2240N0870Q7783M22314K22262
6020D931170j12967J62844m0810J3337J6456Q963R2901K67586k06046N1028L52320
6009E536782J04167K57649p3699N1796K16106j42207p4339l6837L08338J39288
5999F287044j22770L86749L02550R5515J4540P7066K67772O8386N01250K18998
$$ plain form
5989 8097100 8414800 8321682 8641933 8709812 8798908 9329032 9555290 9705879 9898919 10271389
5979 10271389 10482884 10725947 11251553 11853477 12067516 12390631 13022662 13432276 13994132
5970 13994132 14360105 14964274 15435266 15721645 16197846 16775189 17183384 17351067 17880408
5961 17880408 18183507 18509764 18851734 18972137 19464876 20144837 20634166 21172913 21920617
5952 21920617 23060553 24039971 24988523 25796188 26699396 27395088 28161417 29183644 29893904
5943 29893904 30410825 31044471 31979512 32806590 33541502 34008984 34341089 34885900 35591729
5934 35591729 35962939 36449661 37435637 38378840 39524396 40504762 41658642 42851970 44082319
5925 44082319 45958040 47926323 50277559 52532807 54416869 56506895 58521651 60305940
$$ packed form
5989H097100L17700r3118L20251O7879Q9096N30124K26258J50589J93040L72470
5979A0271389K11495K43063N25606O01924K14039L23115O32031M09614N61856
5970A3994132L65973O04169M70992K86379M76201N77343M08195J67683N29341
5961A7880408L03099L26257L41970J20403M92739O79961M89329N38747P47704
5952B1920617J139936R79418R48552Q07665R03208O95692P66329J022227P10260
5943B9893904N16921O33646R35041Q27078P34912M67482L32105N44811P05829
5934C5591729L71210M86722R85976R43203J145556R80366J153880J193328J230349
5925D4082319J875721J968283K351236K255248J884062K090026K014756J784289
$$ plain form
5917 60305940 61795380 63803080 65297144 66536118 67946599 69243444 70337549 71698297
5909 71698297 74109597 76789011 79808013 83989914 89229373 95133941 101870745 109262030
5901 109262030 116771665 125115443 133277565 141547683 150781605 162045252 176286977 193078299
5893 193078299 212681937 232396610 248760806 257834618 257931533 250137693 238013849 225074510
5885 225074510 210919099 194331277 176327502 158949234 143554061 131013970 121272202
5878 121272202 114006217 108729568 104363330 99610361 94162387 87815695 81184130 74699853
5870 74699853 68964530 64540398 61043788 59098494 57646751 56005484 53888377 51765289
5862 51765289 49360663 46454452 43169284 39466740 36270393 33740035 31462033 29176276
$$ packed form
5917F0305940J489440K007700J494064J238974J410481J296845J094105J360748
5909G1698297K411300K679414L019002M181901N239459N904568O736804P391285
5901A09262030P509635Q343778Q162122Q270118R233922J1263647J4241725J6791322
5893A93078299J9603638J9714673J6364196R073812R6915p793840j2123844j2939339
5885B25074510j4155411j6587822j8003775j7378268j5395173j2540091r741768
5878A21272202p265985n276649m366238m752969n447974o346692o631565o484277
5870G4699853n735323m424132l496610j945294j451743j641267k117107k123088
5862E1765289k404626k906211l285168l702544l196347k530358k278002k285757
$$ plain form
5854 29176276 27664423 26384368 25090327 24103360 22913533 21808505 21131301 20209043 19033721
5845 19033721 17995402 17102032 16592858 15916771 15572284 15120675 14572311 13964735 13553433
5836 13553433 13133471 12800965 12641960 11985379 11565510 11063090 10968404 10319713 10001755 10004553
5826 10004553 9962072 9844050 9246351 9007637 8945050 8544088 8414822 8142599 8261222 8181179
5816 8181179 7826125 7764655 7593191 7163908 6679519 6591442 6686238 6321249 6084906 6192080
5806 6192080 6323411 5859543 5876636 5857138 5533759 5453042 5363887 4861849 4996938 4713516
5796 4713516 4432808 4635327 4536065 4625712 4603529 4650880 4257764 4043446 3925366 4061751
5786 4061751 3984584 3764558 3774152 3918100 3930820 3742960 3616652 3665366 3631102 3815250 3916142
$$ packed form
5854B9176276j511853j280055j294041r86967j189827j105028o77204r22258j175322
5845A9033721j038319q93370n09174o76087l44487m51609n48364o07576m11302
5836A3553433m19962l32506j59005o56581m19869n02420r4686o48691l17958K798
5826A0004553m2481j18022n97699k38714o2587m00962j29266k72223J18623q0043
5816H181179l55054o1470j71464m29283m84389q8077R4796l64989k36343J07174
5806F192080J31331m63868J7093j9498l23379q0717q9155n02038J35089k83422
5796D713516k80708K02519r9262Q9647k2183M7351l93116k14318j18080J36385
5786D061751p7167k20026R594J43948J2720j87860j26308M8714l4264J84148J00892
$$ plain form
5775 3916142 4001308 3988644 3992047 3841488 3621942 3435257 3778223 3978655 3813230 3502180
5765 3502180 3532139 3820093 3960233 3896551 3974316 3767430 3777380 3705868 3648455 3211012 2982847
5754 2982847 3130096 2916673 2882708 2827355 2570814 2966803 2908256 2862149 2773673 2529124
5744 2529124 2672439 2873053 2791221 2736550 2523221 2378043 2568153 2477446 2643910 2946854
5734 2946854 3071423 2853238 2835283 2812343 2435515 2341911 2458007 2343866 2246601 2454146
5724 2454146 2307427 2157996 2031427 2188978 2294908 2227227 2133373 2119395 2006232 1992776
5714 1992776 2323761 2299390 2606265 2584243 2884538 2670123 2788487 2822041 2876707 2697824
5704 2697824 2387423 2270113 2544479 2382264 2089866 2188227 1987087 2082094 2218497 2253902
$$ packed form
5775C916142Q5166j2664L403j50559k19546j86685L42966K00432j65425l11050
5765C502180K9959K87954J40140o3682P7765k06886R950p1512n7413m37443k28165
5754B982847J47249k13423l3965n5353k56541L95989n8547m6107q8476k44549
5744B529124J43315K00614q1832n4671k13329j45178J90110r0707J66464L02944
5734B946854J24569k18185j7955k2940l76828r3604J16096j14141r7265K07545
5724B454146j46719j49431j26569J57551J05930o7681r3854j3978j13163j3456
5714A992776L30985k4371L06875k2022L00295k14415J18364L3554N4666j78883
5704B697824l10401j17310K74366j62215k92398R8361k01140R5007J36403L5405
$$ plain form
5694 2253902 2079078 1987445 1913563 1989327 2075399 2144884 2285775 2459428 2392272 2537494 2278477
5683 2278477 2470192 2575833 2270940 2341701 2242209 2199720 2101489 1826207 2000118 1950872
5673 1950872 1734614 1911437 2076848 1946877 1878483 2044769 1860703 1985982 2127603 2102287
5663 2102287 1954268 2009257 1687311 1730299 1748782 1880167 2079359 1855878 2078645 2060769
5653 2060769 1689388 1573372 1397746 1471776 1557205 1355271 1679434 1818107 1982649 1655594
5643 1655594 1395533 1815013 1835160 1604574 1720154 2002875 1969778 2017624 2088524 1920305
5633 1920305 1787148 2024473 1934290 1839706 2154983 1933852 1605770 1820255 1863107 1800869
5623 1800869 1577542 1646269 1733480 1930700 2162819 1910191 1786253 1847746 1851366 1877974 1928734
$$ packed form
5694B253902j74824r1633p3882P5764Q6072O9485J40891J73653o7156J45222k59017
5683B278477J91715J05641l04893P0761r9492m2489r8231k75282J73911m9246
5673A950872k16258J76823J65411j29971o8394J66286j84066J25279J41621k5316
5663B102287j48019N4989l21946M2988J8483J31385J99192k23481K22767j7876
5653B060769l71381j16016j75626P4030Q5429k01934L24163J38673J64542l27055
5643A655594k60061M19480K0147k30586J15580K82721l3097M7846P0900j68219
5633A920305j33157K37325r0183r4584L15277k21131l28082K14485M2852o2238
5623A800869k23327O8727Q7211J97220K32119k52628j23938O1493L620K6608N0760
$$ plain form
5612 1928734 2044891 2228877 2035694 1919949 2235649 2095637 1906961 1983889 2124058 2279347
5602 2279347 2164570 2477743 2428037 2445697 2527426 2198636 2232762 2210463 2303849 2253995 2526783
5591 2526783 2660789 2514799 2519604 2538182 2393195 2299635 2411241 2586054 2494576 2665729
5581 2665729 2758282 2728276 2459384 2417587 2538313 2677162 2821053 3008369 2996616 3352250
5571 3352250 3234604 3181394 3370687 3354724 3575868 3670065 3522955 3381514 3407191 3424215
5561 3424215 3689878 3851916 3892639 3705943 3794664 3619569 3536530 3782671 3779195 3601671
5551 3601671 3419267 3318449 3656497 3802216 3925111 4199667 4211551 4010924 4170252 4148529
5541 4148529 4144994 4324485 4616943 4195330 4575530 4804888 4943988 5079988 5034939 4824886
$$ packed form
5612A928734J16157J83986j93183j15745L15700j40012j88676P6928J40169J55289
5602B279347j14777L13173m9706J7660Q1729l28790L4126k2299R3386m9854K72788
5591B526783J34006j45990M805J8578j44987r3560J11606J74813r1478J71153
5581B665729R2553l0006k68892m1797J20726J38849J43891J87316j1753L55634
5571C352250j17646n3210J89293j5963K21144R4197j47110j41441K5677J7024
5561C424215K65663J62038M0723j86696Q8721j75095q3039K46141l476j77524
5551C601671j82404j00818L38048J45719J22895K74556J1884k00627J59328k1723
5541D148529l535J79491K92458m21613L80200K29358J39100J36000m5049k10053
$$ plain form
5531 4824886 4792876 4724006 4966883 4902451 5154622 5140596 5186091 5757901 5731300 5812089 5842723
5520 5842723 6437967 6230521 6028915 6587230 7034771 7263778 7362185 7655122 7539888 7635543
5510 7635543 7794508 8140229 8091353 8382167 8430516 8311905 8530690 8944076 8951407 9265264
5500 9265264 9559963 10085713 10461248 10901189 11563959 11672596 12483949 13673019 14826317
5491 14826317 15481544 15637897 15628141 15527900 15565715 15513797 15219395 15141393 15161370 15386250
5481 15386250 15933944 16552588 16754750 16909267 17122992 17139481 17449694 18379453 18569440 18857442
5471 18857442 19230435 19811036 20225178 21033928 21487600 21278530 21245347 21385146 21564268 22017334
5461 22017334 22251340 23142241 23807999 24523402 25230089 26511684 27561851 29133212 30895930
$$ packed form
5531D824886l2010o8870K42877o4432K52171j4026M5495N71810k6601Q0789L0634
5520E842723N95244k07446k01606N58315M47541K29007R8407K92937j15234R5655
5510G635543J58965L45721m8876K90814M8349j18611K18785M13386P331L13857
5500I265264K94699N25750L75535M39941O62770J08637Q11353J189070J153298
5491A4826317O55227J56353r756j00241L7815n1918k94402p8002J9977K24880
5481A5386250N47694O18644K02162J54517K13725J6489L10213R29759J89987K88002
5471A8857442L72993N80601M14142Q08750M53672k09070l3183J39799J79122M53066
5461B2017334K34006Q90901O65758P15403P06687J281595J050167J571361J762718
$$ plain form
5452 30895930 32212874 33652521 35485786 37859180 40705957 43940483 47658284 52596969
5444 52596969 58331682 64957352 73394729 83047282 92933185 100613500 103459519 102217150
5436 102217150 98982195 95240339 92490673 91527050 92903731 96246040 99885052 102036972
5428 102036972 101350441 99209512 97658029 97384587 98126952 100110242 103415727 107431656
5420 107431656 112181470 117145906 120527540 121439153 118675322 111162591 101250692 92491120
5412 92491120 85403687 80528572 78022710 76572143 75559344 74631992 74241229 72973188
5404 72973188 69398880 62971622 54920330 47877453 42130357 37716245 34434037 31708208
5396 31708208 29327309 27121599 25369504 23809919 22469096 21563150 20856492 20127775 19557251
$$ packed form
5452C0895930J316944J439647J833265K373394K846777L234526L717801M938685
5444E2596969N734713O625670Q437377R652553R885903P680315K846019j242369
5436A02217150l234955l741856k749666r63623J376681L342309L639012K151920
5428A02036972o86531k140929j551483k73442P42365J983290L305485M015929
5420A07431656M749814M964436L381634R11613k763831p512731r911899q759572
5412I2491120p087433m875115k505862j450567j012799r27352l90763j268041
5404G2973188l574308o427258q051292p042877n747096m414112l282208k725829
5396C1708208k380899k205710j752095j559585j340823r05946p06658p28717n70524
$$ plain form
5387 19557251 19032100 18599535 18333656 18188527 17959825 18200317 18603249 18774995 19236273
5378 19236273 19696865 19367511 18460615 17514705 16407777 15485098 14395491 13931859 13048988
5369 13048988 12601927 11778568 11303421 11229219 11140636 10697902 10447685 10774014 10677437 10616127
5359 10616127 11165967 11505150 11734057 12010493 12217356 12339914 12365946 11733860 10224013
5350 10224013 8981208 8297303 7589750 7017710 6871459 6727180 6324425 5964957 5706889
5341 5706889 5513461 5188577 4954773 4860577 4834011 4888757 4723962 4580001 4506946 4311225
5331 4311225 4130435 4077295 4101799 3918346 3820622 3553321 3641913 3481902 3302550 3138585
5321 3138585 3197110 3450271 3365285 3358654 2915263 3001375 2967712 2903773 3266901 3309289 2933600
$$ packed form
5387A9557251n25151m32565k65879j45129k28702K40492M02932J71746M61278
5378A9236273M60592l29354r06896r45910j106928r22679j089607m63632q82871
5369A3048988m47061q23359m75147p4202q8583m42734k50217L26329r6577o1310
5359A0616127N49840L39183K28907K76436K06863J22558K6032o32086j509847
5350A0224013j242805o83905p07553n72040j46251j44279m02755l59468k58068
5341E706889j93428l24884k33804r4196k6566N4746j64795j43961p3055j95721
5331D311225j80790n3140K4504j83453r7724k67301Q8592j60011j79352j63965
5321C138585N8525K53161q4986o631m43391Q6112l3663o3939L63128M2388l75689
$$ plain form
5310 2933600 2956454 3014841 2664253 2472601 2631439 2365924 2151876 2422932 2665794 2544833
5300 2544833 2517164 2587919 2513949 2490011 2380538 2511217 2738090 2815355 2514594 2570695 2805736
5289 2805736 2689625 2714778 2754139 2679974 2244008 2473392 2394649 2001951 1864464 1864029 2162117
5278 2162117 2387481 2230976 2286986 2355950 2452535 2226277 2216364 2166573 2312793 2343908 2550883
5267 2550883 2710308 2236822 2186703 2398923 2444034 2272051 2462113 2340242 2305079 2582591
5257 2582591 2491918 2493475 2615050 2805838 2674644 2612105 2738006 2669220 2832627 3165656
5247 3165656 3322588 3189584 3040390 3061513 3553290 3623928 3634711 3686719 4100029 4178545
5237 4178545 3913907 4103143 4320424 4438568 4453182 4476755 4793190 5045283 5464412 5576639
$$ packed form
5310B933600K2854N8387l50588j91652J58838k65515k14048K71056K42862j20961
5300B544833k7669P0755p3970k3938j09473J30679K26873P7265l00761N6101K35041
5289B805736j16111K5153L9361p4165m35966K29384p8743l92698j37487m35K98088
5278B162117K25364j56505N6010O8964R6585k26258r913m9791J46220L1115K06975
5267B550883J59425m73486n0119K12220M5111j71983J90062j21871l5163K77512
5257B582591r0673J557J21575J90788j31194o2539J25901o8786J63407L33029
5247C165656J56932j33004j49194K1123M91777P0638J0783N2008M13310P8516
5237D178545k64638J89236K17281J18144J4614K3573L16435K52093M19129J12227
$$ plain form
5227 5576639 5772598 6360763 6865808 7531858 8375050 9426269 10619726 12266906 13368573
5218 13368573 14807253 17018661 19146323 21261598 23376927 24412870 24170550 23706206
5210 23706206 22858552 20736372 18204373 15881135 13553633 11605285 9920494 8568204
5202 8568204 7678425 6828470 6242194 5524803 4952663 4728485 4474599 4417245 4089501 3893048
5192 3893048 3772779 3537836 3312067 3211595 3163284 2890231 3037630 2794481 2667544 2707064
5182 2707064 2867369 2774124 2591060 2544483 2327062 1999265 2065535 2198389 2405621 2472462
5172 2472462 2375399 2615981 2322819 2106303 1937099 2193197 2165952 2216974 2096542 2152292
5162 2152292 2237415 2650878 2675093 2319595 2270803 2121762 2213131 2211465 2146014 1978847 2361931
$$ packed form
5227E576639J95959N88165N05045O66050Q43192J051219J193457J647180J101667
5218A3368573J438680K211408K127662K115275K115329J035943k42320m64344
5210B3706206q47654k122180k531999k323238k327502j948348j684791j352290
5202H568204q89779q49955n86276p17391n72140k24178k53886n7354l27744j96453
5192C893048j20269k34943k25769j00472m8311k73053J47399k43149j26937L9520
5182B707064J60305r3245j83064m6577k17421l27797O6270J32854K07232O6841
5172B472462r7063K40582k93162k16516j69204K56098k7245N1022j20432N5750
5162B152292Q5123M13463K4215l55498m8792j49041R1369j666o5451j67167L83084
$$ plain form
5151 2361931 2534858 2539501 2569820 2411848 2503758 2280941 2140130 2344948 2394800 2417666 2592927
5140 2592927 2464302 2438696 2648352 2779575 2369245 2303831 2495995 2474545 2404582 2315522
5130 2315522 2262051 2136820 2009890 2058218 2175306 2263229 1948383 1826912 2198042 1972962
5120 1972962 1880831 2009066 2290482 2239647 2015861 1961476 2399003 2437544 1995278 1769990
5110 1769990 1913275 1592964 1681068 1793239 1584360 1463333 1691310 2007308 1876976 1736191
5100 1736191 1939436 1919504 1581699 1751614 1927994 1977781 1996528 2192835 2136608 2254116
5090 2254116 2095348 1898039 2018975 2146818 1898823 2158322 2113713 1514000 1336794 1414574
5080 1414574 1697117 1688229 1998222 1890534 1483139 1571938 1634942 1585961 1532723 1877788 1845650
$$ packed form
5151B361931J72927M643L0319j57972R1910k22817j40811K04818M9852K2866J75261
5140B592927j28625k5606K09656J31223m10330o5414J92164k1450o9963q9060
5130B315522n3471j25231j26930M8328J17088Q7923l14846j21471L71130k25080
5120A972962r2131J28235K81416n0835k23786n4385M37527L8541m42266k25288
5110A769990J43285l20311Q8104J12171k08879j21027K27977L15998j30332j40785
5100A736191K03245j9932l37805J69915J76380M9787J8747J96307n6227J17508
5090B254116j58768j97309J20936J27843k47995K59499m4609n99713j77206P7780
5080A414574K82543q888L09993j07688m07395Q8799O3004m8981n3238L45065l2138
$$ plain form
5069 1845650 1590781 1743549 1672404 1668915 1530124 1401191 1705276 1611535 1651227 1651175 1650191 1657843
5057 1657843 1893862 1562713 1509231 1531671 1397894 1418720 1449771 1356594 1283772 1525003 1185036
5046 1185036 1158844 1269179 1356690 1300587 1390424 1491489 1676450 1718929 1362685 1129462
5036 1129462 1563763 1918788 1703065 1515942 1539894 1340245 1579230 2107191 1611720 1719893
5026 1719893 1787390 1520912 1647963 1694785 1472112 1220744 1546475 1881954 1721587 1701968
5016 1701968 1734725 1886555 2078564 1682766 1870062 1907567 1846363 2080670 2134886 1843047
5006 1843047 1567164 1600531 1524252 1877452 1808132 1660322 1993649 1827034 1532535 1755947
4996 1755947 2055811 1961734 1877771 1849474 1776636 1771732 1772327 1835182 2080796 2041290 1867501
$$ packed form
5069A845650k54869J52768p1145l489j38791j28933L04085r3741L9692n2r84P652
5057A657843K36019l31149n3482K2440j33777K0826L1051r3177p2822K41231l39967
5046A185036k6192J10335Q7511n6103Q9837J01065J84961M2479l56244k33223
5036A129462M34301L55025k15723j87123K3952j99649K38985N27961m95471J08173
5026A719893O7497k66478J27051M6822k22673k51368L25731L35479j60367j9619
5016A701968L2757J51830J92009l95798J87296L7505o1204K34307N4216k91839
5006A843047k75883L3367p6279L53200o9320j47810L33327j66615k94499K23412
4996A755947K99864r4077q3963k8297p2838m904N95O2855K45614l9506j73789
$$ plain form
4985 1867501 1793153 1924727 1918551 2029792 1962351 2134560 1930600 1987987 2117071 1783276
4975 1783276 1927997 2180074 2217647 2211554 2516711 2465235 2354503 2459892 2509188 2327683
4965 2327683 2318734 2698646 2825394 2745560 2547201 2582513 2569169 2311134 2524030 2902597
4955 2902597 2888299 2973085 2722495 2662725 2699884 2644624 2984599 3082681 2937479 2941205 2930880
4944 2930880 3005841 3063667 3052896 3121082 2984604 3124094 3102541 3149588 3191364 3247991 3332578
4933 3332578 3421794 3396896 3429351 3697243 3559101 3423184 3663852 3669669 3581195 3814242 4055253
4922 4055253 3961557 4126755 3945421 3819866 3994920 3873824 4034900 4316596 4291653 4173369
4912 4173369 4115368 4249895 4724390 4917498 4842588 4935270 5002449 4869582 4749574 4724686
$$ packed form
4985A867501p4348J31574o176J11241o7441J72209k03960N7387J29084l33795
4975A783276J44721K52077L7573o093L05157n1476j10732J05389M9296j81505
4965B327683q949L79912J26748p9834j98359L5312j3344k58035K12896L78567
4955B902597j4298Q4786k50590n9770L7159n5260L39975R8082j45202L726j0325
4944B930880P4961N7826j0771O8186j36478J39490k1553M7047M1776N6627Q4587
4933C332578Q9216k4898L2455K67892j38142j35917K40668N817q8474K33047K41011
4922D055253r3696J65198j81334j25555J75054j21096J61076K81696k4943j18284
4912D173369n8001J34527M74495J93108p4910R2682O7179j32867j20008k4888
$$ plain form
4902 4724686 4834789 5115312 5335965 5114175 5106741 5218952 5185713 5331631 5696954 6081574
4892 6081574 6109480 6269393 6332891 6096643 6037364 6082121 6029350 5962428 6111317 6704586 6704106
4881 6704106 6618819 6831573 6734788 6717893 6940782 7245258 7445493 7359590 7347498 7239235
4871 7239235 7179498 7406647 7662328 7839679 8202949 8421317 8239819 8436151 8763166 8908470
4861 8908470 8963718 9137074 9192287 9478305 9801547 9811968 9681929 10044674 10331719 10418259
4851 10418259 10744848 10808839 11144732 11043562 11119566 11444303 11780690 12083296 11811472 12130357
4841 12130357 12415348 12355861 12726984 12813662 12851401 13115349 13608274 14141959 14280850 14202414
4831 14202414 14546871 14552448 14406544 14538789 14834515 15214428 15441478 15733032 15840676 16224089
$$ packed form
4902D724686J10103K80523K20653k21790p434J12211l3239J45918L65323L84620
4892F081574K7906J59913O3498k36248n9279M4757n2771o6922J48889N93269m80
4881F704106q5287K12754r6785j6895K22889L04476K00235q5903j2092j08263
4871G239235n9737K27149K55681J77351L63270K18368j81498J96332L27015J45304
4861H908470N5248J73356N5213K86018L23242J0421j30039L62745K87045Q6540
4851A0418259L26589O3991L35893j01170P6004L24737L36387L02606k71824L18885
4841A2130357K84991n9487L71123Q6678L7739K63948M92925N33685J38891p8436
4831A4202414L44457N577j45904J32245K95726L79913K27050K91554J07644L83413
$$ plain form
4821 16224089 16504038 16884989 17174954 17072743 16951984 17332447 17554069 17261529 17346829 17893351
4811 17893351 18212842 18305312 18027533 18293362 18645617 18658222 18593518 18667543 18879336 19007985
4801 19007985 19102254 19027781 19072900 18957867 19136790 19310505 19208722 19236759 19387915 19601830
4791 19601830 19453634 19113208 18971763 18920307 18729201 18402698 18131352 18132123 18304772 18050762
4781 18050762 17699319 17488519 17275794 17310295 17348711 16659066 16816711 16751934 16689661 16698542
4771 16698542 16670588 16302749 16202383 16203183 15992070 15880367 15358379 14719551 14458780 14193815
4761 14193815 14057313 14088662 13733599 13769364 13619442 13382550 13134989 13143248 13156924 13027232
4751 13027232 12706562 12409535 12323268 12348210 12207788 12388878 12168329 11978988 11501844 10890191
$$ packed form
4821A6224089K79949L80951K89965j02211j20759L80463K21622k92540Q5300N46522
4811A7893351L19491R2470k77779K65829L52255J2605o4704P4025K11793J28649
4801A9007985R4269p4473M5119j15033J78923J73715j01783K8037J51156K13915
4791A9601830j48196l40426j41445n1456j91106l26503k71346P71J72649k54010
4781A8050762l51443k10800k12725L4501L8416o89645J57645o4777o2273Q881
4771A6698542k7954l67839j00366Q00k11113j11703n21988o38828k60771k64965
4761A4193815j36502L1349l55063L5765j49922k36892k47561Q259J3676j29692
4751A3027232l20670k97027q6267K4942j40422J81090k20549j89341m77144o11653
$$ plain form
4741 10890191 10729713 10574143 10140278 9927670 9929548 9743802 9568006 9231405 9133014 9225602
4731 9225602 9226772 9364831 9281786 8752073 8749078 8839272 8682506 8482183 8111728 7641876 7586447
4720 7586447 7333721 7031326 7167488 6806658 6829280 6941273 7304461 7045176 6702492 6531998
4710 6531998 6344079 6425102 6115867 6000763 5731787 5546620 5822971 5893128 5734191 5517409
4700 5517409 5390823 5149890 5086032 5167750 5059503 5204163 5206845 5092131 5101798 5180503 5001262
4689 5001262 4760720 4934312 4784094 4347964 4228420 4200520 4486272 4644782 4162252 3996635
4679 3996635 4241414 4398767 4161631 4300959 3995602 3956863 3998004 3716482 3869010 3985130
4669 3985130 3779700 3725784 3756786 3690086 3871119 4078504 3623627 3431640 3493449 3442288
$$ packed form
4741A0890191j60478j55570m33865k12608J878j85746j75796l36601r8391R2588
4731I225602J170J38059q3045n29713k995R0194j56766k00323l70455m69852n5429
4720G586447k52726l02395J36162l60830K2622J11993L63188k59285l42684j70494
4710F531998j87919Q1023l09235j15104k68976j85167K76351P0157j58937k16782
4700E517409j26586k40933o3858Q1718j08247J44660K682j14714R667P8705j79241
4689E001262k40542J73592j50218m36130j19544k7900K85752J58510m82530j65617
4679C996635K44779J57353k37136J39328l05357l8739M1141k81522J52528J16120
4669C985130k05430n3916L1002o6700J81033K07385m54877j91987O1809n1161
$$ plain form
4659 3442288 3634574 3445600 3240975 3282187 3712212 3349923 3181213 3070067 3060763 3214666
4649 3214666 3016958 2871645 3239470 3516107 3185801 2999742 3256137 3099771 3156152 3355464
4639 3355464 3302889 3047021 2807727 2998373 2742977 2455470 2698141 2433123 2774476 2916779
4629 2916779 2968618 2844625 2561862 2609870 2583815 2965126 2978105 2395236 2545032 2432696
4619 2432696 2532230 2576545 2383086 2420732 2594198 2255937 2361825 2604119 2450985 2012017
4609 2012017 2324933 2510192 2414934 2277955 2287202 2357726 2141205 2159233 2393195 2588590
4599 2588590 2330512 2422890 2116978 2337802 2516168 2566505 2490019 2567981 2463988 2602549
4589 2602549 2806791 3011017 2883596 2751180 2619652 2631222 2644332 2971431 3237056 2960551
$$ packed form
4659C442288J92286j88974k04625M1212M30025l62289j68710j11146r304J53903
4649C214666j97708j45313L67825K76637l30306j86059K56395j56366N6381J99312
4639C355464n2575k55868k39294J90646k55396k87507K42671k65018L41353J42303
4629B916779N1839j23993k82763M8008k6055L81311J2979n82869J49796j12336
4619B432696R9534M4315j93459L7646J73466l38261J05888K42294j53134m38968
4609B012017L12916J85259r5258j36979R247P0524k16521J8028K33962J95395
4599B588590k58078R2378l05912K20824J78366N0337p6486P7962j03993J38561
4589B602549K04242K04226j27421j32416j31528J1570J3110L27099K65625k76505
$$ plain form
4579 2960551 2875533 2617899 2366127 2609310 2258105 2293272 2431679 2300389 2232903 2556942
4569 2556942 2801389 2553583 2606344 2606791 2810005 2880901 2615837 2405948 2362885 2523004 2502664
4558 2502664 2837177 2924331 2976815 2818141 2757923 2625149 2222960 2037074 2216701 2247751
4548 2247751 2354283 2212920 2181693 2198518 2303080 2242140 1811671 1871548 1811475 2088556
4538 2088556 2052375 1838677 1818854 1749069 1727958 1892726 1829703 1797641 2086222 2116577 2030008
4527 2030008 2245459 1914256 1810659 1948285 1853149 1643355 1697418 1482908 1698325 1928899
4517 1928899 1603516 1553970 1648529 1587706 1622607 1653259 1554387 1791055 1780563 2001923 2095630
4506 2095630 1916463 2038883 2060578 2094568 2218456 2136789 2374562 2592242 2639962 2560589
$$ packed form
4579B960551q5018k57634k51772K43183l51205L5167J38407j31290o7486L24039
4569B556942K44447k47806N2761M47K03214P0896k65064k09889m3063J60119k0340
4558B502664L34513Q7154N2484j58674o0218j32774m02189j85886J79627L1050
4548B247751J06532j41363l1227J6825J04562o0940m30469N9877o0073K77081
4538B088556l6181k13698j9823o9785k1111J64768o3023l2062K88581L0355q6569
4527B030008K15451l31203j03597J37626r5136k09794N4063k14510K15417K30574
4517A928899l25383m9546R4559o0823L4901L0652r8872K36668j0492K21360R3707
4506B095630j79167J22420K1695L3990J23888q1667K37773K17680M7720p9373
$$ plain form
4496 2560589 2509350 2712468 2843436 2683569 2917382 3493511 3043885 2628991 2356876 2489619
4486 2489619 2656629 2501955 2086554 1960070 2286854 2217092 2191636 2413227 2141398 1861983
4476 1861983 1892328 1844132 2003680 2027116 2156769 2312509 2031989 2044838 2206640 2292428
4466 2292428 2239618 2172300 1938056 2004455 2049551 1971667 2017297 2152935 1860763 2136898 2259668
4455 2259668 2021898 1975782 2076300 2203564 2415178 2469751 2485667 2740563 2843274 2889857
4445 2889857 2732806 2820640 2988935 3291995 3767880 4293131 4625634 4851382 4779991 4695288
4435 4695288 4197474 3795919 3240483 2870513 2829587 2816176 2536288 2697692 2519751 2305019
4425 2305019 2415322 2732810 2504778 2592711 2568080 2154419 2384076 2613978 2277228 2016223
$$ packed form
4496B560589n1239K03118J30968j59867K33813N76129m49626m14894k72115J32743
4486B489619J67010j54674m15401j26484L26784o9762k5456K21591k71829k79415
4476A861983L0345m8196J59548K3436J29653J55740k80520J2849J61802Q5788
4466B292428n2810o7318k34244O6399M5096p7884M5630J35638k92172K76135J22770
4455B259668k37770m6116J00518J27264K11614N4573J5916K54896J02711M6583
4445B889857j57051Q7834J68295L03060M75885N25251L32503K25748p1391q4703
4435D695288m97814m01555n55436l69970m0926j3411k79888J61404j77941k14732
4425B305019J10303L17488k28032Q7933k4631m13661K29657K29902l36750k61005
$$ plain form
4415 2016223 2074845 2192806 2129714 2079014 2416106 2833223 2769909 2365422 2158312 2270625
4405 2270625 2248618 2475739 2463366 2269068 2220128 1979257 2007248 2056474 2175173 2240575 2280738
4394 2280738 2383546 2177886 2151154 2427768 2575897 2461517 2042536 2100640 2143861 2236803
4384 2236803 2300794 2566498 2702897 2870583 2900345 2802098 2688273 2723867 2557843 2628379
4374 2628379 2654455 2795511 2388463 2325868 2437719 2384474 2408971 2317117 2360126 2545134 2886060
4363 2886060 2533482 2464315 2749604 2916875 2671042 2755555 3159358 2885409 2720869 2769091
4353 2769091 2831357 2880817 3046098 3003206 3126230 3251844 3256328 3197334 2883817 2877158 2994425
4342 2994425 3196500 3075959 2937195 3067926 3037693 3199627 3557419 3410423 3135346 2951587
$$ packed form
4415B016223N8622J17961o3092n0700L37092M17117o3314m04487k07110J12313
4405B270625k2007K27121j2373j94298m8940k40871K7991M9226J18699O5402M0163
4394B280738J02808k05660k6732K76614J48129j14380m18981N8104M3221R2942
4384B236803O3991K65704J36399J67686K9762r8247j13825L5594j66024P0536
4374B628379K6076J41056m07048o2595J11851n3245K4497r1854M3009J85008L40926
4363B886060l52578o9167K85289J67271k45833Q4513M03803k73949j64540M8222
4353B769091O2266M9460J65281m2892J23024J25614M484n8994l13517o659J17267
4342B994425K02075j20541j38764J30731l0233J61934L57792j46996k75077j83759
$$ plain form
4332 2951587 2840803 2991686 3238028 3435066 3346394 3260042 3380922 3663072 3867535 3807298
4322 3807298 3956287 4223403 4425919 4444882 4653911 4343721 4187116 4162818 4462647 4598801
4312 4598801 4354175 4401727 4372441 4517590 4162885 3860987 4294487 4426328 4142665 4344219
4302 4344219 4259672 4738731 4673759 4645401 4503214 4789608 4950989 5082893 5063456 5192402
4292 5192402 5708972 5413325 5240782 5567322 5951171 5730545 5501464 5650730 5729834 5669376
4282 5669376 5743553 5682748 5791468 5850061 6232377 6472755 6297233 6111842 6335786 6691994
4272 6691994 6851284 7185111 7258448 7313957 7793990 7993450 8129220 8512921 9045323 9273336
4262 9273336 9524636 9908941 10645011 11009109 11878222 12801898 13984206 15439599 16807483
$$ packed form
4332B951587j10784J50883K46342J97038q8672q6352J20880K82150K04463o0237
4322C807298J48989K67116K02516J8963K09029l10190j56605k4298K99829J36154
4312D598801k44626M7552k9286J45149l54705l01898M33500J31841k83663K01554
4302D344219q4547M79059o4972k8358j42187K86394J61381J31904j9437J28946
4292E192402N16570k95647j72543L26540L83849k20626k29081J49266P9104o0458
4282E669376P4177o0805J08720N8593L82316K40378j75522j85391K23944L56208
4272F691994J59290L33827P3337N5509M80033J99460J35770L83701N32402K28013
4262I273336K51300L84305P36070L64098Q69113R23676J182308J455393J367884
$$ plain form
4253 16807483 17671961 17273570 15869984 14414422 13269021 12367908 11873528 11687312 11578588
4244 11578588 11412737 10908611 10679416 10977593 11155733 11469815 11817608 12058203 12260101
4235 12260101 12148293 12796153 13040430 12997879 13227894 14030717 14454579 14650978 14816302 14654496
4225 14654496 14921121 14813452 14802131 14843228 15085232 15437437 15504626 15472020 15318923 15580908
4215 15580908 15708396 16079838 16488016 16469960 16734583 17461897 17805307 18115815 18273459 18687577
4205 18687577 19097300 19463570 19619513 20114703 20595333 21307975 21669441 22020678 23253469
4196 23253469 24336038 25073834 25395236 26180804 26618913 27075092 28018559 28728623 29040363
4187 29040363 29891652 31046481 32558870 33899404 35410950 36788106 38170895 39661727
$$ packed form
4253A6807483Q64478l98391j403586j455562j145401r01113m94380j86216j08724
4244A1578588j65851n04126k29195K98177J78140L14082L47793K40595K01898
4235A2260101j11808O47860K44277m2551K30015Q02823M23862J96399J65324j61806
4225A4654496K66625j07669j1321M1097K42004L52205O7189l2606j53097K61985
4215A5580908J27488L71442M08178j8056K64623P27314L43410L10508J57644M14118
4205A8687577M09723L66270J55943M95190M80630P12642L61466L51237J232791
4196B3253469J082569P37796L21402P85568M38109M56179R43467P10064L11740
4187B9040363Q51289J154829J512389J340534J511546J377156J382789J490832
$$ plain form
4179 39661727 41314830 42684527 44433900 46170097 48032479 50028711 52270427 54710331
4171 54710331 57473425 60738927 64408306 68237007 72808093 78483723 84705892 91354308
4163 91354308 99287381 108201511 118978478 132179406 148226278 166857075 189376599
4156 189376599 217301560 252623843 297834457 354975114 420612082 483483260 513765694
4149 513765694 495916801 435131592 357047917 288083437 234613756 195772763 166520576
4142 166520576 144178523 126531589 112172479 100012874 90682878 82724476 76307065
4135 76307065 70997061 66573418 62322258 58647958 55412563 52079818 49387932 47013257
4127 47013257 44795448 43067543 41572242 40348026 38535082 36939173 35619155 34845294
$$ packed form
4179C9661727J653103J369697J749373J736197J862382J996232K241716K439904
4171E4710331K763094L265502L669379L828701M571086N675630O222169O648416
4163I1354308P933073Q914130J0776967J3200928J6046872J8630797K2519524
4156A89376599K7924961L5322283M5210614N7140657O5636968O2871178L0282434
4149E13765694j7848893o0785209p8083675o8964480n3469681l8840993k9252187
4142A66520576k2342053j7646934j4359110j2159605r329996p958402o417411
4135G6307065n310004m423643m251160l674300l235395l332745k691886k374675
4127D7013257k217809j727905j495301j224216j812944j595909j320018p73861
$$ plain form
4119 34845294 33689096 32443564 31295137 30224575 29329703 29039373 28841855 28790623 28389326
4110 28389326 28085453 27904903 27688504 28115087 28914681 29696280 31147326 32714475 34668154
4101 34668154 37199964 40328581 43973472 47276312 49566798 51619375 51863370 49188578
4093 49188578 45376487 41739306 37527663 33028722 29185197 25986512 24090044 22582468
4085 22582468 21127510 20226965 19424961 18660245 18322873 18111352 17817832 17707227 17537780
4076 17537780 17007425 16900633 16744369 15917100 14741718 13565296 12702106 12249024 12024005
4067 12024005 11668935 10979565 10637202 10125702 9631718 9779694 9614938 9366462 9005536
4058 9005536 9048230 8684046 8388731 8515891 8315426 7863570 7575227 7635653 7510556 7395289
$$ packed form
4119C4845294j156198j245532j148427j070562q94872k90330j97518n1232m01297
4110B8389326l03873j80550k16399M26583P99594P81599J451046J567149J953679
4101C4668154K531810L128617L644891L302840K290486K052577K43995k674792
4093D9188578l812091l637181m211643m498941l843525l198685j896468j507576
4085B2582468j454958r00545q02004p64716l37372k11521k93520j10605j69447
4076A7537780n30355j06792j56264q27269j175382j176422q63190m53082k25019
4067A2024005l55070o89370l42363n11500m93984J47976j64756k48476l60926
4058I005536M2694l64184k95315J27160k00465m51856k88343O0426j25097j15267
$$ plain form
4048 7395289 7354758 7419474 6981655 6748996 6673854 6448914 6582353 6481706 6336752 6080040
4038 6080040 6127986 6208207 6379323 6426396 6476207 7196754 7430144 7674666 7709894 7331283
4028 7331283 6728781 6250812 6027390 5704040 5256439 4663314 4731743 4862336 4814868 5019227
4018 5019227 4574826 4219842 4300991 4458070 4912520 4830491 4514597 4347719 4480874 4621073
4008 4621073 4312822 4294081 4257194 4286787 4520204 4386082 4072471 4027031 4116720 3855720
3998 3855720 3600071 3743355 3522713 3534199 3586245 3634579 3980462 3957819 3721226 3819335
3988 3819335 3586455 3536014 3613622 3518105 3740854 3846801 4070395 4068885 3751350 3576982
3978 3576982 3500432 3449554 3596889 3711160 3689137 3467246 3698398 3761064 3751378 3875365 3941808
$$ packed form
4048G395289m0531O4716m37819k32659p5142k24940J33439j00647j44954k56712
4038F080040M7946Q0221J71116M7073M9811P20547K33390K44522L5228l78611
4028G331283o02502m77969k23422l23350m47601n93125O8429J30593m7468K04359
4018E019227m44401l54984Q1149J57079M54450q2029l15894j66878J33155J40199
4008D621073l08251j8741l6887K9593K33417j34122l13611m5440Q9689k61000
3998C855720k55649J43284k20642J1486N2046M8334L45883k2643k36593R8109
3988C819335k32880n0441P7608r5517K22749J05947K23594j510l17535j74368
3978C576982p6550n0878J47335J14271k2023k21891K31152O2666r686J23987O6443
$$ plain form
3967 3941808 4145478 3809986 3831190 3577424 3565649 3792582 3984047 3957807 3704349 3565852
3957 3565852 3682258 3522881 3344409 3106762 3235117 3137467 3253392 3310988 2933430 2730040
3947 2730040 2809568 2676954 2980917 3534704 3147428 2817295 3049921 3071187 3259174 3406924
3937 3406924 3440223 3480708 3290563 3354883 3420355 3506472 3223031 3232238 3229739 2948787 3243694
3926 3243694 3310551 3402958 3213984 3239109 3656079 3351107 3248821 3290383 3524800 3304605
3916 3304605 3394752 3519334 3224334 3149401 3172857 3038498 3319156 3157487 3040792 3370725
3906 3370725 3408370 3284718 3115096 2967143 2983867 2927882 2740600 2661847 2861439 2934252
3896 2934252 3016153 2747445 2955510 3104176 2829950 3096303 3331500 3336614 3082850 3012239
$$ packed form
3967C941808K03670l35492K1204k53766j1775K26933J91465k6240k53458j38497
3957C565852J16406j59377j78472k37647J28355r7650J15925N7596l77558k03390
3947B730040P9528j32614L03963N53787l87276l30133K32626K1266J87987J47750
3937C406924L3299M0485j90145O4320O5472Q6117k83441R207k499k80952K94907
3926C243694O6857R2407j88974K5125M16970l04972j02286M1562K34417k20195
3916C304605R0147J24582k95000p4933K3456j34359K80658j61669j16695L29933
3906C370725L7645j23652j69622j47953J6724n5985j87282p8753J99592P2813
3896B934252Q1901k68708K08065J48666k74226K66353K35197N114k53764p0611
$$ plain form
3886 3012239 3142278 3154600 2984347 3229800 3409580 3297602 3209749 3267475 3563504 3659235
3876 3659235 3487055 3163861 3255403 3426277 3300684 3341093 3795939 4050833 3860590 3930148
3866 3930148 4013224 4321440 4374073 4342370 4400127 4720719 5147193 5472279 5449070 4903348
3856 4903348 4392168 4202867 4210738 4063690 3926969 3582682 3389595 3417010 3413792 3510623 3477814
3845 3477814 3495466 3376028 3123515 3076619 3007283 3275900 3607297 3567856 3308053 3344471
3835 3344471 3126519 3121348 2912716 3035552 3360392 3360291 3503930 3744181 3399564 3618937
3825 3618937 3628361 3115684 3378068 3466164 3695360 3605120 3244034 3192447 3354907 3423736 3381668
3814 3381668 3538544 3416533 3714460 3721814 3458503 3745823 3752642 3612115 3688415 4006418
$$ packed form
3886C012239J30039J2322j70253K45453J79780j11978q7853N7726K96029R5731
3876C659235j72180l23194R1542J70874j25593M0409M54846K54894j90243O9558
3866C930148Q3076L08216N2633l1703N7757L20592M26474L25086k3209n45722
3856D903348n11180j89301P871j47048j36721l44287j93087K7415l218R6831l2809
3845C477814J7652j19438k52513m6896o9336K68617L31397l9441k59803L6418
3835C344471k17952n171k08632J22836L24840j01J43639K40251l44617K19373
3825C618937R424n12677K62384Q8096K29196r0240l61086n1587J62460O8829m2068
3814C381668J56876j22011K97927P354k63311K87320O819j40527P6300L18003
$$ plain form
3804 4006418 3834043 3903101 4148345 4099009 4152573 4116064 3942004 4035354 4176610 3984951
3794 3984951 4018047 4107047 3938869 3879447 3703934 3856336 4174465 4150397 3983581 3906789
3784 3906789 4159581 4135619 4162016 4457677 4332903 4323647 4304354 4387742 4573672 4527448 4348257
3773 4348257 4232532 4370898 4406474 4134248 3982365 4212902 4690983 4571904 4629053 4754285
3763 4754285 4670261 4545153 4620662 4249714 4379327 4403043 4644161 4952914 5003671 4820326
3753 4820326 4955784 4772259 4777338 5033712 4886392 4774655 4686688 4723323 4796862 5051708
3743 5051708 4866212 4900181 4725747 4790994 4875457 5089261 4947034 5017349 4939099 4846615 5156818
3732 5156818 5209155 5104037 5047789 4786963 4774076 4829164 4963500 4902107 4779789 4782975 5069557
$$ packed form
3804D006418j72375O9058K45244m9336N3564l6509j74060R3350J41256j91659
3794C984951L3096Q9000j68178n9422j75513J52402L18129k4068j66816p6792
3784C906789K52792k3962K6397K95661j24774r256j9293Q3388J85930m6224j79191
3773D348257j15725J38366L5576k72226j51883K30537M78081j19079N7149J25232
3763D754285q4024j25108P5509l70948J29613K3716K41118L08753N0757j83345
3753D820326J35458j83525N079K56374j47320j11737q7967L6635P3539K54846
3743E051708j85496L3969j74434O5247Q4463K13804j42227P0315p8250r2484L10203
3732E156818N2337j05118n6248k60826j2887N5088J34336o1393j22318L186K86582
$$ plain form
3721 5069557 4944727 4874845 4751183 4672063 4857414 5159252 5087332 4925910 5063199 4999094
3711 4999094 4889702 4746037 4710276 4884892 4777685 4693612 4753561 5067244 4982278 4754608
3701 4754608 4981572 5032069 4613961 4485214 4572792 4575942 4631786 4853119 4882262 4554899 4673376
3690 4673376 4716704 4604996 4430514 4494834 4630831 4744288 4828649 4776755 4580502 4640989
3680 4640989 4690640 4427728 4254580 4514527 4493089 4687432 4367422 4516821 4266627 4527069
3670 4527069 4473700 4054409 3898927 3995680 3891675 4090342 3962048 4190141 4291118 4322544
3660 4322544 3922555 3922276 3687752 3611363 3945234 3698130 3810571 3943774 4116575 3745596
3650 3745596 3726609 3523893 3569259 3791397 3791303 3649045 3713667 3574013 3635984 3273653 3219860
$$ packed form
3721E069557j24830o9882j23662p9120J85351L01838p1920j61422J37289o4105
3711D999094j09392j43665l5761J74616j07207q4073N9949L13683q4966k27670
3701D754608K26964N0497m18108j28747Q7578L150N5844K21333K9143l27363J18477
3690D673376M3328j11708j74482O4320J35997J13457Q4361n1894j96253O0487
3680D640989M9651k62912j73148K59947k1438J94343l20010J49399k50194K60442
3670D527069n3369m19291j55482R6753j04005J98667j28294K28093J00977L1426
3660D322544l99989k79k34524p6389L33871k47104J12441J33203J72801l70979
3650C745596j8987k02716M5366K22138r4j42258O4622j39654O1971l62331n3793
$$ plain form
3639 3219860 3090577 3181956 3234809 3472844 3691973 3815433 3384739 3420359 3440412 3374598
3629 3374598 3308485 3221771 3311293 3456820 3450179 3389370 3362482 3223494 3100672 3275959 3300676
3618 3300676 3192263 3061459 2828667 3088552 3134745 3168924 3098639 3050867 3280843 3437603
3608 3437603 3411999 3462891 3045049 2880990 2954791 3051837 3588112 3517039 3389976 3328842 3345102
3597 3345102 3399354 3367437 3383593 3039256 2607374 2671691 2992407 3163053 2805750 2670036
3587 2670036 2819388 3006002 2879311 3029605 3374855 3273418 2894169 2744924 2851110 3275245
3577 3275245 3431404 3063048 3027714 3082422 3004185 2869489 2571450 2872457 3054411 3106875
3567 3106875 3217877 3361830 3170198 2937349 3211606 3167667 2844086 2706134 2685941 2748544
$$ packed form
3639C219860j29283R1379N2853K38035K19129J23460m30694L5620K0053o5814
3629C374598o6113q6714Q9522J45527o641o0809k6888j38988j22822J75287K4717
3618C300676j08413j30804k32792K59885M6193L4179p0285m7772K29976J56760
3608C437603k5604N0892m17842j64059P3801R7046N36275p1073j27063o1134J6260
3597C345102N4252l1917J6156l44337m31882O4317L20716J70646l57303j35714
3587B670036J49352J86614j26691J50294L45250j01437l79249j49245J06186M24135
3577C275245J56159l68356l5334N4708p8237j34696k98039L01007J81954N2464
3567C106875J11002J43953j91632k32849K74257m3939l23581j37952k0193O2603
$$ plain form
3557 2748544 3081563 2785297 2622848 2604398 2825226 2606812 2672274 2806691 2561745 2583007
3547 2583007 2811329 2929567 2954142 2623964 2524258 2325690 2534591 2591846 2466213 2663193
3537 2663193 2527803 2457866 2591304 2630194 2479748 2509332 2585995 2475077 2456223 2773650
3527 2773650 2788318 2390712 2092608 2157123 2258947 2164962 2072873 2072195 2064415 1828621 1586336
3516 1586336 1736276 1879415 1887229 2067374 1961069 2002412 2117350 1782711 1851179 1942816
3506 1942816 2032432 2201475 2217173 1812342 1903206 2077077 1667232 1511063 1673297 1615340
3496 1615340 1824049 1818591 1705657 1647090 1499234 1585440 1461058 1685809 1611202 1545984 1675329
3485 1675329 1545053 1348458 1545611 1406969 1411759 1302409 1363881 1409265 1243845 1503270
$$ packed form
3557B748544L33019k96266j62449j8450K20828k18414O5462J34417k44946K1262
3547B583007K28322J18238K4575l30178r9706j98568K08901N7255j25633J96980
3537B663193j35390o9937J33438L8890j50446K9584P6663j10918j8854L17427
3527B773650J4668l97606k98104O4515J01824r3985r2089o78p780k35794k42285
3516A586336J49940J43139P814J80145j06305M1343J14938l34639O8468R1637
3506A942816Q9616J69043J5698m04831R0864J73871m09845j56169J62234n7957
3496A615340K08709n458j12934n8567j47856Q6206j24382K24751p4607o5218J29345
3485A675329j30276j96595J97153j38642M790j09350O1472M5384j65420K59425
$$ plain form
3475 1503270 1576278 1550259 1636709 1337322 1609171 1466546 1447671 1745246 1995612 1558979
3465 1558979 1502117 1718940 1677326 1721657 1505429 1519290 1545501 1677478 1555314 1743929
3455 1743929 1791231 1967740 1783434 1644943 1266274 1376374 1752102 1615073 1289510 1698731
3445 1698731 1828014 2049813 1965352 1867964 1897390 1679606 1732539 1543124 1559278 1403969
3435 1403969 1503696 1492615 1265256 1293040 1605746 1647354 1518891 1907290 2046691 1673369
3425 1673369 1532114 1234559 1419869 1540954 1450065 1594055 1865284 1767373 1596867 1859598
3415 1859598 1912695 1732845 1788595 1945926 2156233 2301555 2420455 2472169 2121106 1763917
3405 1763917 2014483 1851140 2052667 2148589 1835039 1981483 1784548 1796138 2164127 1879036
$$ packed form
3475A503270P3008k6019Q6450k99387K71849j42625j8875K97575K50366m36633
3465A558979n6862K16823m1614M4331k16228J3861K6211J31977j22164J88615
3455A743929M7302J76509j84306j38491l78669J10100L75728j37029l25563M09221
3445A698731J29283K21799q4461r7388K9426k17784N2933j89415J6154j55309
3435A403969R9727j1081k27359K7784L12706M1608j28463L88399J39401l73322
3425A673369j41255k97555J85310J21085r0889J43990K71229r7911j70506K62731
3415A859598N3097j79850N5750J57331K10307J45322J18900N1714l51063l57189
3405A763917K50566j63343K01527R5922l13550J46444j96935J1590L67989k85091
$$ plain form
3395 1879036 1592042 1845817 1900333 1871537 1710091 1810374 1814478 1720070 1595743 1700225
3385 1700225 1754016 2017609 1903687 1804830 2087060 2429851 2365229 2639614 2679526 2562071
3375 2562071 2274297 1889876 2186695 2356911 2348609 2318771 2355238 2581679 2603378 2291887
3365 2291887 2119242 2407299 2601499 2532590 2156770 2190056 2322704 2424420 2558902 2683589
3355 2683589 2716176 2953312 3108856 3263422 3015150 3002393 2920811 2897064 3071174 2898590
3345 2898590 3002900 3109883 3203089 3341830 3391033 3448347 3705369 3614909 3599696 3772849
3335 3772849 3784417 3865887 4055109 4091324 4026829 4201705 4468490 4319514 4393271 4497582
3325 4497582 4462288 4460453 4665173 4576877 4547423 4731872 4764214 4834593 5076375 4893297 4783541
$$ packed form
3395A879036k86994K53775N4516k8796j61446J00283M104r4408j24327J04482
3385A700225N3791K63593j13922r8857K82230L42791o4622K74385L9912j17455
3375B562071k87774l84421K96819J70216q302k9838L6467K26441K1699l11491
3365B291887j72645K88057J94200o8909l75820L3286J32648J01716J34482J24687
3355B683589L2587K37136J55544J54566k48272j2757q1582k3747J74110j72584
3345B898590J04310J06983R3206J38741M9203N7314K57022r0460j5213J73153
3335C772849J1568Q1470J89222L6215o4495J74876K66785j48976P3757J04311
3325D497582l5294j835K04720q8296k9454J84449L2342P0379K41782j83078j09756
$$ plain form
3314 4783541 5056871 5091391 5227492 5392685 5561385 5640052 5649804 5837694 5989302 6153515
3304 6153515 6270713 6643631 6715460 6778872 6963438 7094771 7214108 7486475 7553986 7513568
3294 7513568 7494674 7632903 7758519 8353249 8604278 8607467 8689414 8800545 9175346 9718360
3284 9718360 10195199 10215234 10071733 10536127 10787523 11131681 11220387 11560279 12169231 12261141
3274 12261141 12638576 13089614 13484984 13789262 14090991 14887188 15309180 15694604 15798577
3265 15798577 16562742 17336828 17835930 18448242 19150961 19936948 20505874 21217500 22300791
3256 22300791 23547182 24612411 26045873 27923954 29866025 31574212 33878113 35969186
3248 35969186 38497425 41525978 44335114 47216231 49819794 51721255 52781150 51991331
$$ packed form
3314D783541K73330L4520J36101J65193J68700P8667R752J87890J51608J64213
3304F153515J17198L72918P1829O3412J84566J31333J19337K72367O7511m0418
3294G513568j8894J38229J25616N94730K51029L189Q1947J11131L74801N43014
3284I718360M76839K0035j43501M64394K51396L44158Q8706L39892O08952R1910
3274A2261141L77435M51038L95370L04278L01729P96197M21992L85424J03973
3265A5798577P64165P74086M99102O12312P02719P85987N68926P11626J083291
3256B2300791J246391J065229J433462J878081J942071J708187K303901K091073
3248C5969186K528239L028553K809136K881117K603563J901461J059895p89819
$$ plain form
3240 51991331 50043097 46921692 42495695 37702391 33070328 29045640 26001875 23267509
3232 23267509 20799238 18934242 17547857 16268451 14985587 13749205 12925980 12063091
3224 12063091 11222590 10606461 10347150 9549381 9022400 8688908 8305639 7896667 7746084
3215 7746084 7567409 7620075 7464929 6962618 6422198 6281731 6029090 5862469 5746111 5590382
3205 5590382 5375966 4981735 5203955 5070033 4953481 4798992 4545421 4301614 4173657 3984595
3195 3984595 3996880 4012734 3954931 3719972 3761252 3454348 3413346 3479096 3152114 3235893 2915788
3184 2915788 3032804 3143185 2882135 2872886 2851933 2914347 2837479 2822191 2777495 2575096 2320650
3173 2320650 2223529 2346463 2438328 2524402 2314524 2265385 2682604 2355570 2243852 2461133
$$ packed form
3240E1991331j948234l121405m425997m793304m632063m024688l043765k734366
3232B3267509k468271j864996j386385j279406j282864j236382q23225q62889
3224A2063091q40501o16129k59311p97769n26981l33492l83269m08972j50583
3215G746084j78675N2666j55146n02311n40420j40467k52641j66621j16358j55729
3205E590382k14416l94231K22220j33922j16552j54489k53571k43807j27957j89062
3195C984595J2285J5854n7803k34959M1280l06904m1002O5750l26982Q3779l20105
3184B915788J17016J10381k61050r249k0953O2414p6868j5288m4696k02399k54446
3173B320650r7121J22934R1865Q6074k09878m9139M17219l27034j11718K17281
$$ plain form
3163 2461133 2310918 2059562 2170245 2073184 1818476 1766222 1933605 2007665 1779646 1667747
3153 1667747 1839713 1705759 1538607 1899608 1861979 2002280 1886157 1774719 1903894 1797486
3143 1797486 1699767 1574399 1325855 1530000 1648329 1692938 1649511 1821923 1828183 1625372
3133 1625372 1591535 1265670 1538792 1486390 1331641 1327784 1409574 1284713 1226961 1240094 1292078
3122 1292078 1209285 1022900 1332954 1128751 1121048 1439952 1356301 1393275 1324236 1335599 1274034
3111 1274034 1220700 943015 911753 1134017 867426 693162 803723 732145 493857 954572
3101 954572 1254065 1030396 917767 1124357 1237949 1285071 1177121 977668 1116581 1296350
3091 1296350 1359588 1276865 1106538 1056269 975113 814358 898411 1003248 931494 1080011 971827
$$ packed form
3163B461133j50215k51356J10683r7061k54708n2254J67383P4060k28019j11899
3153A667747J71966j33954j67152L61001l7629J40301j16123j11438J29175j06408
3143A797486r7719j25368k48544K04145J18329M4609m3427J72412O260k02811
3133A625372l3837l25865K73122n2402j54749l857Q1790j24861n7752J3133N1984
3122A292078q2793j86385L10054k04203p703L18904q3651L6974o9039J1363o1565
3111A274034n3334k77685l1262K22264k66591j74264J10561p1578k38288M60715
3101I54572K99493k23669j12629K06590J13592M7122j07950j99453J38913J79769
3091A296350O3238q2723j70327n0269q1156j60755Q4053J04837p1754J48517j08184
$$ plain form
3080 971827 942058 622068 486310 872837 943755 688208 616562 622466 901816 890947 1146829
3069 1146829 1129099 1084530 1029369 558105 396738 636700 892606 978603 774904 848202
3059 848202 959028 791246 765512 748540 958079 886366 925112 690386 603919 696268 932919
3048 932919 865171 730112 580701 692896 364851 536381 1302895 1177269 721459 692074
3038 692074 698491 714923 757646 577775 636503 665479 662640 790710 666172 749996 591934
3027 591934 828347 727803 583812 405865 417566 517378 637873 548949 334973 598777
3017 598777 584142 524067 496004 757325 615426 704800 760558 615190 809852 699584 700215
3006 700215 960307 797816 758730 747872 655176 647034 951776 1045315 1044489 993318 887206
$$ packed form
3080I71827k9769l19990j35758L86527P0918k55547p1646N904K79350j0869K55882
3069A146829j7730m4569n5161m71264j61367K39962K55906Q5997k03699P3298
3059H48202J10826j67782k5734j6972K09539p1713L8746k34726q6467R2349K36651
3048I32919o7748j35059j49411J12195l28045J71530P66514j25626m55810k9385
3038F92074O417J6432M2723j79871N8728K8976k839J28070j24538Q3824j58062
3027E91934K36413j00544j43991j77947J1701R9812J20495q8924k13976K63804
3017E98777j4635o0075k8063K61321j41899Q9374N5758j45368J94662j10268O31
3006G00215K60092j62491l9086j0858r2696q142L04742R3539q26n1171j06112
$$ plain form
2995 887206 1022696 1117889 1022444 733027 937840 868436 794369 591765 533879 791352 1058514
2984 1058514 1196998 1343554 1185602 975852 977737 1107310 1249530 1144662 1148621 1393192
2974 1393192 1470998 1244572 1215119 1317761 1029131 1123295 1312619 1035886 1106569 1178819
2964 1178819 1349241 1370242 1182810 1138704 1078813 1238788 1513037 1486441 1495658 1523008 1509271
2953 1509271 1179959 1192542 1276826 1451291 1508811 1859044 1840847 1932636 1790167 1669059
2943 1669059 1772076 1971315 2033802 2062488 2013018 2125759 2244791 2169028 2100964 2383103
2933 2383103 2700663 2620406 2648228 2833381 2970829 3055165 2916765 2726660 3030414 3077817
2923 3077817 2978698 3337814 3315937 2990531 3098831 2869361 3134572 3001311 3004853 3198934
$$ packed form
2995H87206J35490R5193r5445k89417K04813o9404p4067k02604n7886K57473K67162
2984A058514J38484J46556j57952k09750J885J29573J42220j04868L959K44571
2974A393192P7806k26426k9453J02642k88630R4164J89324k76733P0683P2250
2964A178819J70422K1001j87432m4106n9891J59975K74249k6596R217K7350j3737
2953A509271l29312J2583Q4284J74465N7520L50233j8197R1789j42469j21108
2943A669059J03017J99239O2487K8686m9470J12741J19032p5763o8064K82139
2933B383103L17560q0257K7822J85153J37448Q4336j38400j90105L03754M7403
2923C077817r9119L59116k1877l25406J08300k29470K65211j33261L542J94081
$$ plain form
2913 3198934 3132322 3439857 3376388 3553396 3493014 3970094 4408827 4504498 4640399 4873067
2903 4873067 5222086 5208632 4808347 4451867 4544739 4003483 3624660 3300885 3082783 2918870
2893 2918870 2927722 2815897 2757770 2519270 2572011 2547428 2515471 2540485 2520345 2584205 2513122
2882 2513122 2827052 2937435 2963777 2766734 2733550 2695676 2926995 2960593 3004229 3007902 2761419
2871 2761419 2600658 2637835 2502147 2529080 2631561 2374620 2038708 1799499 1687686 1814990
2861 1814990 1568157 1389316 1773530 1698798 1362908 1585573 1633377 1380918 1512077 1239673
2851 1239673 1170728 1097953 1180279 1338835 1243880 829749 793666 893198 700302 825782 1002842
2840 1002842 983040 1162090 1387988 966769 891174 1120319 981138 775704 950817 785981
$$ packed form
2913C198934o6612L07535o3469J77008o0382M77080M38733R5671J35901K32668
2903D873067L49019j3454m00285l56480R2872n41256l78823l23775k18102j63913
2893B918870Q852j11825n8127k38500N2741k4583l1957K5014k0140O3860p1083
2882B513122L13930J10383K6342j97043l3184l7874K31319L3598M3636L673k46483
2871B761419j60761L7177j35688K6933J02481k56941l35912k39209j11813J27304
2861A814990k46833j78841L84214p4732l35890K22665M7804k52459J31159k72404
2851A239673o8945p2775Q2326J58556r4955m14131l6083R9532j92896J25480J77060
2840A002842j9802J79050K25898m21219p5595K29145j39181k05434J75113j64836
$$ plain form
2830 785981 651493 1021992 977160 747025 529841 432611 696446 1136793 729098 437994
2820 437994 976733 866818 777514 783388 297579 376309 543638 413923 652913 605659 460136
2809 460136 545582 241776 428290 205030 308415 488276 322086 231242 216179 90791
2799 90791 39207 68673 480818 706183 475352 165420 136927 -27328 -283022 -38441
2789 -38441 351386 79434 261609 350423 423132 323479 285574 353199 177638 106510 226719
2778 226719 272386 372651 153094 -70310 339716 241800 60736 101013 324429 296334
2768 296334 149640 46381 17153 85970 460459 273175 85773 -422 202407 466081
2758 466081 662099 294959 -86952 215085 302997 17482 70022 -78552 262976 233195
$$ packed form
2830G85981j34488L70499m4832k30135k17184r7230K63835M40347m07695k91104
2820D37994N38739j09915q9304N874m85809P8730J67329j29715K38990m7254j45523
2809D60136Q5446l03806J86514k23260J03385J79861j66190r0844j5063j25388
2799I0791n1584K9466M12145K25365k30831l09932k8493j64255k55694K44581
2789c8441L89827k71952J82175Q8814P2709r9653l7905O7625j75561p1128J20209
2778B26719M5667J00265k19557k23404M10026r7916j81064M0277K23416k8095
2768B96334j46694j03259k9228O8817L74489j87284j87402q6195K02829K63674
2758D66081J96018l67140l81911L02037Q7912k85515N2540j48574L41528k9781
$$ plain form
2748 233195 190195 51809 59361 86003 -54797 282838 273576 348336 290853 -118722 -97649
2737 -97649 -5586 104105 64497 -100523 -205870 -140824 -352390 -166855 83497 108768 200795
2726 200795 131675 -155729 -219613 -157745 -8562 -85269 -29024 71605 -1572 -27932 -18139
2715 -18139 -81955 168257 274651 457862 398973 -22300 44098 80140 -39754 88896 251747
2704 251747 126965 104603 128790 298450 -118705 -230764 91717 -63765 -54862 43722 -269759
2693 -269759 -231959 -181658 -34759 -81893 -143650 -399893 -177656 -21718 -110787 -306446 -120854
2682 -120854 24785 -215652 -237114 -128894 91843 104407 -139862 -316599 -625387 -463041
2672 -463041 -116766 29248 -169835 45347 -20557 -2736 -163922 -155809 20522 164120
$$ packed form
2748B33195m3000j38386P552K6642j40800L37635r262P4760n7483m09575K1073
2737i7649R2063J09691l9608j65020j05347O5046k11566J85535K50352K5271R2027
2726B00795o9120k87404o3884O1868J49183p6707N6245J00629p3177k6360R793
2715a8139o3816K50212J06394J83211n8889m21273O6398L6042j19894J28650J62851
2704B51747j24782k2362K4187J69660m17155j12059L22481j55482Q903R8584l13481
2693b69759L7800N0301J46899m7134o1757k56243K22237J55938q9069j95659J85592
2682a20854J45639k40437k1462J08220K20737J2564k44269j76737l08788J62346
2672d63041L46275J46014j99083K15182o5904J7821j61186Q113J76331J43598
$$ plain form
2662 164120 401886 -145591 128940 310387 200486 232809 43433 -104656 -64221 -235857
2652 -235857 -160347 48321 130848 106901 328028 -50989 -175422 -74141 -188796 -246851
2642 -246851 -146400 -119303 -52924 -71182 9264 115191 162775 357623 236388 129246 -176820
2631 -176820 -201639 69138 13512 339065 334203 -36353 -106632 -94246 -88669 93288 71077
2620 71077 -202248 -89538 -152540 -163523 -255100 -201 43449 -15681 59362 4932 141160
2609 141160 -932 -173017 -65233 48732 262794 102472 -283199 -324650 -21855 8803
2599 8803 -150023 -110765 -580666 -466518 -415294 -476187 -320693 -313088 -20309 325571 79420
2588 79420 -137897 73099 -129751 -413565 -482370 -441529 -163339 -54012 106384 337304
$$ packed form
2662A64120K37766n47477K74531J81447j09901L2323j89376j48089M0435j71636
2652b35857P5510K08668Q2527k3947K21127l79017j24433J01281j14655n8055
2642b46851J00451K7097O6379j8258Q0446J05927M7584J94848j21235j07142l06066
2631a76820k4819K70777n5626L25553m862l70556p0279J2386N577J81957k2211
2620G1077k73325J12710o3002j0983r1577K54899M3650n9130P5043n4430J36228
2609A41160j42092j72085J07784J13965K14062j60322l85671m1451L02795L0658
2599H803j58826L9258m69901J14148N1224o0893J55494P605K92779L45880k46151
2588G9420k17317K10996k02850k83814o8805M0841K78190J09327J60396K30920
$$ plain form
2578 337304 196277 8223 -28552 194408 -253617 -82597 -315169 -310212 -436543 -375772
2568 -375772 -400707 -458611 -38087 88582 -154804 -373023 -27761 -144288 -437536 -583929
2558 -583929 -373597 -103650 24563 170859 182426 318496 -88655 -168645 260781 72837
2548 72837 44633 -180477 52987 207645 -50192 40631 263847 15921 52081 -93535
2538 -93535 -11179 -116655 -317794 -405197 -348352 -107626 -16115 -44864 -72120 -177468 -329628
2527 -329628 79875 -235082 -179622 -338205 -365577 -435249 -254358 99955 -164183 -117818
2517 -117818 -341148 -321507 -216802 -119549 40304 -28794 -276893 -348929 150897 154483 -158840
2506 -158840 25948 -110096 21649 -106406 -299001 -320730 66376 70585 134608 261879
$$ packed form
2578C37304j41027j88054l6775K22960m48025J71020k32572M957j26331O0771
2568c75772k4935n7904M20524J26669k43386k18219L45262j16527k93248j46393
2558e83929K10332K69947J28213J46296J1567J36070m07151p9990M29426j87944
2548G2837k8204k25110K33464J54658k57837R0823K23216k47926L6160j45616
2538i3535Q2356j05476k01139q7403N6845K40726R1511k8749k7256j05348j52160
2527c29628M09503l14957N5460j58583k7372o9672J80891L54313k64138M6365
2517a17818k23330J9641J04705R7253J59853o9098k48099p2036M99826L586l13323
2506a58840J84788j36044J31745j28055j92595k1729L87106M209O4023J27271
$$ plain form
2496 261879 154747 281563 451271 256933 -35519 -138960 -268655 -198444 20646 -93217
2486 -93217 -173372 -28143 -69953 -58299 -3988 -201670 -208255 -75126 4610 -180250 -90988
2475 -90988 1934 -269314 -191819 -233871 -38064 83937 -16523 -133987 -145649 -10475 -152195
2464 -152195 -153149 -162914 117686 170560 284729 103563 -110920 176444 -102079 -215250 -177352
2453 -177352 -450569 -555408 -341656 -437527 -138410 -133004 144850 50389 -53913 -62549 -95175
2442 -95175 -206503 -209250 -251597 -311614 -43456 -117680 -245195 -206112 73311 -19778 -374718
2431 -374718 -409191 -262519 -63389 312402 512535 7816 25929 13265 -100458 -126158
2421 -126158 43671 101477 -132093 -94306 -24240 80870 -113562 208468 731850 584646
$$ packed form
2496B61879j07132J26816J69708j94338k92452j03441j29695P0211K19090j13863
2486i3217q0155J45229m1810J1654N4311j97682o585J33129P9736j84860Q9262
2475i0988R2922k71248P7495m2052J95807J22001j00460j17464j1662J35174j41720
2464a52195r54r765K80600N2874J14169j81166k14483K87364k78523j13171L7898
2453a77352k73217j04839K13752r5871K99117N406K77854r4461j04302q636l2626
2442i5175j11328k747m2347o0017K68158p4224j27515L9083K79423r3089l54940
2431c74718l4473J46672J99130L75791K00133n04719J8113j2664j13723k5700
2421a26158J69829N7806k33570L7787P0066J05110j94432L22030N23382j47204
$$ plain form
2411 584646 374793 -70393 -369937 -54049 210109 465817 180881 18667 75203 282457
2401 282457 56419 -17489 31930 197332 178650 263881 236280 201488 25851 -213612 3306
2390 3306 475220 358674 188910 212301 19351 -60857 -45780 -175037 -266761 -254244 -127626
2379 -127626 39132 91758 152603 366634 355317 641281 630660 570659 617131 973305 811450
2368 811450 307017 314109 131290 327373 191773 318339 209617 363912 -20179 -60172
2358 -60172 392698 223337 26232 100124 178833 -936 18283 64537 -25970 35645 97990
2347 97990 188522 208656 383747 10156 79530 78489 341195 381565 322100 340251 -25191
2336 -25191 -129226 -2397 42029 112731 181045 193093 325018 542604 594991 369822 445487
$$ packed form
2411E84646k09853m45186k99544L15888K64158K55708k84936j62214N6536K07254
2401B82457k26038p3908M9419J65402j8682Q5231k7601l4792j75637k39463K16918
2390C306M71914j16546j69764K3391j92950q0208J5077j29257r1724J2517J26618
2379a27626J66758N2626O0845K14031j1317K85964j0621o0001M6472L56174j61855
2368H11450n04433P092j82819J96083j35600J26566j08722J54295l84091l9993
2358f0172M52870j69361j97105P3892P8709j79769J9219M6254r0507O1615O2345
2347I7990R0532K0134J75091l73591O9374j041K62706M0370n9465J8151l65442
2336b5191j04035J26829M4426P0702O8314J2048J31925K17586N2387k25169P5665
$$ plain form
2325 445487 343763 106078 153040 148768 128653 139144 464101 575863 605601 377707 108474
2314 108474 269524 181448 383621 532911 561146 302445 142183 88890 -44060 -44433 -33807
2303 -33807 309731 239154 187674 302916 119157 834 121884 157102 266443 371303
2293 371303 8447 -18562 103766 361272 555160 188048 -184848 -176008 213131 207826 9808
2282 9808 -27126 66400 361856 372250 391348 305023 210831 107696 -103276 6181 151897
2271 151897 162392 502084 764219 533715 16795 17196 324225 178510 195754 396817 563159
2260 563159 675447 568960 889693 716695 349919 135747 327484 490161 515187 473830
2250 473830 557881 541518 416497 403363 284267 384693 479285 296062 572116 639167 562616
$$ packed form
2325D45487j01724k37685M6962m272k0115J0491L24957J11762K9738k27894k69233
2314A08474J61050q8076K02173J49290K8235k58701j60262n3293j32950l73J0626
2303c3807L43538p0577n1480J15242j83759j18323J21050L5218J09341J04860
2293C71303l62856k7009J22328K57506J93888l67112l72896Q840L89139n305j98018
2282I808l6934R3526K95456J0394J9098q6325r4192j03135k10972J09457J45716
2271A51897J0495L39692K62135k30504n16920M01L07029j45715J7244K01063J66342
2260E63159J12288j06487L20733j72998l66776k14172J91737J62677K5026m1357
2250D73830Q4051j6363j25021j3134j19096J00426R4592j83223K76054O7051p6551
$$ plain form
2239 562616 564439 770408 688106 977356 911980 742328 931709 1101493 800111 552498
2229 552498 824455 696659 899521 908981 549452 356928 395684 645915 642156 588566 755473
2218 755473 791223 939861 1002774 891068 632796 796261 781696 925067 1033938 806652
2208 806652 652142 852833 923316 930719 962117 1116343 1299151 1153448 1080272 1275409 1697557
2197 1697557 1509749 1297264 1211746 1478911 1776066 1922405 1955421 1996237 1867752 1761959
2187 1761959 1849255 1893003 1726871 1731708 2122003 2020901 2296911 2424812 2182428 2156162
2177 2156162 2208564 2547647 2776633 2534964 2400491 2487090 2909265 2929275 2818278 2606307
2167 2606307 2823809 2904170 3017137 3326518 3317299 3049479 3303833 3304473 3240775 3172201 3335223
$$ packed form
2239E62616J823K05969q2302K89250o5376j69652J89381J69784l01382k47613
2229E52498K71957j27796K02862R460l59529j92524L8756K50231l759n3590J66907
2218G55473L5750J48638O2913j11706k58272J63465j4565J43371J08871k27286
2208H06652j54510K00691P0483P403L1398J54226J82808j45703p3176J95137M22148
2197A697557j87808k12485q5518K67165K97155J46339L3016M0816j28485j05793
2187A761959Q7296M3748j66132M837L90295j01102K76010J27901k42384k6266
2177B156162N2402L39083K28986k41669j34473Q6599M22175K0010j10997k11971
2167B606307K17502Q0361J12967L09381r219k67820K54354O40o3698o8574J63022
$$ plain form
2156 3335223 3246184 3405508 3750253 4079303 4133777 4271544 4265036 4023994 4384821 4435605
2146 4435605 4796475 4608876 4955028 5150096 5487432 5717370 6179564 6676188 7127167 7468324
2136 7468324 7757574 7880536 7903866 8395312 9022298 9375266 9784080 10194377 11080307 11561752
2126 11561752 12368926 13026513 13846979 15111512 16516089 17846268 19570948 20721678 21763876
2117 21763876 23100476 24871445 27801130 31035600 35285646 39731165 46307622 55143569
2109 55143569 66104373 79965370 98275093 119589591 136818681 126388880 99540720
2102 99540720 77032940 60087291 48784384 40611070 34625073 29780298 26289187 23173429
2094 23173429 21250916 19724802 18468611 17781624 17023919 15524760 14424779 13247779
$$ packed form
2156C335223q9039J59324L44745L29050N4474J37767o508k41042L60827N0784
2146D435605L60870j87599L46152J95068L37336K29938M62194M96624M50979L41157
2136G468324K89250J22962K3330M91446O26986L52968M08814M10297Q85930M81445
2126A1561752Q07174O57587Q20466J264533J404577J330179J724680J150730J042198
2117B1763876J336600J770969K929685L234470M250046M445519O576457Q835947
2109E5143569J0960804J3860997J8309723K1314498J7229090j0429801k6848160
2102I9540720k2507780j6945649j1302907q173314n985997m844775l491111l115758
2094B3173429j922513j526114j256191o86987p57705j499159j099981j177000
$$ plain form
2086 13247779 12005547 10818498 10310370 9752211 9169684 8636806 8188799 7948823 7356836
2077 7356836 7182172 6859455 6578626 6001702 5838192 5784904 5264864 5000118 4818380 4864850
2067 4864850 4574784 4531979 4636349 4499157 3971758 3661914 3607387 3521217 3608692 3473937
2057 3473937 3147545 3206151 3370310 2912857 2503083 2801215 2864089 2877853 2619920 2707111
2047 2707111 2637282 2459880 2416065 2436205 2214689 2293478 2119766 2132363 1931642 1805027
2037 1805027 1827472 1703768 1487801 1567469 1512713 1284628 1488768 1546533 1475139 1389749 1092121
2026 1092121 1209541 1317981 1189845 924383 1130857 1055662 1137408 1213477 1048217 1031993
2016 1031993 956014 952320 819864 810800 694252 506601 733421 735259 843542 552460 766199
$$ packed form
2086A3247779j242232j187049n08128n58159n82527n32878m48007k39976n91987
2077G356836j74664l22717k80829n76924j63510n3288n20040k64746j81738M6470
2067D864850k90066m2805J04370j37192n27399l09844n4527q6170Q7475j34755
2057C473937l26392N8606J64159m57453m09774K98132O2874J3764k57933Q7191
2047B707111o9829j77402m3815K0140k21516P8789j73712J2597k00721j26615
2037A805027K2445j23704k15967P9668n4756k28085K04140N7765p1394q5390k97628
2026A092121J17420J08440j28136k65462K06474p5195Q1746P6069j65260j6224
2016A031993p5979l694j32456r064j16548j87651K26820J838J08283k91082K13739
$$ plain form
2005 766199 808347 721670 867555 941885 1201127 717669 359978 343222 545285 420365
1995 420365 648954 594324 742239 692997 638956 433490 335806 335779 415833 165156 330669
1984 330669 405872 140633 304689 352975 420280 407134 54330 309942 304513 239618 379141
1973 379141 511900 607406 586791 677772 174816 245509 324708 91432 229431 180087 243030
1962 243030 209998 418071 115887 317480 315842 359075 345397 289658 539304 276904 63545
1951 63545 91786 60733 5250 501244 610981 700530 359958 299547 440807 449237 287561
1940 287561 47498 402949 216106 183465 477117 172121 117304 130917 -120401 -124642 101503
1929 101503 208085 281033 493479 19801 85943 230584 -200707 -79060 -105407 -281386
$$ packed form
2005G66199M2148q6677J45885P4330K59242m83458l57691j6756K02063j24920
1995D20365K28589n4630J47915m9242n4041k05466r7684k7Q0054k50677J65513
1984C30669P5203k65239J64056M8286O7305j3146l52804K55612n429o4895J39523
1973C79141J32759R5506k0615R0981n02956P0693P9199k33276J37999m9344O2943
1962B43030l3032K08073l02184K01593j638M3233j3678n5739K49646k62400k13359
1951F3545K8241l1053n5483M95994J09737Q9549l40572o0411J41260Q430j61676
1940B87561k40063L55451j86843l2641K93652l04996n4817J3613k51318m241K26145
1929A01503J06582P2948K12446m73678O6142J44641m31291J21647k6347j75979
$$ plain form
1919 -281386 -241122 203105 197579 -11034 36857 183954 -25554 113094 290321 122933
1909 122933 184945 253033 387703 -15282 -250564 57384 233089 26886 -14406 -30160
1899 -30160 -243822 69399 213152 167149 182392 17743 -45764 -136808 -7819 77384 422321
1888 422321 284633 99965 55225 161124 65336 -176827 289776 308667 266104 -36918
1878 -36918 -153620 195848 18605 186433 20372 206662 240296 133258 138952 -270879
1868 -270879 -212477 -266751 -187078 -361908 -278853 113971 118684 -220068 -182649 361765 465397
1857 465397 462578 246434 -95687 82732 204364 230613 471653 546035 208309 156233 213038
1846 213038 280895 313047 163912 134728 85697 53220 380298 652957 643629 592435 585475
$$ packed form
1919b81386M0264M44227n526k08613M7891J47097k09508J38648J77227j67388
1909A22933O2012O8088J34670m02985k35282L07948J75705k06203m1292j5754
1899c0160k13662L13221J43753m6003J5243j64649o3507r1044J28989Q5203L44937
1888D22321j37688j84668m4740J05899r5788k42163M66603J8891m2563l03022
1878c6918j16702L49468j77243J67828j66061J86290L3634j07038N694m09831
1868b70879N8402n4274P9673j74830Q3055L92824M713l38752L7419N44414J03632
1857D65397k819k16144l42121J78419J21632K6249K41040P4382l37726n2076N6805
1846B13038O7857L2152j49135k9184m9031l2477L27078K72659r328n1194o960
$$ plain form
1835 585475 536180 505056 -13002 -50605 197030 212565 -82805 -143920 -1623 -283132 -218851
1824 -218851 -84834 198157 14830 -396995 -166594 -350663 -504787 -411252 -175371 -249057
1814 -249057 -184845 -80420 -179317 -76227 -25228 204485 219356 -111776 108354 -4449
1804 -4449 84561 -193151 -251374 26789 -111751 -155039 -395088 -514562 -160964 -31881 26665
1793 26665 128469 197775 331873 233009 -24193 -41808 207886 113136 337057 166480 -19670
1782 -19670 -173900 -256259 -138280 -7852 -59251 72071 -179393 -66610 22916 -198458
1772 -198458 -254155 -215147 -145782 154455 -47126 -84464 -46907 -63988 -80182 -5683 52849
1761 52849 92162 -113598 -285469 -194862 -163536 -266698 -128739 260575 247349 82788 -210832
$$ packed form
1835E85475m9295l1124n18058l7603K47635J5535k95370o1115J42297k81509O4281
1824b18851J34017K82991j83327m11825K30401j84069j54124R3535K35881p3686
1814b49057O4212J04425r8897J03090N0999K29713J4871l31132K20130j12803
1804d449Q9010k77712n8223K78163j38540m3288k40049j19474L53598J29083N8546
1793B6665J01804O9306J34098r8864k57202j7615K49694r4750K23921j70577j86150
1782a9670j54230q2359J17979J30428n1399J31322k51464J12783Q9526k21374
1772a98458n5697L9008O9365L00237k01581l7338L7557j7081j6194P4499N8532
1761E2849L9313k05760j71871R0607L1326j03162J37959L89314j3226j64561k93620
$$ plain form
1750 -210832 -130156 -495082 -89121 -17488 2977 6858 -90806 -256226 -107268 -175258 -591650
1739 -591650 -8739 295464 220528 392475 348741 184380 242598 217263 83824 -32774
1729 -32774 -169521 -362219 -25247 319268 293305 137481 -5076 133788 183446 155164
1719 155164 176529 166663 -33904 -88892 -1190 -180472 -116484 143949 151845 34531 -171328
1708 -171328 -221975 -232218 -197474 -133405 -130486 92788 71131 -1272 -248959 -166990 41691
1697 41691 -70401 -154423 -148686 85569 30833 -106442 -150295 -19255 107240 -139662 -370260
1686 -370260 -359314 -116935 -3874 33629 182499 32252 -373481 -94177 -44104 -329971
1676 -329971 99919 36097 -27050 -33782 -194961 -89597 136169 116606 -176385 180682 94375
$$ packed form
1750b10832Q0676l64926M05961P1633K0465L881r7664j65420J48958o7990m16392
1739e91650N82911L04203p4936J71947m3734j64361N8218k5335j33439j16598
1729c2774j36747j92698L36972L44515k5963j55824j42557J38864M9658k8282
1719A55164K1365r866k00567n4988Q7702j79282O3988K60433P896j17314k05859
1708a71328n0647j0243L4744O4069K919K23274k1657p2403k47687Q1969K08681
1697D1691j12092q4022N737K34255n4736j37275m3853J31040J26495k46902k30598
1686c70260J0946K42379J13061L7503J48870j50247m05733K79304N0073k85867
1676c29971M29890o3822o3147o732j61179J05364K25766j9563k92991L57067q6307
$$ plain form
1665 94375 -81163 -395722 -315064 21355 -228552 -28253 -22965 -130546 -241276 -229201 10997
1654 10997 39650 79734 69128 118680 -1023 90908 -143070 -154003 -442611 -343498 22473
1643 22473 278840 165347 -138032 -256361 -180295 -62090 -117394 -87691 -109749 33314 -50230
1632 -50230 25594 176126 101328 -87280 -111435 -50492 -108439 -258047 -323714 -142266 -485769
1621 -485769 -487651 -472972 -551227 63399 168452 6777 189224 144351 192243 92815 5408
1610 5408 -108818 -345353 -113882 38718 228506 63791 56158 -23575 -54780 7042 -65667
1599 -65667 -108233 -23307 -445997 -446596 -498897 4649 -24795 -134532 166918 -173490 -70468
1588 -70468 -128154 -73049 -104355 -150434 27065 -120135 -41402 -217442 -273976 142549 -100309
$$ packed form
1665I4375j75538l14559Q0658L36419k49907K00299N288j07581j10730J2075K40198
1654A0997K8653M0084j0606M9552j19703R1931k33978j0933k88608R9113L65971
1643B2473K56367j13493l03379j18329P6066J18205n5304K9703k2058J43063q3544
1632e0230P5824J50532p4798j88608k4155O0943n7947j49608o5667J81448l43503
1621d85769j882J4679p8255O14626J05053j61675J82447m4873M7892r9428q7407
1610E408j14226k36535K31471J52600J89788j64715p633p9733l1205O1822p2709
1599f5667m2566Q4926m22690n99n2301N03546k9444j09737L01450l40408J03022
1588g0468n7686N5105l1306m6079J77499j47200P8733j76040n6534M16525k42858
$$ plain form
1577 -100309 -316019 -7544 -1181 -79438 -259034 -240774 -211859 -178882 -218402 -150559 -325199
1566 -325199 -208232 -96010 -24474 28814 -267090 -292829 -106107 25532 -240230 -350203
1556 -350203 -500455 59118 45012 -364850 -224583 -88207 27427 -143825 -218331 -464494
1546 -464494 -233504 72562 28628 -117078 40810 -20129 -58952 -37180 -24539 84832 120157
1535 120157 10293 -45403 -209017 -274671 -452515 -397991 -402534 -172058 -226954 -403383 -263198
1524 -263198 -216370 -207766 -278817 -31860 -2294 357075 242471 14580 -55482 62941 -58048
1513 -58048 -130980 -200849 -391228 -336216 -106081 -90862 -156431 -99805 2829 -222440 -187147
1502 -187147 6581 -15197 40757 277822 97515 39720 -71026 82490 31196 -272776
$$ packed form
1577a00309k15710L08475O363p8257j79596J8260K8915L2977l9520O7843j74640
1566c25199J16967J12222P1536N3288k95904k5739J86722J31639k65762j09973
1556c50203j50252N59573j4106m09862J40267J36376J15634j71252p4506k46163
1546d64494K30990L06066m3934j45706J57888o0939l8823K1772J2641J09371L5325
1535A20157j09864n5696j63614o5654j77844N4524m543K30476n4896j76429J40185
1524b63198M6828Q604p1051K46957K9566L59369j14604k27891p0062J18423j20989
1513e8048p2932o9869j90379N5012K30135J5219o5569N6626J02634k25269L5293
1502a87147J93728k1778N5954K37065j80307n7795j10746J53516n1294l03972
$$ plain form
1492 -272776 -273542 4142 -8734 -254469 -313131 -355605 -299925 25584 -213627 -387177 14972
1481 14972 126791 47634 116354 -156928 -204092 -85371 16901 -58502 359367 256082 -31271
1470 -31271 64925 98933 144494 -101419 -148748 -45593 -148149 -344857 -236480 -150812 -96507
1459 -96507 -9181 -5109 -46574 194119 -67496 -104755 -246584 -414828 -320923 -364567 -311370
1448 -311370 32280 311101 199188 -249524 -221198 10210 130910 74106 48672 31289
1438 31289 -42509 -221834 -284488 -89323 -219670 -13533 102264 -129026 -231278 39375
1428 39375 95599 -30351 -251322 -38726 127530 -48279 -149358 -233548 -109882 -274114
1418 -274114 -15068 -39720 81145 -66439 -170042 -217079 197815 108883 -85548 -110529
$$ packed form
1492b72776p66K77684j2876k45735n8662m2474N5680L25509k39211j73550M02149
1481A4972J11819p9157O8720k73282m7164J18721J02272p5403M17869j03285k87353
1470c1271R6196L4008M5561k45913m7329J03155j02556j96708J08377Q5668N4305
1459i6507Q7326M072m1465K40693k61615l7259j41829j68244R3905m3644N3197
1448c11370L43650K78821j11913m48712K8326K31408J20700n6804k5434j7383
1438C1289p3798j79325o2654J95165j30347K06137J15797k31290j02252K70653
1428C9375N6224j25950k20971K12596J66256j75809j01079q4190J23666j64232
1418b74114K59046k4652J20865j47584j03603m7037M14894q8932j94431k4981
$$ plain form
1408 -110529 -56799 -33604 -393814 -177761 -56232 -222395 -303708 13195 -217585 -175601
1398 -175601 -188047 92623 281723 100349 -172325 -465779 -334237 -343810 -82820 20346
1388 20346 -280484 -7454 9021 -243603 -186688 50626 -16836 945 10820 -46881 -180878
1377 -180878 -136733 -106483 -179769 -90009 -154801 -3219 -177035 -126601 -108498 1204 91061
1366 91061 -87204 -97898 105677 42025 -301963 -174573 -148553 -185211 -11285 -133274 -31521
1355 -31521 230486 20934 -31527 287824 442371 293830 62790 16302 47521 424315
1345 424315 -96480 -39133 117294 -48052 -226630 -29820 88204 -187887 -171625 -158124
1335 -158124 238120 131708 -6507 58173 -305307 -421059 206215 38060 -174918 207590
$$ packed form
1408a10529N3730K3195l60210K16053J21529j66163q1313L16903k30780M1984
1398a75601j2446K80670J89100j81374k72674k93454J31542r573K60990J03166
1388B0346l00830K73030J6475k52624N6915K37314o7462J7781R875n7701j33997
1377a80878M4145L0250p3286Q9760o4792J51582j73816N0434J8103J09702Q9857
1366I1061j78265j0694K03575o3652l43988J27390K6020l6658J73926j21989J01753
1355c1521K62007k09552n2461L19351J54547j48541k31040m6488L1219L76794
1345D24315n20795N7347J56427j65346j78578J96810J18024k76091J6262J3501
1335a58124L96244j06412j38215O4680l63480j15752O27274j68155k12978L82508
$$ plain form
1325 207590 74015 -183675 -113804 97998 -51597 -425052 -375255 -315503 -156271 -35733
1315 -35733 -320746 -368308 32552 -13109 -8572 -3673 -272858 -195587 -63675 -5671 -146323
1304 -146323 -68157 -260174 -506590 -631196 -399271 -313638 -43057 -4369 -245029 -300796
1294 -300796 -129634 -133993 -177940 -261112 -230484 18697 297290 121403 -287207 -95970 61614
1283 61614 26941 -84935 -99678 -222179 -159878 -74914 140434 -93521 -5505 97326 62982
1272 62982 -16419 -102480 68483 -231136 -355109 85915 85466 147384 -83634 -106606 214270
1261 214270 -172077 -152037 -231663 -141376 118976 -118889 83395 68914 82350 93524 237003
1250 237003 82184 12575 -253182 -63799 -152670 -43804 -50790 -64897 -225455 -132137 -255138
$$ packed form
1325B07590j33575k57690O9871K11802j49595l73455M9797N9752J59232J20538
1315c5733k85013m7562M00860m5661M537M899k69185P7271J31912N8004j40652
1304a46323P8166j92017k46416j24606K31925Q5633K70581L8688k40660n5767
1294c00796J71162m359m3947q3172L0628K49181K78593j75887m08610J91237J57584
1283F1614l4673j11876j4743j22501O2301Q4964K15348k33955Q8016J02831l4344
1272F2982p9401q6061J70963k99619j23973M41024m49O1918k31018k2972L20876
1261B14270l86347K0040p9626R0287K60352k37865K02284j4481J3436J1174J43479
1250B37003j54819o9609k65757J89383q8871J08866o986j4107j60558R3318j23001
$$ plain form
1239 -255138 -55926 -49393 -249992 -89592 59473 -262595 -301419 20214 -131908 106023
1229 106023 -107514 9234 -95673 -203610 323568 198314 2733 121731 149389 176653
1219 176653 104945 302596 191049 -55933 -23599 84482 -31355 -285272 -338233 -53057
1209 -53057 -202277 107550 -197020 -496977 -121150 -171469 -290980 -92885 -275928 -371551
1199 -371551 -321941 83499 -118014 -391303 -129508 -122594 157762 132500 -66268 111415
1189 111415 -20903 -104538 -126313 -55838 -289592 -525716 -570723 -384108 -259933 -118549
1179 -118549 130114 -15833 -352652 -190390 108695 247290 229134 -103127 36149 276394
1169 276394 -78328 255462 217347 141074 23030 -273418 -10115 139865 166274 82894
$$ packed form
1239b55138J99212O533k00599J60400J49065l22068l8824L21633j52122K37931
1229A06023k13537J16748j04907j07937N27178j25254j95581J18998K7658K7264
1219A76653p1708J97651j11547k46982L2334J08081j15837k53917n2961K85176
1209e3057j49220L09827l04570k99957L75827n0319j19511J98095j83043r5623
1199c71551M9610M05440k01513k73289K61795O914K80356k5262j98768J77683
1189A11415j32318q3635k1775P0475k33754k36124m5007J86615J24175J41384
1179a18549K48663j45947l36819J62262K99085J38595j8156l32261J39276K40245
1169B76394l54722L33790l8115p6273j18044k96448K63303J49980K6409q3380
$$ plain form
1159 82894 441296 309626 -1944 -93371 -347710 -46836 25177 130418 147782 101089 221744
$$ packed form
1159H2894L58402j31670l11570r1427k54339L00874P2013J05241J7364m6693J20655
$$ [...]
##END NTUPLES=NMR SPECTRUM
##END=
