##TITLE=1H_CG-1164-4
 CDCl3
 8 sc, 
 24.10.2022
##JCAMPDX= 6.0         $$ Bruker NMR JCAMP-DX V2.0
##DATA TYPE= NMR SPECTRUM
##DATA CLASS= NTUPLES
##ORIGIN= UXNMR, Bruker Analytische Messtechnik GmbH
##OWNER= root
$$ XWIN-NMR		Version 3.5
$$ Mon Oct 24 14:31:15 2022 Russian Standard Time (UT+4h)  she@DPX200
##.OBSERVE FREQUENCY= 200.1313499994
##.OBSERVE NUCLEUS= ^1H
##.ACQUISITION MODE= SIMULTANEOUS
##.ACQUISITION SCHEME= undefined
##.AVERAGES= 8
##.DIGITISER RES= 18
##SPECTROMETER/DATA SYSTEM= spect
##.PULSE SEQUENCE= zg30
##.SOLVENT NAME= CDCl3
##.SHIFT REFERENCE= (INTERNAL, CDCl3, 0, 15.7337)
##AUDIT TRAIL= $$ (NUMBER, WHEN, WHO, WHERE, WHAT)
$$ ##TITLE= Audit trail, XWIN-NMR		Version 3.5
$$ ##JCAMPDX= 5.01
$$ ##ORIGIN= Bruker BioSpin GmbH
$$ ##OWNER= she
$$ F:/spectra/data/she/nmr/H-F/1/pdata/1/auditp.txt
$$ ##AUDIT TRAIL=  $$ (NUMBER, WHEN, WHO, WHERE, WHAT)
(   1,<2022-10-24 14:29:56.12 +0400>,<she>,<DPX200>,
      <created by zg, POWCHK disabled, PULCHK disabled
       configuration hash MD5:
       00 E9 B6 7A A2 85 ED C7 34 08 36 98 17 FE 4E 26
       data hash MD5: 16K
       6F 8C 9E FC C6 72 95 04 1C B4 66 B0 03 06 D6 09>)
(   2,<2022-10-24 14:30:01.09 +0400>,<she>,<DPX200>,
      <Start of raw data processing
       efp BC_mod = 2 LB = 0.24 FT_mod = 6 PKNL = 1 PHC0 = -18033.19 PHC1 = 10.6007 SI = 16K 
       data hash MD5: 16K
       7E 0D D9 AB 97 88 34 71 8A 32 51 A8 34 B5 56 E3>)
(   3,<2022-10-24 14:30:18.04 +0400>,<she>,<DPX200>,
      <pk PHC0 = -4.229699 PHC1 = 1.6 
       data hash MD5: 16K
       AB 80 0F 41 18 44 02 54 CD F0 F6 C7 8C FF CA D9>)
(   4,<2022-10-24 14:30:21.45 +0400>,<she>,<DPX200>,
      <abs ABSG = 5 
       data hash MD5: 16K
       85 1E 7D DF 1B 07 12 81 7C 3B FE FF B2 F5 4B A0>)
$$ ##END=
$$ 
$$ hash MD5
$$ C8 A1 2B 4B 64 BF 7D D7 F0 94 A3 E4 8C A7 7C 94
##$RELAX= 
##$RELAX= 
##$RELAX= 
##$RELAX= 
##$RELAX= 
##$RELAX= 
$$ Bruker specific parameters
$$ --------------------------
##$DU= <F:/spectra>
##$EXPNO= 1
##$NAME= <H-F>
##$PROCNO= 1
##$TYPE= <nmr>
##$USER= <she>
##$AMP= (0..31)
100 100 100 100 100 100 100 100 100 100 100 100 100 100 100 100 100 100 
100 100 100 100 100 100 100 100 100 100 100 100 100 100 
##$AQSEQ= 0
##$AQ_mod= 1
##$AUNM= <au_zg>
##$AUTOPOS= <>
##$BF1= 200.13
##$BF2= 200.13
##$BF3= 200.13
##$BF4= 200.13
##$BF5= 200.13
##$BF6= 200.13
##$BF7= 200.13
##$BF8= 200.13
##$BYTORDA= 1
##$CFDGTYP= 0
##$CFRGTYP= 5
##$CHEMSTR= <none>
##$CNST= (0..31)
1 1 145 1 1 1 1 1 1 1 1 1 1 1 1 1 1 1 1 1 1 1 1 1 1 1 1 1 1 1 1 1 
##$CPDPRG= <>
##$CPDPRG1= <>
##$CPDPRG2= <>
##$CPDPRG3= <>
##$CPDPRG4= <mlev>
##$CPDPRG5= <mlev>
##$CPDPRG6= <mlev>
##$CPDPRG7= <mlev>
##$CPDPRG8= <mlev>
##$CPDPRGB= <>
##$CPDPRGT= <>
##$D= (0..31)
0 1.2 0 0 0 0 0 0 0 0.06 0 0.03 0 0 0 0 0.0002 0 0 0 0 0 0 0 0 0 0 0 0 
0 0 0 
##$DATE= 1666607395
##$DBL= (0..7)
120 120 120 120 120 120 120 120 
##$DBP= (0..7)
150 150 150 150 150 150 150 150 
##$DBP07= 0
##$DBPNAM0= <>
##$DBPNAM1= <>
##$DBPNAM2= <>
##$DBPNAM3= <>
##$DBPNAM4= <>
$$ [...]
##$SUBNAM3= <"">
##$SUBNAM4= <"">
##$SUBNAM5= <"">
##$SUBNAM6= <"">
##$SUBNAM7= <"">
##$SUBNAM8= <"">
##$SUBNAM9= <"">
##$SW= 18.0517283424941
##$SWIBOX= (0..15)
0 0 2 0 0 0 0 0 0 0 0 0 0 0 0 0 
##$SW_h= 3612.71676300578
##$TD= 16384
##$TD0= 1
##$TE= 0
##$TE2= 300
##$TE3= 300
##$TEG= 300
##$TL= (0..7)
0 120 120 120 120 120 120 120 
##$TP= (0..7)
150 150 150 150 150 150 150 150 
##$TP07= 0
##$TPNAME0= <>
##$TPNAME1= <>
##$TPNAME2= <>
##$TPNAME3= <>
##$TPNAME4= <>
##$TPNAME5= <>
##$TPNAME6= <>
##$TPNAME7= <>
##$TPOAL= (0..7)
0.5 0.5 0.5 0.5 0.5 0.5 0.5 0.5 
##$TPOFFS= (0..7)
0 0 0 0 0 0 0 0 
##$TUNHIN= 0
##$TUNHOUT= 0
##$TUNXOUT= 0
##$USERA1= <user>
##$USERA2= <user>
##$USERA3= <user>
##$USERA4= <user>
##$USERA5= <user>
##$V9= 5
##$VALIST= <valist>
##$VCLIST= <CCCCCCCCCCCCCCC>
##$VD= 0
##$VDLIST= <DDDDDDDDDDDDDDD>
##$VPLIST= <PPPPPPPPPPPPPPP>
##$VTLIST= <TTTTTTTTTTTTTTT>
##$WBST= 1024
##$WBSW= 4
##$XGAIN= (0..3)
0 0 0 0 
##$XL= 0
##$YL= 0
##$YMAX_a= 79782
##$YMIN_a= -141368
##$ZGOPTNS= <>
##$ZL1= 120
##$ZL2= 120
##$ZL3= 120
##$ZL4= 120
##$ABSF1= 15.75791
##$ABSF2= -2.29394
##$ABSG= 5
##$ABSL= 3
##$ALPHA= 0
##$AQORDER= 0
##$ASSFAC= 0
##$ASSFACI= 0
##$ASSFACX= 0
##$ASSWID= 0
##$AUNMP= <proc_1d>
##$AZFE= 0.1
##$AZFW= 0.1
##$BCFW= 0
##$BC_mod= 2
##$BYTORDP= 0
##$COROFFS= 0
##$CY= -3
##$DATMOD= 1
##$DC= 0
##$DFILT= <>
##$DTYPP= 0
##$F1P= 0
##$F2P= 0
##$FCOR= 1
##$FTSIZE= 16384
##$FT_mod= 6
##$GAMMA= 0
##$GB= 0
##$INTBC= 1
##$INTSCL= 3.70164e-10
##$ISEN= 128
##$LB= 0.24
##$LEV0= 0
##$LPBIN= 0
##$MAXI= 10000
##$MC2= 0
##$MEAN= 0
##$ME_mod= 0
##$MI= 1.114404
##$NCOEF= 0
##$NC_proc= -7
##$NLEV= 6
##$NOISF1= 3.799351
##$NOISF2= 2.8
##$NSP= 0
##$NTH_PI= 0
##$NZP= 0
##$OFFSET= 15.73367
##$PC= 1
##$PHC0= -18037.42
##$PHC1= 12.2007
##$PH_mod= 1
##$PKNL= yes
##$PPARMOD= 0
##$PSCAL= 0
##$PSIGN= 0
##$REVERSE= no
##$SF= 200.130007579626
##$SI= 16384
##$SIGF1= 3
##$SIGF2= 2
##$SINO= 5.538805
##$SIOLD= 16384
##$SREGLST= <1H.CDCl3>
##$SSB= 0
##$STSI= 16384
##$STSR= 0
##$SW_p= 3612.71676300578
##$SYMM= 0
##$S_DEV= 0
##$TDeff= 16384
##$TDoff= 0
##$TI= <>
##$TILT= no
##$TM1= 0
##$TM2= 0
##$TOPLEV= 0
##$USERP1= <user>
##$USERP2= <user>
##$USERP3= <user>
##$USERP4= <user>
##$USERP5= <user>
##$WDW= 1
##$XDIM= 16384
##$YMAX_p= 327506809
##$YMIN_p= -1112114
$$ End of Bruker specific parameters
$$ ---------------------------------
##NTUPLES= NMR SPECTRUM
##VAR_NAME=  FREQUENCY,     SPECTRUM/REAL,   SPECTRUM/IMAG
##SYMBOL=    X,             R,               I
##VAR_TYPE=  INDEPENDENT,   DEPENDENT,       DEPENDENT
##VAR_FORM=  AFFN,          ASDF,            ASDF
##VAR_DIM=   16384,         16384,           16384
##UNITS=     HZ,            ARBITRARY UNITS, ARBITRARY UNITS
##FACTOR=    0.220516191357247, 1,           1
##FIRST=     3148.77954332188, 0,            0
##LAST=      -463.9372196839, 0,             0
##MIN=       -463.9372196839, -1112114,      0
##MAX=       3148.77954332188, 327506809,    0
$$ Real data points
##PAGE= N=1
##DATA TABLE= (X++(R..R)), XYDATA
$$ [...]
$$ plain form
7089 5699537 5551793 5342369 5194042 5360963 5314302 5016748 4566735 4439107 4631276 4583465
7079 4583465 4889264 4897932 5017787 5228618 5811788 6159594 6529523 7077790 7543636 7674675
7069 7674675 7259312 6624957 5779316 4779843 4341746 3799321 3628077 3555663 3085378 2929373
7059 2929373 2830616 2350117 2233601 2045396 1947728 1905613 1896998 1905914 1832774 1914844 1749675
7048 1749675 1515573 1461820 1135017 1266957 1297029 1103848 1209173 1254589 1207644 1228127
7038 1228127 1203311 978545 854643 727159 798884 670151 698010 834553 808593 714832
7028 714832 740554 836434 449402 690457 969341 435482 425243 516222 668822 701006 744327
7017 744327 786759 835680 907259 819701 850528 860413 755175 658250 570517 586206 344465
$$ packed form
7089E699537j47744k09424j48327J66921m6661k97554m50013j27628J92169m7811
7079D583465L05799Q668J19855K10831N83170L47806L69929N48267M65846J31039
7069G674675m15363o34355q45641r99473m38097n42425j71244p2414m70285j56005
7059B929373r8757m80499j16516j88205r7668m2115q615Q916p3140Q2070j65169
7048A749675k34102n3753l26803J31940L0072j93181J05325M5416m6945K0483
7038A228127k4816k24766j23902j27484P1725j28733K7859J36543k5960r3761
7028G14832K5722R5880l87032K41055K78884n33859j0239R0979J52600L2184M3321
7017G44327M2432M8921P1579q7558L0827R885j05238r6925q7733J5689k41741
$$ plain form
7006 344465 409005 457973 260201 249784 265896 316309 297216 16448 247929 170979 121809
6995 121809 491472 546204 486521 266950 210835 382291 382777 360640 333581 176566 389655
6984 389655 527439 410994 469793 570216 530284 299005 276174 320872 491661 531673 240870
6973 240870 123558 329694 389070 278698 320015 131712 166198 228145 73238 96791 97518
6962 97518 197897 331987 445053 277946 285968 225869 442532 455376 372091 301029 296080
6951 296080 155778 271922 422477 413408 160525 342186 138383 -148577 -139979 -208330 293485
6940 293485 6976 -125920 96049 67992 -3179 -89184 -16815 75414 146523 77510 -101008
6929 -101008 -54971 -35322 -37180 -42620 77777 89468 53119 181982 194589 176650 110720 236318
$$ packed form
7006C44465O4540M8968j97772j0417J6112N0413j9093k80768K31481p6950m9170
6995A21809L69663N4732n9683k19571n6115J71456M86k2137k7059j57015K13089
6984C89655J37784j16445N8799J00423l9932k31279k2831M4698J70789M0012k90803
6973B40870j17312K06136N9376j10372M1317j88303L4486O1947j54907K3553P27
6962I7518J00379J34090J13066j67107Q022o0099K16663J2844q3285p1062m949
6951B96080j40302J16144J50555r069k52883J81661k03803k86960Q598o8351N01815
6940B93485k86509j32896K21969k8057p1171q6005P2369R2229P1109o9013j78518
6929a01008M6037J9649j858n440J20397J1691l6349J28863J2607j7939o5930J25598
$$ plain form
6917 236318 347306 176903 137959 4408 -84398 -148493 106449 88139 21301 -41356 -118685
6906 -118685 -88510 -66082 259 305538 275583 301504 394198 327457 233015 394544 180014
6895 180014 6173 -190840 -193776 -167656 71973 48940 63093 -26838 -286758 -39178 -208122
6884 -208122 -139262 -286558 -242080 3759 192305 107490 -64687 -21210 76663 -84903 -178817
6873 -178817 28108 141696 -14278 45413 21776 -63549 -8445 49744 160215 37979 63237
6862 63237 -7498 176200 370700 355911 412239 299556 132822 53412 115409 151058 -172545
6851 -172545 -276938 -119582 -19759 -227857 -203303 -64798 77199 -57488 -210333 37648
6841 37648 204115 52937 -33424 58428 14530 -86320 -284699 -272107 38106 -184327 -105631
$$ packed form
6917B36318J10988j70403l8944j33551q8806o4095K54942j8310o6838o2657p7329
6906a18685L0175K2428O6341L05279k9955K5921R2694o6741r4442J61529k14530
6895A80014j73841j97013k936K6120K39629k3033J4153q9931k59920K47580j68944
6884b08122O8860j47296M4478K45839J88546q4815j72177M3477R7873j61566r3914
6873a78817K06925J13588j55974N9691k3637q5325N5104N8189J10471j22236K5258
6862F3237p0735J83698J94500j4789N6328j12683j66734p9410O1997L5649l23603
6851a72545j04393J57356R9823k08098K4554J38505J41997j34687j52845K47981
6841C7648J66467j51178q6361R1852m3898j00850j98379J2592L10213k22433P8696
$$ plain form
6830 -105631 -83374 -239174 -260888 -76330 119639 120177 217813 330 62187 183306 85135
6819 85135 -25772 11107 139701 131553 155761 159047 70942 208073 228226 153040 -146087
6808 -146087 -22983 45102 120593 137089 185796 224534 203595 67648 86043 72290 8639
6797 8639 -82148 -103956 -122208 -46750 26336 -29854 -219384 -247094 -57786 56891 36176
6786 36176 21262 -77262 -75222 15185 -13041 35491 -115481 -140000 -4770 105353 146845
6775 146845 56115 -130142 -166926 -11837 -102415 -24419 -53695 -45260 -21562 221606 393731
6764 393731 129439 -182168 -32836 206222 112355 -10960 -45735 73124 260294 255329
6754 255329 179016 88322 110380 328951 304441 178720 56223 -44574 -131760 -5269 -31488
$$ packed form
6830a05631K2257j55800k1714J84558J95969N38R7636k17483O1857J21119r8171
6819H5135j10907L6879J28594q148K4208L286q8105J37131K0153p5186k99127
6808a46087J23104O8085P5491J6496M8707L8738k0939j35947J8395j3753o3651
6797H639r0787k1808j8252P5458P3086n6190j89530k7710J89308J14677k0715
6786C6176j4914r8524K040R0407k8226M8532j50972k4519J35230J10123M1492
6775A46845r0730j86257l6784J55089r0578P7996k9276Q435K3698K43168J72125
6764C93731k64292l11607J49332K39058r3867j23315l4775J18859J87170m965
6754B55329p6313r0694K2058K18571k4510j25721j22497j00797q7186J26491k6219
$$ plain form
6743 -31488 -81909 -14758 -7308 -70768 -31966 -18916 -32369 -6847 44228 49408 260055 456848
6731 456848 149597 312600 433087 163418 274512 301903 271617 403506 397616 103126
6721 103126 149762 117242 502994 557667 403910 398785 182186 200976 195531 114038 75221
6710 75221 204425 246437 166575 267428 338334 65086 -82485 -21890 24696 -99495 123095
6699 123095 31043 -54741 33196 -112996 -26455 -72996 28740 66217 222208 237948 282335
6688 282335 165928 237414 217244 242263 265658 222047 249249 182428 368058 383434 345318
6677 345318 283215 -58144 -87650 -221915 132965 196776 71274 174291 73195 27580
6667 27580 28108 111447 -79920 183108 252813 36490 -18214 -98151 73732 -37281 -2450
$$ packed form
6743c1488n0421O7151P450o3460L8802J3050j3453K5522N1075N180K10647J96793
6731D56848l07251J63003J20487k69669J11094K7391l0286J31889n890k94490
6721A03126M6636l2520L85752N4673j53757n125k16599J8790n445q1493l8817
6710G5221J29204M2012p9862J00853P0906k73248j47571O0595M6586j24191K22590
6699A23095r2052q5784Q7937j46192Q6541m6541J01736L7477J55991J5740M4387
6688B82335j16407P1486k0170K5019K3395m3611K7202o6821J85630J5376l8116
6677C45318o2103l41359k9506j34265L54880O3811j25502J03017j01096m5615
6667B7580N28Q3339j91367K63028O9705k16323n4704p9937J71883j11013L4831
$$ plain form
6656 -2450 -192683 -374852 -477488 -349397 -187865 -178771 33660 177826 218786 232112 150649
6645 150649 164546 137817 314644 377274 346005 416995 290901 114710 27851 226796 24978
6634 24978 122356 115301 448727 265543 -188934 -211073 106184 160780 471074 272708 86483
6623 86483 310007 287450 299541 377665 395360 357073 164636 305352 5872 -4302 -101115
6612 -101115 107679 281202 200873 358205 616256 421893 424133 524968 367712 380564
6602 380564 299217 311929 227615 497915 570905 252629 150303 241707 152964 34762 -153271
6591 -153271 -86173 -169062 -51869 202027 207065 69676 206135 181402 80148 70434 168331
6580 168331 109061 185379 222873 309519 367972 395314 259902 325219 264710 383131 387098
$$ packed form
6656b450j90233j82169j02636J28091J61532R094K12431J44166M0960J3326q1463
6645A50649J3897k6729J76827O2630l1269P0990j26094j76191q6859J98945k01818
6634B4978R7378p055L33426j83184m54477k2139L17257N4596L10294j98366j86225
6623H6483K23524k2557J2091P8124J7695l8287j92437J40716k99480j0174r6813
6612a01115K08794J73523q0329J57332K58051j94363K240J00835j57256J2852
6602C80564q1347J2712q4314K70300P2990l18276j02326R1404q8743j18202j88033
6591a53271O7098q2889J17193K53896N038j37389J36459k4733j01254r714R7897
6580A68331n9270P6318L7494Q6646N8453K7342j35412O5317o0509J18421L967
$$ plain form
6569 387098 348007 424839 503074 259414 78383 -17015 342000 286685 271466 335724 403438
6558 403438 220260 89597 318526 284956 393621 392036 328511 220310 550056 359313
6548 359313 63150 127146 208856 530815 419249 104477 151816 160722 186030 290498 150006
6537 150006 114716 301272 203139 116928 374536 525513 430297 471338 371953 330727 -19372
6526 -19372 -38795 78286 -8971 -173817 -18452 -45948 -125997 -104270 -69701 -308171 -205993
6515 -205993 232110 479655 474441 602624 307620 417148 399657 138826 357085 143383
6505 143383 62030 203458 217566 233466 252250 53248 -51125 -147632 52509 178282 161527
6494 161527 55570 -15476 -75321 -211726 -151115 14624 -15541 -285975 -323406 -123308 94908
$$ packed form
6569C87098l9091P6832P8235k43660j81031r5398L59015n5315j5219O4258O7714
6558D03438j83178j30663K28929l3570J08665j585o3525j08201L29746j90743
6548C59313k96163O3996Q1710L21959j11566l14772M7339Q906K5308J04468j40492
6537A50006l5290J86556r8133q6211K57608J50977r5216M1041r9385m1226l50099
6526a9372j9423J17081q7257j64846J55365k7496q0049K1727L4569k38470J02178
6515b05993M38103K47545n214J28183k95004J09528j7491k60831K18259k13702
6505A43383q1353J41428J4108J5900J8784j99002j04373r6507K00141J25773j6755
6494A61527j05957p1046n9845j36405O0611J65739l0165k70434l7431K00098K18216
$$ plain form
6483 94908 122350 126058 230374 353237 380125 194783 258092 368890 245532 68119 163156
6472 163156 131390 -37241 -60099 135224 -70028 13483 127573 38510 23877 -18548 -40145
6461 -40145 -48841 14318 -104931 -61563 -5423 302849 315353 192618 215815 150286 159882 18712
6449 18712 83920 57482 -23601 167789 272284 269577 441238 213054 -81189 -214212 -44561
6438 -44561 8808 123798 54182 69232 57662 169986 214050 128600 476726 486966 164974
6427 164974 184441 219685 355902 225383 162903 318863 175709 285021 230104 198441 106551
6416 106551 18713 24784 305181 179650 -64568 152881 152803 147260 285166 270605 495353
6405 495353 537382 382143 208842 259549 188228 314929 412864 375977 160154 247556 199100
$$ packed form
6483I4908K7442L708J04316J22863K6888j85342O3309J10798j23358j77413R5037
6472A63156l1766j68631k2858J95323k05252Q3511J14090q9063j4633m2425k1597
6461d0145q696O3159j19249M3368N6140L08272J2504j22735K3197o5529R596j41170
6449A8712O5208k6438q1083J91390J04495k707J71661k28184k94243j33023J69651
6438d4561N3369J14990o9616J5050j1570J12324M4064q5450L48126J0240l21992
6427A64974J9467L5244J36217j30519o2480J55960j43154J09312n4917l1663r1890
6416A06551q7838O071K80397j25531k44218K17449p8n543J37906j4561K24748
6405D95353M2029j55239j73301N0707p1321J26701R7935l6887k15823Q7402m8456
$$ plain form
6394 199100 480838 316660 353975 258015 -9150 52643 252805 302456 461795 619317
6384 619317 228215 532885 596919 367602 58987 25347 115093 97066 121466 193958 541236
6373 541236 904770 755496 608318 497500 382851 421183 452124 283844 322693 229069
6363 229069 430751 512695 686089 363374 569783 543258 442969 422991 362419 358185 387707
6352 387707 355538 308343 244684 229063 482547 573349 432129 227779 432942 420619 490069
6341 490069 464921 378909 250511 320492 501665 712126 540617 331653 336990 302016 277985
6330 277985 401593 398574 617889 505740 422864 412726 521502 461789 194300 223712 570876
6319 570876 555067 312226 462288 487343 499334 548120 411308 628399 385709 434401 581269
$$ packed form
6394A99100K81738j64178L7315r5960k67165O1793K00162M9651J59339J57522
6384F19317l91102L04670O4034k29317l08615l3640Q9746j8027K4400P2492L47278
6373E41236L63534j49274j47178j10818j14649L8332L0941j68280L8849r3624
6363B29069K01682Q1944J73394l22715K06409k6525j00289j9978o0572m234K9522
6352C87707l2169m7195o3659j5621K53484R0802j41220k04350K05163j2323O9450
6341D90069k5148q6012j28398O9981J81173K10461j71509k08964N337l4974k4031
6330B77985J23608l019K19315j12149q2876j0138J08776n9713k67489K9412L47164
6319E70876j5809k42841J50062K5055J1991M8786j36812K17091k42690M8692J46868
$$ plain form
6308 581269 351479 479655 413184 342256 367451 409531 811868 1075953 810792 590435
6298 590435 737471 416754 483618 485694 371661 413004 406722 578137 499856 665172 850689
6287 850689 773814 481709 458626 485156 617866 830290 895385 639568 738588 582652 562795
6276 562795 737969 843239 640906 649631 635000 600499 778214 715596 748838 940595 908790
6265 908790 1084642 1295743 1259775 1145095 1279392 1367782 1295358 1070100 1120189 833282
6255 833282 700984 778255 704953 491446 737523 968425 806733 874539 969675 1015650 730650
6244 730650 1077950 1130923 922710 799638 819571 851000 963616 971111 792789 521657 548640
6233 548640 673835 1001782 1128194 724501 630198 689584 936534 1062839 1113321 804958
$$ packed form
6308E81269k29790J28176o6471p0928K5195M2080M02337K64085k65161k20357
6298E90435J47036l20717O6864K076j14033M1343o282J71415p8281J65316J85517
6287H50689p6875k92105k3083K6530J32710K12424O5095k55817R9020j55936j9857
6276E62795J75174J05270k02333Q725j4631l4501J77715o2618L3242J91757l1805
6265I08790J75852K11101l5968j14680J34297Q8390p2424k25258N0089k86907
6255H33282j32298P7271p3302k13507K46077K30902j61692O7806R5136M5975k85000
6244G30650L47300N2973k08213j23072J9933L1429J12616P495j78322k71132K6983
6233E48640J25195L27947J26412m03693r4303N9386K46950J26305N0482l08363
$$ plain form
6223 804958 845132 1095448 1015581 1145776 1152035 959467 682481 705407 942242 1159918 1012493
6212 1012493 868465 787033 1006600 970081 814695 960250 985234 879839 830324 729064
6202 729064 812361 1024870 924831 1107243 1077469 1141589 1240786 1106311 1093441 938394 988326
6191 988326 1033146 1004002 971802 1107682 960147 1016052 1217940 1201529 1265302 1374031 1385299
6180 1385299 1425520 1317710 1337170 1447646 1410820 1349708 1497191 1384739 1508052 1819074
6170 1819074 1823144 1937488 1814925 1868570 1849239 2016902 2062118 1923249 1955284 2070425 1970310
6159 1970310 2174081 2231235 2362325 2262191 2337287 2430319 2645304 2796190 2536848 2389382
6149 2389382 2617992 2850248 2792736 2986629 3202957 3296968 3328887 3515162 3550802 3556017 3565409
$$ packed form
6223H04958M0174K50316p9867J30195O259j92568k76986K2926K36835K17676j47425
6212A012493j44028q1432K19567l6519j55386J45555K4984j05395m9515j01260
6202G29064Q3297K12509j00039J82412k9774O4120R9197j34475j2870j55047M9932
6191I88326M4820k9144l2200J35880j47535N5905K01888j6411O3773J08729J1268
6180A385299M0221j07810J9460J10476l6826o1112J47483j12452J23313L11022
6170A819074M070J14344j22563N3645j9331J67663M5216j38869L2035J15141j00115
6159A970310K03771N7154J31090j00134P5096R3032K14985J50886k59342j47466
6149B389382K28610K32256n7512J93893K16328R4011L1919J86275L5640N215R392
$$ plain form
6138 3565409 3879700 4249351 4593102 4425571 4446572 4535906 4797808 4818805 5024514 5173375
6128 5173375 5428208 5800408 6202922 6287459 6571394 6825666 6949217 7588946 7943874 8388367
6118 8388367 9152429 10260798 11063166 12064407 13618844 15338931 17444570 19896188 22943167
6109 22943167 26101618 28507038 28638156 26614650 23715269 21403755 20379196 19624419
6101 19624419 19870459 20564252 22135391 24377733 26889145 28737602 28610612 25929578 22202618
6092 22202618 18513881 15864115 14157689 12752120 11693204 10710053 10232735 9810045 9435281
6083 9435281 9235685 9079879 9022107 8781724 8938067 9040338 9173402 9215296 9358985 9492721
6073 9492721 9551395 9804695 10106290 10486903 10920646 11845979 12713024 13472123 14431284 15447519
$$ packed form
6138C565409L14291L69651L43751j67531K1001Q9334K61902K0997K05709J48861
6128E173375K54833L72200M02514Q4537K83935K54272J23551O39729L54928M44493
6118H388367P64062J108369Q02368J001241J554437J720087K105639K451618L046979
6109B2943167L158451K405420J31118k023506k899381k311514j024559p54777
6101A9624419K46040O93793J571139K242342K511412J848457j26990k681034l726960
6092B2202618l688737k649766j706426j405569j058916r83151m77318m22690l74764
6083I435281j99596j55806n7772k40383J56343J02271J33064M1894J43689J33736
6073I492721N8674K53300L01595L80613M33743R25333Q67045P59099R59161J016235
$$ plain form
6063 15447519 16984851 19027629 21325323 23940901 27537424 31757469 35838605 37337688
6055 37337688 35545515 32021372 28358311 25777135 24771099 24691655 25135072 26409646 28814795
6046 28814795 32127045 34977607 35498831 33000572 28269144 23094799 19154431 16020443
6038 16020443 13913610 12350176 10878256 9597541 8779147 8121577 7627915 7169735 6558748
6029 6558748 6020628 5682015 5559914 5321652 5373577 5411878 4923653 4968249 4739563 4352954
6019 4352954 4168197 4105208 4037044 3957789 3705028 3572027 3465935 3307712 2956218 2877925
6009 2877925 2802711 2505566 2321934 2504791 2577312 2592741 2522268 2416850 2318679 2357774 2136577
5998 2136577 1970899 2033804 1947294 1909332 1957365 1941488 2006603 1979788 1770498 1638697 1913788
$$ packed form
6063A5447519J537332K042778K297694K615578L596523M220045M081136J499083
6055C7337688j792173l524143l663061k581176j006036p9444M43417J274574K405149
6046B8814795L312250K850562N21224k498259m731428n174345l940368l133988
6038A6020443k106833j563434j471920j280715q18394o57570m93662m58180o10987
6029F558748n38120l38613j22101k38262N1925L8301m88225M4596k28686l86609
6019D352954j84757o2989o8164p9255k52761j33001j06092j58223l51494p8293
6009B877925p5214k97145j83632J82857P2521J5429p0473j05418r8171L9095k21197
5998B136577j65678O2905q6510l7962M8033j5877O5115k6815k09290j31801K75091
$$ plain form
5987 1913788 2149615 1799733 1960166 2196792 2059636 1989261 1987026 1811189 1925967 2006858
5977 2006858 1927718 1976172 1674209 1544031 1828603 1973170 2111275 1880711 1928156 2034599
5967 2034599 2240681 2121305 2033577 2130130 2181326 2046346 1960832 2095282 2129282 2121497 2034733
5956 2034733 1992840 2029523 2085300 2360918 2623172 2604763 2177680 2040875 2263768 2311754
5946 2311754 2079948 1970085 2215660 2419544 2546591 2317049 2454083 2572429 2501900 2671356
5936 2671356 2747499 2540866 2792105 3222981 3286459 3288383 3350332 3290259 3255773 3009082 2973008
5925 2973008 2843637 3112618 3272091 3306632 3657487 3799051 3844640 4196239 4530749 4643491
5915 4643491 4948691 5349709 5871445 6118475 6248289 6222210 5931937 5763959 5701355 5594030
$$ packed form
5987A913788K35827l49882J60433K36626j37156p0375k235j75837J14778Q0891
5977B006858p9140M8454l01963j30178K84572J44567J38105k30564M7445J06443
5967B034599K06082j19376q7728R6553N1196j34980q5514J34450L4000p785q6764
5956B034733m1893L6683N5777K75618K62254j8409m27083j36805K22893M7986
5946B311754k31806j09863K45575K03884J27047k29542J37034J18346p0529J69456
5936B671356P6143k06633K51239M30876O3478J924O1949o0073l4486k46691l6074
5925B973008j29371K68981J59473L4541L50855J41564M5589L51599L34510J12742
5915D643491L05200M01018N21736K47030J29814k6079k90273j67978o2604j07325
$$ plain form
5905 5594030 5026516 4726968 4797043 4730567 5066195 5098761 4964131 4743506 4351462 4189253
5895 4189253 3988675 3645087 3684599 3389316 3381619 3334273 3367978 3402527 3717284 3894916 3844609
5884 3844609 3736107 3858719 4290846 4214381 4095381 4435292 5060865 5607536 6398339 6784101
5874 6784101 6552511 5899520 4849807 4405986 4079492 4076436 3766128 3391689 3346037 3126058
5864 3126058 3049812 3146854 3043929 3084877 3044528 3085791 3145988 3219977 3342880 3161539 3504410
5853 3504410 3451139 3348001 3737638 3819501 3822173 4267694 4767852 5473812 6037133 6639387
5843 6639387 7016572 6551013 5862412 5178977 4821503 4412931 4199062 3960582 3616610 3431080
5833 3431080 3226964 3210644 3121295 3019578 2902649 3081496 3095023 2897635 3120552 3101076
$$ packed form
5905E594030n67514k99548P0075o6476L35628L2566j34630k20625l92044j62209
5895D189253k00578l43588L9512k95283p697m7346L3705L4549L14757J77632n0307
5884C844609j08502J22612M32127p6465j19000L39911O25573N46671P90803L85762
5874F784101k31590o52991j049713m43821l26494l056l10308l74439m5652k19979
5864C126058p6246R7042j02925M0948m0349M1263O0197P3989J22903j81341L42871
5853C504410n3271j03138L89637Q1863K672M45521N00158P05960N63321O02254
5843F639387L77185m65559o88601o83435l57474m08572k13869k38480l43972j85530
5833C431080k04116j6320q9349j01717j16929J78847J3527j97388K22917j9476
$$ plain form
5823 3101076 2953296 3049578 3265146 3316356 3217662 3443255 3443035 3314283 3852300 4053703 4155509
5812 4155509 4522019 4551677 4828412 4646148 4198312 4005860 4076728 3925181 3873780 3645777
5802 3645777 3673747 3822651 4037238 3958844 4107796 4126233 4176113 4122669 4503246 4646950
5792 4646950 4737495 4836795 5109167 5396650 5593218 5768260 5743608 5713580 5723656 6026680
5782 6026680 6145852 6456602 6936577 7411857 7800007 8374965 8834677 9516863 10353286 11256900
5772 11256900 12457341 13459759 14900193 16795806 19101474 22153233 25723249 29658122
5764 29658122 32485854 32307347 29377348 24900820 20767597 17991293 15825193 14285478
5756 14285478 13190566 12611136 12100638 12084496 12052897 11935192 12042009 12399553 12715449 13264278
$$ packed form
5823C101076j47780R6282K15568N1210r8694K25593k20j28752N38017K01403J01806
5812D155509L66510K9658K76735j82264m47836j92452P0868j51547n1401k28003
5802C645777K7970J48904K14587p8394J48952J8437M9880n3444L80577J43704
5792D646950R0545R9300K72372K87483J96568J75042k4652l0028J0076L03024
5782F026680J19172L10750M79975M75280L88150N74958M59712O82186Q36423R03614
5772A1256900J200441J002418J440434J895613K305668L051759L570016L934873
5764B9658122K827732j78507k929999m476528m133223k776304k166100j539715
5756A4285478j094912n79430n10498j6142l1599j17705J06817L57544L15896N48829
$$ plain form
5746 13264278 13989207 14943251 15757392 17204599 19133287 21228744 24147539 28178290 32431889
5737 32431889 35294989 35228679 31955321 27076350 22483003 19201155 17153208 15377124
5729 15377124 14094129 13146727 12412702 12065121 11638787 11880552 12068784 11967820 12262083
5720 12262083 12706427 13700063 14918290 16086291 17719950 19862621 22977798 25599931
5712 25599931 26443306 24960104 21742520 18392419 15648985 13564263 12186348 11346295
5704 11346295 10568365 10072122 9658442 9581533 9483816 9400446 9330083 9481134 9618923 10063057
5694 10063057 10793236 11418213 12435577 13495123 14852473 16880152 19627981 22723657
5686 22723657 25250708 26471179 24642126 20739164 16846780 13797698 11364452 9857663
$$ packed form
5746A3264278P24929R54044Q14141J447207J928688K095457K918795M030751M253599
5737C2431889K863100o6310l273358m878971m593347l281848k047947j776084
5729A5377124j282995r47402p34025l47581m26334K41765J88232j00964K94263
5720A2262083M44344R93636J218227J168001J633659K142671L115177K622133
5712B5599931Q43375j483202l217584l350101k743434k084722j377915q40053
5704A1346295p77930m96243m13680p6909r7717q3370p0363J51051J37789M44134
5694A0063057P30179O24977J017364J059546J357350K027679K747829L095676
5686B2723657K527051J220471j829053l902962l892384l049082k433246j506789
$$ plain form
5678 9857663 8768560 7816399 7189536 6748754 6267316 5629834 5444535 4941223 4688981
5669 4688981 4289047 4205066 4197585 3851979 3692627 3532201 3576469 3375476 3362471 3145522
5659 3145522 3109912 2907530 2761152 2575345 2691191 2875595 2566138 2656845 2517746 2455397
5649 2455397 2586324 2435152 2506510 2333742 2181317 2483302 2399433 2168170 1943537 2104842
5639 2104842 2128449 1998083 1862634 1964821 1837413 1749260 1685238 1642870 1659627 1892698
5629 1892698 1986137 1883316 1737952 1740352 1828446 1937436 2079483 1954647 1628344 1641708
5619 1641708 1640245 1762054 1884103 1890528 1823720 1985137 2098070 1792216 1799712 1804264 1807857
5608 1807857 1789293 1719654 1828681 1973506 2165901 2127552 2039171 2167292 2254786 2317418 2369569
$$ packed form
5678I857663j089103r52161o26863m40782m81438o37482j85299n03312k52242
5669D688981l99934q3981p481l45606j59352j60426M4268k00993j3005k16949
5659C145522l5610k02382j46378j85807J15846J84404l09457R0707j39099o2349
5649B455397J30927j51172P1358j72768j52425L01985q3869k31263k24633J61305
5639B104842K3607j30366j35449J02187j27408q8153o4022m2368J6757K33071
5629A892698R3439j02821j45364K400Q8094J08990J42047j24836l26303J3364
5619A641708j463J21809J22049O425o6808J61417J12933l05854P496M552L593
5608A807857j8564o9639J09027J44825J92395l8349q8381J28121Q7494O2632N2151
$$ plain form
5597 2369569 2529400 2550867 2298421 2331197 2443937 2611618 2503278 2383426 2297021 2187630
5587 2187630 2190209 2258098 2590033 2641389 2677319 2916850 3074078 3003877 3006452 3275373 3478700
5576 3478700 3756911 3783408 3916829 4200389 4573229 4728346 4746140 4738298 4662809 4414530
5566 4414530 4216050 4225636 4411210 4201827 4277714 4426164 4316452 4248747 4422296 4711373
5556 4711373 4759368 4875460 5122607 5177406 5202384 5628833 5628719 5961408 6005861 6237052 6193251
5545 6193251 6257649 6171037 5984357 5763025 5463321 5278504 5151199 5224149 5252951 5127802
5535 5127802 5156168 5231293 5304144 5395987 5526661 5575919 5995513 6071960 6061663 6380629 6717895
5524 6717895 6893830 7098716 7118101 6746093 6615331 6376838 6040289 5939156 5964818 5889515
$$ packed form
5597B369569J59831K1467k52446L2776J12740J67681j08340j19852q6405j09391
5587B187630K579O7889L31935N1356L5930K39531J57228p0201K575K68921K03327
5576C478700K78211K6497J33421K83560L72840J55117J7794p842p5489k48279
5566D414530j98480R586J85574k09383P5887J48450j09712o7705J73549K89077
5556D711373M7995J16092K47147N4799K4978M26449j14L32689M4453K31191m3801
5545F193251O4398q6612j86680k21332k99704j84817j27305P2950K8802j25149
5535E127802K8366P5125P2851R1843J30674M9258M19594P6447j0297L18966L37266
5524F717895J75935K04886J9385l72008j30762k38493l36549j01133K5662p5303
$$ plain form
5514 5889515 5662921 5561922 5632354 5430267 5498075 5730633 5885571 5692177 5736817 5856901
5504 5856901 6031861 6203078 5975547 5812948 5767149 5422214 5243651 5336391 5154967 5012011
5494 5012011 4961524 5127923 4879321 4751843 4994308 4897636 4950903 4814546 4531714 4455913
5484 4455913 4093607 4087042 4196163 4369592 4455785 4309775 4192531 4087463 4225938 4330613
5474 4330613 4586939 4607129 4294858 4420307 4908153 5239740 5171948 5288771 5651328 5854087
5464 5854087 5964771 6373747 6997611 7466878 7935831 8924801 9862087 10943562 12376193
5455 12376193 14129452 16196447 16998039 16523549 15371350 14040569 13405710 13720868 14187358
5446 14187358 15256017 16702377 17107174 16743499 15725116 14156724 12770490 11858663 11746884
$$ packed form
5514E889515k26594j00999P0432k02087O7808K32558J54938j93394M4640J20084
5504E856901J74960J71217k27531j62599m5799l44935j78563R2740j81424j42956
5494E012011n0487J66399k48602j27478K42465r6672N3267j36357k82832p5801
5484D455913l62306o565J09121J73429Q6193j46010j17244j05068J38475J04675
5474D330613K56326K0190l12271J25449M87846L31587o7792J16823L62557K02759
5464E854087J10684M08976O23864M69267M68953R88970R37286J081475J432631
5455A2376193J753259K066995Q01592m74490j152199j330781o34859L15158M66490
5446A4187358J068659J446360M04797l63675j018383j568392j386234r11827j11779
$$ plain form
5437 11746884 11271619 11334852 11760564 12084705 12763295 13486916 13434576 12142608 10778753
5428 10778753 9790368 9061544 8743645 8515603 8757105 8968246 9146030 9819827 10508206
5419 10508206 10647786 10153807 9237333 7974420 6996500 6087785 5576179 5100477 4824781
5410 4824781 4408070 4116461 3912303 3880987 3887645 3825774 3726167 3632408 3727538 3732993 3809910
5399 3809910 3639344 3622337 3549398 3627870 3551289 3597286 3718824 3598832 3250090 2765335
5389 2765335 2784452 2510951 2509377 2804527 2654141 2448762 2336498 2531872 2504923 2536212
5379 2536212 2575996 2422921 2437583 2683585 2508181 2336554 2422876 2626739 2625455 2827385
5369 2827385 2900461 2759602 2522070 2467000 2320624 2238210 2297770 2156184 1878105 2171005
$$ packed form
5437A1746884m75265O3233M25712L24141O78590P23621n2340j291968j363855
5428A0778753r88385p28824l17899k28042K41502K11141J77784O73797O88379
5419A0508206J39580m93979r16474j262913r77920r08715n11606m75702k75696
5410D824781m16711k91609k04158l1316O658o1871r9607r3759R5130N455P6917
5399C809910j70566j7007p2939P8472p6581M5997J21538j19992l48742m84755
5389B765335J9117k73501j574K95150j50386k05379j12264J95374k6949L1289
5379B536212L9784j53075J4662K46002j75404j71627Q6322K03863j284K01930
5369B827385P3076j40859k37532n5070j46376q2414N9560j41586k78079K92900
$$ plain form
5359 2171005 2367991 2521506 2382653 2034098 2120014 2273565 2280881 2139152 2201684 2115234
5349 2115234 2081504 2138454 2469706 2354014 2124919 2074511 2128145 2396566 2283852 2023983
5339 2023983 2018430 2283920 2251713 2266388 2380982 2262464 2365085 2429474 2534730 2231381
5329 2231381 2024127 2229850 2356717 2403287 2446474 2284373 2475023 2232954 2290451 2353153
5319 2353153 2491230 2512986 2405401 2469629 2542075 2590065 2692145 2360969 2348735 2589497
5309 2589497 2695260 2730205 2696592 2800666 2786140 2920912 2988801 3199490 3281085 3159214
5299 3159214 3307389 3332480 3353765 3654631 3605570 3688436 3799514 3750112 3888262 4095751
5289 4095751 4368953 4433701 4126920 4262866 4288138 4391561 4868200 4838783 4818084 4876980
$$ packed form
5359B171005J96986J53515j38853l48555Q5916J53551P316j41729O2532q6450
5349B115234l3730N6950L31252j15692k29095n0408N3634K68421j12714k59869
5339B023983n553K65490l2207J4675J14594j18518J02621O4389J05256l03349
5329B231381k07254K05723J26867M6570M3187j62101J90650k42069N7497O2702
5319B353153J38077K1756j07585O4228P2446M7990J02080l31176j2234K40762
5309B589497J05763L4945l3613J04074j4526J34772O7889K10689Q1595j21871
5299C159214J48175K5091K1285L00866m9061Q2866J11078m9402J38150K07489
5289D095751K73202O4748l06781J35946K5272J03423M76639k9417k0699N8896
$$ plain form
5279 4876980 4994522 5222239 5295749 5427159 5721543 5540786 5523876 5483600 5561416 5816670
5269 5816670 6181348 6238798 6135233 6333961 6679387 6820948 7080621 7196569 7201129 7676048
5259 7676048 8057421 8389616 8440213 8532442 8876027 9342050 10009691 10382105 10723179 11052866
5249 11052866 11467543 11895221 12353578 13021650 13652922 14479204 15407234 16284206 17130300
5240 17130300 18185218 19254551 20403005 22173840 24052848 25887433 28245202 30927533
5232 30927533 34071882 37717189 42482817 48062109 54531712 61960563 69884435 77799922
5224 77799922 85310143 90376936 91941376 90856320 88309494 82632841 73892555 64512796
5216 64512796 56071301 48289663 41470381 35803036 31711420 28461451 25895841 24131614
$$ packed form
5279D876980J17542K27717P3510J31410K94384j80757j6910m0276P7816K55254
5269E816670L64678N7450j03565J98728L45426J41561K59673J15948M560M74919
5259G676048L81373L32195N0597R2229L43585M66023O67641L72414L41074L29687
5249A1052866M14677M27678M58357O68072O31272Q26282R28030Q76972Q46094
5240A7130300J054918J069333J148454J770835J879008J834585K357769K682331
5232C0927533L144349L645307M765628N579292O469603P428851P923872P915487
5224G7799922P510221N066793J564440j085056k546826n676653q740286r379759
5216F4512796q441495p781638o819282n667345m091616l249969k565610j764227
$$ plain form
5208 24131614 22305285 20866228 19981417 19103046 18464807 17893221 17271747 16703898 16283843
5199 16283843 15918432 15577612 15581915 15571191 15608656 15767631 15755095 15994591 16257426 16317295
5189 16317295 16544656 16997680 17558806 18615921 19751658 21129117 23059443 24930420 27092635
5180 27092635 29305732 31048111 31300405 30211942 29156566 28831382 29043878 30095033 32442338
5171 32442338 34599314 36280300 36875196 36198121 34436636 32236422 31078965 30709032 31173501
5162 31173501 32148688 32893061 33460110 34024181 35258041 37349089 39707867 41546418 41996597
5153 41996597 41545847 40413106 40314861 40648177 40754483 40214230 38935438 37457277 35858736
5144 35858736 34847619 34416555 34336347 34061585 33262297 32320911 31276229 30484805 29673135
$$ packed form
5208B4131614j826329j439057q84811q78371o38239n71586o21474n67849m20055
5199A6283843l65411l40820M303j0724L7465J58975j2536K39496K62835N9869
5189A6317295K27361M53024N61126J057115J135737J377459J930326J870977K162215
5180B7092635K213097J742379K52294j088463j055376l25184K12496J051155K347305
5171C2442338K156976J680986N94896o77075j761485k200214j157457l69933M64469
5162C1173501R75187P44373N67049N64071J233860K091048K358778J838551M50179
5153D1996597m50750j132741r8245L33316J06306n40253j278792j478161j598541
5144C5858736j011117m31064q0208k74762p99288r41386j044682p91424q11670
$$ plain form
5135 29673135 28709129 27512775 25879570 24340284 23633457 23469951 23384861 22660869 21731458
5126 21731458 21494285 21995392 23020182 23914888 23515525 21483886 18606357 16344542 14969068
5117 14969068 14171981 13377163 13033290 12792693 12942043 13114220 13382741 12919677 11844553
5108 11844553 10366010 9302600 8427056 8099511 7474644 7035492 6664989 6186884 6214855
5099 6214855 5879693 5426432 4992903 4990800 4856250 4547342 4228671 4352846 4251893 4196920
5089 4196920 3894647 3751912 3452774 3370333 3315716 3397808 3191951 3254688 3175658 2707986
5079 2707986 2971974 2977270 2897561 2825641 2230983 2281764 2311552 2143928 2119925 2370168 2324558
5068 2324558 2240813 2271010 2225198 2053074 2189758 2140387 1908116 1856245 1989090 1935893 1787673
$$ packed form
5135B9673135r64006j196354j633205j539286p06827j63506q5090p23992r29411
5126B1731458k37173N01107J024790Q94706l99363k031639k877529k261815j375474
5117A4969068p97087p94818l43873k40597J49350J72177K68521m63064j075124
5108A1844553j478543j063410q75544l27545o24867m39152l70503m78105K7971
5099F214855l35162m53261m33529k103j34550l08908l18671J24175j00953n4973
5089D196920l02273j42735k99138q2441n4617Q2092k05857O2737p9030m67672
5079B707986K63988N296p9709p1920n94658N0781K9788j67624k4003K50243m5610
5068B324558q3745L0197m5812j72124J36684m9371k32271n1871J32845n3197j48220
$$ plain form
5057 1787673 1813497 1850894 1867265 1552568 1643387 1528003 1455452 1448538 1476415 1578146 1383839
5046 1383839 1404671 1293831 1180927 1017179 934034 1091688 1096924 991104 970954 1054965 919489
5035 919489 1014839 1167497 1210485 1055921 764376 1053310 986966 853686 957595 1016574
5025 1016574 1016131 822007 853035 1050079 1024994 1063057 949932 755162 756544 772986 1028827
5014 1028827 1251081 939431 925003 1046535 1008826 1001312 977606 898191 896027 739232 717975
5003 717975 872476 1013118 864230 937227 873195 782706 1019517 785760 905916 840429
4993 840429 1102978 1224463 979998 1127000 1042007 836880 944322 809626 1014143 1459535
4983 1459535 1430365 1028404 1006520 824264 861290 814072 899798 1084404 1028352 1078859 1063373
$$ packed form
5057A787673K5824L7397J6371l14697R0819j15384p2551o914K7877J01731j94307
5046A383839K0832j10840j12904j63748q3145J57654N236j05820k0150Q4011j35476
5035I19489R5350J52658M2988j54564k91545K88934o6344j33280J03909N8979
5025A016574m43j94124L1028J97044k5085L8063j13125j94770J382J6442K55841
5014A028827K22254l11650j4428J21532l7709p514k3706p9415k164j56795k1257
5003G17975J54501J40642j48888P2997o4032r0489K36811k33757J20156o5487
4993H40429K62549J21485k44465J47002q4993k05127J07442j34696K04517M45392
4983A459535k9170m01961k1884j82256L7026m7218Q5726J84606n6052N0507j5486
$$ plain form
4972 1063373 952700 757697 849711 801656 829871 1071200 968186 814548 906441 1087675
4962 1087675 913885 804328 942571 875577 959209 1146682 951177 986132 1008616 1134195
4952 1134195 1107212 1094017 1169927 917992 878560 952652 906369 1015059 1109600 981873 761603
4941 761603 580300 818694 756824 535835 580219 771183 727541 689949 664729 781819 727230
4930 727230 751808 837064 934497 998562 1172529 1015335 1089427 1165397 1092171 1266607 1416895
4919 1416895 1417914 1324071 1326644 1102407 939126 926240 1092060 918354 965145 967481 779473
4908 779473 987708 1086951 1052865 931464 809955 868023 868172 863891 732260 924286 1097458
4897 1097458 1145203 960766 774560 859991 1010066 1001899 937677 767603 727197 1016962 1155138
$$ packed form
4972A063373j10673j95003R2014m8055K8215K41329j03014j53638R1893J81234
4962A087675j73790j09557J38243o6994Q3632J87473j95505L4955K2484J25579
4952A134195k6983j3195P5910k51935l9432P4092m6283J08690R4541j27727k20270
4941G61603j81303K38394o1870k20989M4384J90964m3642l7592k5220J17090n4589
4930G27230K4578Q5256R7433O4065J73967j57194P4092P5970p3226J74436J50288
4919A416895J019r3843K573k24237j63281j2886J65820j73706M6791K336j88008
4908G79473K08235R9243l4086j21401j21509N8068J49m281j31631J92026J73172
4897A097458M7745j84437j86206Q5431J50075q167o4222j70074m0406K89765J38176
$$ plain form
4886 1155138 1213462 1135157 1133335 1152415 1115469 1117889 1281760 1453353 1264378 1211817 1056376
4875 1056376 1114068 1140254 1276677 1497168 1350051 1344933 1266701 1109226 1181553 1310756 1110714
4864 1110714 1023753 949254 1064551 948223 1138135 1231922 1388766 1495832 1467322 1276505
4854 1276505 1380816 1498307 1322314 1264163 1424551 1591124 1527297 1449917 1689856 1861260
4844 1861260 1795194 1758327 1601188 1772629 1919058 1864879 1877250 1991219 1990382 2314345 2246863
4833 2246863 2049204 2083787 2192184 2279708 2318664 2377228 2150034 2243654 2758436 2781710 2637852
4822 2637852 2496546 2497709 2732917 2918452 2742512 2825418 3022152 3267213 3348073 3045926
4812 3045926 3125087 3160492 3428742 3533162 3414477 3702640 3759195 3739446 3846003 4052790
$$ packed form
4886A155138N8324p8305j822J9080l6946K420J63871J71593j88975n2561j55441
4875A056376N7692K6186J36423K20491j47117n118p8232j57475P2327J29203k00042
4864A110714q6961p4499J15297j16328J89912R3787J56844J07066k8510j90817
4854A276505J04311J17491j75993n8151J60388J66573o3827p7380K39939J71404
4844A861260o6066l6867j57139J71441J46429n4179J2371J13969q37L23963o7482
4833B246863j97659L4583J08397Q7524L8956N8564k27194R3620N14782K3274j43858
4822B637852j41306J163K35208J85535j75940Q2906J96734K45061Q0860l02147
4812C045926P9161L5405K68250J04420j18685K88163N6555j9749J06557K06787
$$ plain form
4802 4052790 4059455 4522897 4878411 4855548 4575662 4623372 4790445 5022135 5374966 5634336
4792 5634336 5659892 5818909 6068482 6262239 6527583 6705630 7100687 7520168 7547668 7821603
4782 7821603 8452310 8979036 9343593 9859852 10667926 11330562 12267483 13281132 14434862
4773 14434862 16315861 18318791 20522144 23750193 27440362 31264248 32893086 31401076
4765 31401076 27603497 23771893 21267647 19694437 18711062 18608034 18530953 19131498 20074729
4756 20074729 21137222 22533981 24741441 27132484 30400626 34683120 40306716 45856757
4748 45856757 50254071 52487834 52454599 50308433 44723695 37681099 31809861 27496906
4740 27496906 24124772 21970456 20517579 19646372 19163853 19166788 19326329 19752594 20825516
$$ packed form
4802D052790O665M63442L55514k2863k79886M7710J67073K31690L52831K59370
4792E634336K5556J59017K49573J93757K65344J78047L95057M19481K7500K73935
4782G821603O30707N26726L64557N16259Q08074O62636R36921J013649J153730
4773A4434862J880999K002930K203353L228049L690169L823886J628838j492010
4765C1401076l797579l831604k504246j573210r83375j03028p7081O00545R43231
4756B0074729J062493J396759K207460K391043L268142M282494N623596N550041
4748D5856757M397314K233763l3235k146166n584738p042596n871238m312955
4740B7496906l372134k154316j452877q71207m82519K935J59541M26265J072922
$$ plain form
4731 20825516 22451650 24320988 27670351 31625937 34934621 35138141 31396293 25913593
4723 25913593 21287144 18348607 15818912 13692428 12119854 11045777 10085460 9242014
4715 9242014 8515052 8201476 8075610 7536412 7152186 6560588 6261551 6074618 6103329 5962307
4705 5962307 5757102 5555583 5206286 5249342 5204816 4851772 4784736 4792035 4694525 4574239 4514446
4694 4514446 4701938 4660595 4452449 4306498 4413909 4474237 4124154 3948563 4118022 4070723
4684 4070723 3991293 3787299 3537345 3661598 3640964 3923947 3923796 3896637 3734831 3468713 3600449
4673 3600449 3851661 3720403 3640934 3746615 3657899 3589594 3537263 3455984 3467294 3503453 3688133
4662 3688133 3912350 3980826 3929061 3902043 3869403 3887872 3892597 3966000 4425761 4302651 3986577
$$ packed form
4731B0825516J626134J869338L349363L955586L308684K03520l741848n482700
4723B5913593m626449k938537k529695k126484j572574j074077r60317q43446
4715I242014p26962l13576j25866n39198l84226n91598k99037j86933K8711j41022
4705E962307k05205k01519l49297M3056m4526l53044o7036P299r7510j20286n9793
4694D514446J87492m1343k08146j45951J07411O0328l50083j75591J69459m7299
4684D070723p9430k03994k49954J24253k0634K82983j51k7159j61806k66118J31736
4673C600449K51212j31258p9469J05681q8716o8305n2331q1279J1310L6159J84680
4662C688133K24217O8476n1765k7018l2640J8469M725P3403M59761j23110l16074
$$ plain form
4651 3986577 4126675 4123485 4123904 4315117 4353202 4293533 4352523 4571736 4611081 4768881 4845250
4640 4845250 4728964 4801391 4996337 5008041 4987948 5315398 5436748 5329834 5505321 5750361
4630 5750361 5727830 5601010 5714141 6060728 6177772 6143471 6221929 6131732 6756134 7161086
4620 7161086 6992269 7189271 7690400 7791152 8076571 8440008 8676480 8751082 8953911 9246654
4610 9246654 9475832 10101575 10492591 10830291 11499737 11708676 12162179 12718765 13395611 14188448
4600 14188448 15400296 16979141 18356979 20189526 22544800 25159765 28285962 32364566
4592 32364566 36903465 40644967 41317164 39044475 35458892 32430949 30545940 29743654
4584 29743654 30209906 31687974 34013198 37268376 40855890 43433664 43284597 40440950
$$ packed form
4651C986577J40098l190M19J91213L8085n9669N8990K19213L9345J57800P6369
4640D845250j16286P2427J94946J1704k0093L27450J21350j06914J75487K45040
4630E750361k2531j26820J13131L46587J17044l4301P8458r0197O24402M04952
4620G161086j68817J97002N01129J00752K85419L63437K36472P4602K02829K92743
4610I246654K29178O25743L91016L37700O69446K08939M53503N56586O76846P92837
4600A4188448J211848J578845J377838J832547K355274K614965L126197M078604
4592C2364566M538899L741502O72197k272689l585583l027943j885009q02286
4584B9743654M66252J478068K325224L255178L587514K577774j49067k843647
$$ plain form
4576 40440950 36584262 33456367 31806892 31076564 31678575 33807254 36282520 37635556
4568 37635556 36680638 33965989 30241084 27093080 25534761 24540405 24379492 24910191 26223016
4559 26223016 28336513 30394001 31426259 30099039 26647123 22827067 19247645 16689746
4551 16689746 14440011 12913772 11808770 10894931 9983208 9483964 8980385 8368897 7933378
4542 7933378 7560114 7510341 7254922 6974102 6559487 6141903 6077389 6118622 5738891 5462422
4532 5462422 5122714 5429926 5320115 5275874 5030563 4945162 4936446 4792509 4818219 4663736
4522 4663736 4440789 4354831 4293838 4321544 4324276 4296108 4501952 4648909 4865163 4723554 4183991
4511 4183991 3822306 3606064 3680244 3535862 3352258 3074858 2737019 2565022 2819321 3017068
$$ packed form
4576D0440950l856688l127895j649475p30328O02011K128679K475266J353036
4568C7635556r54918k714649l724905l148004j558319r94356j60913N30699J312825
4559B6223016K113497K057488J032258j327220l451916l820056l579422k557899
4551A6689746k249735j526239j105002r13839r11723m99244n03579o11488m35519
4542G933378l73264m9773k55419k80820m14615m17584o4514M1233l79731k76469
4532E462422l39708L07212j09811m4241k45311q5401q716j43937K5710j54483
4522D663736k22947q5958o0993K7706K732k8168K05844J46957K16254j41609n39563
4511D183991l61685k16242P4180j44382j83604k77400l37839j71997K54299J97747
$$ plain form
4501 3017068 3011615 3003599 3065172 2902072 2726996 2806796 2661763 2695329 2875045 2969789 2820137
4490 2820137 2942882 2822271 2641214 2553694 2670280 2716529 2546811 2557991 2506635 2606962
4480 2606962 2485567 2490832 2699034 2686817 2528378 2240520 2343466 2499464 2474741 2312013
4470 2312013 2252169 2217183 2188925 2105861 2034337 2054653 2134526 1997546 2121282 2116498 2201466
4459 2201466 2355874 2455671 2318342 2054234 2114078 2300691 2368570 2441323 2562767 2653210
4449 2653210 2617413 2780197 2795376 3144230 3521823 3300449 3163696 2961530 2927594 3022434
4439 3022434 2766513 2672337 2446250 2539423 2525820 2475891 2600090 2472109 2478660 2208116 2086663
4428 2086663 2270510 2060647 1692280 1707694 1954550 2077938 1941578 2009353 1941289 2067905
$$ packed form
4501C017068n453q016O1573j63100j75076P9800j45033L3566J79716R4744j49652
4490B820137J22745j20611j81057q7520J16586M6249j69718J1180n1356J00327
4480B606962j21395N265K08202j2217j58439k87858J02946J55998k4723j62728
4470B312013n9844l4986k8258q3064p1524K0316P9873j36980J23736m784Q4968
4459B201466J54408R9797j37329k64108N9844J86613O7879P2753J21444R0443
4449B653210l5797J62784J5179L48854L77593k21374j36753k02166l3936R4840
4439C022434k55921r4176k26087R3173j3603m9929J24199j27981O551k70544j21453
4428B086663J83847k09863l68367J5414K46856J23388j36360O7775o8064J26616
$$ plain form
4418 2067905 2211491 2091481 1887030 1705985 1812961 1997210 2088443 2152998 1896679 2037190
4408 2037190 1876105 1834993 1890098 2117768 2090237 2061496 2018676 1892180 2124583 2233728
4398 2233728 2052999 1978531 2202310 2256926 2440332 2556435 2560881 2477763 2806275 3179297
4388 3179297 3147870 3041880 2947706 2762589 2571075 2492781 2331070 2440014 2388378 2471209
4378 2471209 2565188 2516010 2457784 2590630 2417504 2422064 2618461 2646321 2426962 2446990 2825824
4367 2825824 2794187 2804822 2616967 2710579 2746359 2729170 2763368 2659202 2577478 2740383 2879861
4356 2879861 2817492 2942851 3091987 3130696 3067387 3217137 3063040 2995737 3073051 3042125 3144088
4345 3144088 3107601 3224445 3417902 3367937 3515523 3747809 3914397 3900339 3938235 3906936
$$ packed form
4418B067905J43586j20010k04451j81045J06976J84249R1233O4555k56319J40511
4408B037190j61085m1112N5105K27670k7531k8741m2820j26496K32403J09145
4398B233728j80729p4468K23779N4616J83406J16103M446q3118L28512L73022
4388C179297l1427j05990r4174j85117j91514p8294j61711J08944n1636Q2831
4378B471209R3979m9178n8226J32846j73126M560J96397K7860k19359K0028L78834
4367B825824l1637J0635j87855R3612L5780j7189L4198j04166q1724J62905J39478
4356B879861o2369J25359J49136L8709o3309J49750j54097o7303P7314l0926J01963
4345C144088l6487J16844J93457m9965J47586K32286J66588j4058L7896l1299
$$ plain form
4335 3906936 3786918 4141704 4347826 4382180 4376192 4413145 4562605 5016345 5268844 5509417
4325 5509417 5981559 6627015 7094235 7694775 8063595 8333183 8175589 7839319 7215849 6784044
4315 6784044 6528130 6517507 6754745 6671773 6559670 6280155 5751037 5731475 5395708 5298389
4305 5298389 5239584 5301823 5503011 5467446 5609591 5589734 5975694 6324205 6518008 6665765
4295 6665765 7126952 7362489 7808761 8484503 8989456 9266654 9254197 9085083 8392105 7623815
4285 7623815 6935594 6550851 6633193 6700430 6631165 6506056 6549108 6399529 6375893 6796529
4275 6796529 6593332 6695924 6951048 6877271 6919999 7042745 7581628 7818856 7885889 8423949
4265 8423949 8869360 9236010 9839738 10317877 11110963 12412442 13627239 14806855 16411812
$$ packed form
4335C906936j20018L54786K06122L4354n988L6953J49460M53740K52499K40573
4325E509417M72142O45456M67220O00540L68820K69588j57594l36270o23470m31805
4315F784044k55914j0623K37238q2972j12103k79515n29118j9562l35767r7319
4305E298389n8805O2239K01188l5565J42145j9857L85960L48511J93803J47757
4295F665765M61187K35537M46272O75742N04953K77198j2457j69114o92978p68290
4285G623815o88221l84743Q2342O7237o9265j25109M3052j49579k3636M20636
4275F796529k03197J02592K55124p3777M2728J22746N38883K37228O7033N38060
4265H423949M45411L66650O03728M78139P93086J301479J214797J179616J604957
$$ plain form
4256 16411812 18488718 20819086 21982142 21914655 20006766 17369158 15157102 13644068
4248 13644068 12468262 11445530 10798406 10383568 10144597 9776314 9533480 9523133 9271686
4239 9271686 9432763 9275422 9187824 9360204 9377146 9623891 9708115 9697136 9751799 9688429 10128646
4228 10128646 10279607 10071776 10365732 10442237 10601134 10791855 11120128 11483275 11783913 11900436
4218 11900436 11832732 12252368 12887309 12909682 12909987 12988865 13305993 13575091 13706722 13733865 14409181
4207 14409181 15030023 15302296 15569586 15905680 16346924 16757236 17072729 17137671 17471317 18307398
4197 18307398 18798948 19063375 19801887 20048058 20635185 21564155 22066248 22886073 23742192
4188 23742192 24438918 25333276 26462480 27850152 28647714 29985139 31243985 32585647 34340336
$$ packed form
4256A6411812K076906K330368J163056o7487j907889k637608k212056j513034
4248A3644068j175806j022732o47124m14838k38971l68283k42834j0347k51447
4239I271686J61077j57341q7598J72380J6942K46745Q4224j0979N4663o3370M40217
4228A0128646J50961k07831K93956P6505J58897J90721L28273L63147L00638J16523
4218A1900436o7704M19636O34941K2373L05P8878L17128K69098J31631K7143O75316
4207A4409181O20842K72273K67290L36094M41244M10312L15493O4942L33646Q36081
4197A8307398M91550K64427P38512K46171N87127R28970N02093Q19825Q56119
4188B3742192O96726Q94358J129204J387672P97562J337425J258846J341662J754689
$$ plain form
4179 34340336 36375655 38099102 40055729 42203595 44438391 47184275 50343540 53913862
4171 53913862 57927195 62156908 67105151 72813311 79332790 87425788 97028644 108421606
4163 108421606 122717903 140322542 161286705 188031511 222904058 265216787 305869609
4156 305869609 327506809 316374593 276857236 225509189 179724089 145672278 121489885
4149 121489885 104060814 91050304 80499749 72148724 65526604 60290990 56171740 52521947
4141 52521947 49331913 46533574 44096052 41891500 39787625 38335521 36964874 35692939
4133 35692939 34916778 34298396 33598085 32656105 32251685 31588874 31317257 31197132 31205345 31066454
4123 31066454 31078097 31007058 30702219 31176764 31591466 32073198 32762743 33658374 34698672 35796697
$$ packed form
4179C4340336K035319J723447J956627K147866K234796K745884L159265L570322
4171E3913862M013333M229713M948243N708160O519479Q092998R602856J1392962
4163A08421606J4296297J7604639K0964163K6744806L4872547M2312729M0652822
4156C05869609K1637200j1132216l9517357n1348047m5785100l4051811k4182393
4149A21489885j7429071j3010510j0550555q351025o622120n235614m119250l649793
4141E2521947l190034k798339k437522k204552k103875j452104j370647j271935
4133C5692939p76161o18382p00311r41980m04420o62811k71617j20125Q213j38891
4123C1066454J1643p1039l04839M74545M14702M81732O89545Q95631J040298J098025
$$ plain form
4113 35796697 36805357 38330712 40362883 42688197 45408039 48853723 53118260 58379053
4105 58379053 64918332 73055201 83061764 95768846 110017358 123684178 135679023
4098 135679023 145486951 151070744 148940528 138111974 123546754 108875037 93144800
4091 93144800 77721807 64884018 55392685 48436506 42916616 38385530 35045073 31983164
4083 31983164 29821736 27838605 25971007 24471157 23120577 21763466 20315754 19526898
4075 19526898 18520374 17575864 17092595 16345309 15414230 14662184 13902718 13300824 12886013
4066 12886013 12389584 11816916 11234002 10868817 10448183 10025423 9635650 9214035 8657345
4057 8657345 8549233 8487555 8192586 7951731 7612205 7409912 7305223 7097360 6801585 6416493
$$ packed form
4113C5796697J008660J525355K032171K325314K719842L445684M264537N260793
4105E8379053O539279Q136869J0006563J2707082J4248512J3666820J1994845
4098A35679023R807928N583793k130216j0828554j4565220j4671717j5730237
4091I3144800j5422993j2837789r491333o956179n519890m531086l340457l061909
4083C1983164k161428j983131j867598j499850j350580j357111j447712p88856
4075A9526898j006524r44510m83269p47286r31079p52046p59466o01894m14811
4066A2886013m96429n72668n82914l65185m20634m22760l89773m21615n56690
4057H657345j08112o1678k94969k40855l39526k02293j04689k07863k95775l85092
$$ plain form
4047 6416493 6316920 6205726 6117796 5860152 5611832 5490420 5535393 5536171 5383978 5513568 5490111
4036 5490111 5371415 5178194 5036470 4967096 5000576 5053309 4919860 4996699 5095960 4695898
4026 4695898 4460148 4341354 4311022 4104568 3972972 4196947 3920586 3559715 3562115 3469818
4016 3469818 3377048 3258958 3265468 3213263 2972600 3025351 3232310 2976079 2862281 2723284
4006 2723284 2459090 2532641 2761936 2636933 2687202 2769104 2844921 2497317 2242282 2523183
3996 2523183 2563286 2560010 2577331 2694743 2439824 2461116 2541617 2603365 2611543 2541806 2748069
3985 2748069 2753479 2362933 2279391 2056638 2053558 1788842 1805419 1686655 1365017 1344549 1285155
3974 1285155 1407675 1637422 1665129 1679824 1686108 1575825 1657620 1723866 1701886 1507110 1634055
$$ packed form
4047F416493r9573j11194q7930k57644k48320j21412M4973P78j52193J29590k3457
4036E490111j18696j93221j41724o9374L3480N2733j33449P6839R9261m00062
4026D695898k35750j18794l0332k06454j31596K23975k76361l60871K400r2297
4016C469818r2770j18090O510n2205k40663N2751K06959k56231j13798j38997
4006B723284k64194P3551K29295j25003N0269Q1902P5817l47604k55035K80901
3996B523183M0103l276J7321J17412k54919K1292Q0501O1748Q178o9737K06263
3985B748069N410l90546q3542k22753l080k64716J6577j18764l21638k0468n9394
3974A285155J22520K29747K7707J4695O284j10283Q1795O6246k1980j94776J26945
$$ plain form
3963 1634055 1697686 1576191 1890431 1933267 1808716 1847501 1626812 1490976 1646348 1811798
3953 1811798 1829554 1745520 1506548 1318079 1225392 1328795 1410854 1426376 1497549 1439459 1305405
3942 1305405 1470345 1521132 1520654 1538136 1515168 1714300 1714008 1559874 1457506 1490175 1316384
3931 1316384 1473241 1519923 1528889 1619247 1728049 1634175 1623246 1525834 1306557 1177650 910971
3920 910971 1231857 1147361 1153162 1359435 1369228 1461162 1454674 1453367 1585261 1485492 1374916 1291831
3908 1291831 1212400 1207977 1425034 1250692 1232364 1283731 1551685 1521011 1530379 1492135 1248183
3897 1248183 1508834 1599876 1403506 1086868 1183723 1353937 1408052 1423850 1390730 1491009
3887 1491009 1293245 1513606 1657495 1597418 1657083 1784323 1865050 1797887 1532466 1221716
$$ packed form
3963A634055O3631j21495L14240M2836j24551L8785k20689j35836J55372J65450
3953A811798J7756q4034k38972j88469r2687J03403Q2059J5522P1173n8090j34054
3942A305405J64940N0787m78J7482k2968J99132k92j54134j02368L2669j73791
3931A316384J56857M6682Q966R0358J08802r3874j0929r7412k19277j28907k66679
3920I10971L20886q4496N801K06273R793R1934o488j307J31894r9769j10576q3085
3908A291831p9431m423K17057j74342j8328N1367K67954l0674R368l8244k43952
3897A248183K60651R1042j96370l16638R6855J70214N4115J5798l3120J00279
3887A491009j97764K20361J43889o0077N9665J27240Q0727o7163k65421l10750
$$ plain form
3877 1221716 1405692 1694842 1681273 1712538 1869776 1920242 2137181 2229785 2434429 2639672
3867 2639672 2544844 2994535 3145818 2997448 2861183 2565042 2376590 2164379 2030076 2030985
3857 2030985 1942959 1837303 1721726 1511835 1613142 1787133 1793592 1799355 1838059 1882021 1721621
3846 1721621 1681956 1661145 1610117 1445916 1453847 1819688 1865621 1902210 1754556 1836308 1966061
3835 1966061 1988335 1901793 2012122 2067870 1908819 1913728 1915152 1835427 1760252 1801906 1850428
3824 1850428 1796192 1789234 1729835 1739553 1903758 1986355 1852168 1975882 1907975 2064738 2098830
3813 2098830 1892010 1850868 1981299 2079584 2310458 2414908 2457527 2856153 2821890 2727142
3803 2727142 2786219 2786129 2818823 2802889 2801334 2772556 2519062 2622940 2612573 2639538 2557615 2660627
$$ packed form
3877A221716J83976K89150j3569L1265J57238N0466K16939R2604K04644K05243
3867B639672r4828M49691J51283j48370j36265k96141j88452k12211j34303R09
3857B030985q8026j05656j15577k09891J01307J73991O459N763L8704M3962j60400
3846A721621l9665k0811n1028j64201P931L65841M5933L6589j47654Q1752J29753
3835A966061K2274q6542J10329N5748j59051M909J424p9725p5175M1654M8522
3824A850428n4236o958n9399R718J64205Q2597j34187J23714o7907J56763L4092
3813B098830k06820m1142J30431R8285K30874J04450M2619L98626l4263r4748
3803B727142N9077r0L2694j5934j555k8778k53494J03878j0367K6965q1923J03012
$$ plain form
3791 2660627 2822467 2613078 2650124 2730946 2903233 2549917 2415475 2381014 2494681 2498977
3781 2498977 2576641 2806012 2891291 2809682 2642945 2899811 3237781 3174101 3026517 2959064
3771 2959064 2930253 3115387 2933525 2920795 3197252 3271532 3398696 3388697 3385045 3498676 3553475
3760 3553475 3450938 3615785 3640766 3381933 3515221 3488239 3653872 3842030 3767172 3718457
3750 3718457 3938609 4082915 4081280 4088628 4212797 4355176 4038894 4040474 4072984 4213443 4171389
3739 4171389 4092754 4302089 4288853 4221734 4386964 4377871 4468079 4725501 4682699 4703991 5006771
3728 5006771 4944861 5055413 5180289 5022132 4987049 5029527 5027793 5271187 5537017 5530071 5660059
3717 5660059 5750904 5740360 5755800 5881712 5652815 5597174 5829004 5851684 5864427 6082773 6032443
$$ packed form
3791B660627J61840k09389L7046Q0822J72287l53316j34442l4461J13667M296
3781B498977P7664K29371Q5279q1609j66737K56866L37970o3680j47584o7453
3771B959064k8811J85134j81862j2730K76457P4280J27164r999l652J13631N4799
3760C553475j02537J64847K4981k58833J33288k6982J65633J88158p4858m8715
3750C718457K20152J44306j635P348J24169J42379l16282J580L2510J40459m2054
3739D171389p8635K09335j3236o7119J65230r093R0208K57422m2802K1292L02780
3728E006771o1910J10552J24876j58157l5083M2478j734K43394K65830o946J29988
3717E660059R0845j0544J5440J25912k28897n5641K31830K2680J2743K18346n0330
$$ plain form
3706 6032443 6184461 6125740 5982880 6064676 6513551 6475801 6341268 6457907 6457822 6352462 6410583
3695 6410583 6354146 6399049 6184792 6313812 6518106 6616066 6811094 6866224 6769709 6537739
3685 6537739 6396130 6540023 6605621 6621980 6667723 6904261 6806145 6636381 6492309 6522593
3675 6522593 6785949 6761611 6480640 6353409 6545360 6649042 6732305 6687704 6527931 6313156
3665 6313156 6180122 6189603 6165362 6201418 6067566 5915029 6023918 6006028 6027433 5714535 5688215
3654 5688215 5474496 5661518 5841070 5689595 5458153 5466068 5548889 5444332 5397853 5433766
3644 5433766 5329808 5006009 4970909 4988801 5094808 5211266 5277803 5256043 4980397 4664168
3634 4664168 4736153 4870942 4586237 4423865 4548961 4543912 4375452 4501249 4308927 4234458
$$ packed form
3706F032443J52018n8721j42860Q1796M48875l7750j34533J16639q5j05360N8121
3695F410583n6437M4903k14257J29020K04294R7960J95028N5130r6515k31970
3685F537739j41609J43893O5598J6359M5743K36538r8116j69764j44072L0284
3675F522593K63356k4338k80971j27231J91951J03682Q3263m4601j59773k14775
3665F313156j33034R481k4241L6056j33852j52537J08889j7890K1405l12898k6320
3654E688215k13719J87022J79552j51475k31442P915Q2821j04557m6479L5913
3644E433766j03958l23799l5100J7892J06007J16458O6537k1760k75646l16229
3634D664168P1985J34789k84705j62372J25096n049j68460J25797j92322p4469
$$ plain form
3624 4234458 4258675 4187701 4173064 4136634 4014625 4135645 4234860 4010316 4049651 4169102 4211461
3613 4211461 3921789 4168496 4012912 3766289 3924948 3873028 3698572 3867362 3711502 3430965
3603 3430965 3626828 3548095 3535422 3444566 3606190 3509755 3451558 3323530 3361331 3447924 3167982
3592 3167982 3246895 3336378 3273254 3387486 3274992 3225085 2942915 2934713 2910012 3316986 3304664
3581 3304664 2979497 2986742 2989991 3293885 3295646 3362278 3307919 3300593 3122551 2890281 3048292
3570 3048292 3126813 2854951 2749039 2750683 2873972 3022524 2993598 2991375 2995649 2805085 2735265
3559 2735265 2825997 2996563 2781587 2470468 2830202 2987343 2674377 2504710 2388635 2639260
3549 2639260 2659288 2558802 2772565 2537514 2515779 2334334 2563901 2542138 2425140 2560109
$$ packed form
3624D234458K4217p0974j4637l6430j22009J21020R9215k24544L9335J19451M2359
3613D211461k89672K46707j55584k46623J58659n1920j74456J68790j55860k80537
3603C430965J95863p8733j2673r0856J61624r6435n8197j28028L7801Q6593k79942
3592C167982P8913Q9483o3124J14232j12494m9907k82170q202k4701M06974j2322
3581C304664l25167P245L249L03894J761O6632n4359p326j78042k32270J58011
3570C048292P8521k71862j05912J644J23289J48552k8926k223M274j90564o9820
3559B735265R0732J70566k14976l11119L59734J57141l12966j69667j16075K50625
3549B639260K0028j00486K13763k35051k1735j81445K29567k1763j16998J34969
$$ plain form
3539 2560109 2519186 2433152 2438026 2464921 2371159 2374479 2355731 2400656 2396456 2452877 2556076 2601876
3527 2601876 2430305 2445105 2392778 2307393 2142856 2030153 2009156 2022084 2021069 2272098 2263050
3516 2263050 2371193 2394585 2345861 2042396 2202365 2376495 2274200 2407713 2112157 1983936
3506 1983936 1908453 2066614 2233305 2385349 2183193 1990862 2077576 2144487 2229483 2349800
3496 2349800 2271841 2189424 2198354 2083204 2131391 2032286 2019032 2089145 2241118 2266672 2108735
3485 2108735 2055516 2073435 2283286 2574290 2430247 2137646 2467130 2209481 2104870 2458713
3475 2458713 2358700 2108380 2088505 2284469 2066986 2223984 2355430 2460357 2356958 2363909
3465 2363909 2620405 2585543 2278035 2415210 2704327 2861298 2664682 2837688 3032110 3125964
$$ packed form
3539B560109m0923q6034M874K6895r3762L320j8748M4925m200N6421J03199M5800
3527B601876j71571J4800n2327q5385j64537j12703k0997J2928j015K51029r048
3516B263050J08143K3392m8724l03465J59969J74130j02295J33513k95556j28221
3506A983936p5483J58161J66691J52044k02156j92331Q6714O6911Q4996J20317
3496B349800p7959q2417Q930j15150M8187r9105j3254P0113J51973K5554j57937
3485B108735n3219J7919K09851K91004j44043k92601L29484k57649j04611L53843
3475B458713j00013k50320j9875J95964k17483J56998J31446J04927j03399O951
3465B363909K56496l4862l07508J37175K89117J56971j96616J73006J94422R3854
$$ plain form
3455 3125964 3478341 3626058 3992090 4206393 4108937 4552186 4895691 5328454 6128893 6619142
3445 6619142 6980864 6937526 6388948 5666138 5040613 4867403 4808113 4362450 3988386 3735738
3435 3735738 3640262 3428365 3789934 3918825 3826578 3787402 3931384 3864667 3890411 4350633
3425 4350633 4306947 4199860 4660095 5119439 5056872 5367428 5806260 6286694 6902926 7798397
3415 7798397 9187931 10697784 11717539 11523403 10437878 8976911 7630724 6771302 6010260
3406 6010260 5312745 4823422 4718803 4477696 4328216 4342217 4201004 4370054 3953956 3822747
3396 3822747 3743281 3875654 4045931 3819259 4044994 4099671 4023457 4203756 4568559 4924708
3386 4924708 4995883 5211856 5643942 5960225 6486184 6790908 6959615 6399475 5636340 5070414
$$ packed form
3455C125964L52377J47717L66032K14303r7456M43249L43505M32763Q00439M90249
3445F619142L61722m3338n48578p22810o25525j73210n9290m45663l74064k52648
3435C735738r5476k11897L61569J28891r2247l9176J43982o6717K5744M60222
3425D350633m3686j07087M60235M59344o2567L10556M38832M80434O16232Q95471
3415G798397J389534J509853J019755j94136j085525j460967j346187q59422p61042
3406F010260o97515m89323j04619k41107j49480J4001j41213J69050m16098j31209
3396C822747p9466J32373J70277k26672K25735N4677p6214J80299L64803L56149
3386D924708P1175K15973M32086L16283N25959L04724J68707n60140p63135n65926
$$ plain form
3376 5070414 4607813 4313946 3965273 3917277 3865585 3640018 3479395 3616733 3421026 3440982
3366 3440982 3337948 3391607 3321994 3230651 3043136 3113559 3192174 3524710 3727570 3600049
3356 3600049 3442331 3386913 3479056 3401767 3489150 3585145 3566988 3543327 3696807 3592709 3348594
3345 3348594 3560432 3833226 3679489 3514967 3720429 3902822 3741216 3546272 3660839 3757614
3335 3757614 3718182 3954632 3899228 3955008 3996570 4149431 4128289 4122937 4302883 4417500 4346992
3324 4346992 4345141 4379405 4308985 4560765 4911566 4996803 5165735 5092842 5330058 5581239 5877368
3313 5877368 5800758 5873821 6033992 6004498 6159318 6239201 6469052 6766681 6872547 6858565
3303 6858565 7061979 7067301 6835183 6833132 6673807 6778465 7203958 7115339 7406130 7503600 7541083
$$ packed form
3376E070414m62601k93867l48673m7996n1692k25567j60623J37338j95707J9956
3366C440982j03034N3659o9613r1343j87515P0423P8615L32536K02860j27521
3356C600049j57718n5418R2143p7289Q7383R5995j8157k3661J53480j04098k44115
3345C348594K11838K72794j53737j64522K05462J82393j61606j94944J14567R6775
3335C757614l9432K36450n5404N5780M1562J52861k1142n352J79946J14617p0508
3324D346992j851L4264p0420K51780L50801Q5237J68932p2893K37216K51181K96129
3313E877368p6610P3063J60171k9494J54820P9883K29851K97629J05866j3982
3303F858565K03414N322k32118k051j59325J04658M25493q8619K90791R7470L7483
$$ plain form
3292 7541083 7572079 7762430 7958556 8025971 8015992 8278091 8455252 8648830 8890695 9210791
3282 9210791 9504956 9758611 10138097 10602859 10749899 11040097 11398807 11908584 12504482 12891878
3272 12891878 13423773 13181921 13104967 12866566 12943107 13024568 13111520 13500711 13894227 14333849
3262 14333849 14823320 15269543 15917049 16256440 16886510 17334234 17907429 19043453 19885336
3253 19885336 20986283 22312651 23505401 24783791 26509320 28196750 30014595 31603139
3245 31603139 33240888 34719680 35653978 36011272 35496895 33800378 31499587 28616444 25389755
3236 25389755 22838301 20896012 18793981 17299969 16116931 15075069 13996513 12911915
3228 12911915 12454283 11916466 11424141 10823134 10253532 9969478 9641481 9358601 9180324
$$ packed form
3292G541083L0996J90351J96126O7415r979K62099J77161J93578K41865L20096
3282I210791K94165K53655L79486M64762J47040K90198L58710N09777N95898L87396
3272A2891878N31895k41852p6954k38401P6541Q1461Q6952L89191L93516M39622
3262A4333849M89471M46223O47506L39391O30070M47724N73195J136024Q41883
3253A9885336J100947J326368J192750J278390J725529J687430J817845J588544
3245C1603139J637749J478792R34298L57294n14377j696517k300791k883143l226689
3236B5389755k551454j942289k102031j494012j183038j041862j078556j084598
3228A2911915m57632n37817m92325o01007n69602k84054l27997k82880j78277
$$ plain form
3219 9180324 8650564 8470241 8154986 7816323 7664947 7568061 7371476 7244314 6920694 6891734
3209 6891734 6762328 6324664 6060887 5998370 5778172 5785522 5681315 5395897 5275594 5440627
3199 5440627 5505143 5246697 4963875 4975108 4848919 4687215 4585450 4573812 4549760 4056778
3189 4056778 4093012 4175290 4167669 3967251 3966574 3869614 3929831 3706407 3502052 3586991 3488427
3178 3488427 3627261 3472118 3149165 3414645 3606118 3356909 3287325 3294229 3098759 3058156
3168 3058156 3250213 3423723 3195022 3176446 3070657 2927290 2926581 3187872 3191609 2898324 2682820
3157 2682820 2600204 2527053 2665864 2478810 2455271 2451441 2440394 2532130 2365192 2364220 2341178
3146 2341178 2297423 2459074 2304725 2191269 2272321 2190452 2287353 2347656 2169421 2095601 2242813
$$ packed form
3219I180324n29760j80323l15255l38663j51376r6886j96585j27162l23620k8960
3209F891734j29406m37664k63777o2517k20198P350j04207k85418j20303J65033
3199E440627O4516k58446k82822J1233j26189j61704j01765j1638k4052m92982
3189D056778L6234Q2278p621k00418o77r6960O0217k23424k04355Q4939r8564
3178C488427J38834j55143l22953K65480J91473k49209o9584O904j95470m0603
3168C058156J92057J73510k28701j8576j05789j43367p09K61291L737k93285k15504
3157B682820q2616p3151J38811j87054k3539l830j1047R1736j66938r72k3042
3146B341178m3755J61651j54349j13456Q1052q1869R6901O0303j78235p3820J47212
$$ plain form
3135 2242813 2206501 1992066 2179318 2002516 1950124 1961038 1907561 2045041 2043232 2013684 1865940
3124 1865940 2028132 2142814 2253446 2040367 2030156 1943543 1751620 1854648 1895718 2077137
3114 2077137 2170127 2093733 1621274 1848533 1798402 1571196 1842526 1897970 1691406 1609029
3104 1609029 1591397 1519144 1712182 1743473 1791337 1638759 1704902 1787787 1772774 1655845 1840718
3093 1840718 1818807 1679843 1701566 1853719 1976753 1882759 1561144 1618852 1576031 1481777 1133453
3082 1133453 1050420 1388021 1239622 1336029 1304436 1314273 1277632 1185066 1418492 1598408 1529258
3071 1529258 1247313 1236949 1266901 1422578 1391859 1095480 929281 1102443 1194405 1329939
3061 1329939 1364575 1270523 1159779 1272913 1284273 1284733 1186772 1263788 1356536 1437240 1540420
$$ packed form
3135B242813l6312k14435J87252j76802n2392J0914n3477J37480j809k9548j47744
3124A865940J62192J14682J10632k13079j0211q6613j91923J03028M1070J81419
3114B077137R2990p6394m72459K27259n0131k27206K71330N5444k06564q2377
3104A609029j7632p2253J93038L1291M7864j52578O6143Q2885j5013j16929J84873
3093A840718k1911j38964K1723J52153J23034r3994l21615N7708m2821r4254l48324
3082A133453q3033L37601j48399R6407l1593R837l6641r2566K33426J79916o9150
3071A529258k81945j0364K9952J55677l0719k96379j66199J73162R1962J35534
3061A329939L4636r4052j10744J13134J1360M60r7961P7016R2748Q0704J03180
$$ plain form
3050 1540420 1647366 1411140 1359065 1286371 1052121 1400001 1220438 1160677 1074764 1037871
3040 1037871 941786 955230 1369475 1281802 1148118 1203573 1306268 1312737 1511643 1361524 1260514
3029 1260514 1287257 1181315 1180194 1341912 1394415 1228553 1219739 1252301 1417438 1398868 1496091
3018 1496091 1384838 1278622 1619434 1525949 1426477 1588224 1329988 1233550 1240551 1247021 1235327
3007 1235327 1331920 1505164 1622538 1708340 1567324 1362055 1822687 1812451 1544212 1468422
2997 1468422 1599481 1572693 1570822 1729956 1901405 1896265 1739519 1758792 1759944 1976799 1877588
2986 1877588 1708380 1720164 1661723 1745213 1847820 1743706 1784468 1747668 1574575 1866763
2976 1866763 2147923 2060525 1923057 1959372 2026643 1935702 1922822 1985127 1963633 1957191 1902435
$$ packed form
3050A540420J06946k36226n2075p2694k34250L47880j79563n9761q5913l6893
3040A037871r6085J3444M14245q7673j33684N5455J02695O469J98906j50119j01010
3029A260514K6743j05942j121J61718N2503j65862q814L2562J65137j8570R7223
3018A496091j11253j06216L40812r3485r9472J61747k58236r6438P001O470j1694
3007A235327R6593J73244J17374Q5802j41016k05269M60632j0236k68239p5790
2997A468422J31059k6788j871J59134J71449n140j56746J9273J152K16855r9211
2986A877588j69208J1784n8441Q3490J02607j04114M0762l6800j73093K92188
2976A866763K81160q7398j37468L6315O7271r0941j2880O2305k1494o442n4756
$$ plain form
2965 1902435 1835332 1814788 1956255 2061133 2301189 2098706 2088889 1969576 2012213 2393622
2955 2393622 2298074 2149114 2508391 2471181 2255888 2340203 2410277 2402557 2806903 2822012 2984795
2944 2984795 2848156 2961471 3055553 3191989 3283874 3317243 3257025 3218908 3350707 3571943
2934 3571943 3481666 3512466 3722074 3890830 4110834 4209896 3955179 3831730 4019960 3940691
2924 3940691 4115987 3979046 3947393 3917253 4270237 4154149 4515505 4504977 4488839 4587828
2914 4587828 4691687 4699446 5037695 5113353 5407864 5462278 5579683 5845989 6115698 6119055 6447342
2903 6447342 6606067 6763306 6241330 5824886 5600989 5529606 5294915 5240689 5119967 5118539
2893 5118539 5191173 5098275 5045516 5106550 5103468 4949396 5215657 5220012 5207713 5239162 5282598
$$ packed form
2965A902435o7103k0544J41467J04878K40056k02483r817j19313M2637L81409
2955B393622r5548j48960L59277l7210k15293Q4315P0074p720M04346J5109J62783
2944B984795j36639J13315R4082J36436R1885L3369o0218l8117J31799K21236
2934C571943r0277L0800K09608J68756K20004R9062k54717j23449J88230p9269
2924C940691J75296j36941l1653l0140L52984j16088L61356j0528j6138R8989
2914D587828J03859P759L38249P5658K94511N4414J17405K66306K69709L357L28287
2903F447342J58725J57239n21976m16444k23897p1383k34691n4226j20722j428
2893E118539P2634r2898n2759O1034l082j54072K66261M355j2299L1449M3436
$$ plain form
2882 5282598 5685194 5675331 5537847 5525139 5709007 5747995 5731270 5686963 5670621 5509628 5298860
2871 5298860 5330255 4947849 4886172 4499224 4582000 4255224 3833339 3482477 3741247 3644379
2861 3644379 3602656 3899278 4089797 3967140 3892876 3449249 3575465 3596865 3540260 3364788
2851 3364788 3244054 3322140 3164405 3003558 2818002 2469320 2285388 2518130 2634691 2418819
2841 2418819 2565941 2486018 2527957 2457669 2060735 1865246 1844447 1805157 1777142 1682604 1622959
2830 1622959 1693163 1794014 1742298 1591377 1751175 1544921 1487227 1464864 1527451 1302120
2820 1302120 1139015 1289644 1243716 1316166 1499466 1579603 1467181 1418040 1315514 1110731
2810 1110731 1284281 1142040 1108614 1031457 1134338 1132985 1021438 1039405 1051433 1258500 1252160
$$ packed form
2882E282598M02596r863j37484j2708J83868L8988j6725m4307j6342j60993k10768
2871E298860L1395l82406o1677l86948Q2776l26776m21885l50862K58770r6868
2861C644379m1723K96622J90519j22657p4264m43627J26216K1400n6605j75472
2851C364788j20734P8086j57735j60847j85556l48682j83932K32742J16561k15872
2841B418819J47122p9923M1939p0288l96934j95489k0799l9290k8015r4538n9645
2830A622959P0204J00851n1716j50921J59798k06254n7694k2363O2587k25331
2820A302120j63105J50629m5928P2450J83300Q0137j12422m9141j02526k04783
2810A110731J73550j42241l3426p7157J02881j353j11547J7967J2028K07067o340
$$ plain form
2799 1252160 1015474 903957 800830 740951 898668 925707 744406 875702 938242 855228
2789 855228 872997 756481 880013 760343 726982 730781 754518 523080 620205 811240 507029
2778 507029 424491 391200 503721 605035 566536 746784 727316 570945 503747 445546 822982
2767 822982 788060 657147 572022 413127 533729 450034 126581 312837 366532 321000 686470
2756 686470 475349 431372 578587 429082 390902 465912 459465 537952 644996 588555 666556
2745 666556 607439 247871 342829 271879 377520 515621 227986 300338 261353 582609 401900
2734 401900 268037 251454 306391 166796 117717 119625 22987 25382 96600 221647 149663
2723 149663 44914 34541 261696 332477 182120 122223 235557 469639 549413 410432
$$ packed form
2799A252160k36686j11517j03127n9879J57717K7039j81301J31296O2540q3014
2789H55228J7769j16516J23532j19670l3361L799K3737k31438R7125J91035l04211
2778E07029q2538l3291J12521J01314l8499J80248j9468j56371o7198n8201L77436
2767H22982l4922j30913q5125j58895J20602q3695l23453J86256N3695m5532L65470
2756F86470k11121m3977J47215j49505l8180P5010o447P8487J07044n6441P8001
2745F66556n9117l59568R4958p0950J05641J38101k87635P2352l8985L21256j80709
2734D01900j33863j6583N4937j39595m9079J908r6638K395P1218J25047p1984
2723A49663j04749j0373K27155P0781j50357n9897J13334K34082P9774j38981
$$ plain form
2713 410432 320391 346322 405894 251668 19304 -79313 -30094 149454 181723 197204 159582
2702 159582 -16587 221935 194121 73510 221951 102676 56893 -13024 54594 19399 173353
2691 173353 268826 71905 265572 489705 316369 106875 -958 -4658 -10360 35585 81876
2680 81876 -22807 -26590 113598 118861 -9151 55418 -96347 -183644 -91877 -85890 -3676 85683
2668 85683 143383 339195 179600 116035 271043 100552 136475 149046 162894 331744 186649
2657 186649 136164 159865 -115115 -32182 301684 342690 98236 83437 205067 35360 62673
2646 62673 45257 134728 128127 171770 -85300 -170404 127863 172347 87464 72476 44540 85625
2634 85625 211885 302232 124306 165895 261336 200166 -33170 72270 125156 -140444 4503
$$ packed form
2713D10432r0041K5931N9572j54226k32364r8617M9219J79548L2269J5481l7622
2702A59582j76169K38522k7814j20611J48441j19275m5783o9917O7618l5195J53954
2691A73353R5473j96921J93667K24133j73336k09494j07833l700n702M5945M6291
2680H1876j04683l783J40188N263j28012O4569j51765q7297R1767N987Q2214Q9359
2668H5683N7700J95812j59595o3565J55008j70491L5923J2571J3848J68850j45095
2657A86649n0485K3701k74980Q2933L33866M1006k44454j4799J21630j69707K7313
2646F2673j7416Q9471o601M3643k57070q5104K98267M4484q4883j4988k7936M1085
2634H5625J26260R0347j77926M1589R5441o1170k33336J05440N2886k65600J44947
$$ plain form
2623 4503 78385 -109795 123249 176148 101632 256723 97811 58445 -36984 -274873 -190154
2612 -190154 -11737 -37226 41632 173695 159022 44408 -126683 48350 46496 -119144 -47597
2601 -47597 18200 -102010 10306 198055 206630 133295 178409 167834 175005 162424 29889
2590 29889 -38983 77573 -42920 108681 82844 321978 296952 157712 95317 19847 213310
2579 213310 129466 68059 899 -163155 -119590 294116 240079 109530 5768 403883 280258
2568 280258 130593 74661 180200 -66404 -221742 -110173 31406 -177907 -53419 236381
2558 236381 117785 -801 -121711 -51652 16023 52166 -121491 -3971 224995 281951
2548 281951 44377 -84181 262576 75590 -18853 121579 233625 262167 312253 83294
$$ packed form
2623D503P3882j88180K33044N2899p4516J55091j58912l9366r5429k37889Q4719
2612a90154J78417k5489P8858J32063j4673j14614j71091J75033j854j65640P1547
2601d7597O5797j20210J12316J87749Q575p3335M5114j0575P171j2581j32535
2590B9889o8872J16556j20493J51601k5837K39134k5026j39240o2395p5470J93463
2579B13310q3844o1407o7160j64054M3565M13706n4037j30549j03762L98115j23625
2568B80258j49665n5932J05539k46604j55338J11569J41579k09313J24488K89800
2558B36381j18596j18586j20910P0059O7675L6143j73657J17520K28966N6956
2548B81951k37574j28558L46757j86986r4443J40432J12046K8542N0086k28959
$$ plain form
2538 83294 131335 271276 127675 -77923 -390923 -298254 -68173 -41525 -168294 -293300
2528 -293300 -156377 -104054 -91043 -120589 -6474 25493 42019 145350 20393 36741 30997
2517 30997 -29709 -62061 161515 265689 185220 228026 103457 128440 165626 53794 123456
2506 123456 11591 -30159 2898 163904 -59975 -159117 176155 131655 328057 148149
2496 148149 225244 164436 84898 96813 75944 258953 -41252 -4741 -31431 -79284 99423
2485 99423 113521 196041 64682 29293 -27794 -82339 -104795 -106751 209588 60223 -99160
2474 -99160 62874 193747 86542 84102 -25290 36615 -99501 -60897 -144896 151972 104554
2463 104554 17421 151374 119641 -25523 -258909 31562 184651 -42225 -42049 -163515 -260104
$$ packed form
2538H3294M8041J39941j43601k05598l13000R2669K30081K6648j26769j25006
2528b93300J36923N2323J3011k9546J14115L1967J6526J03331j24957J6348n744
2517C0997o0706l2352K23576J04174q0469M2806j24569K4983L7186j11832O9662
2506A23456j11865m1750L3057J61006k23879r9142L35272m4500J96402j79908
2496A48149P7095o0808p9538J1915k0869J83009l00205L6511k6690m7853J78707
2485I9423J4098Q2520j31359l5389n7087n4545k2456j956L16339j49365j59383
2474i9160J62034J30873j07205k440j09392O1905j36116L8604q3999K96868m7418
2463A04554q7133J33953l1733j45164k33386K90471J53089k26876J76j21466r6589
$$ plain form
2452 -260104 -107033 -259511 -301141 67423 109428 192423 134422 165757 -44871 -27932 142484
2441 142484 -5182 -122395 -184646 21202 -160037 -27775 -95299 -19341 -14808 113480 266369
2430 266369 30445 130549 43860 -27744 -196073 104578 253772 93661 93788 -5231 -133373
2419 -133373 -12627 40565 34830 70337 139798 287625 166116 -25646 -148006 -172611 -136548
2408 -136548 -90182 -5934 277869 338937 352363 287410 277855 225836 194831 325257 306244
2397 306244 143180 216115 152571 131213 225749 319563 175565 64751 67399 -29429 84163
2386 84163 84842 224262 234680 47007 364493 411645 356953 391212 475542 241009 177645
2375 177645 339395 544200 512748 455289 395674 219434 276508 303765 246813 44811 4516
$$ packed form
2452b60104J53071j52478m1630L68564M2005Q2995n8001L1335k10628J6939J70416
2441A42484j47666j17213o2251K05848j81239J32262o7524P5958M533J28288J52889
2430B66369k35924J00104q6689p1604j68329L00651J49194j60111J27r9019j28142
2419a33373J20746N3192n735L5507O9461J47827j21509j91762j22360k4605L6063
2408a36548M6366Q4248K83803O1068J3426o4953r555n2019l1005J30426j9013
2397C06244j63064P2935o3544k1358R4536R3814j43998j10814K648r6828J13592
2386H4163O79J39420J0418j87673L17486M7152n4692L4259Q4330k34533o3364
2375A77645J61750K04805l1452n7459n9615j76240N7074K7257n6952k02002m0295
$$ plain form
2364 4516 49742 111602 160235 97861 247491 349098 274660 -16937 -44376 38492 -5559
2353 -5559 179196 217877 188865 302361 411093 89271 -18216 61922 144588 125736 8311
2342 8311 66588 220894 49534 -26917 -4345 287643 268197 9770 106911 32611 -38309
2331 -38309 25604 289949 41405 3642 47745 -150733 -35892 155712 1100 109701
2321 109701 137490 248406 424100 479598 436518 313353 462331 440823 118033 80167 258543
2310 258543 281203 334813 372627 136726 292269 261003 -140089 -233919 -125285 9187 10725
2299 10725 294097 373376 283358 112253 67066 242201 135614 249930 185309 166508 391729
2288 391729 473431 314710 292650 469597 531895 603183 359106 503666 336251 563799
$$ packed form
2364D516M5226O1860M8633o2374J49630J01607p4438k91597k7439Q2868m4051
2353e559J84755L8681k9012J13496J08732l21822j07487Q0138Q2666j8852j17425
2342H311N8277J54306j71360p6451K2572K91988j9446k58427R7141p4300p0920
2331c8309O3913K64345k48544l7763M4103j98478J14841J91604j54612J08601
2321A09701K7789J10916J75694N5498m3080j23165J48978k1508l22790l7866J78376
2310B58543K2660N3610L7814k35901J55543l1266m01092r3830J08634J34472J538
2299A0725K83372P9279r0018j71105m5187J75135j06587J14316o4621j8801K25221
2288C91729Q1702j58721k2060J76947O2298P1288k44077J44560j67415K27548
$$ plain form
2278 563799 408075 195300 164067 188294 102717 42133 299860 277724 157157 421178 376891
2267 376891 173590 239110 690390 682462 599407 546499 467612 595259 647976 534960 773182
2256 773182 970327 900589 711927 570988 427278 409846 479470 463640 505274 385904 565002
2245 565002 443868 442965 573743 559749 488292 524559 252309 333524 406102 436338 325024
2234 325024 281623 159473 214479 391262 590016 598280 522432 314822 316519 347252 370554
2223 370554 574932 602163 528321 610566 710637 679541 740094 704784 506892 292932 454440
2212 454440 665128 533839 566835 681538 597262 804042 710946 960179 1200970 1007765
2202 1007765 1141684 1032611 962997 1037558 1219880 990351 800570 763051 876229 1012595
$$ packed form
2278E63799j55724k12775l1233K4227q5577o0584K57727k2136j20567K64021m4287
2267C76891k03301O5520M51280p928q3055n2908p8887J27647N2717j13016K38222
2256G73182J97145o9738j88662j40939j43710j7432O9624j5830M1634j19370J79098
2245E65002j21134r03J30778j3994p1457L6267k72250Q1215P2578L0236j11314
2234C25024m3401j22150N5006J76783J98754Q264p5848k07610J697L0733K3302
2223C70554K04378K7231p3842Q2245J00071l1096O0553l5310j97892k13960J61508
2212D54440K10688j31289L2996J14703q4276K06780r3096K49233K40791j93205
2202A007765J33919j09073o9614P4561J82322k29529j89781l7519J13178J36366
$$ plain form
2192 1012595 1239568 1065819 1175072 1500142 1287487 1203321 1282780 1513746 1634935 1517437
2182 1517437 1546252 1735806 1647233 1524706 1641074 1787175 1755509 1679394 1910231 2228207
2172 2228207 2341862 2153114 2121268 2267928 2331178 2291375 2229182 2563412 2865655 2953723
2162 2953723 2796033 2835322 2845285 2990691 3115720 2993562 3038360 3489489 3452717 3688739
2152 3688739 3667353 3593287 3523358 3698037 3924906 4103733 4180649 4325616 4594667 4773285
2142 4773285 4701418 4719405 5132389 5747678 5982203 6097100 6332626 6414649 6810051 7054906
2132 7054906 7452305 7853983 8179050 8793803 9320689 10041702 10596275 11054766 11926392 12700392
2122 12700392 13522668 14946556 16220013 17358784 18345949 19142533 20592781 22374852 24702280
$$ packed form
2192A012595K26973j73749J09253L25070k12655q4166P9459K30966J21189j17498
2182A517437K8815J89554q8573j22527J16368J46101l1666p6115K30837L17976
2172B228207J13655j88748l1846J46660O3250l9803o2193L34230L02243Q8068
2162B953723j57690L9289R963J45406J25029j22158M4798M51129l6772K36022
2152C688739k1386p4066o9929J74679K26869J78827P6916J44967K69051J78618
2142D773285p1867J7987M12984O15289K34525J14897K35526Q2023L95402K44855
2132G054906L97399M01678L25067O14753N26886P21013N54573M58491Q71626P74000
2122A2700392Q22276J423888J273457J138771R87165P96584J450248J782071K327428
$$ plain form
2113 24702280 27463027 31304751 35988439 41883403 48602376 57412945 69095434 86395831
2105 86395831 101652757 104502406 90069110 68471204 52437647 41793013 34457051
2098 34457051 29110430 25222371 22050939 19486301 17224515 15893225 15005083 14365690
2090 14365690 13552380 13034456 12019319 11112876 9996814 9043055 8389270 7931004 7494246
2081 7494246 7231974 6768854 6772100 6225512 5698289 5433018 5293334 5093433 4877554 4386553
2071 4386553 4070163 4050015 3739529 3767511 3728109 3632682 3551721 3098668 3021934 2983833 2729554
2060 2729554 2700910 2563665 2670523 2630617 2348313 2403923 2153750 2127108 2366962 2125768
2050 2125768 2170160 2020783 2147494 2034324 1852317 1628931 1464005 1588160 1576472 1310209
$$ packed form
2113B4702280K760747L841724M683688N894964O718973Q810569J1682489J7300397
2105H6395831J5256926K849649j4433296k1597906j6033557j0644634p335962
2098C4457051n346621l888059l171432k564638k261786j331290q88142o39393
2090A4365690q13310n17924j015137r06443j116062r53759o53785m58266m36758
2081G494246k62272m63120L246n46588n27223k65271j39684j99901k15879m91001
2071D386553l16390k0148l10486K7982l9402r5427q0961m53053p6734l8101k54279
2060B729554k8644j37245J06858l9906k82304N5610k50173k6642K39854k41194
2050B125768M4392j49377J26711j13170j82007k23386j64926J24155j1688k66263
$$ plain form
2040 1310209 1314982 1528865 1586660 1426258 1347771 1508602 1559689 1520677 1358663 1164469 1185654
2029 1185654 1155697 1098066 965908 1224838 1001808 810452 722113 618769 537513 584035
2019 584035 617658 662149 683197 764212 665818 778553 602886 461506 505538 529262 665885
2008 665885 496071 511664 735543 640313 458815 475062 355694 198452 464963 826527
1998 826527 594847 500715 375301 68942 201189 357369 412986 368264 551806 729039
1988 729039 496846 394727 322473 347002 168870 318640 261179 164879 292906 246204 144352
1977 144352 24093 316899 500240 152441 59707 491991 463740 218849 139357 -18256
1967 -18256 308020 286340 310093 153934 91081 70035 293131 126794 60971 302350 83468
$$ packed form
2040A310209M773K13883N7795j60402p8487J60831N1087l9012j62014j94194K1185
2029A185654k9957n7631j32158K58930k23030j91356q8339j03344q1256M6522
2019E84035L3623M4491K1048Q1015r8394J12735j75667j41380M4032K3724J36623
2008F65885j69814J5593K23879r5230j81498J6247j19368j57242K66511L61564
1998H26527k31680r4132j25414l06359J32247J56180N5617m4722J83542J77233
1988G29039k32193j02119p2254K4529j78132J49770n7461r6300J28027m6702j01852
1977A44352j20259K92806J83341l47799r2734M32284k8251k44891p9492j57613
1967a8256L26276k1680K3753j56159o2853k1046K23096j66337o5823K41379k18882
$$ plain form
1956 83468 -152944 -95687 70775 -127222 18792 -59878 121331 231124 148421 120462 63464
1945 63464 252675 230191 103230 16615 34655 11946 26398 63538 205425 195426 43146
1934 43146 111023 67838 114429 216238 224041 135287 -165896 -272910 -122171 -191990 -237443
1923 -237443 -194489 -34303 23785 -55018 -203155 -311202 -77900 171432 125881 -154622
1913 -154622 -107043 -28611 -94356 -13724 219751 -116194 -62095 -34202 -196628 -73599 -44832
1902 -44832 13435 142953 29727 -166862 -170493 -72713 -123513 -81108 -49467 -81257 -22979
1891 -22979 -137733 -197022 -127840 -78912 164901 115213 248700 82492 69995 -56707 -55993
1880 -55993 80516 -59916 111608 208146 153646 11914 111668 57623 -70991 -240550 79890
$$ packed form
1956H3468k36412N7257J66462j97997J46014p8670J81209J09793q2703k7959n6998
1945F3464J89211k2484j26961q6615J8040k2709J4452L7140J41887r999j52280
1934D3146O7877m3185M6591J01809P803q8754l01183j07014J50739o9819m5453
1923b37443M2954J60186N8088p8803j48137j08047K33302K49332m5551k80503
1913a54622M7579P8432o5745Q0632K33475l35945N4099K7893j62426J23029K8767
1902d4832N8267J29518j13226j96589l631R7780n0800M2405L1641l1790N8278
1891b2979j14754n9289O9182M8928K43813m9688J33487j66208j2497j26702P14
1880e5993J36509j40432J71524R6538n4500j41732R9754n4045j28614j69559L20440
$$ plain form
1869 79890 354436 235142 76113 -75538 -96329 -262730 -472929 -244114 -93149 70395
1859 70395 200407 123395 -107639 -273850 -510086 -380191 -284414 -42432 57122 74102 -93479
1848 -93479 -193077 9153 112847 8879 -7091 -94152 273561 444109 279570 375256 474270
1837 474270 539486 577729 543977 383370 429717 345232 197300 196806 -92047 111581 105030
1826 105030 -65364 305625 382473 329003 329362 222138 20621 26259 -66188 -54931 88816
1815 88816 62484 24691 -42074 -223621 -154427 19016 -43749 96116 -96079 108576 116923
1804 116923 39061 -13794 -145798 -172923 -171834 -120872 -138998 -127272 -238679 139784 141575
1793 141575 174550 215488 160549 -34110 -48447 5441 51617 -179026 -69135 -10023 -232929
$$ packed form
1869G9890K74546j19294j59029j51651k0791j66401k10199K28815J50965J63544
1859G0395J30012p7012k31034j66211k36236J29895R5777K41982R9554J6980j67581
1848i3479r9598K02230J03694j03968j5970q7061L67713J70548j64539R5686R9014
1837D74270O5216L8243l3752j60607M6347q4485j47932m94k88853K03628o551
1826A05030j70394L70989P6848n3470L59j07224k01517N638r2447J1257J43747
1815H8816k6332l7793o6765j81547O9194J73443o2765J39865j92195K04655Q347
1804A16923p7862n2855j32004k7125J089N0962j8126J1726j11407L78463J791
1793A41575L2975M0938n4939j94659j4337N3888M6176k30643J09891N9112k22906
$$ plain form
1782 -232929 -138748 -69823 177922 215420 6981 -148931 -267898 -385023 -187786 -195596 -198837
1771 -198837 -179375 -193465 -204972 -136970 -122649 18193 116679 33845 -9348 104684 5934
1760 5934 -89811 -118878 -78763 73293 31314 -36460 5598 89720 154561 249040 65923 -31852
1748 -31852 -162691 -72720 73987 20154 -47285 49110 -145414 861 -7572 25035 254085
1737 254085 127748 -127130 -101305 -51957 -211616 -74728 -52392 -440623 -257217 -201324
1727 -201324 -312988 -171811 -372896 -273692 -203261 -307908 10303 41987 125712 37400 -150307
1716 -150307 -37526 1058 -330424 -350919 10645 111077 -92377 -57974 -54433 -52409 -345394
1705 -345394 106433 211368 269693 456416 -11231 -122622 -183749 101310 109600 -44832
$$ packed form
1782b32929R4181O8925K47745L7498k08439j55912j18967j17125J97237p810l241
1771a98837J9462j4090j1507O8002J4321J40842R8486q2834m3193J14032r8750
1760E934r5745k9067M0115J52056m1979o7774M2058Q4122O4841R4479j83117r7775
1748c1852j30839Q9971J46707n3833o7439R6395j94524J46275q433L2607K29050
1737B54085j26337k54878K5825M9348j59659J36888K2336l88231J83406N5893
1727b01324j11664J41177k01085R9204P0431j04647L18211L1684Q3725q8312j87707
1716a50307J12781L8584l31482k0495L61564J00432k03454L4403L541K024k92985
1705c45394M51827J04935N8325J86723m67647j11391o1127K85059Q290j54432
$$ plain form
1695 -44832 -129102 -20324 2025 -82991 32345 108737 8017 -53499 -117712 60230 115924
1684 115924 -26378 -107679 -68074 154133 110010 145389 320056 100422 51287 222122 145283
1673 145283 10914 103642 27871 270022 111596 -313807 -364607 -162105 -34199 155519
1663 155519 -72855 -243046 -193696 -231040 -66995 118332 -215814 -233553 -13702 -76301
1653 -76301 11499 43279 -68288 -60905 -357566 -335725 -7020 78199 -196862 -213059 -24951
1642 -24951 -68576 22873 -38900 -24024 -78424 -136199 -120359 -45448 -135444 -48521 103312 182787
1630 182787 62193 -90267 43243 40178 99405 148434 9919 111990 179691 40888 -46580
1619 -46580 -48977 4035 -210187 -115472 6569 -135089 -142487 -134934 -90087 -237106 -94348
$$ packed form
1695d4832q4270J08778K2349q5016J15336P6392j00720o1516o4213J77942N5694
1684A15924j42302q1301L9605K22207m4123L5379J74667k19634m9135J70835p6839
1673A45283j34369R2728p5771K42151j58426m25403n0800K02502J27906J89718
1663A55519k28374j70191M9350l7344J64045J85327l34146j7739K19851o2599
1653g6301Q7800L1780j11567P383k96661K1841L28705Q5219k75061j6197J88108
1642b4951m3625R1449o1773J4876n4400n7775J5840P4911q9996Q6923J51833P9475
1630A82787j20594j52460J33510l065N9227M9029j38515J02071O7701j38803q7468
1619d6580k397N3012k14222R4715J22041j41658p398P553M4847j47019J42758
$$ plain form
1608 -94348 -247455 -79527 126824 -50456 -226248 -335245 -93238 -2454 -148893 -202985
1598 -202985 -152392 -196340 -109930 -131714 -129879 42078 247465 43539 51736 -55538 -111831
1587 -111831 193916 57915 -174125 21733 113830 163675 162028 117430 100302 171505 194853
1576 194853 89145 -67092 -81943 -80631 -228982 -51092 6197 42848 -26323 -153223 -292962
1565 -292962 -550993 -412632 -246594 -432083 -556126 -364929 -35369 3879 -11964 129874
1555 129874 65360 -241659 -369463 -78993 45016 -40059 -69163 -128561 -141641 -86669 -158313
1544 -158313 60914 -71902 54777 118425 -103640 73645 -16667 -253045 -342884 -99524
1534 -99524 136665 -32987 -103312 -23160 75526 47095 -229727 -160244 -143012 114168 75239
$$ packed form
1608i4348j53107J67928K06351j77280j75792j08997K42007R0784j46439n4092
1598b02985N0593m3948Q6410k1784J835J71957K05387k03926Q197j07274n6293
1587a11831L05747j36001k32040J95858R2097M9845j647m4598j7128P1203K3348
1576A94853j05708j56237j4851J312j48351J77890N7289L6651o9171j26900j39739
1565b92962k58031J38361J66038j85489j24043J91197L29560L9248j5843J41838
1555A29874o4514l07019j27804K90470J24009q5075k9104n9398j3080N4972p1644
1544a58313K19227j32816J26679O3648k22065J77285r0312k36378q9839K43360
1534i9524K36189j69652p0325Q0152R8686k8431k76822O9483J7232K57180l8929
$$ plain form
1523 75239 -102277 10362 -73796 -25499 56833 -203869 -211537 -390785 -324240 -93868 74175
1512 74175 193430 332325 280387 165888 31444 -64425 -175930 180640 199180 38190
1502 38190 -31685 6853 -85589 -29212 66710 118624 68243 6904 70943 37305 -88147 -59787
1490 -59787 -172179 -9660 11593 -8931 26395 -18148 -115000 -21473 90207 -113772 147473
1479 147473 -16605 -136737 -120241 79174 113503 259192 269567 38986 -309463 -178198
1469 -178198 -58884 -34205 -158477 -21723 20437 -28026 -167828 87790 -12375 -165054
1459 -165054 -114492 -22942 17077 -107434 5301 -39914 240568 33564 -49534 45491 -155819
1448 -155819 -307158 -380691 -234506 -336681 -346420 -171526 -253709 -203394 -4973 -23082 106979
$$ packed form
1523G5239j77516J12639q4158M8297Q2332k60702p668j79248O6545K30372J68043
1512G4175J19255J38895n1938j14499j34444r5869j11505L56570J8540j60990
1502C8190o9875L8538r2442N6377R5922N1914n0381o1339O4039l3638j25452K8360
1490e9787j12392J62519K1253k0524L5326m4543r6852R3527J11680k03979K61245
1479A47473j64078j20132J6496J99415L4329J45689J0375k30581l48449J31265
1469a78198J19314K4679j24272J36754M2160m8463j39802K55618j00165j52679
1459a65054N0562R1550M0019j24511J12735m5215K80482k07004q3098R5025k01310
1448a55819j51339p3533J46185j02175r739J74894q2183N0315J98421j8109J30061
$$ plain form
1437 106979 -3916 179613 222453 -104162 -271 65593 7816 -195815 -34915 38147
1427 38147 16297 120681 155612 43177 45662 266717 313585 195486 128344 -49354 -152349
1416 -152349 -218164 -100779 -181466 -170585 -164700 -37465 -181777 -425780 -379877 -114151 -197206
1405 -197206 -283572 -350990 -238752 -8962 -132194 -102487 119249 281488 222189 -161190
1395 -161190 -307612 -203285 -313148 -242812 -269774 -257109 -420474 87401 74615 -165631
1385 -165631 -105063 -83618 -129555 38980 -56298 -170859 -111932 26912 -234020 -71866 -34319
1374 -34319 -50534 -318068 -263595 -129504 -70554 -87460 -144743 -45800 -177865 -130034 -304163
1363 -304163 -423395 -342388 -200349 -104414 145455 -22186 3432 12429 76139 -66737 8960
$$ packed form
1437A06979j10895J83529M2840l26615J03891O5864n7777k03631J60900P3062
1427C8147k1850J04384L4931j12435K485K21055M6868j18099o7142j77698j02995
1416a52349o5815J17385q0687J0881N885J27235j44312k44003M5903K65726q3055
1405a97206q6366o7418J12238K29790j23232K9707K21736J62239n9299l83379
1395a61190j46422J04327j09863P0336k6962J2665j63365N07875j2786k40246
1385a65631O0568K1445m5937J68535r5278j14561N8927J38844k60932J62154L7547
1374c4319j6215k67534N4473J34091N8950j6906n7283R8943j32065M7831j74129
1363c04163j19232Q1007J42039R5935K49869j67641K5618Q997O3710j42876P5697
$$ plain form
1352 8960 149983 222703 10207 -79590 89822 37942 -107471 -231761 -352868 -256217 51786
1341 51786 221270 -122981 -77591 317617 215290 48520 -7743 -130101 -240294 -169829
1331 -169829 -305610 -93200 130872 219079 286365 66346 95518 179401 142380 60488 -135057
1320 -135057 -23729 10116 -217131 -251270 -39087 60353 -134349 -303996 -69857 -81578
1310 -81578 -196903 -42820 101671 -91429 -174949 -23911 -361624 -123363 -210516 -186987
1300 -186987 -36065 -30680 -153010 -110012 41668 29732 -179586 -301280 -316896 -175523 -21448
1289 -21448 76663 261738 94070 -3722 147403 20400 -196347 -118670 131873 183005 125796
1278 125796 142274 -6827 -24170 68633 -25583 45295 116114 -106527 4148 430648 302473
$$ packed form
1352H960J41023P2720k12496q9797J69412n1880j45413j24290j21107R6651L08003
1341E1786J69484l44251M5390L95208j02327j66770n6263j22358j10193P0465
1331a69829j35781K12410K24072Q8207O7286k20019K9172Q3883l7021q1892j95545
1320a35057J11328L3845k27247l4139K12183R9440j94702j69647K34139j1721
1310h1578j15325J54083J44491j93100q3520J51038l37713K38261q7153K3529
1300a86987J50922N385j22330M2998J51680j1936k09318j21694j5616J41373J54075
1289b1448R8111J85075j67668r7792J51125j27003k16747P7677K50543N1132n7209
1278A25796J6478j49101j7343R2803r4216P0878P0819k22641J10675M26500j28175
$$ plain form
1267 302473 -52591 -100217 -74656 -4745 45780 13601 -3267 208420 44757 -153573 -120318
1256 -120318 282371 338851 341957 260749 3473 -39168 71110 29128 -126152 -34951 -66875
1245 -66875 103154 112341 51862 68313 46210 18006 -11485 41246 259305 301823 220803 90812
1233 90812 -19041 -124316 -10599 32687 -5104 -125254 8720 -26605 47491 -158861 -222613
1222 -222613 -171521 -30835 32568 45222 200379 -52407 95172 -51104 -70110 -53847 -184133
1211 -184133 -282882 -270485 -111993 234188 220395 204807 337315 69012 40820 -49320 -111287
1200 -111287 28559 -87373 12907 29582 71785 -119743 -121567 -90942 -13051 45285 19050
1189 19050 -101914 42331 -94446 -121244 -140701 70329 301166 128803 -74295 65848
$$ packed form
1267C02473l55064m7626K5561O9911N0525l2179j6868K11687j63663j98330L3255
1256a20318M02689N6480L106q1208k57276m2641J10278m1982j55280R1201l1924
1245f6875J70029R187o0479J6451k2103k8204k9491N2731K18059M2518q1020j29991
1233I0812j09853j05275J13717M3286l7791j20150J33974l5325P4096k06352o3752
1222b22613N1092J40686O3403J2654J55157k52786J47579j46276j9006J6263j30286
1211a84133r8749J2397J58492L46181j3793j5588J32508k68303k8192r0140o1967
1200a11287J39846j15932J00280J6675M2203j91528j824L0625P7891N8336k6235
1189A9050j20964J44245j36777k6798j9457K11030K30837j72363k03098J40143
$$ plain form
1179 65848 336907 171907 89588 180913 -18501 38817 10060 -167008 -157230 1144 128628
1168 128628 21249 134823 137718 -4833 -178811 -204560 -187914 -162444 -41765 64004 -48412
1157 -48412 26239 320698 35400 -83506 -4493 -55258 47428 -211874 -356927 -225150
1147 -225150 -3291 121588 -7907 97074 -12198 -67815 -62926 -74220 26825 -73299
1137 -73299 -257013 -244967 -121057 -33718 -26514 -157046 -45642 64779 285617 228938 276911
1126 276911 52 -175557 -151949 -80587 -131193 -106062 -205765 -231183 -44729 50004 150690
1115 150690 62844 -76940 88413 128220 -188811 -233048 -197608 -235438 -386100 -421241 -169509
1104 -169509 -169932 -251215 65241 -55410 -54774 -35510 -100108 -22423 -225079 -87018 -163258 -66691
$$ packed form
1179F5848K71059j65000q2319R1325j99414N7318k8757j77068R778J58374J27484
1168A28628j07379J13574K895j42551j73978k5749J6646K5470J20679J05769j12416
1157d8412P4651K94459k85298j18906P9013n0765J02686k59302j45053J31777
1147b25150K21859J24879j29495J04981j09272n5617M889j1294J01045j00124
1137g3299j83714J2046J23910Q7339P204j30532J11404J10421K20838n6679M7973
1126B76911k76859j75609K3608P1362n0606K5131r9703k5418J86454R4733J00686
1115A50690q7846j39784J65353L9807l17031m4237L5440l7830j50662l5141K51732
1104a69509m23q1283L16456j20651O36J9264o4598P7685k02656J38061p6240R6567
$$ [...]
##END NTUPLES=NMR SPECTRUM
##END=
