##TITLE=1H_CG-1164-3
 CDCl3
 8 sc, 
 24.10.2022
##JCAMPDX= 6.0         $$ Bruker NMR JCAMP-DX V2.0
##DATA TYPE= NMR SPECTRUM
##DATA CLASS= NTUPLES
##ORIGIN= UXNMR, Bruker Analytische Messtechnik GmbH
##OWNER= root
$$ XWIN-NMR		Version 3.5
$$ Mon Oct 24 14:38:11 2022 Russian Standard Time (UT+4h)  she@DPX200
##.OBSERVE FREQUENCY= 200.1313499994
##.OBSERVE NUCLEUS= ^1H
##.ACQUISITION MODE= SIMULTANEOUS
##.ACQUISITION SCHEME= undefined
##.AVERAGES= 8
##.DIGITISER RES= 18
##SPECTROMETER/DATA SYSTEM= spect
##.PULSE SEQUENCE= zg30
##.SOLVENT NAME= CDCl3
##.SHIFT REFERENCE= (INTERNAL, CDCl3, 0, 15.7326)
##AUDIT TRAIL= $$ (NUMBER, WHEN, WHO, WHERE, WHAT)
$$ ##TITLE= Audit trail, XWIN-NMR		Version 3.5
$$ ##JCAMPDX= 5.01
$$ ##ORIGIN= Bruker BioSpin GmbH
$$ ##OWNER= she
$$ F:/spectra/data/she/nmr/H-F/1/pdata/1/auditp.txt
$$ ##AUDIT TRAIL=  $$ (NUMBER, WHEN, WHO, WHERE, WHAT)
(   1,<2022-10-24 14:36:45.45 +0400>,<she>,<DPX200>,
      <created by zg, POWCHK disabled, PULCHK disabled
       configuration hash MD5:
       00 E9 B6 7A A2 85 ED C7 34 08 36 98 17 FE 4E 26
       data hash MD5: 16K
       52 FE 00 FD 27 FD E0 44 17 C0 A6 BB 29 9A C1 1B>)
(   2,<2022-10-24 14:36:48.10 +0400>,<she>,<DPX200>,
      <Start of raw data processing
       efp BC_mod = 2 LB = 0.24 FT_mod = 6 PKNL = 1 PHC0 = -18037.42 PHC1 = 12.2007 SI = 16K 
       data hash MD5: 16K
       7C 06 85 96 15 C0 A9 A2 69 06 F4 13 44 0C B9 54>)
(   3,<2022-10-24 14:37:09.76 +0400>,<she>,<DPX200>,
      <pk PHC0 = 4.680587 PHC1 = -3.6 
       data hash MD5: 16K
       8D 0F 8D 85 4D 93 AE 9E E0 98 4A 5F 0B E4 95 D5>)
(   4,<2022-10-24 14:37:13.42 +0400>,<she>,<DPX200>,
      <abs ABSG = 5 
       data hash MD5: 16K
       8F E2 E3 CB DD 39 F3 C1 53 69 1C 66 7D 34 8F 0D>)
$$ ##END=
$$ 
$$ hash MD5
$$ 8B 2A 57 7B 1D B3 2A 8E 75 E8 28 89 47 B4 CA 4F
##$RELAX= 
##$RELAX= 
##$RELAX= 
##$RELAX= 
##$RELAX= 
##$RELAX= 
$$ Bruker specific parameters
$$ --------------------------
##$DU= <F:/spectra>
##$EXPNO= 1
##$NAME= <H-F>
##$PROCNO= 1
##$TYPE= <nmr>
##$USER= <she>
##$AMP= (0..31)
100 100 100 100 100 100 100 100 100 100 100 100 100 100 100 100 100 100 
100 100 100 100 100 100 100 100 100 100 100 100 100 100 
##$AQSEQ= 0
##$AQ_mod= 1
##$AUNM= <au_zg>
##$AUTOPOS= <>
##$BF1= 200.13
##$BF2= 200.13
##$BF3= 200.13
##$BF4= 200.13
##$BF5= 200.13
##$BF6= 200.13
##$BF7= 200.13
##$BF8= 200.13
##$BYTORDA= 1
##$CFDGTYP= 0
##$CFRGTYP= 5
##$CHEMSTR= <none>
##$CNST= (0..31)
1 1 145 1 1 1 1 1 1 1 1 1 1 1 1 1 1 1 1 1 1 1 1 1 1 1 1 1 1 1 1 1 
##$CPDPRG= <>
##$CPDPRG1= <>
##$CPDPRG2= <>
##$CPDPRG3= <>
##$CPDPRG4= <mlev>
##$CPDPRG5= <mlev>
##$CPDPRG6= <mlev>
##$CPDPRG7= <mlev>
##$CPDPRG8= <mlev>
##$CPDPRGB= <>
##$CPDPRGT= <>
##$D= (0..31)
0 1.2 0 0 0 0 0 0 0 0.06 0 0.03 0 0 0 0 0.0002 0 0 0 0 0 0 0 0 0 0 0 0 
0 0 0 
##$DATE= 1666607804
##$DBL= (0..7)
120 120 120 120 120 120 120 120 
##$DBP= (0..7)
150 150 150 150 150 150 150 150 
##$DBP07= 0
##$DBPNAM0= <>
##$DBPNAM1= <>
##$DBPNAM2= <>
##$DBPNAM3= <>
##$DBPNAM4= <>
$$ [...]
##$SUBNAM3= <"">
##$SUBNAM4= <"">
##$SUBNAM5= <"">
##$SUBNAM6= <"">
##$SUBNAM7= <"">
##$SUBNAM8= <"">
##$SUBNAM9= <"">
##$SW= 18.0517283424941
##$SWIBOX= (0..15)
0 0 2 0 0 0 0 0 0 0 0 0 0 0 0 0 
##$SW_h= 3612.71676300578
##$TD= 16384
##$TD0= 1
##$TE= 0
##$TE2= 300
##$TE3= 300
##$TEG= 300
##$TL= (0..7)
0 120 120 120 120 120 120 120 
##$TP= (0..7)
150 150 150 150 150 150 150 150 
##$TP07= 0
##$TPNAME0= <>
##$TPNAME1= <>
##$TPNAME2= <>
##$TPNAME3= <>
##$TPNAME4= <>
##$TPNAME5= <>
##$TPNAME6= <>
##$TPNAME7= <>
##$TPOAL= (0..7)
0.5 0.5 0.5 0.5 0.5 0.5 0.5 0.5 
##$TPOFFS= (0..7)
0 0 0 0 0 0 0 0 
##$TUNHIN= 0
##$TUNHOUT= 0
##$TUNXOUT= 0
##$USERA1= <user>
##$USERA2= <user>
##$USERA3= <user>
##$USERA4= <user>
##$USERA5= <user>
##$V9= 5
##$VALIST= <valist>
##$VCLIST= <CCCCCCCCCCCCCCC>
##$VD= 0
##$VDLIST= <DDDDDDDDDDDDDDD>
##$VPLIST= <PPPPPPPPPPPPPPP>
##$VTLIST= <TTTTTTTTTTTTTTT>
##$WBST= 1024
##$WBSW= 4
##$XGAIN= (0..3)
0 0 0 0 
##$XL= 0
##$YL= 0
##$YMAX_a= 323538
##$YMIN_a= -487338
##$ZGOPTNS= <>
##$ZL1= 120
##$ZL2= 120
##$ZL3= 120
##$ZL4= 120
##$ABSF1= 15.73366
##$ABSF2= -2.31819
##$ABSG= 5
##$ABSL= 3
##$ALPHA= 0
##$AQORDER= 0
##$ASSFAC= 0
##$ASSFACI= 0
##$ASSFACX= 0
##$ASSWID= 0
##$AUNMP= <proc_1d>
##$AZFE= 0.1
##$AZFW= 0.1
##$BCFW= 0
##$BC_mod= 2
##$BYTORDP= 0
##$COROFFS= 0
##$CY= -3
##$DATMOD= 1
##$DC= 0
##$DFILT= <>
##$DTYPP= 0
##$F1P= 0
##$F2P= 0
##$FCOR= 1
##$FTSIZE= 16384
##$FT_mod= 6
##$GAMMA= 0
##$GB= 0
##$INTBC= 1
##$INTSCL= 3.70164e-10
##$ISEN= 128
##$LB= 0.24
##$LEV0= 0
##$LPBIN= 0
##$MAXI= 10000
##$MC2= 0
##$MEAN= 0
##$ME_mod= 0
##$MI= 1.114404
##$NCOEF= 0
##$NC_proc= -5
##$NLEV= 6
##$NOISF1= 3.799351
##$NOISF2= 2.8
##$NSP= 0
##$NTH_PI= 0
##$NZP= 0
##$OFFSET= 15.73257
##$PC= 1
##$PHC0= -18032.74
##$PHC1= 8.6007
##$PH_mod= 1
##$PKNL= yes
##$PPARMOD= 0
##$PSCAL= 0
##$PSIGN= 0
##$REVERSE= no
##$SF= 200.130007798558
##$SI= 16384
##$SIGF1= 3
##$SIGF2= 2
##$SINO= 5.538805
##$SIOLD= 16384
##$SREGLST= <1H.CDCl3>
##$SSB= 0
##$STSI= 16384
##$STSR= 0
##$SW_p= 3612.71676300578
##$SYMM= 0
##$S_DEV= 0
##$TDeff= 16384
##$TDoff= 0
##$TI= <>
##$TILT= no
##$TM1= 0
##$TM2= 0
##$TOPLEV= 0
##$USERP1= <user>
##$USERP2= <user>
##$USERP3= <user>
##$USERP4= <user>
##$USERP5= <user>
##$WDW= 1
##$XDIM= 16384
##$YMAX_p= 416286198
##$YMIN_p= -164151
$$ End of Bruker specific parameters
$$ ---------------------------------
##NTUPLES= NMR SPECTRUM
##VAR_NAME=  FREQUENCY,     SPECTRUM/REAL,   SPECTRUM/IMAG
##SYMBOL=    X,             R,               I
##VAR_TYPE=  INDEPENDENT,   DEPENDENT,       DEPENDENT
##VAR_FORM=  AFFN,          ASDF,            ASDF
##VAR_DIM=   16384,         16384,           16384
##UNITS=     HZ,            ARBITRARY UNITS, ARBITRARY UNITS
##FACTOR=    0.220516191357247, 1,           1
##FIRST=     3148.55929565545, 0,            0
##LAST=      -464.157467350327, 0,           0
##MIN=       -464.157467350327, -164151,     0
##MAX=       3148.55929565545, 416286198,    0
$$ Real data points
##PAGE= N=1
##DATA TABLE= (X++(R..R)), XYDATA
$$ [...]
$$ plain form
7261 277586 239051 236704 243647 211692 221435 261043 275988 221952 210605 261500 244835 171873
7249 171873 76172 111851 155807 195795 199393 186596 248331 239974 269413 282982 259556 208384
7237 208384 223988 262010 260069 267060 236967 241540 236763 233778 260259 275828 347378 376592 402467
7224 402467 406223 414876 492529 457525 439054 467773 526611 499913 501965 564172 594319 600590
7212 600590 564254 546136 648436 640203 636033 615358 603674 610544 584923 594254 585890 595264 569457
7199 569457 600049 653217 597790 626476 663347 700676 699364 709401 758783 760559 765590 755540
7187 755540 814660 856660 834283 775312 866017 893136 908206 886077 881858 934243 929079 895726
7175 895726 995511 1123108 1227414 1147675 1149894 1215317 1251086 1261944 1304455 1287375 1340090
$$ packed form
7261B77586l8535k347O943l1955R743L9608J4945n4036j1347N0895j6665p2962
7249A71873r5701L5679M3956L9988L598j2797O1735q357K9439J3569k3426n1172
7237B08384J5604L8022j941O991l0093M573m777k985K6481J5569P1550K9214K5875
7224D02467L756Q653P7653l5004j8471K8719N8838k6698K052O2207L0147O271
7212F00590l6336j8118J02300q233m170k0675j1684O870k5621R331q364R374k5807
7199E69457L0592N3168n5427K8686L6871L7329j312J0037M9382J776N031j0050
7187G55540N9120M2000k2377n8971R0705K7119J5070k2129m219N2385n164l3353
7175H95726R9785J27597J04306p9739K219O5423L5769J0858M2511j7080N2715
$$ plain form
7164 1340090 1460654 1544773 1551103 1561576 1692004 1776944 1795091 1768099 1814431 1913084 1972198
7153 1972198 1984230 1946028 2012164 2016942 2041864 2132884 2239296 2337339 2422108 2565692 2638846
7142 2638846 2721360 2780362 2894505 2985741 3116981 3259195 3376464 3430553 3557710 3729450
7132 3729450 3906801 4060660 4223677 4389307 4630353 4858538 5094519 5344381 5660084 6024894
7122 6024894 6443574 6968067 7534517 8191034 8954557 9911368 11013624 12292589 13804976
7113 13804976 15717963 18183059 21148008 24483363 27411624 29181183 29130800 27313044
7105 27313044 24266446 20836869 17740591 15279298 13466592 12205191 11369749 10769317
7097 10769317 10375480 10139714 10002164 9906839 9846013 9776701 9839496 9825469 9876992 9956196 10062490
$$ packed form
7164A340090J20564Q4119O330J0473J30428Q4940J8147k6992M6332R8653N9114
7153A972198J2032l8202O6136M778K4922R1020J06412R8043Q4769J43584P3154
7142B638846Q2514N9002J14143R1236J31240J42214J17269N4089J27157J71740
7132C729450J77351J53859J63017J65630K41046K28185K35981K49862L15703L64810
7122F024894M18680N24493N66450O56517P63523R56811J102256J278965J512387
7113A3804976J912987K465096K964949L335355K928261J769559n0383j817756
7105B7313044l046598l429577l096278k461293j812706j261401q35442o00432
7097A0769317l93837k35766j37550r5325o0826o9312O2795j4027N1523P9204J06294
$$ plain form
7086 10062490 10250072 10412486 10602298 10958813 11327924 11663724 12030940 12544788 13193994
7077 13193994 13928656 14807653 15929923 17265024 18894277 20778747 22976612 25621560
7069 25621560 28756562 32441948 36868784 42229844 48921501 57468152 68285621 80825941
7061 80825941 92946530 101305798 102747410 96646499 84809761 70750601 57536900 46739410
7053 46739410 38585024 32585228 28165982 24973150 22481280 20453986 18832707 17498197
7045 17498197 16219956 15127366 14072679 13124663 12295791 11508663 10835207 10213853 9609357
7036 9609357 8978293 8473543 8093618 7672696 7235126 6897662 6556900 6225063 5933248 5633651
7026 5633651 5383592 5171829 4937943 4741180 4591075 4471759 4318975 4148013 4006070 3848006
$$ packed form
7086A0062490J87582J62414J89812L56515L69111L35800L67216N13848O49206
7077A3193994P34662Q78997J122270J335101J629253J884470K197865K644948
7069B5621560L135002L685386M426836N361060O691657Q546651J0817469J2540320
7061H0825941J2120589Q359268J441612o100911j1836738j4059160j3213701j0797490
7053D6739410q154386n999796m419246l192832k491870k027294j621279j334510
7045A7498197j278241j092590j054687r48016q28872p87128o73456o21354o04496
7036I609357o31064n04750l79925m20922m37570l37464l40762l31837k91815k99597
7026E633651k50059k11763k33886j96763j50105j19316j52784j70962j41943j58064
$$ plain form
7016 3848006 3679838 3518804 3470476 3334466 3207900 3144918 3053755 2945621 2825830 2792343
7006 2792343 2695724 2578553 2536322 2475932 2395382 2337470 2309050 2306780 2212696 2177383 2166377
6995 2166377 2110575 2017555 1966726 1908554 1897289 1866429 1816581 1751578 1705234 1616473 1573011
6984 1573011 1534226 1448799 1405268 1410318 1338216 1306845 1232196 1190989 1173564 1150157 1151188 1123318
6972 1123318 1133398 1086936 1046335 943417 914930 880046 809753 784261 774021 791709 806472
6961 806472 748823 719838 699594 668427 664617 644021 687501 727693 771023 745979 646496 600549
6949 600549 619139 586654 585058 602048 607525 651621 588329 613544 586897 573182 540031 521124
6937 521124 527556 558760 624291 609586 515889 467263 491991 475251 502357 469122 392448 436604
$$ packed form
7016C848006j68168j61034m8328j36010j26566o2982r1163j08134j19791l3487
7006B792343r6619j17171m2231o0390q0550n7912k8420k270r4084l5313j1006
6995B166377n5802r3020n0829n8172j1265l0860m9848o5003m6344q8761m3462
6984A573011l8785q5427m3531N050p2102l1371p4649m1207j7425k3407J031k7870
6972A123318J0080m6462m0601j02918k8487l4884p0293k5492j0240J7688J4763
6961H06472n7649k8985k0244l1167l810k0596M3480M0192M3330k5044r9483m5947
6949F00549J8590l2485j596J6990N477M4096o3292K5215k6647j3715l3151j8907
6937E21124O432L1204O5531j4705r3697m8626K4728j6740K7106l3235p6674M4156
$$ plain form
6925 436604 482393 444105 454572 447837 443801 413803 359011 332816 362504 418182 409909 378249
6913 378249 373154 334515 356440 301805 240593 264871 280523 314929 315340 234503 188003 229253
6901 229253 234387 208911 206314 249436 248436 242533 259139 333194 339913 333391 350995 350150 353133
6888 353133 338260 369881 365684 360981 351762 275678 220766 271488 302390 344302 302115 282349
6876 282349 304099 234383 229751 239493 235786 268761 307157 338235 365971 307491 283112 226109
6864 226109 237447 218746 192466 245788 282316 192016 241994 290629 224781 186204 180800 228147
6852 228147 211909 221395 204876 186460 272315 356868 335638 360423 435733 518323 599796 673399
6840 673399 713444 918630 1037928 1051770 991628 885806 783577 691152 586924 475545
$$ packed form
6925D36604M5789l8288J0467o735m036k9998n4792k6195K9688N5678q273l1660
6913C78249n095l8639K1925n4635o1212K4278J5652L4406M11q0837m6500M1250
6901B29253N134k5476k597M3122j000n903J6606P4055O719o522J7604q45K983
6888C53133j4873L1621m197m703r219p6084n4912N0722L0902M1912m2187j9766
6876B82349K1750o9716m632R742l707L2975L8396L1078K7736n8480k4379n7003
6864B26109J1338j8701k6280N3322L6528r0300M9978M8635o5848l8577n404M7347
6852B28147j6238R486j6519j8416Q5855Q4553k1230K4785P5310Q2590Q1473P3603
6840F73399M0045K05186J19298J3842o0142j05822j02229r2425j04228j11379
$$ plain form
6830 475545 411901 380471 340090 190013 239377 224229 200355 272664 232969 195342 180712
6819 180712 134449 117993 138291 110746 100688 121650 162774 144218 149073 208914 115588 83349
6807 83349 63102 51747 47873 97652 132460 42812 74058 130550 153188 142407 131904 118645
6795 118645 125755 112754 102595 103113 94082 104583 141415 173347 120548 51273 57984 41568 24603
6782 24603 46083 67264 -5055 78728 59109 69878 125990 123076 62256 25017 74346 75056
6770 75056 101779 149181 134253 124118 176514 140491 73702 18182 103895 108711 105378 71763
6758 71763 63265 53966 64163 88388 149232 126964 110404 31354 28135 90525 -38341 -82139
6746 -82139 -31796 51138 -66985 -5387 43336 60929 34943 -16473 813 14306 36526 -8315
$$ packed form
6830D75545o3644l1430m0381j50077M9364j5148k3874P2309l9695l7627j4630
6819A80712m6263j6456K0298k7545j0058K0962M1124j8556M855N9841r3326l2239
6807H3349k0247j1355l874M9779L4808q9648L1246N6492K2638j0781j0503j3259
6795A18645P110j3001j0159N18r031J0501L6832L1932n2799o9275O711j6416j6965
6782B4603K1480K1181p2319Q3783j9619J0769N6112k914o0820l7239M9329P10
6770G5056K6723M7402j4928j0135N2396l6023o6789n5520Q5713M816l333l3615
6758G1763q498r299J0197K4225O0844k2268j6560p9050l219O2390j28866m3798
6746h2139N0343Q2934j18123O1598M8723J7593k5986n1416J7286J3493K2220m4841
$$ plain form
6734 -8315 32820 4102 6761 46631 68044 27312 58459 40106 34147 22366 114074 152609
6722 152609 142075 119104 92087 98699 100071 78968 106333 87232 69465 100996 138382 140626
6710 140626 76302 131610 205193 191578 125772 99304 127245 129344 142770 176768 78059 65619
6698 65619 49993 69945 101963 120334 116687 132220 80502 39746 -4100 58258 63854 27654
6686 27654 7688 -23079 17533 25793 17641 58595 56195 93047 90211 42251 18663 32441 52090
6673 52090 31863 98847 100120 109516 145949 174691 140889 104815 185562 274930 291083 312911
6661 312911 356851 408978 516694 532103 487834 434012 430186 392731 251939 191473 173427
6650 173427 157186 137202 116791 149887 169828 88109 47390 117983 158641 145048 81617 84361
$$ packed form
6734h315M1135k8718K659L9870K1413m0732L1147j8353n959j1781R1708L8535
6722A52609j0534k2971k7017O612J372k1103K7365j9101j7767L1531L7386K244
6710A40626o4324N5308P3583j3615o5806k6468K7941K099J3426L3998r8709j2440
6698F5619j5626J9952L2018J8371l647J5533n1718m0756m3846O2358N596l6200
6686B7654j9966l0767M0612Q260q152M0954k400L6852k836m7960k3588J3778J9649
6673E2090k0227O6984J273R396L6433K8742l3802l6074Q0747Q9368J6153K1828
6661C12911M3940N2127J07716J5409m4269n3822l826l7455j40792o0466j8046
6650A73427j6241j9984k0411L3096J9941q1719m0719P0593M0658j3593o3431K744
$$ plain form
6638 84361 60186 3583 30475 11982 6491 -14892 -18072 -10605 -3103 -38753 -31978 -22917 -3115
6625 -3115 -31718 -5606 5726 28647 10108 30395 831 34373 23885 11905 527 50187
6613 50187 87854 72072 87539 26084 29382 18409 5311 5134 52976 36056 40818 -10999 -9842
6600 -9842 -17643 -20794 13085 31772 11256 76727 84467 38176 7374 19273 -4456 30540 9609
6587 9609 1540 -1965 563 9223 11032 -48354 -21957 -69550 -63782 28591 46672 16337 -2847
6574 -2847 -515 -86257 -83026 -38254 -21057 -73046 -104883 -20994 -29796 -15321 34395 5056 -26908
6561 -26908 -63411 -61958 -50496 -31728 -77994 -44623 -54127 -39310 -18082 -22137 -62900 595
6549 595 87366 53977 20164 24425 -23205 29857 -5166 44144 6753 -11639 68874 75187 55971
$$ packed form
6638H4361k4175n6603K6892j8493n491k1383l180P467P502l5650O775R061J9802
6625c115k8603K6112J1332K2921j8539K0287k9564L3542j0488j1980j1378M9660
6613E0187L7667j5782J5467o1455L298j0973j3098j77M7842j6920M762n1817J157
6600i842p801l151L3879J8687k0516O5471P740m6291l0802J1899k3729L4996k0931
6587I609q069l505K528Q660J809n9386K6397m7593N768R2373J8081l0335j9184
6574b847K332q5742L231M4772J7197n1989l1837Q3889q802J4475M9716k9339l1964
6561b6908l6503J453J1462J8768m6266L3371r504J4817K1228m055m0763O3495
6549E95Q6771l3389l3813M261m7630N3062l5023M9310l7391j8392Q0513O313j9216
$$ plain form
6536 55971 -19830 -34570 -12663 -46763 -20164 -10339 10906 47871 36230 27049 -45773 -28255
6524 -28255 -3070 -18512 8687 -28960 18602 -952 24099 40161 17969 43217 32658 -29959
6512 -29959 -36238 83024 22231 -41090 20226 1807 -68617 -20967 25965 20157 -11132 2585
6500 2585 28371 86328 24428 -8500 26314 -56202 -91460 -41349 20856 66679 24155 12472
6488 12472 22179 42838 -1115 -50324 -74406 -20201 71636 42618 37851 4691 5755 -9880
6476 -9880 -20661 -13945 -38551 -17719 -40294 -42266 24444 4246 -3440 54977 64753 67696 33890
6463 33890 -15150 -35443 -3525 -44850 -96791 -36477 21987 25092 44081 33217 -14027 -13463
6451 -13463 -1004 -17494 -11666 -24439 -16923 24117 36091 -33644 -11171 -31481 1362 -26520
$$ packed form
6536E5971p5801j4740K1907l4100K6599R825K1245L6965j1641r181p2822J7518
6524b8255K5185j5442K7199l7647M7562j9554K5051J6062k2192K5248j0559o2617
6512b9959o279J19262o0793o3321O1316j8419p0424M7650M6932n808l1289J3717
6500B585K5786N7957o1900l2928L4814q2516l5258N0111O2205M5823m2524j1683
6488A2472R707K0659m3953m9209k4082N4205R1837k9018m767l3160J064j5635
6476i880j0781O716k4606K0832k2575j972O6710k0198p686N8417R776K943l3806
6463C3890m9040k0293L1918m1325n1941O0314N8464L105J8989j0864m7244N64
6451a3463J2459j6490N828j2773P516M1040J1974o9735K2473k0310L2843k7882
$$ plain form
6439 -26520 6490 13268 -7447 9025 102678 81679 15555 32441 53888 -14786 -37070 212
6427 212 -35337 2505 10121 52106 34635 69662 33587 27392 19051 87202 81196 18557 -3243
6414 -3243 10746 530 27098 55483 49062 42915 -11151 -16562 18050 30575 -62636 -11837 40429
6401 40429 16792 -36300 -17292 -7661 11424 3697 -20126 -46880 -18119 69196 61682 66070 57393
6388 57393 31370 70463 40286 -16718 -12347 9566 35903 39581 35888 39299 42108 -7781 29775
6375 29775 63857 77153 46160 37244 53461 61952 52967 101397 102954 80476 73757 55492 1398
6362 1398 61546 60037 76399 84952 108181 153469 119936 70836 74923 15575 23052 53473 39028
6349 39028 74926 67476 61605 53568 19669 43768 48649 95066 71767 3762 50013 46437 81679
$$ packed form
6439b6520L3010O778k0715J6472R3653k0999o6124J6886K1447o8674k2284L7282
6427B12l5549L7842P616M1985j7471L5027l6075o195q341O8151o006o2639k1800
6414c243J3989j0216K6568K8385o421o147n4066n411L4612J2525r3211N0799N2266
6401D0429k3637n3092J9008R631J9085p727k3823k6754K8761Q7315p514M388q677
6388E7393k6023L9093l0177n7004M371K1913K6337L678l693L411K809m9889L7556
6375B9775L4082J3296l0993q916J6217Q491q985M8430J557k2478o719j8265n4094
6362A398O0148j509J6362Q553K3229M5288l3533m9100M087n9348P477L0421j4445
6349C9028L5898p450n871q037l3899K4099M881M6417k3299o8005M6251l576L5242
$$ plain form
6336 81679 67756 83446 -3785 -40840 23564 -49983 -44417 -44948 -12603 -34921 26962 52569
6324 52569 40099 115923 68156 90763 74883 74302 89342 84357 19638 -3033 23063 28379 22450
6311 22450 89463 70498 31315 51942 64412 46959 9959 -12326 6713 78703 78867 24981
6299 24981 22434 58251 68937 92614 78695 58924 70712 114923 113067 123215 138908 79890
6287 79890 96061 129195 109905 62739 94888 92365 82200 43073 56164 84802 66822 69333
6275 69333 133763 102605 96180 155409 190344 127706 90287 69690 116300 119320 59274 105401
6263 105401 64988 75945 121897 138551 95670 70268 147693 130964 119225 124143 87461 118593
6251 118593 142142 94784 91596 104817 101933 147886 204298 216106 136222 183201 197348 212433
$$ packed form
6336H1679j3923J5690q7231l7055O4404p3547N566n31L2345k2318O1883K5607
6324E2569j2470P5824m7767K2607j5880n81J5040m985o4719k2671K6096N316n929
6311B2450O7013j8965l9183K0627J2470j7453l7000k2285J9039P1990J64n3886
6299B4981k547L5817J0686K3677j3919j9771J1788M4211j856J0148J5693n9018
6287G9890J6171L3134j9290m7166L2149k523j0165l9127J3091K8638j7980K511
6275F9333O4430l1158o425N9229L4935o2638l7419k0597M6610L020o0046M6127
6263A05401m0413J0957M5952J6654m2881k5402P7425j6729j1739M918l6682L1132
6251A18593K3549m7358l188J3221k884M5953N6412J1808p9884M6979J4147J5085
$$ plain form
6239 212433 194519 181065 162775 168885 182524 191114 169893 136447 173486 218663 224217 172741
6227 172741 225072 245573 271575 298850 255399 246596 288135 309098 297523 341896 389640 417341
6215 417341 364106 291048 260348 250306 268164 312588 334181 383865 307814 321102 265666 276628
6203 276628 357042 391439 377807 350317 326944 358228 408085 386551 468357 459277 451127 528847
6191 528847 561396 572701 618915 601083 703127 767976 704957 698665 698630 658835 592125 541838
6179 541838 531956 510661 511658 504119 544502 499093 517471 486447 542974 547028 553852 564605 573734
6166 573734 540920 513010 484952 553210 581310 562409 643744 731414 788954 777109 853977 929262
6154 929262 909809 930047 923923 900074 844494 741468 729816 760318 728028 702205 718627 774715
$$ packed form
6239B12433j7914j3454j8290O110J3639Q590k1221l3446L7039M5177N554n1476
6227A72741N2331K0501K6002K7275m3451q803M1539K0963j1575M4373M7744K7701
6215D17341n3235p3058l0700j0042J7858M4424K1593M9684p6051J3288n5436J0962
6203B76628Q0414L4397j3632k7490k3373L1284M9857k1534Q1806r080q150P7720
6191E28847L2549J1305M6214j7832J02044O4849o3019o292l5l9795o6710n0287
6179E41838r882k1295R97p539M0383m5409J8378l1024N6527M054O824J0753R129
6166E73734l2814k7910k8058O8258K8100j8901Q1335Q7670N7540j1845P6868P5285
6154I29262j9453K0238o124k3849n5580j03026j1652L0502l2290k5823J6422N6088
$$ plain form
6142 774715 774797 729183 753743 768505 785037 784627 819857 808700 814268 822516 895644 938565 973698
6129 973698 939930 935905 935865 1008044 1074686 1133962 1172868 1202778 1256749 1232818 1209367 1239358
6117 1239358 1207497 1283309 1342517 1431574 1494380 1495506 1571604 1602206 1662399 1719843 1816998 1910932
6105 1910932 2026480 2168694 2313335 2524814 2746805 2968143 3284426 3657946 4059131 4556422
6095 4556422 5218629 6045876 6881567 7559226 7832246 7580134 6994310 6492673 6078058 5881297
6085 5881297 5857545 5981925 6349112 6915954 7663100 8117503 8057053 7499101 6612035 5729753
6075 5729753 5023215 4419737 3946293 3687842 3463366 3280207 3121854 3036598 2920915 2859734
6065 2859734 2836084 2823010 2771642 2793805 2763131 2795037 2813680 2832953 2862948 2947982 3075848
$$ packed form
6142G74715Q2m5614K4560J4762J6532m10L5230j1157N568Q248P3128M2921L5133
6129I73698l3768m025m0P2179O6642N9276L8906K9910N3971k3931k3451K9991
6117A239358l1861P5812N9208Q9057O2806J126P6098L0602O0193N7444R7155R3934
6105A910932J15548J42214J44641K11479K21991K21338L16283L73520M01185M97291
6095D556422O62207Q27247Q35691O77659K73020k52112n85824n01637m14615j96761
6085E881297k3752J24380L67187N66842P47146M54403o0450n57952q87066q82282
6075E729753p06538o03478m73444k58451k24476j83159j58353q5256j15683o1181
6065B859734k3650j3074n1368K2163l0674L1906J8643J9273K9995Q5034J27866
$$ plain form
6054 3075848 3210245 3382873 3503988 3749364 4031080 4308856 4712576 5235339 5795548 6453347
6044 6453347 7214946 8237740 9323815 10244166 10699792 10550326 9888213 9089873 8376861
6035 8376861 7894512 7715652 7762028 8064299 8688550 9461008 10216438 10443515 9924269 8876861
6025 8876861 7691701 6603465 5754717 5080759 4572152 4202898 3998417 3825548 3695576
6016 3695576 3552015 3484893 3461202 3533133 3490711 3347305 3173522 3036466 2824941 2645584
6006 2645584 2555832 2447580 2356743 2355901 2351816 2281315 2256569 2178840 2097136 2065793 2014821 2042314
5994 2042314 2097858 2151309 2112862 2098069 2142962 2135039 2198791 2190958 2205596 2322078 2446817
5983 2446817 2509739 2510645 2561512 2610569 2571992 2564416 2582483 2543666 2565452 2580976 2561400 2557270
$$ packed form
6054C075848J34397J72628J21115K45376K81716K77776M03720N22763N60209O57799
6044F453347P61599J022794J086075R20351M55626j49466o62113p98340p13012
6035H376861m82349j78860M6376L02271O24251P72458P55430K27077n19246j047408
6025H876861j185160j088236q48748o73958n08607l69254k04481j72869j29972
6016C695576j43561o7122k3691P1931m2422j43406j73783j37056k11525j79357
6006B645584q9752j08252r0837q42m085p0501k4746p7729q1704l1343n0972K7493
5994B042314N5544N3451l8447j4793M4893p923O3752p833J4638J16482J24739
5983B446817O2922R06N0867M9057l8577p576J8067l8817K1786J5524j9576m130
$$ plain form
5971 2557270 2587473 2671882 2688184 2663824 2644548 2716094 2781547 2906147 3020728 3120295 3283833
5960 3283833 3453452 3643683 3823906 3875659 3780744 3691034 3653469 3616539 3627689 3585833 3624269
5949 3624269 3676405 3769751 3801616 3919436 4080826 4236666 4435988 4614729 4729849 4781846
5939 4781846 4794144 4770806 4793987 4830281 4924844 5121847 5242304 5518435 5878953 6236227
5929 6236227 6664863 7169239 7649675 8163558 8365119 8264276 8047922 7837955 7690812 7518985
5919 7518985 7548795 7619125 7752006 7926469 8108695 8453662 8836194 9250237 9721087 10214498
5909 10214498 10753158 11240355 11795930 12424310 13179986 14211747 15448757 16922154 18476423
5900 18476423 19937611 21097851 21978069 22633409 23378516 24592179 26346445 28510856 31013570
$$ packed form
5971B557270L0203Q4409J6302k4360j9276P1546O5453J24600J14581R9567J63538
5960C283833J69619J90231J80223N1753r4915q9710l7565l6930J1150m1856L8436
5949C624269N2136R3346L1865J17820J61390J55840J99322J78741J15120N1997
5939D781846J2298k3338K3181L6294R4563J97003J20457K76131L60518L57274
5929F236227M28636N04376M80436N13883K01561j00843k16354k09967j47143j71827
5919G518985K9810P0330J32881J74463J82226L44967L82532M14043M70850M93411
5909A0214498N38660M87197N55575O28380P55676J031761J237010J473397J554269
5900A8476423J461188J160240Q80218O55340P45107J213663J754266K164411K502714
$$ plain form
5891 31013570 33647254 35710763 36109315 34433112 31419590 28131595 25227572 22920026
5883 22920026 21229076 19978250 19201911 18791813 18542454 18453045 18441244 18583503 18866217
5874 18866217 19349003 19908342 20742185 21861400 23129904 24729386 26634773 29104335 32005698
5865 32005698 35405404 39350726 44222381 50195838 57510659 66539145 76610716 84909789
5857 84909789 87522770 82489604 72657016 61894969 52170724 44575670 38938880 34841438
5849 34841438 31855609 29630740 28001167 26804537 25897453 25259151 24954577 24819244 24967727
5840 24967727 25266306 25948644 26954659 28136397 29717033 31791646 34316104 37414124
5832 37414124 41169596 45751944 51318236 58373953 67346605 77510754 85863886 88118870
$$ packed form
5891C1013570K633684K063509L98552j676203l013522l287995k904023k307546
5883B2920026j690950j250826p76339m10098k49359q9409j1801J42259K82714
5874A8866217M82786N59339Q33843J119215J268504J599482J905387K469562K901363
5865C2005698L399706L945322M871655N973457P314821R028486J0071571Q299073
5857H4909789K612981n033166r832588j0762047r724245p595054n636790m097442
5849C4841438k985829k224869j629573j196630r07084o38302l04574j35333J48483
5840B4967727K98579O82338J006015J181738J580636K074613K524458L098020
5832C7414124L755472M582348N566292P055717Q972652J0164149Q353132K254984
$$ plain form
5824 88118870 82559221 72150854 60803006 50648261 42690262 36640881 32204757 28794286
5816 28794286 26219250 24222162 22596538 21308765 20246245 19470767 18799973 18250505 17874086
5807 17874086 17637705 17554015 17572218 17755499 18150558 18728424 19544707 20606607 21967342
5798 21967342 23741576 26016350 28854219 31992101 34487397 34932278 32949176 29400066
5790 29400066 25369892 21675587 18738384 16482423 14690482 13393506 12361109 11516767
5782 11516767 10838358 10240587 9793676 9368780 9037703 8672907 8337706 8038697 7717568
5773 7717568 7427601 7171335 6966910 6784464 6631751 6408496 6220083 6044059 5791617 5652757
5763 5652757 5573923 5550295 5422763 5282059 5206370 5149374 5171701 5181967 5199917 5166779 5138341
$$ packed form
5824H8118870n559649j0408367j1347848j0154745p957999o049381m436124l410471
5816B8794286k575036j997088j625624j287773j062520p75478o70794n49468l76419
5807A7874086k36381q3690J8203J83281L95059N77866Q16283J061900J360735
5798B1967342J774234K274774K837869L137882K495296M44881j983102l549110
5790B9400066m030174l694305k937203k255961j791941j296976j032397q44342
5782A1516767o78409n97771m46911m24896l31077l64796l35201k99009l21129
5773G717568k89967k56266k04425j82446j52713k23255j88413j76024k52442j38860
5763E652757p8834k3628j27532j40704p5689n6996K2327J0266J7950l3138k8438
$$ plain form
5752 5138341 5164111 5268867 5265092 5380140 5506881 5634815 5830689 6152043 6530292 7007602
5742 7007602 7637965 8357410 9290305 10042587 10442541 10230416 9560673 8667967 7707294 6865707
5732 6865707 6180570 5681040 5366255 5182594 5009954 4892094 4837383 4821540 4801641 4828689
5722 4828689 4926534 5043151 5285551 5576976 5873745 6284360 6793508 7492375 8246633 9114743
5712 9114743 9937085 10362986 10361534 9706876 8807052 7771163 6802158 6085719 5544539 5062743
5702 5062743 4720661 4544786 4410374 4286709 4238205 4233669 4357719 4502032 4639261 4805088
5692 4805088 5119991 5572801 5999657 6521085 7165441 7606052 7666569 7312306 6618910 5954001
5682 5954001 5274489 4734831 4328022 3955925 3751240 3602099 3399488 3263003 3201489 3258723
$$ packed form
5752E138341K5770J04756l775J15048J26741J27934J95874L21354L78249M77310
5742G007602O30363P19445R32895P52282L99954k12125o69743q92706r60673q41587
5732F865707o85137m99530l14785j83661j72640j17860n4711j5843j9899K7048
5722D828689R7845J16617K42400K91425K96769M10615N09148O98867P54258Q68110
5712I114743Q22342M25901j452o54658q99824j035889r69005p16439n41180m81796
5702E062743l42082j75875j34412j23665m8504m536J24050J44313J37229J65827
5692D805088L14903M52810M26856N21428O44356M40611O0517l54263o93396o64909
5682E954001o79512n39658m06809l72097k04685j49141k02611j36485o1514N7234
$$ plain form
5672 3258723 3222713 3235486 3298824 3415516 3596145 3825996 4126229 4488305 4889176 5451460
5662 5451460 6091408 6718460 7196841 7353667 7031291 6360504 5523324 4721887 4038604 3549495
5652 3549495 3182230 2871943 2680879 2490636 2375759 2190043 2053015 1982990 1973561 1874687
5642 1874687 1803809 1690266 1612354 1561586 1522697 1451240 1394800 1383683 1393079 1360839 1358965 1366108
5630 1366108 1360350 1326693 1282806 1322580 1277162 1188002 1211749 1182466 1177096 1227391 1089607 1048954
5618 1048954 1040426 1025988 1031113 978694 912561 888199 890908 929724 921593 935124 921429 931477
5606 931477 960852 946499 862187 913163 919670 891897 878229 871068 897543 854753 764801 804639
5594 804639 876651 831880 785988 805052 801617 893627 898583 855848 873132 827168 817885 729692
$$ packed form
5672C258723l6010J2773O3338J16692J80629K29851L00233L62076M00871N62284
5662E451460O39948O27052M78381J56826l22376o70787q37180q01437o83283m89109
5652C549495l67265l10287j91064j90243j14877j85716j37028p0025r429r8874
5642A874687p0878j13543p7912n0768l8889p1457n6440j1117R396l2240j874P143
5630A366108n758l3657m3887L9774m5418q9160K3747k9283n370N0295j37784m0653
5618A048954q528j4438N125n2419o6133k4362K709L8816q131J3531j3695J0048
5606I31477K9375j4353q4312N0976O507k7773j3668p161K6475m2790q9952L9838
5594H04639P2012m4771m5892J9064l435R2010M956m2735J7284m5964r283q8193
$$ plain form
5582 729692 783693 792535 760636 763146 800893 743722 745800 750324 819399 881252 860937 840438
5570 840438 831991 892394 896490 899057 870205 901306 920409 937214 944534 983897 979000 1005345 1068627
5557 1068627 1129990 1143564 1208674 1295415 1301109 1258629 1292519 1356188 1368689 1472738 1550280
5546 1550280 1663682 1775845 1901064 2100062 2386145 2690487 2981390 3181615 3122001 2910936
5536 2910936 2660665 2364802 2099914 1947399 1865032 1821114 1796726 1817283 1845644 1866658 1895012
5525 1895012 2010968 2060376 2008917 2015477 1944815 1955333 1972314 2003034 2009120 1987507 2127222
5514 2127222 2185065 2194760 2154695 2114647 2073550 2088287 2093617 2091514 2115225 2163416 2170866 2108525
5502 2108525 2206808 2201668 2156735 2127306 2173958 2318228 2368149 2449815 2524717 2628674 2716174
$$ packed form
5582G29692N4001Q842l1899K510L7747n7171K078M524O9075O1853k0315k0499
5570H40438q447O0403M096K567k8852L1101J9103J6805P320L9363m897K6345O3282
5557A068627O1363J3574O5110Q6741N694m2480L3890O3669J2501J04049P7542
5546A550280J13402J12163J25219J98998K86083L04342K90903K00225n9614k11065
5536B910936k50271k95863k64888j52515q2367m3918k4388K0557K8361K1014K8354
5525A895012J15956M9408n1459O560p0662J0518J6981L0720O086k1613J39715
5514B127222N7843R695m0065m0048m1097J4737N330k103K3711M8191P450o2341
5502B108525R8283n140m4933k9429M6652J44270M9921Q1666P4902J03957Q7500
$$ plain form
5491 2716174 2777965 2792853 2736405 2714606 2735217 2730719 2732319 2776847 2790420 2805853 2690760 2677833
5479 2677833 2690623 2673934 2641771 2591342 2590417 2631836 2637321 2596047 2646909 2659305 2621955 2675511
5467 2675511 2700705 2742214 2792486 2850160 2904015 2903015 2899683 2895843 2850340 2861518 2862885 2887473
5455 2887473 2863117 2833098 2765306 2652289 2630795 2614590 2560281 2564701 2569038 2576241 2596471 2574899
5443 2574899 2596102 2652549 2723175 2747355 2691862 2687031 2689527 2708653 2698694 2615868 2620567 2644368
5431 2644368 2693295 2665221 2735029 2804370 2775398 2832384 2988982 3068206 3238212 3433479 3670867
5420 3670867 3892830 4037667 4175356 4041413 3779825 3557317 3395810 3231561 3062856 2929056
5410 2929056 2847314 2774283 2755581 2754685 2715985 2790057 2905355 2995223 3061263 3124961 3282246
$$ packed form
5491B716174O1791J4888n6448k1799K0611m498J600M4528J3573J5433j15093j2927
5479B677833J2790j6689l2163n0429r25M1419N485m1274N0862J2396l7350N3556
5467B675511K5194M1509N0272N7674N3855j000l332l840m5503J1178J367K4588
5455B887473k4356l0019o7792j13017k1494j6205n4309M420M337P203K0230k1572
5443B574899K1203N6447P0626K4180n5493m831K496J9126r959q2826M699K3801
5431B644368M8927k8074O9808O9341k8972N6986J56598P9224J70006J95267K37388
5420C670867K21963J44837J37689j33943k61588k22508j61507j64249j68705j33800
5410B929056q1742p3031j8702q96l8700P4072J15298Q9868O6040O3698J57285
$$ plain form
5399 3282246 3439643 3644164 3927533 4123963 4458550 4829893 5317761 5758657 6217720 6657768
5389 6657768 6936406 7100821 7034304 6841455 6470265 6068972 5706164 5347266 5050287 4793729
5379 4793729 4593401 4423474 4326201 4292782 4375528 4381238 4445699 4621534 4736618 4842113 4908651
5368 4908651 4821158 4721255 4614667 4508470 4438687 4356361 4235548 4050595 3875021 3620304
5358 3620304 3379736 3124916 2946610 2758095 2616296 2482983 2326511 2176595 2134737 2063256
5348 2063256 1973466 1940656 1939018 1840157 1786614 1825065 1845373 1822693 1792862 1744171 1712406 1648244
5336 1648244 1615738 1630970 1507632 1488376 1456464 1428181 1362785 1295422 1305562 1269318 1254125
5325 1254125 1229787 1220837 1216127 1174314 1190946 1167939 1179013 1160911 1231072 1215190 1226183 1330119
$$ packed form
5399C282246J57397K04521K83369J96430L34587L71343M87868M40896M59063M40048
5389F657768K78638J64415o6517j92849l71190m01293l62808l58898k96979k56558
5379D793729k00328j69927r7273l3419Q2746N710O4461J75835J15084J05495O6538
5368D908651q7493r9903j06588j06197o9783q2326j20813j84953j75574k54717
5358C620304k40568k54820j78306j88515j41799j33313j56472j49916m1858p1481
5348B063256q9790l2810j638r8861n3543L8451K0308k2680k9831m8691l1765o4162
5336A648244l2506J5232j23338j9256l1912k8283o5396o7363J0140l6244j5193
5325A254125k4338q950m710m1813J6632k3007J1074j8102P0161j5882J0993J03936
$$ plain form
5313 1330119 1287855 1305633 1423178 1528939 1575502 1633112 1636772 1543519 1415047 1322792 1211742
5302 1211742 1165124 1188342 1145557 1109580 1116649 1028591 981796 936264 914523 927767 893460 873421
5290 873421 893728 907089 922476 1002153 933654 877161 923113 974359 1028134 1066493 1100323 1119896
5278 1119896 1208202 1273639 1343487 1397221 1372791 1306011 1256396 1173631 1101768 981953 971812
5267 971812 906976 807689 760495 757609 815776 790206 788058 807075 759918 803659 794317 743666
5255 743666 846208 802611 811205 809391 802796 829498 844770 927313 931905 948680 1028780 962099
5243 962099 975033 983102 966862 945912 915824 921316 965024 968154 960714 1053966 1077968 1158068
5231 1158068 1228208 1281565 1367597 1426875 1468682 1338596 1235024 1153419 1090854 1062881 1012517
$$ packed form
5313A330119m2264J7778J17545J05761M6563N7610L660r3253j28472r2255j11050
5302A211742m6618K3218m2785l5977P069q8058m6795m5532k1741J3244l4307k0039
5290H73421K0307J3361J5387P9677o8499n6493M5952N1246N3775L8359L3830J9573
5278A119896Q8306O5437O9848N3734k4430o6780m9615q2765p1863j19815j0141
5267I71812o4836r9287m7194k886N8167k5570k148J9017m7157M3741r342n0651
5255G43666J02542m3597Q594j814o595K6702J5272Q2543M592J6775Q0100o6681
5243I62099J2934Q069j6240k0950l0088N492M3708L130p440R3252K4002Q0100
5231A158068P0140N3357Q6032N9278M1807j30086j03572q1605o2565k7973n0364
$$ plain form
5220 1012517 935206 899921 917084 977252 968979 930290 959747 964958 985115 1001543 991975 978195
5208 978195 1000022 992785 965853 1011593 1047415 1098506 1097698 1097224 1126756 1156665 1143252 1207986 1240208
5195 1240208 1201331 1254184 1273528 1363308 1383460 1422730 1366448 1393612 1468682 1491621 1482754 1582986
5183 1582986 1621679 1573437 1591404 1668126 1755281 1851804 1873969 1987226 2079975 2176614 2260717
5172 2260717 2342285 2425831 2521971 2642127 2748834 2917190 3012142 3171049 3428306 3687199
5162 3687199 3963838 4216589 4268176 4208825 4232721 4276544 4329833 4462105 4727291 5130225
5152 5130225 5533974 6010344 6586711 6949204 6980185 6896864 6749251 6686034 6771253 6985093
5142 6985093 7171714 7357807 7536578 7734606 7985435 8283235 8527314 8773748 9073520 9431490
$$ packed form
5220A012517p7311l5285J7163O0168q273l8689K9457N211K0157J6428r568j3780
5208I78195K1827p237k6932M5740L5822N1091q08m74K9532K9909j3413O4734L2222
5195A240208l8877N2853J9344Q9780K0152L9270n6282K7164P5070K2939q867J00232
5183A582986L8693m8242J7967P6722Q7155R6523K2165J13257R2749R6639Q4103
5172B260717Q1568Q3546R6140J20156J06707J68356R4952J58907K57257K58893
5162C687199K76639K52751N1587n9351K3896M3823N3289J32272K65186M02934
5152E130225M03749M76370N76367L62493L0981q3321j47613o3217Q5219K13840
5142F985093J86621J86093J78771J98028K50829K97800K44079K46434K99772L57970
$$ plain form
5132 9431490 9741769 10118635 10336149 10289404 10198424 10165587 10214660 10358449 10462322 10660369
5122 10660369 10811646 10771268 10687993 10531015 10378991 10293681 10189743 10078998 9997127 9911392
5112 9911392 9867357 9835377 9710799 9475406 9301037 9247598 9312443 9529862 9809846 9845354
5102 9845354 9520708 8945607 8208765 7469936 6882488 6451919 6178459 6039633 6027293 6133975
5092 6133975 6213751 6207035 6056258 5845524 5542091 5198965 4826788 4407186 3990266 3691960
5082 3691960 3470783 3228757 2940257 2708134 2575280 2448013 2365560 2230986 2087006 2031293
5072 2031293 1994865 1969377 1984077 1905589 1899131 1878999 1818204 1683367 1637448 1595174 1579661
5061 1579661 1532781 1487058 1409186 1342049 1280439 1214731 1189983 1161428 1121188 1047808 993673
$$ packed form
5132I431490L10279L76866K17514m6745r0980l2837M9073J43789J03873J98047
5122A0660369J51277m0378q3275j56978j52024q5310j03938j10745q1871q5735
5112I911392m4035l1980j24578k35393j74369n3439O4845K17419K79984L5508
5102I845354l24646n75101p36842p38829n87448m30569k73460j38826j2340J06682
5092F133975P9776o716j50777k10734l03433l43126l72177m19602m16920k98306
5082C691960k21177k42026k88500k32123j32854j27267q2453j34574j43980n5713
5072B031293l6428k5488J4700p8488o458k0132o0795j34837m5919m2274j5513
5061A579661m6880m5723p7872o7137o1610o5708k4748k8555m0240p3380n4135
$$ plain form
5050 993673 1027704 1032057 1079795 1077027 1001624 1067962 1121759 1091217 991599 1031730 1010508 1039108
5038 1039108 980091 918921 862033 840124 813704 803355 733125 681193 735466 707943 654013
5027 654013 597375 614821 612365 555825 569031 572711 541226 569523 558704 531271 519533 478614
5015 478614 394921 432083 519585 475481 439267 430538 403240 443982 383742 434464 453385 438521
5003 438521 389845 393706 388468 394402 402447 358491 365196 359447 361470 289626 312625 375406 345398
4990 345398 321526 349950 339943 300312 343217 381842 390940 371690 337137 395255 390033 412072
4978 412072 423949 368747 356545 316865 367552 408396 348369 342025 340660 334217 334459 347397 330822
4965 330822 294348 265454 277839 338002 340586 329259 374242 315667 242928 268728 297696 357052
$$ packed form
5050I93673L4031M353M7738k768p5403O6338N3797l0542r9618M0131k1222K8600
5038A039108n9017o1170n6888k1909k6420j0349p0230n1932N4273k7523n3930
5027F54013n6638J7446k456n6540J3206L680l1485K8297j0819k7433j1738m0919
5015D78614q3693L7162Q7502m4104l6214q729k7298M0742o0240N0722J8921j4864
5003D38521m8676L861n238N934Q045m3956O705n749K023p1844K2999O2781l0008
4990C45398k3872K8424j0007l9631M2905L8625R098j9250l4553N8118n222K2039
4978D12072J1877n5202j2202l9680N0687M0844o0027o344j365o443K42J2938j6575
4965C30822l6474k8894J2385O0163K584j1327M4983n8575p2739K5800K8968N9356
$$ plain form
4953 357052 313249 335046 348223 342222 387705 411878 381493 355438 311670 273237 309803 284302
4941 284302 280161 298680 300011 310386 272412 301333 280464 248586 291678 277691 318228 282114
4929 282114 265088 267711 229669 208994 225077 209590 232762 286956 297092 249680 239947 240843
4917 240843 207609 222452 328167 305933 251046 262879 204147 222739 237886 218245 296473
4906 296473 265521 248863 245442 269138 349039 292627 263563 296149 302508 279296 254579 261490
4894 261490 277349 256250 241874 243448 229724 239129 247910 269069 300383 273685 259175 270553
4882 270553 241929 251295 259725 315266 323484 250191 235737 196687 248380 288114 310811 297039
4870 297039 311894 296139 327327 369077 324517 349783 322876 320597 296456 291521 289110 314087
$$ packed form
4953C57052m3803K1797J3177o001M5483K4173l0385k6055m3768l8433L6566k5501
4941B84302m141J8519J331J0375l7974K8921k0869l1878M3092j3987M0537l6114
4929B82114j7026K623l8042k0675J6083j5487K3172N4194J0136m7412r733Q96
4917B40843l3234J4843J05715k2234n4887J1833n8732J8592J5147j9641P8228
4906B96473l0952j6658l421K3696P9901n6412k9064L2586O359k3212k4717O911
4894B61490J5859k1099j4376J574j3724R405Q781K1159L1314k6698j4510J1378
4882B70553k8624R366Q430N5541Q218p3293j4454l9050N1693L9734K2697j3772
4870B97039J4855j5755L1188M1750m4560K5266k6907k279k4141m935k411K4977
$$ plain form
4858 314087 303212 297470 277747 327067 334717 295946 332022 315507 306746 328344 304385 303442 307369
4845 307369 319008 375360 355054 396067 359353 378814 384407 413505 374699 321356 311757 351695
4833 351695 426070 432418 425549 466141 446592 400327 431591 417953 384971 432234 410646 426040
4821 426040 437202 378742 460405 440982 453797 483379 549095 533395 473432 485672 498265 518620
4809 518620 549854 555971 517619 524334 630584 645182 635963 633240 635958 642562 691800 758875 750737
4796 750737 741022 773730 782258 726829 819261 853262 873989 892972 891489 1003107 958749 968274
4784 968274 983644 1000288 1072402 1140115 1187207 1220911 1266157 1249604 1285501 1333240 1365886 1371339
4772 1371339 1433216 1473164 1500451 1533028 1619623 1719428 1775665 1842758 1899438 1992308 2142775
$$ packed form
4858C14087j0875n742j9723M9320P650l8771L6076j6515q761K1598k3959r43L927
4845C07369J1639N6352k0306M1013l6714J9461N593K9098l8806n3343r599L9938
4833C51695P4375O348o869M0592j9549m6265L1264j3638l2982M7263k1588J5394
4821D26040J1162n8460Q1663j9423J2815K9582O5716j5700n9963J2240J2593K0355
4809E18620L1234O117l8352O715J06250J4598r219k723K718O604M9238O7075q138
4796G50737r715L2708Q528n5429R2432L4001K0727J8983j483J11618m4358R525
4784I68274J5370J6644P2114O7713M7092L3704M5246j6553L5897M7739L2646N453
4772A371339O1877L9948K7287L2577Q6595R9805N6237O7093N6680R2870J50467
$$ plain form
4761 2142775 2275649 2368083 2410443 2565542 2780836 2990978 3119204 3405521 3752647 4076958
4751 4076958 4585723 5209023 5928781 6850958 7811097 8423745 8440287 7862318 7049587 6307907
4741 6307907 5696591 5280382 5090597 5044020 5074349 5220156 5500139 5949108 6446010 7046553
4731 7046553 7865244 8865633 10230710 11662648 12962818 13901540 14323995 14076470 13014637
4722 13014637 11548810 9981791 8596063 7428617 6612101 6065391 5692037 5495645 5425459
4713 5425459 5436046 5656667 5894266 6258387 6785771 7573126 8434864 9256088 9648956 9184510
4703 9184510 8244016 7073743 5976793 5014038 4265764 3751688 3385511 3098365 2887744
4694 2887744 2714411 2511199 2332307 2215120 2071875 2017611 1892521 1856878 1775903 1653156
$$ packed form
4761B142775J32874R2434M2360J55099K15294K10142J28226K86317L47126L24311
4751D076958N08765O23300P19758R22177R60139O12648J6542n77969q12731p41680
4741F307907o11316m16209j89785m6577L0329J45807K79983M48969M96902O00543
4731G046553Q18691J000389J365077J431938J300170R38722M22455k47525j061833
4722A3014637j465827j567019j385728j167446q16516n46710l73354j96392p0186
4713E425459J0587K20621K37599L64121N27384P87355Q61738Q21224L92868m64446
4703I184510r40494j170273j096950r62755p48274n14076l66177k87146k10621
4694B887744j73333k03212j78892j17187j43245n4264j25090l5643q0975j22747
$$ plain form
4684 1653156 1601517 1572925 1521704 1462487 1405361 1377774 1301395 1300786 1307877 1261355 1227954 1170144
4672 1170144 1112992 1101540 1088472 1158054 1183607 1131202 1058496 1047798 1072458 1048493 1036828
4661 1036828 1007293 1008126 1007138 1013428 1013488 997152 1029591 992963 945417 911829 914480 908153 883840
4648 883840 934497 943085 901562 910972 933197 941515 928531 972673 988104 991414 1008372 1003005 993667
4635 993667 1029299 1014481 1015488 1044283 1062161 1065905 1031696 1039351 1034941 1089798 1036529 1063472
4623 1063472 1093440 1072956 1106970 1137921 1148225 1132134 1175480 1216755 1237269 1194299 1235924
4612 1235924 1303022 1358035 1346672 1345289 1400693 1431417 1450646 1479551 1477278 1519033 1552088 1644698
4600 1644698 1758435 1748999 1788333 1841172 1919992 2002866 2019289 2039296 2072760 2151855 2265136
$$ packed form
4684A653156n1639k8592n1221n9217n7126k7587p6379o09P091m6522l3401n7810
4672A170144n7152j1452j3068O9582K5553n2405p2706j0698K4660k3965j1665
4661A036828k9535Q33r88O290O0j6336L2439l6628m7546l3588K651o327k4313
4648H83840N0657Q588m1523R410K2225Q318j2984M4142J5431L310J6958n367r338
4635I93667L5632j4818J007K8795J7878L744l4209P655m410N4857n3269K6943
4623A063472K9968k0484L4014L0951J0304j6091M3346M1275K0514m2970M1625
4612A235924O7098N5013j1363j383N5404L0724J9229K8905k273M1755L3055R2610
4600A644698J13737r436L9334N2839P8820Q2874J6423K0007L3464P9095J13281
$$ plain form
4589 2265136 2333708 2515247 2603540 2677080 2804754 2914769 3148226 3398404 3578919 3882434
4579 3882434 4307645 4723321 5199952 5737428 6479210 7516472 8613290 9744550 10546494
4570 10546494 10826366 10404091 9747383 9003514 8440057 8265559 8347388 8630064 9249012 10098943
4560 10098943 10997118 11634205 11584878 11046522 10312540 9584854 9052893 8869179 9075291 9459084
4550 9459084 9970532 10317283 10138763 9526591 8750905 8047754 7476865 7215851 7175546 7332749
4540 7332749 7717887 8171203 8645673 8815130 8516282 7801930 6943135 6021615 5283036 4658085
4530 4658085 4189843 3911182 3711510 3479906 3389217 3257801 3128726 3029180 2991465 2933191
4520 2933191 2839577 2779812 2719065 2767293 2796446 2838734 2853902 2938226 3044178 3193470 3309822
$$ packed form
4589B265136O8572J81539Q8293P3540J27674J10015K33457K50178J80515L03515
4579C882434M25211M15676M76631N37476P41782J037262J096818J131260Q01944
4570A0546494K79872m22275o56708p43869n63457j74498Q1829K82676O18948Q49931
4560A0098943Q98175O37087m9327n38356p33982p27686n31961j83714K06112L83793
4550I459084N11448L46751j78520o12172p75686p03151n70889k61014m0305J57203
4540G332749L85138M53316M74470J69457k98848p14352q58795r21520p38579o24951
4530D658085m68242k78661j99672k31604r0689j31416j29075r9546l7715n8274
4520B933191r3614n9765o0747M8228K9153M2288J5168Q4324J05952J49292J16352
$$ plain form
4509 3309822 3425564 3631665 3901920 4254072 4784132 5121289 5176227 4867826 4422572 3958942
4499 3958942 3567745 3300099 3054965 2849961 2735839 2627610 2581950 2515770 2479407 2465226
4489 2465226 2484652 2481998 2474333 2419551 2479121 2421868 2405217 2420840 2452815 2581078 2589591 2665047
4477 2665047 2721832 2723800 2899492 3047440 3222266 3357719 3551146 3767447 4036891 4364669
4467 4364669 4803783 5342873 5959883 6714854 7720121 8899296 10235590 11508841 12474755
4458 12474755 12622911 11889321 10648026 9165810 7811212 6660932 5750473 5067931 4594474
4449 4594474 4262912 4060288 3940475 3837397 3714731 3679671 3677733 3673129 3782266 3981863
4439 3981863 4193221 4390698 4522481 4509044 4264771 3965495 3660301 3445502 3235092 3039612
$$ packed form
4509C309822J15742K06101K70255L52152N30060L37157N4938l08401m45254m63630
4499C958942l91197k67646k45134k05004j14122j08229m5660o6180l6363j4181
4489B465226J9426k654p665n4782N9570n7253j6651J5623L1975J28263Q513P5456
4477B665047N6785J968J75692J47948J74826J35453J93427K16301K69444L27778
4467D364669M39114N39090O17010P54971J005267J179175J336294J273251R65914
4458A2474755J48156p33590j241295j482216j354598j150280r10459o82542m73457
4449D594474l31562k02624j19813j03078j22666l5060j938m604J09137J99597
4439C981863K11358J97477J31783j3437k44273k99276l05194k14799k10410j95480
$$ plain form
4429 3039612 2801028 2636964 2626336 2560167 2480923 2496769 2469881 2456646 2389410 2361366 2238252
4418 2238252 2112126 2064551 2043953 2013037 1968672 1867355 1838641 1818987 1826866 1879124 1793145
4407 1793145 1782817 1763575 1771969 1790572 1778690 1819571 1849074 1794854 1775762 1831696 1861276 1879746
4395 1879746 1852385 1815364 1820091 1820610 1805175 1878183 1884134 1921982 1968414 1997627 2048251 2092721
4383 2092721 2185412 2310123 2435414 2595223 2704701 2729584 2607956 2486311 2354417 2319896
4373 2319896 2320804 2267833 2274581 2347295 2411501 2557811 2829417 2963228 3034092 3009620 2827647
4362 2827647 2671355 2545121 2451966 2441726 2470726 2420375 2414628 2437407 2389281 2262172 2329418
4351 2329418 2457186 2407459 2368152 2333350 2324558 2339469 2367326 2324270 2308243 2344952 2425731
$$ packed form
4429C039612k38584j64064j0628o6169p9244J5846k6888j3235o7236k8044j23114
4418B238252j26126m7575k0598l0916m4365j01317k8714j9654P879N2258q5979
4407A793145j0328j9242Q394J8603j1882M0881K9503n4220j9092N5934K9580J8470
4395A879746k7361l7021M727N19j5435P3008N951L7848M6432K9213N0624M4470
4383B092721R2691J24711J25291J59809J09478K4883j21628j21645j31894l4521
4373B319896R08n2971O748P2714O4206J46310K71606J33811P0864k4472j81973
4362B827647j56292j26234r3155j0240K9000n0351n747K2779m8126j27109O7246
4351B329418J27768m9727l9307l4802q792J4911K7857m3056j6027L6709Q0779
$$ plain form
4340 2425731 2457222 2469401 2556494 2630527 2709413 2863373 2889991 2849734 2922060 3012490 3091172
4329 3091172 3113994 3165482 3248215 3288775 3336299 3423324 3516185 3617762 3774958 3950824 4103177
4318 4103177 4331896 4627074 4936641 5134281 5346658 5610878 5869284 6260878 6710625 7264686
4308 7264686 7840771 8421690 9182310 10131414 11158511 12373214 13823018 15337982 16707111
4299 16707111 17620458 17791771 17086788 15899412 14508931 13046284 11790595 10855553 10096965
4290 10096965 9583488 9306761 9128722 8993266 9005098 9139703 9265617 9515683 9831228 10195327
4280 10195327 10685689 11361199 12157916 13132701 14353727 15842614 17617865 19660828 21674916
4271 21674916 23429170 24583287 24964296 24399191 22913818 20791563 18487884 16313910
$$ packed form
4340B425731L1491J2179Q7093P4033P8886J53960K6618m0257P2326R0430P8682
4329C091172K2822N1488Q2733M0560M7524Q7025R2861J01577J57196J75866J52353
4318D103177K28719K95178L09567J97640K12377K64220K58406L91594M49747N54061
4308G264686N76085N80919P60620R49104J027097J214703J449804J514964J369129
4299A6707111R13347J71313p04983j187376j390481j462647j255689r35042p58588
4290A0096965n13477k76727j78039j35456J1832J34605J25914K50066L15545L64099
4280A0195327M90362O75510P96717R74785J221026J488887J775251K042963K014088
4271B1674916J754254J154117L81009n65105j485373k122255k303679k173974
$$ plain form
4263 16313910 14434431 12951896 11883188 10974501 10279769 9784513 9477771 9234668 9040974
4254 9040974 8851313 8778572 8743939 8766707 8731047 8727543 8773888 8799408 8827883 8814741 8850582
4243 8850582 8887655 8990973 9147655 9280497 9491698 9734882 10090352 10609376 11201449 11952989
4233 11952989 12683025 13640999 14725479 15939092 17180482 18356451 19419176 20014294 20046549
4224 20046549 19527405 18686064 17526617 16359279 15417260 14617224 13985548 13573513 13331548
4215 13331548 13129218 13089597 13105344 13081270 13162413 13299139 13478356 13672662 13891898 14206121
4205 14206121 14473223 14774741 15067687 15238859 15454937 15624525 15861396 16129436 16405949
4196 16405949 16768051 17223422 17577618 18016014 18392842 18849245 19418985 20041261 20738321
$$ packed form
4263A6313910j879479j482535j068708r08687o94732m95256l06742k43103j93694
4254I040974j89661p2741l4633K2768l5660l504M6345K5520K8475j3142L5841
4243H850582L7073J03318J56682J32842K11201K43184L55470N19024N92073P51540
4233A1952989P30036R57974J084480J213613J241390J175969J062725N95118L2255
4224B0046549n19144q41341j159447j167338r42019q00036o31676m12035k41965
4215A3331548k02330l9621J5747k4074Q1143J36726J79217J94306K19236L14223
4205A4206121K67102L01518K92946J71172K16078J69588K36871K68040K76513
4196A6405949L62102M55371L54196M38396L76828M56403N69740O22276O97060
$$ plain form
4187 20738321 21493279 22366616 23243757 24217792 25200656 26128722 27090790 28034166 29064903
4178 29064903 30176106 31280065 32508068 33782972 35276126 36934607 38673983 40455917
4170 40455917 42337974 44455839 47100695 50282441 54077781 58487083 63468696 69126400
4162 69126400 75810501 83798038 93632112 105569729 119908291 136497597 156154361 179802821
4154 179802821 209719180 248505392 299063469 356311128 403258504 416286198 388466723
4147 388466723 331689552 268923164 216604555 176766843 147940683 126413250 110548429
4140 110548429 98422204 89063040 81331377 74867301 69222299 64346513 59931976 56081340
4132 56081340 52423711 49135327 46045188 43108641 40407491 37919028 35805670 34023762
$$ packed form
4187B0738321P54958Q73337Q77141R74035R82864R28066R62068R43376J030737
4178B9064903J111203J103959J228003J274904J493154J658481J739376J781934
4170D0455917J882057K117865K644856L181746L795340M409302M981613N657704
4162F9126400O684101P987537R834074J1937617J4338562J6589306J9656764K3648460
4154A79802821K9916359L8786212N0558077N7247659M6947376J3027694k7819475
4147C88466723n6777171o2766388n2318609l9837712k8826160k1527433j5864821
4140A10548429j2126225r359164p731663o464076n645002m875786m414537l850636
4132E6081340l657629l288384l090139k936547k701150k488463k113358j781908
$$ plain form
4124 34023762 32422390 30886321 29372043 27958739 26560195 25326577 24199836 23151957
4116 23151957 22094078 21193011 20401028 19740219 19054417 18407655 17783330 17324028 16855162
4107 16855162 16341701 15781167 15231279 14782899 14421783 14052015 13709068 13406735 13071928
4098 13071928 12724014 12392238 12107419 11897127 11659070 11560199 11436979 11202228 10974276 10739511
4088 10739511 10513869 10344156 10150520 9890539 9640194 9468488 9400089 9231708 9039119 8858035
4078 8858035 8721807 8581026 8386587 8231487 8036640 7912010 7766873 7590951 7412353 7270509
4068 7270509 7109151 6983942 6854120 6829287 6791440 6762492 6773277 6653046 6528298 6373123
4058 6373123 6223819 6068910 5923760 5754352 5650948 5548334 5467211 5465415 5439181 5446675 5514532
$$ packed form
4124C4023762j601372j536069j514278j413304j398544j233618j126741j047879
4116B3151957j057879r01067p91983o60809o85802o46762o24325m59302m68866
4107A6855162n13461n60534n49888m48380l61116l69768l42947l02333l34807
4098A3071928l47914l31776k84819k10292k38057r8871j23220k34751k27952k34765
4088A0739511k25642j69713j93636k59981k50345j71706o8399j68381j92589j81084
4078H858035j36228j40781j94439j55100j94847j24630j45137j75922j78598j41844
4068G270509j61358j25209j29822k4833l7847k8948J0785j20231j24748j55175
4058F373123j49304j54909j45150j69408j03404j02614q1123j796k6234P494O7857
$$ plain form
4047 5514532 5532076 5484883 5432288 5538884 5540910 5619484 5619409 5624591 5551134 5500652 5418226 5385583
4035 5385583 5356692 5380923 5386725 5371289 5417874 5416345 5343157 5249197 5180307 5141334 5094324 5108723
4023 5108723 5062219 5066127 4971746 4921455 4834316 4763735 4743966 4610301 4549599 4541808 4542443 4461746
4011 4461746 4433579 4390204 4363413 4311523 4288612 4236231 4203744 4229651 4153847 4062655 3934332
4000 3934332 3892742 3765293 3640794 3572552 3488823 3465784 3397604 3367054 3320114 3308077 3329821
3989 3329821 3332609 3353698 3322083 3252124 3330709 3317656 3329397 3386673 3407128 3452204 3505518 3477507
3977 3477507 3446391 3408121 3354924 3323449 3297189 3100879 3048911 3051769 3030370 2936669 2861076
3966 2861076 2813980 2819679 2758622 2662806 2626071 2652035 2664333 2685876 2678817 2638728 2601026 2480216
$$ packed form
4047E514532J7544m7193n2595J06596K026P8574p5N182p3457n0482q2426l2643
4035E385583k8891K4231N802j5436M6585j529p3188r3960o8890l8973m7010J4399
4023E108723m6504L908r4381n0291q7139p0581j9769j33665o0702p791O35q0697
4011D461746k8167m3375k6791n1890k2911n2381l2487K5907p5804r1192j28323
4000C934332m1590j27449j24499o8242q3729k3039o8180l0550m6940j2037K1744
3989C329821K788K1089l1615o9959P8585j3053J1741N7276K0455M5076N3314k8011
3977C477507l1116l8270n3197l1475k6260j96310n1968K858k1399r3701p5593
3966B861076m7096N699o1057r5816l6735K5964J2298K1543p059m0089l7702j20810
$$ plain form
3954 2480216 2410062 2279337 2337258 2292609 2218402 2176567 2080828 2013957 2078929 2074579 2056861
3943 2056861 2035760 1958830 1910021 1808056 1896355 1948612 1912238 1840876 1842219 1844729 1832318 1782296
3931 1782296 1825876 1846688 1816092 1753043 1692672 1705381 1714498 1747913 1689289 1625870 1616120 1680600
3919 1680600 1599782 1593107 1570859 1545253 1565456 1583412 1521317 1503121 1496789 1503707 1463288 1459027
3907 1459027 1433291 1416648 1438845 1404140 1389185 1348798 1360828 1373575 1385468 1322279 1316236 1422524
3895 1422524 1389785 1427515 1445881 1382682 1341656 1309790 1326654 1325591 1297450 1307930 1352203 1316911
3883 1316911 1249043 1251390 1355948 1321548 1315700 1403790 1382135 1379039 1421181 1444668 1407183 1384707
3871 1384707 1459097 1493849 1579866 1643153 1683541 1762092 1892277 2005824 2184192 2440131 2715752
$$ packed form
3954B480216p0154j30725N7921m4649p4207m1835r5739o6871O4972m350j7718
3943B056861k1101p6930m8809j01965Q8299N2257l6374p1362J343K510j2411n0022
3931A782296M3580K0812l0596o3049o0371J2709R117L3415n8624o3419r750O4480
3919A680600q0818o675k2248k5606K0203J7956o2095j8196o332O918m0419m261
3907A459027k5736j6643K2197l4705j4955m0387J2030J2747J1893o3189o043J06288
3895A422524l2739L7730J8366o3199m1026l1866J6864j063k8141J0480M4273l5292
3883A316911o7868K347J04558l4400n848Q8090k1655l096M2142K3487l7485k2476
3871A384707P4390L4752Q6017O3287M0388P8551J30185J13547J78368K55939K75621
$$ plain form
3860 2715752 3045006 3137231 3102949 2895177 2584259 2221029 1934560 1763747 1665869 1572232
3850 1572232 1460758 1375712 1402547 1355768 1371670 1354412 1209041 1203756 1182556 1152041 1088075
3839 1088075 1080800 1054239 966346 968758 972034 927544 897143 947298 942645 876449 943981 939293
3827 939293 935819 857388 822289 837081 814506 823418 871161 808653 792636 773637 815387 782541
3815 782541 798739 818007 784858 777050 757392 774126 787618 690091 683152 702130 752063 738044
3803 738044 658295 690267 715687 754904 809288 752228 768842 778125 805700 801308 757015 797617
3791 797617 878972 870195 854370 925420 892577 866122 811667 805522 796663 741494 735840 739471 703370
3778 703370 664745 704970 737314 722877 694419 697061 739243 758208 803732 815966 771765 858980
$$ packed form
3860B715752L29254R2225l4282k07772l10918l63230k86469j70813r7878r3637
3850A572232j11474q5046K6835m6779J5902j7258j45371n285k1200l0515o3966
3839A088075p275k6561q7893K412L276m4490l0401N0155m653o6196O7532m688
3827I39293l474p8431l5099J4792k2575Q912M7743o2508j6017j8999M1750l2846
3815G82541J6198J9268l3149p808j9658J6734J3492r7527o939J8978M9933j4019
3803G38044p9749L1972K5420L9217N4384n7060J6614R283K7575m392m4293M0602
3791G97617Q1355q777j5825P1050l2843k6455n4455o145q859n5169n654L631l6101
3778G03370l8625M0225L2344j4437k8458K642M2182J8965M5524J2234m4201Q7215
$$ plain form
3766 858980 834971 728524 792802 790313 827587 831978 851075 832061 791190 898130 963082 925551
3754 925551 963408 969134 958804 877579 893891 886571 858649 868358 875377 886171 892146 883284 877727
3741 877727 868316 904606 927183 943010 939731 1006966 992598 955891 925207 969455 921066 906220
3729 906220 969640 967069 947285 921869 980784 1064840 1079062 1114594 1181956 1237146 1292604 1349384
3717 1349384 1388149 1355842 1326059 1279898 1209890 1158105 1084858 1111615 1110153 1121817 1120726 1092680
3705 1092680 1073006 1107077 1149831 1159835 1199038 1245866 1288974 1346576 1366895 1365725 1443674 1473393
3693 1473393 1578754 1639326 1625664 1690733 1701226 1720071 1851357 1959911 2008643 2028899 1954016
3682 1954016 1809734 1648719 1513507 1489207 1467191 1471416 1444376 1437224 1393908 1393194 1391147 1399276
$$ packed form
3766H58980k4009j06447O4278k489L7274M391J9097j9014m0871J06940O4952l7531
3754I25551L7857N726j0330q1225J6312p320k7922R709P019J0794N975q862n557
3741H77727r411L6290K2577J5827l279O7235j4368l6707l0684M4248m8389j4846
3729I06220O3420k571j9784k5416N8915Q4056J4222L5532O7362N5190N5458N6780
3717A349384L8765l2307k9783m6161p0008n1785p3247K6757j462J1664j091k8046
3705A092680j9674L4071M2754J0004L9203M6828M3108N7602K0319j170P7949K9719
3693A473393J05361O0572j3662O5069J0493J8845J31286J08554M8732K0256p4883
3682A954016j44282j61015j35212k4300k2016M225k7040p152m3316p14k047Q129
$$ plain form
3670 1399276 1434807 1425018 1379631 1464130 1457062 1421483 1409993 1437737 1403980 1396561 1431058 1370883
3658 1370883 1408225 1443967 1444746 1541733 1577906 1605283 1629876 1520288 1488506 1505329 1430622 1426996
3646 1426996 1429923 1325123 1296012 1299090 1277973 1300364 1286804 1339597 1349294 1393247 1424974 1414405
3634 1414405 1419539 1447022 1502280 1497619 1504304 1511725 1526661 1607875 1625400 1593050 1593931 1610349 1577155
3621 1577155 1501296 1435812 1427883 1339222 1321608 1369482 1411942 1435361 1398127 1423988 1419251 1382646
3609 1382646 1342039 1303117 1358568 1382859 1329641 1328837 1315257 1360396 1405508 1365560 1347878 1418343
3597 1418343 1477629 1483060 1471622 1421494 1362928 1415077 1415171 1462196 1543750 1438926 1457467 1473404
3585 1473404 1537658 1575715 1577333 1566975 1579285 1555174 1516521 1580954 1598817 1653720 1633310 1586799
$$ packed form
3670A399276L5531r789m5387Q4499p068l5579j1490K7744l3757p419L4497o0175
3658A370883L7342L5742P79R6987L6173K7377K4593j09588l1782J6823p4707l626
3646A426996K927j04800k9111L078k1117K2391j3560N2793R697M3953L1727j0569
3634A414405N134K7483N5258m661O685P421J4936Q1214J7525l2350Q81J6418l3194
3621A577155p5859o5484p929q8661j7614M7874M2460K3419l7234K5861m737l6605
3609A382646m0607l8922N5451K4291n3218q04j3580M5139M5112l9948j7682P0465
3597A418343N9286N431j1438n0128n8566N2149R4M7025Q1554j04824J8541J5937
3585A473404O4254L8057J618j0358J2310k4111l8653O4433J7863N4903k0410m6511
$$ plain form
3573 1586799 1595176 1595903 1573205 1614162 1627684 1652632 1622490 1731513 1783694 1779048 1793005 1819455
3561 1819455 1823753 1908035 1906125 1928399 1939257 2001450 2079068 2023455 2143904 2175076 2135983 2126798
3549 2126798 2117015 2084987 2122068 2132717 2156975 2176499 2183566 2218451 2165171 2193794 2250399 2250007
3537 2250007 2267767 2328572 2376703 2397827 2442597 2532248 2524339 2520188 2562541 2600169 2666167 2711395
3525 2711395 2729912 2723464 2739282 2748501 2799480 2888630 2851641 2853785 2877467 2880263 3030516 3121801
3513 3121801 3174351 3233545 3250337 3336513 3406854 3435921 3458457 3544825 3597073 3633641 3763512
3502 3763512 3892717 3996792 4058644 4156801 4246370 4347390 4508292 4609256 4670534 4712860
3492 4712860 4839350 4845170 4887934 4979340 5051288 5099777 5234392 5380289 5451465 5617724 5785604
$$ packed form
3573A586799Q377P27k2698M0957J3522K4948l0142J09023N2181m646J3957K6450
3561A819455M298Q4282j910K2274J0858O2193P7618n5613J20449L1172l9093r185
3549B126798r783l2028L7081J0649K4258J9524P067L4885n3280K8623N6605l92
3537B250007J7760O0805M8131K1124M4770Q9651p909m151M2353L7628O5998M5228
3525B711395J8517o448J5818R219N0979Q9150l6989K144K3682K796J50253R1285
3513C121801N2550N9194J6792Q6176P0341K9067K2536Q6368N2248L6568J29871
3502C763512J29205J04075O1852R8157Q9569J01020J60902J00964O1278M2326
3492D712860J26490N820M2764R1406P1948M8489J34615J45897P1176J66259J67880
$$ plain form
3481 5785604 5979509 6159363 6244344 6402630 6501739 6616294 6758894 6929786 7130197 7396511
3471 7396511 7604052 7784983 8133081 8358683 8611388 8930082 9258665 9564748 9912138 10243407
3461 10243407 10500902 10747524 11080008 11407367 11654331 12078343 12551076 13003971 13585979
3452 13585979 14087212 14632878 15189429 15813189 16497238 17247933 18095299 19138323 20334734
3443 20334734 21765256 23388463 25335255 27596869 30265968 33451100 37095052 41436969
3435 41436969 46711725 53204717 61283791 71520588 83176625 93115111 96539737 91315305
3427 91315305 80801930 69491649 59567715 51919360 46496174 42592340 39968385 38257607
3419 38257607 37143527 36416880 35959147 35874941 36124891 36677161 37578305 38890198 40696182
$$ packed form
3481E785604J93905J79854Q4981J58286R9109J14555J42600J70892K00411K66314
3471G396511K07541J80931L48098K25602K52705L18694L28583L06083L47390L31269
3461A0243407K57495K46622L32484L27359K46964M24012M72733M52895N82008
3452A3585979N01233N45666N56551O23760O84049P50695Q47366J043024J196411
3443B0334734J430522J623207J946792K261614K669099L185132L643952M341917
3435D1436969N274756O492992Q079074J0236797J1656037R938486L424626n224432
3427I1315305j0513375j1310281r923934p648355n423186l903834k623955j710778
3419C8257607j114080p26647m57733q4206K49950N52270R01144J311893J805984
$$ plain form
3410 40696182 43046171 45921040 49426757 53947920 59444492 65763077 73223594 82682878
3402 82682878 94400147 109341322 128956188 152038400 171402567 176634847 163816202
3395 163816202 141094362 117253738 96641591 80874205 69220362 60769032 54532029
3388 54532029 50051539 46664013 43916215 41671369 39967062 38507973 37407804 36629150
3380 36629150 36191152 36089787 36288225 36721287 37653972 39021635 40952939 43395902 46472956
3371 46472956 50504995 55614459 62217336 70975680 80941194 89105384 91026334 84803256
3363 84803256 73791674 62120612 51887452 43928445 37894008 33444066 30100627 27499728
3355 27499728 25573400 23972607 22564050 21367459 20229814 19213588 18256664 17392133
$$ packed form
3410D0696182K349989K874869L505717M521163N496572O318585P460517R459284
3402H2682878J1717269J4941175J9614866K3082212J9364167N232280j2818645
3395A63816202k2721840k3840624k0612147j5767386j1653843q451330o237003
3388E4532029m480490l387526k747798k244846j704307j459089j100169p78654
3380C6629150m37998j01365J98438M33062R32685J367663J931304K442963L077054
3371D6472956M032039N109464O602877Q758344R965514Q164190J920950o223078
3363H4803256j1011582j1671062j0233160p959007o034437m449942l343439k600899
3355B7499728j926328j600793j408557j196591j137645j016226r56924q64531
$$ plain form
3347 17392133 16644542 15870552 15183701 14544956 13935918 13442212 12998145 12539987 12119883
3338 12119883 11786294 11383913 11074819 10806307 10542382 10287462 10026797 9849843 9609866
3329 9609866 9433691 9252643 9121748 9014358 8914016 8871530 8767554 8675114 8547737 8410648
3319 8410648 8393218 8300951 8177768 8050488 7961559 7923020 7913251 7909064 7877491 7943134 8002318
3308 8002318 7961061 8008159 8080874 8237356 8479330 8778218 9027128 9291493 9586493 9861185
3298 9861185 10190774 10162019 9797329 9316986 8789155 8416247 8227264 8061756 7921252 7863680
3288 7863680 7755731 7699480 7635235 7685131 7661817 7751715 7883426 7967718 8202268 8315603 8477537
3277 8477537 8721832 8893529 9100868 9453278 9971067 10524528 11195020 11921643 12564109 13180620
$$ packed form
3347A7392133p47591p73990o86851o38745o09038m93706m44067m58158m20104
3338A2119883l33589m02381l09094k68512k63925k54920k60665j76954k39977
3329I609866j76175j81048j30895j07390j00342m2486j03976r2440j27377j37089
3319H410648j7430r2267j23183j27280q8929l8539r769m187l1573O5643N9184
3308H002318m1257M7098P2715J56482K41974K98888K48910K64365K95000K74692
3298I861185L29589k8755l64690m80343n27831l72908j88983j65508j40504n7572
3288G863680j07949n6251o4245M9896k3314Q9898J31711Q4292K34550J13335J61934
3277H477537K44295J71697K07339L52410N17789N53461O70492P26623O42466O16511
$$ plain form
3267 13180620 13878227 14620209 14958078 14654436 13737521 12861734 12223330 11866214 11623268
3258 11623268 11535146 11493807 11531666 11805214 12014987 12385516 12821743 13281848 13825876 14361541
3248 14361541 14961505 15609713 16204192 16593776 16864209 16926983 16833034 16524403 16020891 15435967
3238 15435967 14827332 14255227 13717912 13284537 12959625 12642994 12124201 11361048 10554992
3229 10554992 9778374 9162120 8583784 8132524 7776750 7464784 7192415 6881482 6634698
3220 6634698 6445203 6218622 6017813 5897294 5740228 5509155 5391210 5260657 5147892 4983094
3210 4983094 4851512 4816706 4690649 4606645 4449602 4393556 4349105 4273015 4139299 4092611 4001159
3199 4001159 3988145 3888100 3815507 3748514 3733588 3639070 3600997 3481034 3392797 3381560 3289937
$$ packed form
3267A3180620O97607P41982L37869l03642r16915q75787o38404l57116k42946
3258A1623268q8122m1339L7859K73548K09773L70529M36227M60105N44028N35665
3248A4361541N99964O48208N94479L89584K70433O2774r3949l08631n03512n84924
3238A5435967o08635n72105n37315m33375l24912l16631n18793p63153q06056
3229A0554992p76618o16254n78336m51260l55774l11966k72369l10933k46784
3220F634698j89495k26581k00809j20519j57066k31073j17945j30553j12765j64798
3210D983094j31582l4806j26057q4004j57043n6046m4451p6090j33716m6688r1452
3199D001159j3014j00045p2593o6993j4926r4518l8073j19963q8237j1237r1623
$$ plain form
3188 3289937 3200966 3164037 3119140 3170103 3070509 2997874 3008350 2965248 2924769 2902891 2945470
3177 2945470 2888123 2799942 2760643 2754247 2765472 2713546 2682825 2662718 2581022 2639253 2622403 2550214
3165 2550214 2480025 2496812 2421888 2373220 2343101 2388855 2347306 2263595 2217290 2226716 2227805 2194808
3153 2194808 2195049 2188661 2165099 2164065 2194984 2251131 2140106 2178934 2213950 2251551 2297322 2290741
3141 2290741 2349162 2375673 2345166 2286328 2284110 2176519 2116025 2039574 2007016 2010061 2015481 2041189
3129 2041189 1991400 1960468 1949476 1903509 1846737 1824651 1900500 1876266 1784613 1799568 1837015
3118 1837015 1879037 1894873 1907845 1931484 1928385 1956207 2002731 2029475 2151364 2250677 2330718
3107 2330718 2408427 2355506 2190300 1991330 1892165 1819358 1778462 1689582 1704298 1673049 1670530
$$ packed form
3188C289937q8971l6929m4897N0963r9594p2635J0476m3102m0479k1878M2579
3177B945470n7347q8181l9299o396J1225n1926l0721k0107q1696N8231j6850p2189
3165B550214p0189J6787p4924m8668l0119M5754m1549q3711m6305R426J089l2997
3153B194808K41o388k3562j034L0919N6147j11025L8828L5016L7601M5771o581
3141B290741N8421K6511l0507n8838k218j07591o0494p6451l2558L045N420K5708
3129B041189m9789l0932j0992m5967n6772k2086P5849k4234r1653J4955L7447
3118A837015M2022J5836J2972K3639l099K7822M6524K6744J21889R9313Q0041
3107B330718P7709n2921j65206j98970r9165p2807m0896q8880J4716l1249k519
$$ plain form
3096 1670530 1634151 1544305 1472136 1473425 1480676 1424269 1459402 1490423 1422115 1397998 1436829 1432658
3084 1432658 1450422 1451255 1480860 1499862 1624486 1617940 1695218 1702960 1731788 1712800 1697383 1663407
3072 1663407 1566813 1475575 1490581 1432630 1332395 1307967 1304342 1313491 1270107 1259660 1279111 1257897
3060 1257897 1229472 1208141 1196557 1179580 1212968 1209781 1158001 1181920 1179732 1155689 1150319 1194832
3048 1194832 1264830 1299230 1200804 1141310 1200541 1208485 1229139 1197739 1188107 1235678 1232300 1238713
3036 1238713 1226330 1235083 1192600 1194450 1271507 1284440 1202944 1204926 1246147 1316973 1259466 1318994
3024 1318994 1351464 1339555 1384705 1436088 1461260 1510858 1549991 1677434 1816074 1910609 1982159
3013 1982159 2099073 2012009 1939810 1851751 1795214 1816925 1798034 1825064 1799718 1763107 1757595
$$ packed form
3096A670530l6379q9846p2169J289P251n6407L5133L1021o8308k4117L8831m171
3084A432658J7764Q33K9605J9002J24624o546P7278P742K8828j8988j5417l3976
3072A663407r6594r1238J5006n7951j00235k4428l625R149m3384j0447J9451k1214
3060A257897k8425k1331j1584j6977L3388l187n1780K3919k188k4043n370M4513
3048A194832O9998L4400r8426n9494N9231P944K0654l1400r632M7571l378O413
3036A238713j2383Q753m2483J850P7057J2933q1496J982M1221P0826n7507N9528
3024A318994L2470j1909M5150N1383K5172M9598L9133J27443J38640R4535P1550
3013A982159J16914q7064p2199q8059n6537K1711j8891K7030k5346l6611n512
$$ plain form
3002 1757595 1732756 1647199 1606991 1597312 1593827 1589845 1607691 1617192 1680462 1696687 1751277 1809553
2990 1809553 1899607 1907169 1974082 2145086 2287913 2427384 2661017 2853853 3014410 3078239
2980 3078239 2986317 2739360 2603307 2527041 2414057 2436768 2470531 2473858 2467867 2363358 2245332
2969 2245332 2110156 2054876 2038429 2016671 1978807 1969704 1951312 1884614 1896727 1932848 1997253
2958 1997253 1920459 1915666 2020733 2101453 2195323 2310191 2374010 2463670 2565621 2688463 2679027
2947 2679027 2607023 2492926 2463795 2502749 2503062 2506397 2557143 2491563 2523612 2601803 2591896 2564591
2935 2564591 2545379 2515039 2584714 2512342 2475902 2483296 2537508 2629360 2638959 2707606 2737275 2718067
2923 2718067 2724963 2701155 2685448 2680113 2766803 2889222 2903408 2958962 2993932 3014750 3072733 3125346
$$ packed form
3002A757595k4839q5557m0208r679l485l982J7846R501O3270J6225N4590N8276
2990A809553R0054P562O6913J71004J42827J39471K33633J92836J60557O3829
2980C078239r1922k46957j36053p6266j12984K2711L3763L327n991j04509j18026
2969B245332j35176n5280j6447k1758l7864r103j8392o6698J2113L6121O4405
2958A997253p6794m793J05067Q0720R3870J14868O3819Q9660J01951J22842r436
2947B679027p2004j14097k9131L8954L13L335N0746o5580L2049P8191r907k7305
2935B564591j9212l0340O9675p2372l6440P394N4212R1852R599O8647K9669j9208
2923B718067O896k3808j5707n335Q6690J22419J4186N5554L4970K0818N7983N2613
$$ plain form
2911 3125346 3145268 3257677 3323680 3446638 3556656 3683400 3795840 3867235 3931016 4010011
2901 4010011 4002990 3961783 3847657 3670849 3537375 3442165 3334436 3220209 3256146 3268983 3228234
2890 3228234 3265806 3227017 3217902 3301652 3334038 3358748 3376888 3364898 3482612 3457315 3444346
2879 3444346 3434085 3514674 3570969 3510463 3403145 3340785 3317494 3281621 3224724 3193089 3098709
2868 3098709 2993415 2893338 2865434 2846610 2755792 2624175 2592308 2585895 2556941 2534645 2514050
2857 2514050 2536857 2502567 2441395 2369263 2345351 2287040 2224127 2178431 2130866 2011668 1937631
2846 1937631 1934262 1859125 1787371 1721909 1726570 1678598 1582547 1574671 1590406 1534370 1416765 1334278
2834 1334278 1337609 1310389 1331044 1295083 1287657 1237659 1164995 1168637 1190672 1191818 1160674 1182073
$$ packed form
2911C125346J9922J12409O6003J22958J10018J26744J12440P1395O3781P8995
2901D010011p021m1207j14126j76808j33474r5210j07729j14227L5937J2837m0749
2890C228234L7572l8789r115Q3750L2386K4710J8140j1990J17714k5297j2969
2879C444346j0261Q0589N6295o0506j07318o2360k3291l5873n6897l1635r4380
2868C098709j05294j00077k7904j8824r0818j31617l1867o413k8954k2296k0595
2857B514050K2807l4290o1172p2132k3912n8311o2913m5696m7565j19198p4037
2846A937631l369p5137p1754o5462M661m7972r6051p876J5735n6036j17605q2487
2834A334278L331k7220K0655l5961p426m9998p2664L642K2035J146l1144K1399
$$ plain form
2822 1182073 1159674 1182886 1151788 1054446 996399 987433 982652 961553 913945 911374 885151 847022
2810 847022 867150 916211 864881 836382 792113 782548 763025 744875 757222 712788 720461 709218
2798 709218 696107 688301 646746 689656 710335 680456 597792 688759 673025 705302 658931 613434
2786 613434 645323 647029 601475 567664 520001 565933 580472 562206 553474 514411 445799 453337
2774 453337 463882 446777 471482 528033 465575 462071 484685 456606 461778 467875 429434 425590
2762 425590 418012 430470 389610 351899 381924 345544 310083 333216 314467 338614 416341 423740
2750 423740 403986 322810 337141 393799 401851 371809 303639 280837 303180 276773 260350 180408
2738 180408 250900 261547 323661 306642 253960 205309 184531 165795 250201 266617 305925 332778
$$ packed form
2822A182073k2399K3212l1098r7342n8047q966m781k1099m7608k571k6223l8129
2810H47022K0128M9061n1330k8499m4269r565j9523j8150J2347m4434P673j1243
2798G09218j3111p806m1555M2910K0679k9879q2664R0967j5734L2277m6371m5497
2786F13434L1889J706m5554l3811m7663M5932J4539j8266q732l9063o8612P538
2774D53337J0545j7105K4705N6551o2458l504K2614k8079N172O097l8441l844
2762D25590p578J2458m0860l7711L0025l6380l5461K3133j8749K4147P7727P399
2750D23740j9754q1176J4331N6658Q052l0042o8170k2802K2343k6407j6423p9942
2738A80408P0492J0647O2114j7019n2682m8651k0778j8736Q4406J6416L9308K6853
$$ plain form
2726 332778 307576 279864 308638 215642 218474 277954 177636 205520 239629 198959 184943 215381
2714 215381 262658 225714 206261 191642 219676 225337 140020 128848 115583 98868 150369 179095
2702 179095 158959 149874 152370 131901 115214 151377 158629 157530 137684 184069 176477 151063 123813
2689 123813 139448 174842 154193 193435 176366 157834 101796 120345 161759 151014 98882 112078
2677 112078 150081 117360 149640 133227 117715 115982 111802 156611 144994 93320 96190 101453
2665 101453 101868 87132 67099 76490 157623 171799 136442 121140 80560 67194 69872 47737
2653 47737 64318 102348 135353 33710 48918 76603 94275 102039 75409 73416 71922 96422
2641 96422 78951 92145 72025 38997 99614 47188 70080 84344 26589 46533 75307 40545
$$ packed form
2726C32778k5202k7712K8774r2996K832N9480j00318K7884L4109m0670j4016L0438
2714B15381M7277l6944j9453j4619K8034N661q5317j1172j3265j6715N1501K8726
2702A79095k0136r085K496k0469j6687L6163P252j099j9846M6385p592k5414k7250
2689A23813J5635L5394k0649L9242j7069j8532n6038J8549M1414j0745n2132J3196
2677A12078L8003l2721L2280j6413j5512j733m180M4809j1617n1674K870N263
2665A01453M15j4736k0033R391Q1133J4176l5357j5302m0580j3366K678k2135
2653D7737J6581L8030L3005j01643J5208K7685J7672P764k6630j993j494K4500
2641I6422j7471J3194k0120l3028O0617n2426K2892J4264n7755J9944K8774l4762
$$ plain form
2629 40545 82022 74659 64474 133591 133659 92974 37070 27870 33844 122784 77793 61371 7713
2616 7713 -12734 52597 67860 92887 105627 93683 144376 93732 41009 16925 78825 81826
2604 81826 74036 55248 27509 56080 28125 92354 66472 45980 119255 135326 112526 95466
2592 95466 32055 -1564 37549 91377 80681 69485 109194 59758 105205 91675 84010 124775
2580 124775 156223 128687 80191 56668 10015 7919 3989 -8570 17877 29491 30534 -9436
2568 -9436 -8499 -25939 -4417 44931 56495 134188 74007 105795 55403 10634 26254 92061
2556 92061 103019 67531 37398 48587 39571 18405 106881 78102 -1826 11811 82080 32990
2544 32990 -28627 17318 40308 46288 -52338 -56887 -3002 87308 83572 27543 44184 26370
$$ packed form
2629D0545M1477p363j0185O9117O8m0685n5904r200N974Q8940m4991j6422n3658
2616G713k0447O5331J5263K5027J2740j1944N0693n0644n2723k4084O1900L001
2604H1826p790j8788k7739K8571k7955O4229k5882k0492P3275J6071k2800j7060
2592I5466o3411l3619L9113N3828j0696j1196L9709m9436M5447j3530p665M0765
2580A24775L1448k7536m8496k3523m6653k096l930j2559K6447J1614J043l9970
2568i436R37j7440K1522M9348J1564P7693o0181L1788n0392m4769J5620O5807
2556I2061J0958l5488l0133J1189r016k1166Q8476k8779p9928J3637P0269m9090
2544C2990o1617M5945K2990N980r8626m549N3885R0310l736n6029J6641j7814
$$ plain form
2532 26370 -24452 34929 69953 45639 8241 -5828 -9172 -1424 -40490 -55559 3545 21658
2520 21658 23261 30165 6203 31696 19411 32348 29498 -5294 -22460 -55952 -61716 -9277 -803
2507 -803 -24425 7951 15835 42751 63054 -15152 -30041 -2584 12648 23402 -34617 -6590
2495 -6590 36415 41881 50098 -13984 -46269 -57755 -25081 -7640 -36630 -40270 -3934 -3621 39525
2482 39525 92561 48102 20754 57651 73067 39560 4129 -56297 -9380 12182 45812 8017
2470 8017 -24631 -18514 37856 14852 25288 -33213 47771 -4878 -76773 -75009 -58756 1245
2458 1245 -20387 -6607 -48243 6149 3132 -45873 7898 41681 43701 10766 12166 -29841 -39560
2445 -39560 -21592 -13916 -22417 -6438 9644 32644 3833 10892 -37823 -46972 -34008 -24007 -38118
$$ packed form
2532B6370n0822N9381L5024k4314l7398j4069l344P748l9066j5069N9104J8113
2520B1658J603O904k3962K5493j2285J2937k850l4792j7166l3492n764N2439Q474
2507h03k3622L2376P884K6916K0303p8206j4889K7457J5232J0754n8019K8027
2495f590M3005N466Q217o4082l2285j1486L2674J7441k8990l640L6336L13M3146
2482C9525N3036m4459k7348L6897J5416l3507l5431o0426M6917K1562L3630l7795
2470H017l2648O117N6370k3004J0436n8501Q0984n2649p1895J764J6253O0001
2458A245k1632J3780m1636N4392l017m9005N3771L3783K020l2935J400m2007r719
2445c9560J7968P676q501J5979J6082K3000k8811P059m8715r149J2964J0001j4111
$$ plain form
2432 -38118 -60909 -63542 -64085 -76666 -86744 -47355 -29892 -97556 -101191 -78889 -52317 57638
2420 57638 53802 40431 -15235 -10436 -5632 -61569 -32694 -76105 -115483 -105880 -37633 -107008 -74310
2407 -74310 -15211 -22903 -25572 -49953 18786 28864 31013 20635 -34131 -69204 -15329 19186
2395 19186 28699 11052 1533 -3857 -23886 -33720 2782 28879 28164 7963 22221 16883 21288
2382 21288 15040 5869 -26575 63489 100666 76292 67084 62999 70151 148788 96265 66157 43810
2369 43810 64780 58863 3685 -18554 -53378 -14140 46291 56694 55583 10378 24834 33288
2357 33288 7019 -6835 24527 22936 -25807 -41393 -10025 -9762 15437 -25703 -15806 8917 -8015
2344 -8015 -47892 10473 45722 9088 -12154 5695 29388 -38660 -33676 -10821 23564 -21946
$$ packed form
2432c8118k2791k633n43j2581j0078L9389J7463o7664l635K2302K6572J09955
2420E7638l836j3371n5666M799M804n5937K8875m3411l9378R603O8247o9375L2698
2407g4310N9099p692k669k4381O8739J0078K149j0378n4766l5073N3875L4515
2395A9186R513j7647r519n390k0029r834L6502K6097p15k0201J4258n338M405
2382B1288o248r171l2444R0064L7177k4374r208m085P152P8637n2523l0108k2347
2369D3810K0970n917n5178k2239l4824L9238O0431J0403j111m5205J4456Q454
2357C3288k6269j3854L1362j591m8743j5586L1368K63K5199m1140R897K4723j6932
2344h015l9877N8365L5249l6634k1242J7849K3693o8048M984K2855L4385m5510
$$ plain form
2332 -21946 -3302 31658 37156 11847 -10578 -48478 -51134 -17205 -58337 -4964 -7376 92031
2320 92031 73035 -36681 -55243 -37135 -27410 -12591 -9969 31355 -38934 -76298 -16116 36102
2308 36102 64292 -17210 13265 19429 9750 -3662 9128 -10868 -33392 -27152 24237 8985
2296 8985 -57334 -77145 -13780 -48177 8023 8206 -23425 6321 93735 124016 46772 43696 61273
2283 61273 30815 66841 82507 47730 25984 32847 -29544 -37786 -19444 25082 35470 45960
2271 45960 -22368 -16691 39374 60152 10121 17390 76178 115313 119844 150998 160449 119245 91270
2258 91270 83659 86569 44326 40306 19121 45454 35512 53482 50461 62005 76001 10235 10064
2245 10064 55999 5791 41518 53873 45624 87393 73535 97814 112829 73803 140546 116068
$$ packed form
2332b1946J8644L4960N498k5309k2425l7900k656L3929m1132N3373k412R9407
2320I2031j8996j09716j8562J8108R725J4819K622M1324p0289l7364O0182N2218
2308C6102K8190q1502L0475O164r679j3412J2790j9996k2524O240N1389j5252
2296H985o6319j9811O3365l4397N6200J83l1631K9746Q7414L0281p7244l076J7577
2283F1273l0458L6026J5666l4777k1746O863o2391q242J8342M4526J0388J0490
2271D5960o8328N677N6065K0778n0031P269N8788L9135M531L1154R451m1204k7975
2258I1270p611K910m2243m020k1185K6333r942J7970l021J1544J3996o5766j71
2245A0064M5935n0208L5727J2355q249M1769j3858K4279J5015l9026O6743k4478
$$ plain form
2233 116068 88026 64483 44728 68703 60383 55819 83318 98053 81414 75288 97650 117299
2221 117299 125787 183284 189366 138893 136995 155221 95283 66230 81083 157860 86759 121278
2209 121278 83951 112845 116835 131766 149647 151013 186856 211845 213229 209402 229983 208098
2197 208098 202255 183811 224236 200282 184405 180610 243695 250153 276633 300541 246747 211739
2185 211739 219866 234879 313041 318006 275073 316863 369750 319316 336890 376823 393864 395311
2173 395311 389152 448465 535294 462176 438848 474941 498478 462032 485176 514837 548062 658736
2161 658736 676230 666483 657888 673452 671601 650151 668279 656920 677027 715969 764852 766201
2149 766201 768482 772252 807194 808469 861549 943596 954345 941085 980784 1059631 1130266 1251826
$$ packed form
2233A16068k8042k3543j9755K3975q320m564K7499J4735j6639o126K2362J9649
2221A17299Q488N7497O082n0473j898J8226n9938k9053J4853P6777p1101L4519
2209A21278l7327K8894L990J4931J7881J366L5843K4989J384l827K0581k1885
2197B08098n843j8444M0425k3954j5877l795O3085O458K6480K3908n3794l5008
2185B11739Q127J5013P8162M965m2933M1790N2887n0434J7574L9933J7041J447
2173C95311o159N9313Q6829p3118k3328L6093K3537l6446K3144K9661L3225J10674
2161F58736J7494r747q595J5564j851k1450J8128j1359K0107L8942M8883J349
2149G66201K281L770L4942J275N3080Q2047J0749j3260L9699P8847P0635J21560
$$ plain form
2137 1251826 1291480 1372353 1421057 1487776 1562455 1614047 1708198 1768980 1864358 1960426 2110612
2126 2110612 2170715 2297679 2459912 2621456 2838465 3162303 3490429 3751525 3941812 4284133
2116 4284133 4679889 5274794 5925859 6747380 7716693 8894475 10496378 12385590 14897798
2107 14897798 18613674 23109969 26210562 24550234 19295405 14795838 11565241 9412654
2099 9412654 7821940 6607301 5692621 5042792 4559167 4236286 3954833 3770587 3634203
2090 3634203 3481885 3220670 2932218 2728529 2541088 2331732 2168408 2010980 1858944 1763262
2080 1763262 1705559 1622772 1538437 1432256 1321356 1278017 1200708 1152025 1074561 991537 976353
2069 976353 977369 981469 900018 864107 850409 801136 760848 746520 725435 722792 709967 671065
$$ packed form
2137A251826L9654Q0873M8704O6719P4679N1592R4151O0782R5378R6068J50186
2126B110612O0103J26964J62233J61544K17009L23838L28126K61096J90287L42321
2116D284133L95756N94905O51065Q21521R69313J177782J601903J889212K512208
2107A4897798L715876M496295L100593j660328n254829m499567l230597k152587
2099I412654j590714j214639r14680o49829m83625l22881k81453j84246j36384
2090C634203j52318k61215k88452k03689j87441k09356j63324j57428j52036r5682
2080A763262n7703q2787q4335j06181j10900m3339p7309m8683p7464q3024j5184
2069I76353J016M100q1451l5911j3698m9273m0288j4328k1085k643j2825l8902
$$ plain form
2057 671065 688872 647957 586045 516658 410143 392548 426783 450490 447360 383867 394766 379444
2045 379444 359054 397276 398950 388086 389651 391794 416982 382608 336273 392685 395689 347458
2033 347458 307209 323477 332819 311700 282034 260935 231845 251552 288553 206004 199275 250077
2021 250077 239821 199231 172876 230214 255810 241291 195482 208933 178222 152072 188912 128156
2009 128156 113936 123866 89743 84006 143045 128522 155312 152729 146422 79918 99735 79051
1997 79051 63555 122118 112259 49954 61463 83722 42066 112322 124689 100559 108835 156534
1985 156534 152903 174038 143069 64117 102471 160756 121540 102119 30924 75058 38532 -14034
1973 -14034 30549 68761 31211 -16632 22278 59118 43480 19906 66588 90593 98732 48388
$$ packed form
2057F71065J7807m0915o1912o9387j06515j7595L4235K3707l130o3493J0899j5322
2045C79444k0390L8222J674j0864J565K143K5188l4374m6335N6412L004m8231
2033C47458m0249J6268R342k1119k9666k1099k9090J9707L7001q2549o729N0802
2021B50077j0256m0590k6355N7338K5596j4519m5809J3451l0711k6150L6840o0756
2009A28156j4220R930l4123n737N9039j4523K6790k583o307o6504J9817k0684
1997G9051j5496N8563r859o2305J1509K2259m1656P0256J2367k4130Q276M7699
1985A56534l631K1135l0969p8952L8354N8285l9216j9421p1195M4134l6526n2566
1973a4034M4583L8212l7550m7843L8910L6840j5638k3574M6682K4005Q139n0344
$$ plain form
1961 48388 93567 65918 63756 26216 17348 42686 44802 78590 110522 16131 16974 76636 82744
1948 82744 51586 10063 21201 6385 42181 55843 5274 5808 7263 50839 60683 47278 84786
1935 84786 32595 22556 -10081 3282 9198 3627 9554 -10940 30092 23858 -4201 -21411 -35425
1922 -35425 -40478 -41448 -15821 1481 21859 34062 -2442 53325 88821 84904 83777 129683 81083
1909 81083 66298 47999 78678 85680 75322 69263 67587 68588 14712 -3770 -11299 24819 -37861
1896 -37861 -16489 -61851 -30693 27302 -11817 27345 22436 -884 39852 88370 100393 59329
1884 59329 18970 -11166 -43638 22133 19746 3309 9263 21400 61657 27594 37368 71385
1872 71385 70768 71242 -5743 1955 97313 63722 -45377 2052 -22234 18772 79719 -22876
$$ packed form
1961D8388M5179k7649k162l7540q868K5338K116L3788L1932r4391Q43N9662O108
1948H2744l1158m1523J1138j4816L5796J3662n0569N34J455M3576R844j3405L7508
1935H4786n2191j0039l2637J3363N916n571N927k0494M1032o234k8059j7210j4014
1922c5425n053r70K5627J7302K0378J2203l6504N5767L5496l917j127M5906m8600
1909H1083j4785j8299L0679P002j0358o059j676J001n3876j8482p529L6118o2680
1896c7861K1372m5362L1158N7995l9119L9162m909k3320M0736M8518J2023m1064
1884E9329m0359l0136l2472O5771k387j6437N954J2137M0257l4063R774L4017
1872G1385o17M74p6985P698R5358l3591j09099M7429k4286M1006O0947j02595
$$ plain form
1860 -22876 24499 8674 21737 46722 52467 -1882 -7476 -20398 4054 69864 87421 73127
1848 73127 54341 58580 36065 3610 -12731 20942 90377 74327 68696 35664 34214 68041
1836 68041 137538 88197 58747 22689 62076 79123 27630 -786 -21290 -31182 -50662 29028
1824 29028 111174 81230 33807 39631 27068 80235 52811 62097 25464 1188 -37547 -26352
1812 -26352 37437 16281 -25719 -59039 -49060 -62237 -30752 -43462 -36894 -48253 10643 59470
1800 59470 13015 -11644 -22772 -56846 -52631 -39405 -79867 -59085 -31214 -43622 -28806 -14739
1788 -14739 -85640 -100158 -26535 -1576 -22758 -48181 -72218 -60533 -85249 -39799 -6498 -12455
1776 -12455 -61955 -42122 31390 -39751 -58277 -52523 -52234 23254 -5952 -38882 7333 52161
$$ packed form
1860b2876M7375j5825J3063K4985N745n4349n594j2922K4452O5810J7557j4294
1848G3127j8786M239k2515l2455j6341L3673O9435j6050n631l3032j450L3827
1836F8041O9497m9341k9450l6058L9387J7047n1493k8416k0504r892j9480P9690
1824B9028Q2146k9944m7423N824j2563N3167k7424R286l6633k4276l8735J1195
1812b6352O3789k1156m2000l3320R979j3177L1485j2710O568j1359N8896M8827
1800E9470m6455k4659j1128l4074M215J3226m0462K0782K7871j2408J4816J4067
1788a4739p0901j4518P3623K4959k1182k5423k4037J1685k4716M5450L3301n957
1776a2455m9500J9833P3512p1141j8526N754K89P5488k9206l2930M6215M4828
$$ plain form
1764 52161 17162 17082 3285 -5134 -5636 -21672 -3506 15466 25734 -4156 58551 10595 12557
1751 12557 82662 83626 75250 62437 39632 -197 3079 -35675 22634 205 -639 -24455 7287
1738 7287 -21279 -49587 -75906 -74574 -8041 8991 19226 13383 16322 28769 28523 25154 -1511
1725 -1511 -7942 -52844 -27962 -12903 -67847 -99696 -47781 -31345 -61808 -78871 -40765 -13683
1713 -13683 20908 -14023 -37873 -26569 -98226 -18649 -51356 -45880 -31131 27283 35815 12422
1701 12422 1126 -25749 -69574 -28027 18981 -5470 -30121 -74035 -48217 -31215 -23726 -59116
1689 -59116 -26504 -9546 5214 29534 -30114 -14431 -29941 -67574 -40038 3764 -40757 -30731
1677 -30731 8200 -4754 -18830 -16606 -31376 -97372 -117592 1736 -2937 -10719 7771 -11189
$$ packed form
1764E2161l4999q0j3797q419n02j6036J8166J8972J0268k9890O2707m7956J962
1751A2557P0105R64q376j2813k2805l9829L276l8754N8309k2429q44k3816L1742
1738G287k8566k8308k6319J332O6533J7032J0235n843K939J2447k46l369k6665
1725a511o431m4902K4882J5059n4944l1849N1915J6436l0463j7063L8106K7082
1713a3683L4591l4931k3850J1304p1657P9577l2707N476J4749N8414Q532k3393
1701A2422j1296k6875m3825M1547M7008k4451k4651m3914K5818J7002P489l5390
1689e9116L2612J6958J4760K4320n9648J5683j5510l7633K7536M3802m4521J0026
1677c0731L8931j2954j4076K224j4770o5996k0220J19328m673p782J8490j8960
$$ plain form
1665 -11189 6936 45218 37055 46081 35240 26905 -36879 -75440 -49649 -41190 -6038 -23515 -71843
1652 -71843 -69540 -25186 -27429 -53958 -37472 -35132 -54264 -62377 -18457 -6701 -16923 2821 45767
1639 45767 56164 34909 59744 26723 -18153 -30385 19464 17916 2999 38325 83394 39753
1627 39753 -839 -48217 -17250 -16834 -19693 -14085 28860 45053 -13503 -28991 7414 -74914 -83577
1614 -83577 -32522 5355 29748 -39782 -44014 -10044 10448 -16182 -78755 -62593 -37624 -91081
1602 -91081 3163 -9886 11967 -31485 -8000 14745 -11420 16304 24379 11183 -8661 18602
1590 18602 10299 -20981 -21367 -33135 -67953 -26005 58919 -1562 20147 71794 94278 81
1578 81 -83252 -35702 -120599 -41035 -23091 -50198 -48899 -15445 16269 -20867 -59445 -78119 -99927
$$ packed form
1665a1189J8125L8282q163R026j0841q335o3784l8561K5791Q459L5152j7477m8328
1652g1843K303M4354k243k6529J6486K340j9132q113M3920J1756j0222J9744M2946
1639D5767J0397k1255K4835l3021m4876j2232M9849j548j4917L5326M5069m3641
1627C9753m0592m7378L0967M16k859N608M2945J6193n8556j5488L6405q2328q663
1614h3577N1055L7877K4393o9530m232L3970K0492k6630o2573J6162K4969n3457
1602i1081R4244j3049K1853m3452K3485K2745k6165K7724Q075j3196j9844K7263
1590A8602q303l1280l86j1768l4818M1948Q4924o0481K1709N1647K2484r4197
1578H1q3333M7550q4897P9564J7944k7107J299L3454L1714l7136l8578j8674k1808
$$ plain form
1565 -99927 -16515 40705 8513 28875 7582 3110 7158 30462 24404 12092 -30947 13780
1553 13780 51183 24309 2755 -29344 -74397 -27748 17355 19364 9669 -18342 -36551 -45936
1541 -45936 -53155 -79119 -96200 -120607 -73836 -64695 -47618 -36428 -39346 -42069 -5298 -50529 -12085
1528 -12085 -66208 -91011 -64362 -13848 -40782 -55759 -41722 4807 -22181 -39904 -15143 -56609
1516 -56609 -23260 -27568 -7043 -25859 -58922 -23041 -87 -39191 -43137 -28052 -17832 -33196
1504 -33196 -45845 -14757 43086 12698 -2352 13103 -21062 -21623 -22379 -43281 -29534 19236 -15048
1491 -15048 -36979 -21730 19708 6228 -36686 -34179 -20133 -7201 -10034 -20844 -97820 -55016
1479 -55016 -39898 26297 51032 -7938 -9598 -14913 -5785 -20721 -33922 -8098 -4639 -13025 -26599
$$ packed form
1565i9927Q3412N7220l2192K0362k1293m472M048K3304o058j2312m3039M4727
1553A3780L7403k6874k1554l2099m5053M6649M5103K009r695k8011j8209r385
1541d5936p219k5964j7081k4407M6771R141J7077J1190k918k723L6771m5231L8444
1528a2085n4123k4803K6649N0514k6934j4977J4037M6529k6988j7723K4761m1466
1516e6609L3349m308K0525j8816l3063L5881K2954l9104l946J5085J0220j5364
1504c3196j2649L1088N7843l0388j5050J5455l4165n61p56k0902J3747M8770l4284
1491a5048k1931J5249M1438j3480m2914K507J4046J2932k833j0810p6976M2804
1479e5016J5118O6195K4735n8970j660n315R128j4936j3201K5824L459q386j3574
$$ plain form
1466 -26599 -38335 -7129 -6016 10359 10214 -4857 6486 -66092 -43883 1297 -45839 -45744 -50635
1453 -50635 -96212 -73482 -78651 -94270 -34588 -51589 -72582 -52993 -26006 26328 33649 10087
1441 10087 13356 35186 -10484 -79476 -43119 -2484 -4506 5494 -50687 -49928 -69085 -69714 -66688
1428 -66688 -64000 -74929 -33411 4132 1117 -47786 -48366 -32745 -52681 -21990 -21951 -42974 -62830
1415 -62830 -59583 -21732 -40857 -4238 698 24171 34627 -6016 14491 -38684 2430 14138
1403 14138 -41728 -71639 -16813 11185 -46295 -46187 -46448 -54886 -47247 1450 9070 19694 7601
1390 7601 -26206 -37320 -42399 -54057 -40551 -46144 -64555 -72167 -83087 -56159 -18262 -42126 -4463
1377 -4463 6984 -52043 -43963 -57521 -47854 -68518 13224 33226 10192 -10945 -65623 -72664 -34874
$$ packed form
1466b6599j1736L1206J113J6375j45j5071J1343p2578K2209M5180m7136R5m891
1453e0635m5577K2730n169j5619N9682j7001k0993J9589K6987N2334P321k3562
1441A0087L269K1830m5670o8992L6357M0635k022J0000n6181P59j9157o29L026
1428f6688K688j0929M1518L7543l015m8903n80J5621j9936L0691L9k1023j9856
1415f2830L247L7851j9125L6619M936K3473J0456m0643K0507n3175M1114J1708
1403A4138n5866k9911N4826K7998n7480J08k61q438P639M8697P620J0624j2093
1390G601l3807j1114n079j1658J3506n593j8411p612j0920K6928L7897k3864L7663
1377d463J1447n9027Q080j3558R667k0664Q1742K0002k3034k1137n4678p041L7790
$$ plain form
1364 -34874 -9889 37318 -13550 -72243 -45213 25308 38487 83245 13558 -34708 -45048 -5871
1352 -5871 14089 7282 15995 -27353 -43638 -48830 -22681 1744 -38254 -42306 -53933 -56072 -6035
1339 -6035 -24698 -32024 -34115 -27160 -49503 -55338 -47361 -47299 -7956 -43635 -33432 -45671 -39255 -4413
1325 -4413 -6977 13160 33925 6219 34514 28907 -42961 -27563 -22445 -16383 2300 34106 19047
1312 19047 35880 4239 16634 31477 28360 -28391 -5959 51955 26560 -13648 29788 50791
1300 50791 29043 41429 61477 6771 5264 -17953 -9412 -32139 3748 -4723 -18047 21597
1288 21597 22734 10569 19366 -2319 -24103 -66475 -91926 -60528 -26130 8590 37376 107254
1276 107254 56009 61665 12296 7718 -11801 -13125 -38562 -61627 -28912 -28352 33076 23188 -24407
$$ packed form
1364c4874K4985M7207n0868n8693K7030P0521J3179M4758o9687m8266j0340L9177
1352e871J9960o807Q713m3348j6285n192K6149K4425l9998m052j1627k139N0037
1339f035j8663p326k091O955k2343n835P977O2L9343l5679J0203j2239O416L4842
1325d413k564K0137K0765k7706K8295n607p1868J5398N118O062J8683L1806j5059
1312A9047J6833l1641J2395J4843l117n6751K2432N7914k5395m0208M3436K1003
1300E0791k1748J2386K0048n4706j507k3217Q541k2727L5887q471j3324L9644
1288B1597J137j2165Q797k1685k1784m2372k5451L1398L4398L4720K8786O9878
1276A07254n1245N656m9369m578j9519j324k5437k3065L2715N60O1428r888m7595
$$ plain form
1263 -24407 43979 53892 -7144 -24271 9127 35407 88267 50785 24137 7174 -11717 -24628
1251 -24628 -1532 89247 104044 15558 -24972 30499 35088 57336 45195 51432 50788 8558 8066
1238 8066 32638 -11791 -53492 -63793 -79388 -40655 -21506 -18473 24838 23121 8309 -74934
1226 -74934 -24105 -12309 -64406 -74728 -7102 41229 1204 -22643 58624 42993 13414 48674
1214 48674 37908 16570 -11221 39473 8244 -42018 -74904 -28075 -19047 -6326 -20004 -3743
1202 -3743 -3130 12681 -3817 36117 28584 -20079 -5016 15359 65717 77590 28366 -10727 -25252
1189 -25252 35304 59074 46268 -1850 -65250 3453 678 -27686 -689 -54000 -70508 -57761
1177 -57761 -8752 -29108 -15516 36250 14557 -17593 -3429 17156 -25115 4025 32956 -35681
$$ packed form
1263b4407O8386R913o1036j7127L3398K6280N2860l7482k6648j6963j8891j2911
1251b4628K3096R0779J4797q8486m0530N5471M589K2248j2141O237o44m2230m92
1238H066K4572m4429m1701j0301j5595L8733J9149L033M3311j717j4812q3243
1226g4934N0829J1796n2097j0322O7626M8331m0025k3847Q1267j5631k9579L5260
1214D8674j0766k1338k7791N0694l1229n0262l2886M6829R028J2721j3678J6261
1202c743O13J5811j6498L9934p533m8663J5063K0375N0358J1873m9224l9093j4525
1189b5252O0556K3770j2806m8118o3400O8703k775k8364K6997n3311j6508J2747
1177e7761M9009k0356J3592N1766k1693l2150J4164K0585m2271K9140K8931o8637
$$ plain form
1165 -35681 -177 -31635 -29215 -25171 -48342 -1547 25728 57719 -18258 31606 11857 2247
1153 2247 -5098 -68420 -34711 54141 53755 32910 -29394 2769 35978 31152 9235 4324 42968
1140 42968 100228 3112 28732 9030 -42129 -40197 -54797 -30902 -5148 -51977 -45860 -45239 -46396
1127 -46396 14001 27500 10297 24799 5303 22693 11332 33188 44080 -9725 -1804 -52477
1115 -52477 -33395 -62704 -17158 15072 42552 47700 68631 64285 19504 38394 61026 94131
1103 94131 80206 49197 -9373 -38977 -17601 -18478 17098 20447 15288 -61650 -35475 -37406 -48947
1090 -48947 -8499 53755 24051 -13926 -10831 13942 28636 -1488 -35356 2592 -1949 11461
1078 11461 -5200 -10829 -9387 -17641 -24771 -12737 15376 70310 60298 -7461 37928 42476 44794
$$ packed form
1165c5681L5504l1458K420M044k3171M6795K7275L1991p5977M9864j9749r610
1153B247p345o3322L3709Q8852l86k0845o2304L2163L3209m826k1917m911L8644
1140D2968N7260r7116K5620j9702n1159J932j4600K3895K5754m6829O117O21j157
1127d6396O0397J3499j7203J4502j9496J7390j1361K1856J0892n3805P921n0673
1115e2477J9082k9309M5546L2230K7480N148K0931m346m4781J8890K2632L3105
1103I4131j3925l1009n8570k9604K1376q77L5576L349n159p6938K6175j931j1541
1090d8947M0448O2254k9704l7977L095K4773J4694l0124l3868L7948m541J3410
1078A1461j6661n629J442q254p130J2034K8113N4934j0012o7759M5389M548K318
$$ plain form
1065 44794 33340 -23947 -32633 -53044 -25472 -19992 -6156 -44780 -34354 25761 54617 25204
1053 25204 -36353 14374 6591 -4052 19484 33353 -3486 59186 13186 7774 -79716 -40431
1041 -40431 15764 -1922 30824 17394 139 -34800 19729 13452 1830 -22496 -83407 -53493
1029 -53493 -22426 12882 29297 12365 -7634 -66528 22070 5466 -13515 -26274 -64714 937
1017 937 29961 66528 46596 29097 27952 -19537 -42361 -25707 -81954 -3965 -2181 -57362 -1802
1004 -1802 38715 -29698 -86664 -109781 -94407 -5446 -12102 -23947 16833 63810 -15344 19203
992 19203 50695 47683 16089 38415 17587 14529 65311 16045 -38493 -60076 -9160 -2201 -44233
979 -44233 -57628 -46750 -13392 -5814 -79292 -47488 -52660 -30785 33591 6491 2142 10772 -65759
$$ packed form
1065D4794j1454n7287q686k0411K7572N480J3836l8624J0426O0115K8856k9413
1053B5204o1557N0727p783j0643K3536J3869l6839O2672m6000n412q7490L9285
1041d0431N6195j7686L2746j3430j7255l4939N4529o277j1622k4326o0911K9914
1029e3493L1067L5308J6415j6932j9999n8894Q8598j6604j8981j2759l8440O5651
1017I37K9024L6567j9932j7499j145m7489k2824J6654n6247P7989J784n5181N5560
1004a802M0517o8413n6966k3117J5374Q8961o656j1845M0780M6977p9154L4547
992A9203L1492l012l1594K2326k0828l058N0782m9266n4538k1583N0916O959m2032
979d4233j3395J0878L3358P578p3478L1804n172K1875O4376k7100m349Q630p6531
$$ plain form
966 -65759 -14814 1911 -2481 64154 79611 31050 52346 58908 32226 33685 21096 34128 16594
953 16594 -38394 13603 40714 55685 28667 -15824 -41186 -40771 -2278 46993 32041 -406
941 -406 6098 12553 42094 52171 27859 -18168 19378 -13088 -55860 -18594 -4963 -23260 23495
928 23495 -2066 -25616 -26891 13976 90094 22840 -11759 -31467 -26522 -7288 -11672 5502 -68458
915 -68458 -24486 -47491 -20527 25795 -15428 -39597 -60674 -65238 -15924 -24881 -187 -7439 1145
902 1145 -503 -43106 -619 81309 21251 74274 61795 -34392 -29770 -44640 -753 -14380 -285
889 -285 -11799 36513 -502 20900 25661 -27180 -41338 -2544 -31477 -918 2702 -60812 -56588
876 -56588 -79389 -3412 -30380 -20086 -33036 -79875 -23521 -43567 -26633 -73665 -28428 -22771
$$ packed form
966f5759N0945J6725m392O6635J5457m8561K1296O562k6682J459j2589J3032j7534
953A6594n4988N1997K7111J4971k7018m4491k5362M15L8493M9271j4952l2447
941d06O504O455K9541J0077k4312m6027L7546l2466m2772L7266J3631j8297M6755
928B3495k5561k3550j275M0867P6118o7254l4599j9708M945J9234m384J7174p3960
915f8458M3972k3005K6964M6322m1223k4169k1077m564M9314q957K4694p252Q584
902A145j648m2603M2487Q1928o0058N3023j2479r6187M622j4870M3887j3627J4095
889b85j1514M8312l7015K1402M761n2841j4158L8794k8933L0559L620o3514M224
876e6588k2801P5977k6968J0294j2950m6839N6354k0046J6934m7032M5237N657
$$ plain form
864 -22771 -32693 -68325 -12651 3220 -41276 9976 71634 48494 6672 8431 9777 1177 -21206
851 -21206 -59249 -100647 -48457 -13487 10535 -4618 57137 21098 28590 -7473 -51947 -49534
839 -49534 8076 16303 57645 22624 -15873 -21311 27044 60906 9957 -6517 35149 25484 -44427
826 -44427 -56654 -62583 -51684 -22569 4290 -33564 -18910 -21800 -96519 -78297 -84411 -85689 -105962
$$ packed form
864b2771r922l5632N5674J5871m4496N1252O1658k3140m1822J759J346q600k2383
851b1206l8043m1398N2190L4970K4022j5153O1755l6039P492l6063m4474K413
839d9534N7610Q227M1342l5021l8497n438M8355L3862n0949j6474M1666r665o9911
826d4427j2227n929J0899K9115K6859l7854J4654k890p4719J8222o114j278k0273
$$ [...]
##END NTUPLES=NMR SPECTRUM
##END=
