##TITLE=1H_CG-1164-2
 CDCl3
 8 sc, 
 20.10.2022
##JCAMPDX= 6.0         $$ Bruker NMR JCAMP-DX V2.0
##DATA TYPE= NMR SPECTRUM
##DATA CLASS= NTUPLES
##ORIGIN= UXNMR, Bruker Analytische Messtechnik GmbH
##OWNER= root
$$ XWIN-NMR		Version 3.5
$$ Thu Oct 20 14:27:08 2022 Russian Standard Time (UT+4h)  she@DPX200
##.OBSERVE FREQUENCY= 200.1313499994
##.OBSERVE NUCLEUS= ^1H
##.ACQUISITION MODE= SIMULTANEOUS
##.ACQUISITION SCHEME= undefined
##.AVERAGES= 8
##.DIGITISER RES= 18
##SPECTROMETER/DATA SYSTEM= spect
##.PULSE SEQUENCE= zg30
##.SOLVENT NAME= CDCl3
##.SHIFT REFERENCE= (INTERNAL, CDCl3, 0, 15.7403)
##AUDIT TRAIL= $$ (NUMBER, WHEN, WHO, WHERE, WHAT)
$$ ##TITLE= Audit trail, XWIN-NMR		Version 3.5
$$ ##JCAMPDX= 5.01
$$ ##ORIGIN= Bruker BioSpin GmbH
$$ ##OWNER= she
$$ F:/spectra/data/she/nmr/H-F/1/pdata/1/auditp.txt
$$ ##AUDIT TRAIL=  $$ (NUMBER, WHEN, WHO, WHERE, WHAT)
(   1,<2022-10-20 14:26:00.35 +0400>,<she>,<DPX200>,
      <created by zg, POWCHK disabled, PULCHK disabled
       configuration hash MD5:
       00 E9 B6 7A A2 85 ED C7 34 08 36 98 17 FE 4E 26
       data hash MD5: 16K
       19 BA E3 EE CF 81 8A 5F 43 FD C3 08 6A 56 47 FC>)
(   2,<2022-10-20 14:26:03.29 +0400>,<she>,<DPX200>,
      <Start of raw data processing
       efp BC_mod = 2 LB = 0.24 FT_mod = 6 PKNL = 1 PHC0 = -18038.88 PHC1 = 17.2007 SI = 16K 
       data hash MD5: 16K
       85 58 85 AE CF 84 6C A1 3D FB 1B 92 9B 3A F1 FB>)
(   3,<2022-10-20 14:26:29.15 +0400>,<she>,<DPX200>,
      <pk PHC0 = -0.1236557 PHC1 = -1.200001 
       data hash MD5: 16K
       0F 23 E1 1F 8B FA 6C F8 38 7F 8C E9 B1 BD 73 42>)
(   4,<2022-10-20 14:26:32.51 +0400>,<she>,<DPX200>,
      <abs ABSG = 5 
       data hash MD5: 16K
       7B 6A 73 B9 8B 04 B1 B1 4B 5F 66 EE 0B 1F A8 70>)
$$ ##END=
$$ 
$$ hash MD5
$$ DF 44 AD 3C 2F E4 2E 41 E6 C4 FF 21 87 2B B9 55
##$RELAX= 
##$RELAX= 
##$RELAX= 
##$RELAX= 
##$RELAX= 
##$RELAX= 
$$ Bruker specific parameters
$$ --------------------------
##$DU= <F:/spectra>
##$EXPNO= 1
##$NAME= <H-F>
##$PROCNO= 1
##$TYPE= <nmr>
##$USER= <she>
##$AMP= (0..31)
100 100 100 100 100 100 100 100 100 100 100 100 100 100 100 100 100 100 
100 100 100 100 100 100 100 100 100 100 100 100 100 100 
##$AQSEQ= 0
##$AQ_mod= 1
##$AUNM= <au_zg>
##$AUTOPOS= <>
##$BF1= 200.13
##$BF2= 200.13
##$BF3= 200.13
##$BF4= 200.13
##$BF5= 200.13
##$BF6= 200.13
##$BF7= 200.13
##$BF8= 200.13
##$BYTORDA= 1
##$CFDGTYP= 0
##$CFRGTYP= 5
##$CHEMSTR= <none>
##$CNST= (0..31)
1 1 145 1 1 1 1 1 1 1 1 1 1 1 1 1 1 1 1 1 1 1 1 1 1 1 1 1 1 1 1 1 
##$CPDPRG= <>
##$CPDPRG1= <>
##$CPDPRG2= <>
##$CPDPRG3= <>
##$CPDPRG4= <mlev>
##$CPDPRG5= <mlev>
##$CPDPRG6= <mlev>
##$CPDPRG7= <mlev>
##$CPDPRG8= <mlev>
##$CPDPRGB= <>
##$CPDPRGT= <>
##$D= (0..31)
0 1.2 0 0 0 0 0 0 0 0.06 0 0.03 0 0 0 0 0.0002 0 0 0 0 0 0 0 0 0 0 0 0 
0 0 0 
##$DATE= 1666261559
##$DBL= (0..7)
120 120 120 120 120 120 120 120 
##$DBP= (0..7)
150 150 150 150 150 150 150 150 
##$DBP07= 0
##$DBPNAM0= <>
##$DBPNAM1= <>
##$DBPNAM2= <>
##$DBPNAM3= <>
##$DBPNAM4= <>
$$ [...]
##$SUBNAM3= <"">
##$SUBNAM4= <"">
##$SUBNAM5= <"">
##$SUBNAM6= <"">
##$SUBNAM7= <"">
##$SUBNAM8= <"">
##$SUBNAM9= <"">
##$SW= 18.0517283424941
##$SWIBOX= (0..15)
0 0 2 0 0 0 0 0 0 0 0 0 0 0 0 0 
##$SW_h= 3612.71676300578
##$TD= 16384
##$TD0= 1
##$TE= 0
##$TE2= 300
##$TE3= 300
##$TEG= 300
##$TL= (0..7)
0 120 120 120 120 120 120 120 
##$TP= (0..7)
150 150 150 150 150 150 150 150 
##$TP07= 0
##$TPNAME0= <>
##$TPNAME1= <>
##$TPNAME2= <>
##$TPNAME3= <>
##$TPNAME4= <>
##$TPNAME5= <>
##$TPNAME6= <>
##$TPNAME7= <>
##$TPOAL= (0..7)
0.5 0.5 0.5 0.5 0.5 0.5 0.5 0.5 
##$TPOFFS= (0..7)
0 0 0 0 0 0 0 0 
##$TUNHIN= 0
##$TUNHOUT= 0
##$TUNXOUT= 0
##$USERA1= <user>
##$USERA2= <user>
##$USERA3= <user>
##$USERA4= <user>
##$USERA5= <user>
##$V9= 5
##$VALIST= <valist>
##$VCLIST= <CCCCCCCCCCCCCCC>
##$VD= 0
##$VDLIST= <DDDDDDDDDDDDDDD>
##$VPLIST= <PPPPPPPPPPPPPPP>
##$VTLIST= <TTTTTTTTTTTTTTT>
##$WBST= 1024
##$WBSW= 4
##$XGAIN= (0..3)
0 0 0 0 
##$XL= 0
##$YL= 0
##$YMAX_a= 134584
##$YMIN_a= -239197
##$ZGOPTNS= <>
##$ZL1= 120
##$ZL2= 120
##$ZL3= 120
##$ZL4= 120
##$ABSF1= 15.73918
##$ABSF2= -2.31267
##$ABSG= 5
##$ABSL= 3
##$ALPHA= 0
##$AQORDER= 0
##$ASSFAC= 0
##$ASSFACI= 0
##$ASSFACX= 0
##$ASSWID= 0
##$AUNMP= <proc_1d>
##$AZFE= 0.1
##$AZFW= 0.1
##$BCFW= 0
##$BC_mod= 2
##$BYTORDP= 0
##$COROFFS= 0
##$CY= -3
##$DATMOD= 1
##$DC= 0
##$DFILT= <>
##$DTYPP= 0
##$F1P= 0
##$F2P= 0
##$FCOR= 1
##$FTSIZE= 16384
##$FT_mod= 6
##$GAMMA= 0
##$GB= 0
##$INTBC= 1
##$INTSCL= 3.70164e-10
##$ISEN= 128
##$LB= 0.24
##$LEV0= 0
##$LPBIN= 0
##$MAXI= 10000
##$MC2= 0
##$MEAN= 0
##$ME_mod= 0
##$MI= 1.114404
##$NCOEF= 0
##$NC_proc= -7
##$NLEV= 6
##$NOISF1= 3.799351
##$NOISF2= 2.8
##$NSP= 0
##$NTH_PI= 0
##$NZP= 0
##$OFFSET= 15.74028
##$PC= 1
##$PHC0= -18039
##$PHC1= 16.0007
##$PH_mod= 1
##$PKNL= yes
##$PPARMOD= 0
##$PSCAL= 0
##$PSIGN= 0
##$REVERSE= no
##$SF= 200.130006255749
##$SI= 16384
##$SIGF1= 3
##$SIGF2= 2
##$SINO= 5.538805
##$SIOLD= 16384
##$SREGLST= <1H.CDCl3>
##$SSB= 0
##$STSI= 16384
##$STSR= 0
##$SW_p= 3612.71676300578
##$SYMM= 0
##$S_DEV= 0
##$TDeff= 16384
##$TDoff= 0
##$TI= <>
##$TILT= no
##$TM1= 0
##$TM2= 0
##$TOPLEV= 0
##$USERP1= <user>
##$USERP2= <user>
##$USERP3= <user>
##$USERP4= <user>
##$USERP5= <user>
##$WDW= 1
##$XDIM= 16384
##$YMAX_p= 335851678
##$YMIN_p= -1553136
$$ End of Bruker specific parameters
$$ ---------------------------------
##NTUPLES= NMR SPECTRUM
##VAR_NAME=  FREQUENCY,     SPECTRUM/REAL,   SPECTRUM/IMAG
##SYMBOL=    X,             R,               I
##VAR_TYPE=  INDEPENDENT,   DEPENDENT,       DEPENDENT
##VAR_FORM=  AFFN,          ASDF,            ASDF
##VAR_DIM=   16384,         16384,           16384
##UNITS=     HZ,            ARBITRARY UNITS, ARBITRARY UNITS
##FACTOR=    0.220516191357247, 1,           1
##FIRST=     3150.10236516036, 0,            0
##LAST=      -462.614397845423, 0,           0
##MIN=       -462.614397845423, -1553136,    0
##MAX=       3150.10236516036, 335851678,    0
$$ Real data points
##PAGE= N=1
##DATA TABLE= (X++(R..R)), XYDATA
$$ [...]
9202 22841561 22704894 22628896 22539976 22567392 22788030 23147110 23495841 24102693 24684761 25549224
9192 25549224 26282028 27401431 28159650 29074381 30206734 31243555 32706384 34254478 35947012
9183 35947012 37327080 38785248 39482101 38574547 36722563 34605555 32423325 30546570
9175 30546570 28944109 27576980 26495339 25499056 24548112 23526592 22398888 21345873
9167 21345873 20536046 19905507 19222468 18409990 17570464 16741668 16067786 15635000 15172787
9158 15172787 14514184 13908009 13814157 13622755 12985139 12643311 12398253 12134818 11632594 11322982
9148 11322982 11160403 11048299 11217314 10889115 10803573 10683808 10425053 10131899 10003037 9817396
9138 9817396 9682622 9679708 9450273 9338159 9437960 9233409 9146068 9247954 9319686 9229006 9159132
9127 9159132 9266420 9247250 9246702 9164406 9045089 9202281 9053048 8924330 8978509 8705873 8629169
9116 8629169 8724895 8630578 8438761 8298486 8528207 8443676 8163152 8091786 8035418 8121129 8235282
9105 8235282 8382544 8183035 8005116 8181914 7993804 8038416 8336922 8404175 8424818 8440468
9095 8440468 8395090 8478124 8551910 8360756 8403685 8450990 8572945 8665230 8665448 8814390 8996744
9084 8996744 9152891 9130309 9217760 9297319 9326058 9687311 9797172 10066109 9951419 10056618
9074 10056618 10165163 10238713 10719403 11008571 11098396 11436459 11628105 12136918 12196590 12565408
9064 12565408 13072061 13292681 13732466 14193746 14833601 15417867 15651473 15562084 15632687 15686155
9054 15686155 15592724 15341561 15484568 15531590 15541492 15695059 15867019 16106935 16249594 16358672
9044 16358672 16588483 16729299 17352537 17435603 17721068 18152416 18496026 19095411 19624786 20293793
9034 20293793 20912855 21631575 22273844 23012184 23920795 24942005 26166056 27332998 28465590
9025 28465590 30044082 32254411 34520136 36337635 37295441 37664025 37134016 36121404 35034355
9016 35034355 33741727 32642598 31824056 31319699 31130214 30707720 30264781 30103079 29951897
9007 29951897 29712985 29855496 30259049 30702030 31037071 31635337 32417146 33418932 34500883
8998 34500883 35535050 36868427 38006082 39862711 41675357 43509492 45531795 47680595
8990 47680595 49874220 52236088 54715351 58049201 62149293 66750265 72476691 78751493
8982 78751493 85125573 90479762 92935670 91939952 87804790 82328133 76353700 70577852
8974 70577852 66286799 63161713 60765256 58818943 56894199 54910184 53206786 51295736
8966 51295736 49666901 48123381 46875634 45976337 45525829 45474410 45829995 46332706 46904422
8957 46904422 47560965 48877613 50398152 51594322 53216094 55095586 57212234 59542523
8949 59542523 61866727 64391376 66807153 69376541 72748248 76937196 81731365 86357226
8941 86357226 90395663 92876976 92345949 88331180 81589465 73842846 66061380 59600056
8933 59600056 54452248 50260890 46891940 44223949 42350658 40459297 38914883 37187739
8925 37187739 35731391 34103155 32597284 31274421 30474084 29319193 28304562 27723833
8917 27723833 27114039 26690332 25837189 24938996 23860369 23017074 22315867 21211180 20140751
8908 20140751 19645946 19194642 18713103 18347126 18022117 17849464 17390364 16971167 16909854 16765077
8898 16765077 16184300 15897951 15809479 15572916 15553549 15414671 15190769 15017726 14802131 14645921
8888 14645921 14521883 14431189 14290134 14145057 14392031 14408501 14058014 14163111 14216448 14023314
8878 14023314 14240492 14424630 14759832 14771967 14607428 14665263 14543771 14556506 14679511 14857132
8868 14857132 14929498 15080077 15243373 15494493 15631695 15750543 15913643 16032008 16375495 16344218
8858 16344218 16729272 16983258 17036946 17392670 17819792 17816210 18245818 18792884 18813685 19042866
8848 19042866 19739183 20065145 20312685 20635879 21426132 21579547 22065538 22678969 23144683
8839 23144683 23599650 24268325 24986048 25520760 25949950 26359272 27053659 27720062 28606200
8830 28606200 29214421 30150055 30839779 31517774 31904249 32598509 33142265 33719735 34331293
8821 34331293 35026431 35721772 36274736 37165491 38137325 38734293 39312714 40208819 41237730
8812 41237730 42460219 43910152 45097114 46246825 47362792 48432710 49856209 51575743
8804 51575743 53437266 55992788 58727792 61792491 65210555 69200379 73530414 77894890
8796 77894890 81709838 84552318 86098027 86810804 87487629 88773187 90609969 92780825
8788 92780825 95458959 98810520 103004371 107874453 113469138 120117540 127672739 135412791
8780 135412791 142530495 147756765 149866174 148427339 144302827 138569174 131880180 126095343
8772 126095343 121032205 116955858 113598566 110610271 107685598 104920995 102290329 99462321
8764 99462321 97276250 95024141 93538592 92756120 92604749 93223603 94449593 95544378 96769047
8755 96769047 97506204 97510756 97314230 96770900 96541276 96940114 98111468 99679134 101336290
8746 101336290 103363197 105711954 108664461 111842850 115669796 119514767 122616074 124902239
8738 124902239 125281509 122921200 118953140 113407989 107448546 101733346 96647046 92096651
8730 92096651 88482068 85305398 82641494 80596996 78979986 77271514 75796615 74773988
8722 74773988 74279362 73503360 72776119 72354351 72293509 72551528 73059449 73642895 74616962 75942195
8712 75942195 78118314 80878598 84714802 89793949 95995284 104075371 114000795 127134640
8704 127134640 144718850 168548484 197698369 224737899 238700326 232167880 200788072
8697 200788072 162257810 131406353 109095659 93428045 82087612 73442868 66544914
8690 66544914 61597670 57690382 54088298 51095062 48671330 46519138 44521548 42658981
8682 42658981 41135043 39720374 38638177 37629864 36713978 36132255 35474134 34801105 33974351
8673 33974351 32975289 32134758 31413664 30846889 30174815 29707073 29016876 28636607 28276571
8664 28276571 27795385 27347512 26842786 26103721 25569448 25018805 24337971 23447010 22803830
8655 22803830 22245370 21673580 21178974 20761381 20273831 19838975 19312099 18785891 18298549
8646 18298549 18022774 17839334 17823369 17462619 17348311 17174656 16955333 16937507 16578751 16623509
8636 16623509 16523007 16233090 16109716 16159265 15921655 15807722 15531786 15500797 15337984 15086980
8626 15086980 14762189 14675055 14221509 14183035 13990579 13668901 13139286 12677817 12500798 12291857
8616 12291857 12037323 11515880 11378196 11179006 10949984 10637272 10369023 10055960 10031569 9873769
8606 9873769 9716414 9577387 9186082 8909401 8697818 8806305 8653004 8458521 8276587 8105478
8596 8105478 7934743 7867890 7779590 7632824 7533846 7548024 7554641 7648361 7522981 7336577 7351895
8585 7351895 7284527 7376373 7056452 6685874 6484801 6533976 6475289 6430528 6274657 6447932
8575 6447932 6552925 6719623 6461867 6634139 6362221 6207609 6360433 6360065 6538531 6285731
8565 6285731 6092920 6083579 6110092 6268898 6195247 6076941 6081399 6205352 6122811 6142104 6157386
8554 6157386 6028786 5925899 5890608 5741930 5698103 6085458 5950763 5659036 5805535 5830522
8544 5830522 5915788 6110667 5926351 6043354 6270860 6223425 6128777 6363425 6230443 6219233
8534 6219233 5976135 6035250 6034421 5990033 5759323 5753272 5844225 5850905 5550063 5523098 5656655
8523 5656655 5504614 5503469 5485596 5472781 5090140 5256510 5554082 5422577 5200060 5078275
8513 5078275 5138311 5243603 5406006 5436599 5207553 5165705 5129169 4958916 5087798 4969163
8503 4969163 4803372 4806410 4772949 4779357 4787159 4603197 4361667 4310263 4284009 4432927 4208478
8492 4208478 4140426 4205492 4086014 4161068 4241943 4215075 4070588 3744003 3458872 3377134 3265876
8481 3265876 3491207 3749730 3529942 3354302 3405813 3508661 3470468 3360384 3288280 3354771
8471 3354771 3327180 3294038 3368546 3209422 3045196 3121500 3158169 3151006 3194995 3031116 3043699
8460 3043699 2946501 2816186 2815638 2485474 2617962 2826887 2968159 2911329 2850009 2801089 2738682
8449 2738682 2731617 2745129 2441487 2373281 2638601 2571594 2421704 2697671 2900536 2859612 2301926
8438 2301926 2040143 2168781 2252692 2211174 2369889 2578056 2329780 2107184 2218906 2293339
8428 2293339 2287012 2268747 2306113 2455047 2533712 2671048 2611697 2331500 2421390 2526098 2603491
8417 2603491 2561648 2401524 2414456 2520500 2547898 2453761 2652479 2694269 2797589 2627137
8407 2627137 2477714 2653502 2499334 2469070 2513643 2270406 2063771 2145089 2201118 2154325
8397 2154325 2331929 2210925 2129339 2030526 2198452 2348294 2161507 1968307 2226593 2204157
8387 2204157 2091944 1906894 2058980 1912748 1963454 2062548 2199654 2057455 1741793 1634635
8377 1634635 1978301 1899494 1666605 1763328 2112204 1983789 2114016 2027428 1936390 2187990
8367 2187990 2168859 2111439 2159930 2137822 2141480 2189661 1977558 2014906 1844728 1831204 2079328
8356 2079328 2087668 2012382 2103512 2056998 2009658 1865343 1974571 1738018 1951209 2094034 1974545
8345 1974545 2079934 1948888 1958732 2153744 1952113 1880371 1898909 1862313 1667085 1616799 1824126
8334 1824126 1832728 1581481 1744914 1584916 1581973 1495472 1597318 1676529 1582062 1617895 1540941
8323 1540941 1472160 1443187 1253281 1392181 1317903 1375166 1390382 1204274 1171324 1243244 1331307
8312 1331307 1417152 1261455 1263173 1225810 1250207 1266371 1055195 879597 865818 1043460 1179958
8301 1179958 1051648 1073650 969296 937965 1100970 1033185 1011002 1141731 1000589 1060662
8291 1060662 1217098 841912 843444 931664 997694 985000 1038303 907053 922152 800590 828063
8280 828063 770921 797067 869825 884929 1030711 985694 978957 1074099 831861 786913 648294
8269 648294 652212 870778 1011488 912407 892740 858986 745510 685854 607149 828521 952870
8258 952870 946122 914184 869447 992360 919449 777184 773314 635419 767050 892116 691018
8247 691018 837949 947797 858917 834236 950533 912617 942696 841071 781775 912920 977426
8236 977426 930132 1103077 1275368 1248364 1281665 1225044 1112071 1170350 1272640 1190449 1446781
8225 1446781 1706410 1961697 2227169 2302159 1785248 1572343 1564905 1372659 969011 1014038
8215 1014038 1087441 1197142 1125495 1076953 1165054 1143735 908031 869613 892821 898589 913122
8204 913122 893877 783330 685977 807469 942907 815421 944395 1010804 1026914 1010032 1050374
8193 1050374 1104774 -1553136 -884562 407951 348941 407713 355905 541715 207050 385534
8183 385534 534956 729652 773318 707442 831319 760639 560958 821988 828356 731451 776487
8172 776487 614820 605376 563845 464789 629269 288494 485925 596822 474645 426489 499660
8161 499660 319479 578696 803639 417380 400790 252997 464338 797201 717154 668731
8151 668731 504218 355387 363722 498061 292032 161873 266431 328427 352442 279949 474125
8140 474125 129196 161357 329896 535499 429893 410212 392430 223344 343076 226010
8130 226010 112125 186038 62694 132159 283787 260347 344346 408128 525232 388498 157437
8119 157437 218456 198862 400627 641035 577108 540283 317303 314027 358863 435679 245358
8108 245358 228858 275716 143085 420299 518300 380909 424003 607576 316436 115717
8098 115717 428047 431548 252761 132480 481313 668399 572921 502625 228631 300461 432377
8087 432377 380079 342570 337109 497236 342370 361799 299379 318194 261427 437584 364340
8076 364340 401643 689880 584135 355944 411214 284156 217756 65798 266429 473567
8066 473567 230583 184171 344269 461795 546462 386970 504815 441735 279238 419639
8056 419639 282590 139146 283893 394942 350296 98135 -125835 -2081 154466 24066
8046 24066 81985 -95686 -148367 49362 159966 249161 123388 133090 -112686 -130047 -109737
8035 -109737 -120589 -8534 97769 49949 181635 111043 93674 -67147 -80145 56975 191605
8024 191605 211763 64522 -100904 184338 72910 119066 65940 114127 386610 327714 304987
8013 304987 314627 235840 174811 283188 381099 241632 64247 180203 456661 520262 556151
8002 556151 487609 312234 185854 173855 -4324 15706 -65645 -139946 231565 339725 347167
7991 347167 89202 117246 24924 73341 133612 252094 311913 189547 179703 171360 420263
7980 420263 368012 311132 148647 219937 21360 -191369 24544 310099 125068 135816
7970 135816 128382 52103 195084 101382 -58655 -6938 53661 -11778 -50191 -99726 141710
7959 141710 -28902 -489972 -118079 129961 -72629 -1744 50960 133440 176395 112911 315071
7948 315071 328310 120047 95571 178273 172089 103142 86800 112773 106645 245130 17132
7937 17132 7019 53491 137287 86904 -10454 -76729 99196 226128 74288 80285 -117329
7926 -117329 -27144 34291 -93659 24723 164482 -172370 -96192 -15659 142014 63618 30189
7915 30189 55616 209907 131375 6166 -195611 -6562 3604 179817 225995 250639 -11060
7904 -11060 132268 79216 -187056 -264648 -48859 211533 -37860 -44560 -92739 141302 457886
7893 457886 405913 224037 -35649 176538 259769 163513 204901 172192 122651 -101385 35515
7882 35515 -60174 -34544 -126534 86874 78217 90158 117479 5043 42513 145151 -4758
7871 -4758 66809 275301 205381 302543 165600 247124 -64590 -150996 -28184 -52524 -212517
7860 -212517 -173307 157240 -4829 -91597 -181225 -146404 -73010 -42259 -299483 -267389 -26092
7849 -26092 32499 67122 -108050 17758 160204 254234 11092 -48216 -161177 -189683 -87290
7838 -87290 -1078 -64418 100132 54592 -205387 -237473 -232559 -177597 239820 216269 -162887
7827 -162887 -38410 10100 16367 46231 -95553 -131412 -14813 -154136 -64093 -128588 -323950
7816 -323950 -398233 -474948 -553928 539627 515654 372693 412014 118594 59340 -47286 17875
7805 17875 -57188 51542 29521 67589 216968 121540 21379 -18437 103534 62141 21758
7794 21758 105651 168025 108370 70506 120458 91742 -82629 -32801 -226603 -10981 132860
7783 132860 94818 27917 -84477 -33979 97186 -157848 -56943 28245 -33747 -264727 -314884
7772 -314884 -23211 -83664 -195725 43580 219634 21843 -15580 -6663 152203 68962 -285107
7761 -285107 -418559 -373427 -197555 62829 107080 -91074 -107003 -224921 -35414 129104
7751 129104 147723 186354 64145 375966 318293 49452 6789 84619 2563 128221 -98399
7740 -98399 22460 -70801 143412 268071 263218 62558 -33686 -17215 -55565 -1783 146922
7729 146922 120165 91918 85477 251568 19482 63006 -102367 -132316 123959 145992 152602
7718 152602 85756 101540 101918 40272 -140201 -19836 -277 -139319 77189 184493 358639
7707 358639 542350 333985 182239 -141135 -137051 -73110 -5257 401 -120183 -20787 64353
7696 64353 2588 191666 90998 -24121 -2775 -85667 -233239 -157373 143645 1350 -109592
7685 -109592 -145511 -325819 -220342 -225840 -266555 -76503 -92058 -168031 -15854 -46593 103751
7674 103751 169968 68867 56486 276315 428435 94656 6975 31151 -32334 124834 226981
7663 226981 101368 -122125 37764 184351 127613 164125 237926 60042 -123196 -358265
7653 -358265 -244065 -45465 -100857 12607 -293257 -237448 62623 -24540 66850 119144 113735
7642 113735 38415 84059 -6115 -298565 -208048 -225885 -96071 114050 114187 244761 106682
7631 106682 26539 22352 -115126 14548 115492 98324 111728 60372 -79064 90292 165818
7620 165818 119799 -81976 -250103 -146763 -42410 164412 191257 288992 249677 -47506
7610 -47506 -247363 -165298 -112392 4623 -72617 123002 168089 226692 192147 260474 11465
7599 11465 -11701 269763 70226 134025 -54371 87327 115696 -678 45579 199185 322940
7588 322940 254023 165119 -88386 -17872 40567 158719 205843 21106 -41326 -25094 -2777
7577 -2777 -104367 6228 396371 211940 152982 364584 -70736 -240159 119465 292324
7567 292324 22756 35037 23280 171968 156052 177867 213565 242257 224457 230162 31230
7556 31230 -177146 -194397 -24367 39191 -359950 -95145 98451 202997 385816 191646
7546 191646 169338 220549 109170 129887 76716 170193 230848 175166 73576 162728 200931
7535 200931 306176 422060 475492 263422 183070 377409 265325 349336 351370 486459 365157
7524 365157 333351 455171 350518 429428 565579 598956 500717 835366 778504 320763 456027
7513 456027 432956 517338 406994 370123 420108 396529 325258 666179 695966 550018 471761
7502 471761 384199 461335 242389 309307 198438 119497 136111 170974 518828 712246 804957
7491 804957 904439 1015469 841525 787813 762098 706118 901370 788563 592289 474019
7481 474019 475807 237689 50218 27496 279490 695633 707447 601783 468634 521433 405907
7470 405907 291816 346307 477532 679241 712960 555861 440872 436902 222082 171913 65917
7459 65917 184744 162238 76164 41488 277745 314230 281278 357743 406466 271616 240799
7448 240799 108888 276980 513117 399913 311100 196307 334510 232815 182822 316855
7438 316855 230614 35802 407620 300965 320955 413481 293303 61985 -39322 186176
7428 186176 267789 349417 380095 323269 323653 474597 233109 178620 433977 404707 236190
7417 236190 413100 439207 390216 309692 348410 522142 501406 459442 505123 571204 362166
7406 362166 172562 179998 262472 179156 100684 238909 446066 330886 49602 148160 313219
7395 313219 135085 344010 527427 265983 174137 140068 392365 619331 843974 597891
7385 597891 384190 394157 440032 411007 409210 528162 443975 389726 311593 416224 530969
7374 530969 548193 436107 293714 402763 257218 380304 371357 365652 514731 578939 528742
7363 528742 430878 557049 440384 511859 303785 284086 421240 335334 371649 391163 336448
7352 336448 416405 397921 491474 612176 703286 774740 618374 234504 367703 279950 466286
7341 466286 528096 423758 463542 462401 476362 546455 571550 376852 400830 317719 364047
7330 364047 518532 242161 396550 529359 361064 573506 528075 349768 180581 112074
7320 112074 352062 555072 503282 476108 606567 592487 730195 755998 661477 603103 477041
7309 477041 421839 487253 603436 623105 595853 771864 711257 663572 550544 324333 401308
7298 401308 248071 514799 412832 446994 566633 420109 270033 514231 639050 389562
7288 389562 243533 402183 394223 284064 407253 659935 668603 483610 518110 624461 563158
7277 563158 466375 766296 610428 377888 627067 818615 858105 501330 540568 669762
7267 669762 649580 735599 662825 597818 621808 600005 692464 741396 950097 583788 444562
7256 444562 553037 625275 689849 726425 916896 901792 853335 625965 811095 801276 932713
7245 932713 1117911 931342 993168 1036762 1001103 854475 987142 1043007 986000 1040252 807991
7234 807991 747431 702783 747308 673249 977332 1126880 1017207 990730 984832 1183953 1285989
7223 1285989 1103486 1081418 891099 953022 936208 1032248 1212906 1182482 1244422 1262005 1107890
7212 1107890 1348883 1492753 1493619 1514888 1310213 1226984 1148616 1292991 1060293 1392861 1501555
7201 1501555 1373642 1612545 1483707 1382049 1349952 1487255 1717227 1662916 1495682 1593365
7191 1593365 1615965 1564717 1810687 1741011 1668644 1701509 1761545 1790642 1601258 1928232 1971593
7180 1971593 2049435 1973524 2093637 2342243 2190667 2236954 2269771 2186168 2175453 2477431 2447280
7169 2447280 2306073 2298697 2455023 2664941 2890934 3024671 2844674 2884873 2960156 3062240
7159 3062240 3206509 3359880 3616128 3373338 3375732 3687023 3932960 4108652 4104793 4031450
7149 4031450 4170652 4458819 4857532 4731176 4735564 4609534 4655447 4939859 5179082 5584896
7139 5584896 5437473 5534383 5758026 5944075 6147519 6269972 6434163 6549258 6569438 6933611
7129 6933611 7305160 7664505 8008884 8433710 8861147 8813584 9260454 9738078 10163215 10533319
7119 10533319 10889924 11731790 12358877 13058331 14216421 15289786 16423156 17772509 19496420
7110 19496420 21410849 23630748 26822961 30124289 33338297 36562343 39056128 40085328
7102 40085328 39547165 38055538 36359073 35824354 36084176 36978741 39327939 42742999 47095529
7093 47095529 52192228 58441600 65030053 71445556 76636916 78992539 77819450 72927631
7085 72927631 65302633 56758947 47938016 40449216 34265227 29436209 25650311 22622981
7077 22622981 20211279 18231498 16602560 15096206 14086815 13188882 12166355 11239250
7069 11239250 10539758 10053032 9521930 9035138 8677181 8228043 7748077 7537129 7385001
7060 7385001 7103588 6842571 6461130 6253695 6196691 5907700 5870305 5806968 5458941 5391382
7050 5391382 5124894 5143186 5020980 4885873 4475242 4402876 4493868 4506400 4425609 4192465
7040 4192465 4063998 4004242 3840176 4076879 3864160 3848193 4045246 3906736 3689645 3673884
7030 3673884 3798865 3959879 3982413 4060732 4228564 4046216 4144142 4547372 4935809 4943113
7020 4943113 5211987 5510794 5656351 6021200 6292575 6588969 6733788 6487379 6393411 5972660
7010 5972660 5514319 5164807 4448915 3899756 3828996 3718674 3459281 3261425 3216965 3252284
7000 3252284 3151583 2942647 2820539 2664801 2721195 2873117 2812727 2640345 2561709 2583367
6990 2583367 2733020 2790513 2783424 2823072 2316125 2342511 2777891 2691889 2738286 2781912 2784445
6979 2784445 2767804 2680595 2656756 2816573 2712326 2727686 2586232 2707459 3084759 3069524
6969 3069524 3067959 3013262 3107817 3310893 3355136 3369447 3414714 3530483 3510996 3665071 4205196
6958 4205196 4216848 3966550 4116529 4506645 4525802 4415429 4510021 4660123 4824855 4847417
6948 4847417 4952497 4854238 4885141 5321132 5024440 4756076 4960008 4891155 4816963 4617298
6938 4617298 4557868 4515778 4294640 4275849 4127222 4162605 4003477 3940792 3659382 3646404 3788571
6927 3788571 3483903 3299924 3131220 3160662 3145769 2986108 2983367 3099302 3105092 2928987 2614656
6916 2614656 2417493 2341350 2397478 2415146 2132719 2154552 2564234 2384978 2231680 2115215
6906 2115215 2181945 2423063 2463830 2336073 2057735 1790856 1594826 1572679 1479189 1693579
6896 1693579 1946870 1690605 1295389 1305050 1452167 1237040 1454313 1419772 1511561 1396823
6886 1396823 1241152 1252179 1363492 1386607 1388479 1319280 1414436 1410138 1230781 1297693 1261292
6875 1261292 1281383 1339851 1305591 1052941 983076 1325051 1420746 1394261 1390983 1189080 1030914
6864 1030914 1035315 1345714 1305576 1231652 1154783 1054236 1041624 1177006 1284170 1156390 1094815
6853 1094815 1416767 1196499 1031059 1035730 1042857 998124 773506 991664 1163289 1267416
6843 1267416 1095143 849445 778966 1069136 1544439 1403838 1140663 1195617 1423783 1371160
6833 1371160 1342625 1231808 914891 728211 890820 1046296 1206231 1342266 1048097 1041743
6823 1041743 1063301 1118644 1256471 1055196 957922 1120773 1216317 1298242 1226639 1271283 1372430
6812 1372430 1148441 999159 1166556 1088377 942449 1278382 1341930 1527943 1444262 1344760
6802 1344760 1395890 1213678 1380873 1358837 1280124 1276451 1071100 1389701 1348343 1359271 1476705
6791 1476705 1414460 1332755 1253144 1285816 1357340 1278890 1359152 1504790 1385813 1526003 1527609
6780 1527609 1331324 1306733 1326285 1621415 1712993 1550539 1357689 1422446 1483357 1408443 1419954
6769 1419954 1458705 1401747 1539974 1502422 1354807 1294424 1454943 1599935 1390505 1512083
6759 1512083 1647153 1711939 1739710 1707980 1642996 1640143 1516110 1376864 1296303 1441709 1556744
6748 1556744 1682472 1921472 1843883 1487503 1662696 1845425 1901173 1790906 1698225 1702609
6738 1702609 1391975 1452365 1698749 1615115 1597939 1766143 1656129 1677020 1644651 1760920
6728 1760920 1834236 1784339 1538207 1393860 1682412 1665013 1899420 2023511 1775435 1759651
6718 1759651 1848099 1688354 1661784 1467390 1543568 1531481 1793786 1815076 1688109 1751041 1714542
6707 1714542 1684531 1649080 1450973 1540981 1844908 1771142 1820815 2030429 1892981 1876651 1959338
6696 1959338 1803760 1738815 1899754 1830085 1701960 1582850 1854912 1768612 1965951 2036355
6686 2036355 1740720 1556332 1531849 1796209 1973149 2032612 2040754 1919552 1881838 2000283
6676 2000283 1758040 1536440 1549082 1453849 1648180 1552377 1286797 1440508 1465613 1320467
6666 1320467 1242552 1382532 1233622 1394423 1494459 1585681 1317565 1252102 1246059 1295979 1646498
6655 1646498 1613131 1618555 1591169 1699126 1663721 1504450 1690504 1510835 1447566 1472685 1545121
6644 1545121 1507580 1591120 1648523 1510855 1567597 1672844 1514010 1326097 1419366 1344380 1428890
6633 1428890 1451234 1221481 1285962 1434214 1421480 1602700 1499137 1417243 1439379 1599754
6623 1599754 1834007 1552630 1405903 1450217 1542835 1527615 1538697 1446348 1363297 1146780 904309
6612 904309 1210374 1523593 1300976 1392397 1522703 1422099 1394396 1446754 1410949 1535775
6602 1535775 1290507 1253705 1188398 1291749 1261638 1236479 1350544 1447705 1450067 1476470 1669743
6591 1669743 1774011 1571147 1441203 1366638 1395878 1558592 1648216 1479711 1608196 1503053
6581 1503053 1437571 1500345 1742640 1632041 1589948 1681136 1468582 1440558 1412838 1295409 1312733
6570 1312733 1339945 1306065 1390564 1482881 1707159 1674037 1619070 1539820 1617881 1513231 1549425
6559 1549425 1218803 1163669 1325175 1433641 1502348 1492146 1157433 1362416 1378093 1348553
6549 1348553 1505276 1522646 1607431 1585641 1553381 1844900 1932420 1715103 1340701 1309756 1665805
6538 1665805 1407148 1151187 1162367 1385888 1667866 1386830 1427936 1373521 1572505 1745665
6528 1745665 1749776 1723539 1604481 1536878 1596059 1439420 1536469 1467713 1482053 1489982 1321110
6517 1321110 1475303 1573503 1283022 1168408 1378929 1486240 1374912 1554852 1629438 1441746
6507 1441746 1548864 1443153 1294142 1351068 1412938 1656213 1590621 1455530 1280596 1205070
6497 1205070 1429280 1377954 1547224 1525778 1291709 1172291 1548859 1636747 1729427 1654393
6487 1654393 1294042 1179157 1357470 1627440 1692431 1603876 1527762 1466195 1636981 1675543
6477 1675543 1687710 1827327 1738809 1705114 1690053 1500338 1560908 1778167 2012565 1995171 1878336
6466 1878336 1973052 2015053 2044093 2015680 1974725 1825182 1751935 1607041 1695696 1919049 1756944
6455 1756944 1930196 1888883 1793141 1554642 1483729 1756789 1779382 2048888 1832930 1552963
6445 1552963 1615400 1456975 1607995 1506495 1278087 1425119 1240319 1307888 1589173 1485264
6435 1485264 1536023 1333640 1589493 1773587 1783115 1682917 1731643 1916235 1745956 1644788
6425 1644788 1763784 1747464 1493516 1476159 1595471 1727324 1891768 1879696 1835811 1807149
6415 1807149 1745676 1953097 1940326 1804675 1993845 1995036 1854727 1898845 1719143 1499283
6405 1499283 1599606 1749886 1552500 1557281 1585365 1805171 1842222 1747791 1726102 1857768 1793774
6394 1793774 1683586 1878120 1552728 1473102 1486042 1732815 1763503 1545487 1445700 1581302
6384 1581302 1727415 1714507 1808878 1881972 1706683 1821824 1720800 1721316 1928002 1711158 1552437
6373 1552437 1749128 1906432 1859597 1896712 1751324 1842877 2008631 1896941 1782328 1814006
6363 1814006 1725387 1739408 1724023 1762212 1762208 1693192 1689844 1661995 1696169 1901842 1900040 1648202
6351 1648202 1540378 1320803 1525271 1842679 1933248 1699241 1574604 1708540 1794244 2044282
6341 2044282 1915841 1914078 1782303 1865208 2024902 2025892 1870856 1618821 1707733 1551362 1800899
6330 1800899 1855697 1847701 1906236 1762766 1835561 1969991 2066992 2143182 2021054 1953498 2038401
6319 2038401 1886931 1948628 2078210 2050878 1940978 1897407 2077975 2132623 1990711 2141234
6309 2141234 2019369 2021515 2073874 1952425 1946349 2233450 2160250 2195051 2237460 2161134 2156549
6298 2156549 2231273 2144408 2136010 2292839 2017990 2072960 2346219 2322272 2785607 2582282 2360265
6287 2360265 2580811 2497462 2386196 2527391 2569108 2680351 2803875 2575868 2476990 2404190
6277 2404190 2539903 2736289 2721457 2483920 2347165 2458718 2449685 2339690 2242017 2201181
6267 2201181 2511680 2659679 2687561 2816480 2796199 2635480 2466517 2440214 2330091 2448257
6257 2448257 2480680 2515118 2774976 2832233 3042593 3098773 2953310 2874086 3074769 3063532 2867432
6246 2867432 2907713 2830908 2617965 2513854 2418146 2392872 2658303 2826823 2743239 2770029 2595095
6235 2595095 2596769 2305584 2484537 2668158 2615337 2330886 2326058 2516874 2633548 2356830
6225 2356830 2090416 2122499 2286329 2642162 2862824 2958206 2859007 2719565 2681981 2705295
6215 2705295 2991439 3111152 2770994 2761825 2805187 2932517 2970378 2975432 3017995 2905689 3014187
6204 3014187 3006306 2888226 2801288 2794222 2922647 2750404 3014708 2960123 2969208 2930119 2788647
6193 2788647 2870976 2679808 2825212 2796841 2686593 2781290 2824635 2673829 2755820 2925115
6183 2925115 2998278 2748975 2887644 2819114 2660968 2823351 2858023 2991926 3015558 2956439
6173 2956439 2827497 2741803 2666702 2952696 2847928 2864924 2869220 2780521 2945709 2810804 2792362
6162 2792362 2835099 3063954 3213849 3075435 3038798 2844624 2886873 2797906 2816142 2820840 3105770
6151 3105770 3339331 3285108 3177322 2939364 3157467 3309236 3230202 3432583 3307755 3225953
6141 3225953 3313050 3312678 3334770 3587876 3563030 3229013 3271719 3361139 3480233 3370552 3475307
6130 3475307 3510034 3566872 3807443 3865709 3836807 3839065 3740682 3758954 3569633 3713067 3786884
6119 3786884 3912149 4058588 4050937 3960399 3969864 4224299 4127128 4457887 4764332 4920399 4761560
6108 4761560 4854050 5160898 5624633 5509895 5402327 5836415 6132131 6435070 7034885 7564894
6098 7564894 8159495 8883591 9560455 10205395 10337425 9861198 9060349 8474629 8322887 8337489
6088 8337489 8410646 8632777 9159165 9893098 10074738 10158208 9771578 9048344 8355018 7877224
6078 7877224 7376265 6726796 6586377 6419320 6045285 5970400 6068321 6137619 6126983 6323400
6068 6323400 6077506 6065520 5919320 5857621 6032203 6038883 5933023 5989409 6279354 6168784
6058 6168784 6053181 6337976 6622985 6772902 7004733 7455578 7782085 7990956 8358315 8718730
6048 8718730 9331257 10199970 11179015 12141681 12705577 12786834 12424885 11717904 11186816 10705634
6038 10705634 10630777 10537189 10782291 11429507 11893375 12537597 12782943 12563875 11905640 10779527
6028 10779527 9783407 9116745 8531930 8115394 7673557 7476451 7379824 7279461 7132890 6838732
6018 6838732 6734558 6884773 6853412 6727166 6649011 6822107 6923531 6641213 6791444 6899240
6008 6899240 6819495 6886223 6942701 6832513 6863593 6950543 7085629 6937607 7189664 7408507
5998 7408507 7397938 7016876 7066519 7348006 7313235 7284580 7594248 7711928 7671414 7680910 7796815
5987 7796815 7812122 7910084 8128383 8083815 8319041 8410796 8298756 8572352 8890378 8940520
5977 8940520 9098955 9251546 9401335 9752839 10172028 10282689 10151183 10341779 10319206 10534637
5967 10534637 10425541 10342604 10532246 10679711 10711336 10930417 10975877 11123235 11424222 11433447
5957 11433447 11675399 11857378 12131447 12265179 12573949 12982190 13472671 13797802 14216261
5948 14216261 14472568 14759348 15335504 15854327 16086861 16418438 16719863 17152375 17539327
5939 17539327 18126815 18327086 18675531 18927587 19278015 19565624 19714652 19974568 20143442
5930 20143442 20391177 20951880 21391203 21790497 21973915 22578103 22891278 22986554 23662474 24200072
5920 24200072 24482110 24695900 25214174 25913212 26504736 26944042 27524717 28090304 28325931
5911 28325931 28988527 29549460 29991326 30736139 31190547 31977277 32944292 33932946 34867565
5902 34867565 35907777 36993027 38292199 39718185 40866840 42200936 43654775 44824464
5894 44824464 46184953 47470486 48962419 50691379 52315497 54055455 55860339 58007462
5886 58007462 60447749 63015921 66124823 69860859 74101326 79026815 84614179 90084489
5878 90084489 95969228 102252893 108219068 114192038 119290912 123052014 125717859 126664545
5870 126664545 126122268 124376825 121210096 117114930 112243415 106338363 100301328 94448732
5862 94448732 88255040 82619580 77319586 72719019 68441055 64489997 60896270 57455526
5854 57455526 54458909 51736859 49171788 46844277 44943718 42904195 41464930 40046605
5846 40046605 38669078 37116055 35689592 34656150 33433412 32088607 30835919 29497892
5838 29497892 28676751 27819599 26956820 26146230 25435305 24893882 24531406 23992023 23328616
5829 23328616 23140797 23020789 22432345 22004773 21579203 21237743 21021645 20821108 20497296
5820 20497296 20138418 19954685 19890128 19834752 19764601 19592241 19671970 20237046 20592529 21090161
5810 21090161 21399932 22084854 22983636 24615518 26355479 28363706 30707025 34419829 39367887
5801 39367887 45343179 52073441 57894062 60342867 57291103 49871278 41363617 34613192
5793 34613192 29213700 25278551 22373865 20433930 19110629 17968454 17084766 16793454
5785 16793454 16548285 16233387 16082204 15645090 15141756 14544942 14009356 13643569 13360989
5776 13360989 13580997 13405250 13539255 13744750 14054712 14684038 15259333 15647057 15543412
5767 15543412 15200281 14373154 13217853 12341967 11731885 11197479 10884485 10098031 9525593
5758 9525593 9257337 9253003 9418936 9413519 9441432 9576888 9395438 9316208 9422483 9654431 9977906
5747 9977906 10145585 10732026 10994898 11150722 11649487 12183259 12702280 13416947 13802899 13509591
5737 13509591 12770141 11933189 11066645 10601432 10067165 9568012 9232345 8913693 8892912 8609925
5727 8609925 8726119 8625283 8356067 8381564 8433176 8686248 8856409 9060976 9348925 9528043
5717 9528043 10004336 10713846 11337533 11666488 12175346 12445462 12747232 12013983 11146336 10399856
5707 10399856 9522346 8902093 8454284 8234009 7685120 7578510 7624755 7485231 7469316 7430812
5697 7430812 7414330 7675479 7842534 7956813 8200755 8530551 9041754 9198749 9765242 10222653
5687 10222653 10289924 9832433 9172949 8801489 8200741 7675485 7276446 7060045 6795760 6879384
5677 6879384 6808462 6543838 6502409 6448031 6284493 6630860 6946715 6981834 7306412 7451991
5667 7451991 7478388 7611090 8079957 8879377 9470280 10228510 10594814 10220582 9771580 9087312
5657 9087312 8428768 8004454 7563338 7097973 6778210 6704169 6442814 6042474 6252069 6218900
5647 6218900 5937946 5890227 5809126 5664639 5718656 5722374 5786191 5797421 5907101 5695890 5409139
5636 5409139 5504771 5520459 5804501 6105453 5965968 6152397 6111739 6153167 6110152 6008821
5626 6008821 5922306 5778369 6085509 6166730 6273658 6122594 6181296 6497944 6561896 6744814
5616 6744814 6884939 7270436 7161775 7497443 7880957 7588305 7740982 8083143 8309444 8242886
5606 8242886 8226899 8204823 8122171 7992727 8205874 8421131 8482031 8585839 8666614 8646458 8768120
5595 8768120 8620778 8661943 8390463 8361335 8292363 8434069 8666912 8627198 8620077 8540607 8448410
5584 8448410 8531814 8546614 8760279 8760064 8862119 9122222 9460986 9745898 9837283 10105090 10365294
5573 10365294 10584411 10815939 11130044 11688477 11875505 12349912 12425487 12988946 13727000 14042128
5563 14042128 14548406 15336879 15873797 16445411 17251244 18352165 19655050 21134009 22853682
5554 22853682 24949181 27788763 31529386 35607428 40678395 47574277 56532281 66675436
5546 66675436 76686751 83815011 82973135 73407009 60345109 49129570 40501477 34553408
5538 34553408 30562170 27583582 25453918 23532582 22152930 20986464 19880899 19248575
5530 19248575 18465618 18309917 17735366 17571640 17438261 17183316 16924291 16981692 17162528 17177606
5520 17177606 17078254 17495351 18156817 18731468 19716052 20592290 21244622 21322650 20172800 18308955
5510 18308955 16396852 15199842 14129098 13440145 12952951 12775541 12412027 11919309 11396502
5501 11396502 11347873 11190119 11290629 11287385 11132313 11223578 11234192 11243372 11048188 11140671 11404309
5490 11404309 11602955 11427632 11304455 11256716 11117914 11185766 11408136 11362590 11455619 11458537
5480 11458537 11591672 11785696 11491680 11653314 12101788 12482938 12718317 13028147 13266864
5471 13266864 13523892 14032189 14610625 14913206 15517767 15776846 16218114 16712877 17063721
5462 17063721 17365498 17818464 18224553 18321685 18328455 18280708 18147957 18369800 18453573 18253832
5452 18253832 18378012 18407743 18324644 18379470 18520097 18684068 18763102 18859285 19118636 19404890
5442 19404890 19973250 20119617 20703130 21240217 21744699 22303811 22613862 23240953 24353341
5433 24353341 25313161 26150762 27064206 28025420 29051923 30183254 31026921 32146186 33238241
5424 33238241 34431064 35729617 37350654 39047865 41445325 43949391 46400983 49064880
5416 49064880 51780795 53977918 56413555 58545296 60113763 61402931 62366917 63027425
5408 63027425 63449418 63635169 63737995 63817168 63589849 63618280 63880233 63976877 64591620 65382180
5398 65382180 66324685 67217302 68069872 68579337 68411349 68147179 67259343 65688853 63829628
5389 63829628 61528265 58917951 56169825 53438678 50802516 48123195 45508634 42850159
5381 42850159 39979014 37266611 34632063 32126455 29945312 27869289 26239458 24788087
5373 24788087 23164611 21841334 20803098 19750535 18841963 18209200 17708869 17220806 16336270
5364 16336270 15986451 15843638 15652930 15526998 15217351 15012025 14724994 14578222 14353383
5355 14353383 14247853 13939571 13459347 13134959 12849567 12487015 12193406 11832012 11552430
5346 11552430 11347707 10968553 10825825 10620689 10299355 10388402 10125324 10119056 9949315 9948113
5336 9948113 10202184 10143747 9648369 9474665 9320078 9060649 8917951 8710876 8612584 8354190
5326 8354190 8071332 8041655 7853767 7409575 7196987 7242973 6965550 6879311 6710378 6491885
5316 6491885 6278081 6436041 6346115 6155792 6304543 6280120 6358978 6306710 6038883 5910677
5306 5910677 5904526 5970152 6169386 6444220 6203203 6094687 6181298 6185198 6337459 6392043 6480183
5295 6480183 6494980 6816702 7129456 6914660 6952898 7269283 7235457 7462856 7966947 8058526
5285 8058526 8024333 8150188 8007944 8114255 7916749 7710363 7591119 7203760 7382681 7572362
5275 7572362 7266744 7129878 7206766 7172052 7026319 6935265 7225070 7254250 7244891 7468112 7664131
5264 7664131 7692118 7806542 7848901 7955522 8150079 8303353 8580355 8827873 8882105 9185767
5254 9185767 9329528 9206230 9185847 9074388 9177559 8945339 8998737 9048994 8883106 8750813
5244 8750813 8882041 8937931 9128813 9394164 9389177 9486145 9709133 9889572 10041802 10377015
5234 10377015 10831576 11390090 12103089 12752349 13159982 13852726 14475318 15849150 17388286
5225 17388286 18717111 20292135 22024956 23180938 23462285 22944651 22048805 21446773 20889883
5216 20889883 20858880 20983358 21549476 22333367 23444587 24639132 25858173 27285641 29089449
5207 29089449 31057044 33203233 35104054 36734283 38322441 39649661 40466533 40577443
5199 40577443 40168305 38859064 37283013 35389267 32883007 30514589 28096804 25818747
5191 25818747 24029794 22342989 20588358 19184028 18090310 17123681 15985560 15080015
5183 15080015 14602999 13984395 13415377 13130182 12726598 12078194 11396374 10963511 10677206
5174 10677206 10299436 10060201 9892033 9729670 9609688 9433298 9458187 9378210 9261183 9275004
5164 9275004 9293706 9365008 9189186 8903069 8883888 9108114 9181567 9279179 9585940 9702894
5154 9702894 10008572 10381726 10776120 10798022 10491022 10203057 10276160 10650319 10876327 10966806
5144 10966806 10929119 10941620 10825755 11037975 10877508 10725345 10936536 11201783 11369420 11288207
5134 11288207 11258686 11069975 10594961 10115953 10065937 9951955 10179927 10516834 10524010 10596929
5124 10596929 10577290 10538649 10212760 10048989 9836892 9574169 9361921 9200869 9054511 8740837
5114 8740837 8579749 8570042 8578188 8498246 8586478 8850904 9114691 9033009 8643553 8544345 8588827
5103 8588827 8433232 8246042 7565887 6934346 6574032 6517918 6580428 6616529 6793932 6505885
5093 6505885 6189421 5758856 5464867 5275658 5262083 5227725 5000313 5069250 5086409 4887438
5083 4887438 4710823 4880594 4908933 4586501 4494210 4660708 4768700 4573551 4603445 4758337
5073 4758337 4928528 5170552 5153241 5192044 5345119 5528595 5546489 5406076 5593619 5446194
5063 5446194 5490962 5565352 5545974 5388971 5157056 5292133 5241233 5687934 5834379 5740419
5053 5740419 5824960 5846319 6015490 6034139 5952545 5936663 6016595 5979427 6153666 5859135 5750174
5042 5750174 5822525 5773755 5765580 5629771 5880829 5695798 5520885 5346706 5174121 5172032 4866860
5031 4866860 4803414 4826190 4776621 4644973 4378037 4204157 4031001 3776480 3852687 3742257
5021 3742257 3765591 3608767 3545526 3514686 3394219 3485312 3503201 3305559 3547201 3559120 3307309
5010 3307309 3300708 3170214 3161266 3295764 3290125 3192273 3107219 3389511 3250011 3070348 3278893
4999 3278893 3331661 3424698 3318223 3386031 3019564 3220485 3189199 3177112 3290727 3264271 3224046
4988 3224046 3447218 3318951 3084507 3128317 3000191 2930469 2946745 2857419 2631217 2584531
4978 2584531 2655963 2709458 2786131 2825333 2875819 2752083 2683825 2672280 2339189 2471771 2455798
4967 2455798 2403277 2403227 2172146 2280554 2420885 2434119 2176610 2321196 2576619 2428548 2465556
4956 2465556 2405276 2168793 2439918 2546635 2539297 2340416 2268197 2198964 2160149 2053688 1946363
4945 1946363 2044682 2266091 2173629 1944283 2163199 2382047 2322279 2325536 2158462 2092441 2225454
4934 2225454 2158708 2159386 1998103 2129886 2153396 2253069 2221668 2290823 2260393 2395921 2332890
4923 2332890 2182034 1843576 1842899 2052937 2181285 2153223 2091844 2205548 2162650 2253404 2436341
4912 2436341 2297014 2112862 2067458 2045467 2366172 2409418 2444747 2585349 2640149 2424101
4902 2424101 2473297 2381224 2071268 2133614 2192206 2353188 2396456 2281460 2261361 2244277 2369305
4891 2369305 2527929 2475383 2588735 2436607 2576582 2618872 2633668 2670915 2503134 2552669
4881 2552669 2335681 2265016 2490229 2816206 2758171 2709451 2839896 2816017 2922871 2821297
4871 2821297 2927467 2778096 2760755 2791976 2656395 2658437 2385365 2766931 2744569 2592403
4861 2592403 2627797 3009614 3010643 2886206 2760964 2804534 2838106 2975619 3119800 3079840 3095380
4850 3095380 3371219 3278439 3185185 3056879 3248927 3437645 3480973 3663522 3799978 3695573
4840 3695573 3766532 3787202 3710041 3637780 3691132 4008575 4021465 4101760 4186778 4436860 4401121
4829 4401121 4393251 4471160 4898010 4801445 4965585 5219433 5278442 5202551 5290076 5487110 5797371
4818 5797371 5807552 6118242 6341360 6341999 6272232 6255963 6558227 6850017 6924486 6870794 7208241
4807 7208241 7767534 7628586 7707763 8045902 8284001 8476814 8667020 8763320 9194569 9584452
4797 9584452 9819956 10099834 10077776 10427143 10701385 10670313 11095786 11467868 11702144 12219882
4787 12219882 12766177 13394072 13795838 14433937 15369645 15936610 16370673 17131615 17851584
4778 17851584 18533394 19502498 20634453 21906960 23174636 24603795 25833429 27165382
4770 27165382 28714084 30736922 32978573 35946230 39320129 42806569 47104244 52363208
4762 52363208 58820773 66170434 74619986 84266255 95028695 105819945 116064395 123454028
4754 123454028 125709015 121646203 112341323 100021746 87550042 76010107 66094989 58443537
4746 58443537 52352049 47543458 43593615 40720461 38339931 36626015 35389911 34853191
4738 34853191 34874341 34473971 34046170 33181758 31935020 30115498 28386148 26488067 24592912
4729 24592912 23117593 22177214 21515093 21016054 20257554 19840569 19528225 19568333 19821563
4720 19821563 19924711 20558463 20987667 21601558 21942537 22187452 22036108 21108039 20152180
4711 20152180 19515844 19285991 18762670 18405901 18447992 18595892 18826780 19289495 19444415 19682896
4701 19682896 20079067 20673959 21196143 22013070 23048781 23766573 24734460 25864006 27136391
4692 27136391 28409208 29690495 31203660 33133354 35535408 38526133 41590197 45176070
4684 45176070 49305689 54149747 59818757 65943349 72962428 80493638 88460326 95961445
4676 95961445 102320418 106402698 107055616 103793507 97359921 89036453 79906733 71247568
4668 71247568 63115431 56289918 50673125 45776801 41496007 37862355 35096938 32611124
4660 32611124 30726936 28874085 27018442 25840546 24521901 23557944 22608496 21691505 20874152
4651 20874152 20023788 19469896 18909915 18091358 17436750 17151360 16811523 16311045 15835505
4642 15835505 15228137 14907952 14344962 13896187 13471917 12963030 12706738 12690916 12524033 12070806
4632 12070806 11821290 11297815 10875995 11061403 11036357 10793054 10499847 10339917 9965563 9765406
4622 9765406 9773410 9319097 9095109 8904039 8472712 8381524 8540738 8308733 7994598 7922661
4612 7922661 7742054 7527323 7305427 7258736 7498916 7346813 7299206 7310470 7160678 6921789
4602 6921789 6778492 6968614 7037782 7036980 7005857 7063187 7063438 7120976 7408353 7556580 7468391
4591 7468391 7545267 7698783 7825099 8062525 8578887 8783791 9030009 9671603 10479561 10988917
4581 10988917 11801503 12660945 13268605 13962232 14491837 14447480 13837130 13434069 13005966 12618803
4571 12618803 12559939 12893628 13434918 13940412 14434802 14721716 15070075 14870580 14276027 13604219
4561 13604219 12873321 12814504 12834402 13070016 13204286 13774033 14109122 13544765 12808277 12341179
4551 12341179 12039033 12030636 12140236 12208219 12727531 13145905 13479892 13957559 13684955 12779828
4541 12779828 11802865 11050333 10235214 9476817 9086737 9005201 8780425 8586446 8862634 9068893
4531 9068893 9134100 9224629 9299765 9336261 9381256 9720167 9776982 9206064 9041238 8490263 8141135
4520 8141135 7709428 7319068 6885139 6744706 6729722 6450747 6527731 6556846 6618475 6693008
4510 6693008 6538483 6593708 6645045 6364710 6460003 6308303 5941987 5656497 5481286 5142863
4500 5142863 4862388 4828517 4706957 4623082 4531636 4395289 4151817 3860426 3757381 3623986
4490 3623986 3671516 3711415 3637057 3411101 3302590 3283749 3311012 3273666 3213387 3113856 3239109
4479 3239109 3409273 3485594 3130035 3222895 3302659 3326247 3213658 3141123 2994805 3064085 3378882
4468 3378882 3143038 3248400 3268867 3205216 3102915 3109626 3099955 3175807 3585616 3822279 3693570
4457 3693570 3314505 3446306 3656580 3498634 3369424 3271062 3204868 3269244 3370675 3595790
4447 3595790 3585784 3665417 3695937 3511180 3765080 3885284 4081585 4263055 4277579 4221157
4437 4221157 4232797 4294317 4414357 4173296 4120655 4263216 4249847 4575580 4744837 4607449
4427 4607449 4656204 4711335 4946451 5130574 5200770 5239675 5464313 5657747 5634539 5819578
4417 5819578 5638306 5621579 5304977 5109293 5319853 5082532 4908922 4785867 4861166 5011709
4407 5011709 4853685 4711225 4625388 4560702 4445865 4491367 4465223 4482107 4544933 4560095 4418295
4396 4418295 4378081 4528127 4277341 4160156 4212530 4252057 3949939 3941594 3923585 3730830 3664536
4385 3664536 3719734 3630531 3464703 3655984 3494487 3368072 3587698 3572972 3647457 3559617
4375 3559617 3572229 3722418 3680393 3787185 3750202 3766134 3796399 3704655 3878077 3772892 3693202
4364 3693202 3684695 3897042 3994504 4202849 4324288 4046516 3937749 4205009 4233623 4322291
4354 4322291 4366538 4356629 4374705 4354667 4568345 4595040 4624649 4588500 4640199 4404934 4557059
4343 4557059 4557910 4561203 4746688 4810438 4760318 4440106 4620979 4959604 4979920 4859577 4803805
4332 4803805 5023627 5059395 4841885 4930255 5015041 4917236 4994583 4924909 4715783 4854101 4845091
4321 4845091 4750145 4646935 4947976 4948345 5033805 4787777 5150986 5213492 5209044 5202811 5187518
4310 5187518 5372317 5305982 5215168 5295547 5448607 5011054 4927234 5038903 4918622 4713446
4300 4713446 4710865 4686824 4682310 4655152 4694228 4820549 4891722 5009364 5280240 5269212 5228841
4289 5228841 5350645 5311926 5293139 5429778 5606609 5834320 5701318 5802247 5951432 6165045
4279 6165045 6316835 6645393 6452353 6426553 6718346 6573395 6596085 6593417 6516512 6608476 6818597
4268 6818597 7067211 6940732 7157096 7055061 7351393 7647600 7337244 7413440 7654121 7770006
4258 7770006 8075828 8097504 8364011 8531953 8591509 8871405 9003136 8990236 9243339 9470779
4248 9470779 9807295 9903523 10330746 10640262 10805138 11071352 11191023 11422194 11881609 12157246
4238 12157246 12504006 12872937 12953866 13511287 13833895 14038897 14194401 14260910 14333831 14490377
4228 14490377 14457353 14902192 15298777 15339931 15672942 15791960 15751674 16114610 16403047 16520612
4218 16520612 16570970 16721895 16873197 17133939 17367630 17343191 17251517 17379695 17638972 17973246
4208 17973246 18278519 18410155 18720383 19453181 19852192 20279694 20557393 20899881 21111620
4199 21111620 21307368 21519110 21573179 21828442 21811350 22271754 22808848 22821373 23098509 23746100
4189 23746100 24247662 24944020 25660918 26683239 27534567 28315386 29210124 30078724 31065986
4180 31065986 32107604 33045544 34269841 35537502 36715733 38781883 40773225 42749854
4172 42749854 44617345 46970583 49539951 52471153 55533506 58242246 60431093 61909395
4164 61909395 62202132 61830880 60936789 59595233 58433397 57987461 57670780 57769904 58409776
4155 58409776 59444887 60591748 62296193 64241317 66455917 69055785 71789817 75203673
4147 75203673 78903018 83027020 87998247 93990725 101256784 110160589 121240571 134270511
4139 134270511 149620824 168295034 190754566 217644885 248424327 281307904 311850267
4132 311850267 332746882 335851678 318502187 286163041 248779222 213180961 182595373
4125 182595373 158304408 139317007 124166401 112214323 102748459 94669297 88092543
4118 88092543 82834057 78444450 74338001 70726865 67766975 64941257 62238383 59947697
4110 59947697 57575004 55865000 54325208 53179217 52019286 50835688 49858416 48819577
4102 48819577 48153647 47693790 47259262 47297124 47492212 47507735 47867920 48450176 49297767 50406250
4092 50406250 52414122 54945401 58484827 62446512 67385724 73327224 79694360 86331230
4084 86331230 92834940 97512347 99541309 98118094 93335143 86196661 77842527 69644451
4076 69644451 62569190 56390828 51800441 48089588 44864041 42243683 40042316 38452488
4068 38452488 37395153 36497808 35521342 34887447 34349208 34191855 33818377 33257962 33062691
4059 33062691 32756110 32845096 33226491 33797748 34463750 35438384 36583638 37572637 38364010
4050 38364010 38597564 38150016 36413946 34215570 31890420 29413429 27482988 25682567
4042 25682567 24212843 23088018 22072422 21409831 20866193 20246497 19836073 19275887 19082219
4033 19082219 18965204 18650432 18389811 18064251 17922050 17990925 17953744 17812225 17914737 17667408
4023 17667408 17568414 17903087 18029794 17811251 17893547 17964539 17804701 17689547 17778900 17825969
4013 17825969 17604296 17814066 18343291 18846588 19436143 19758804 20350664 20543722 20670186
4004 20670186 20712599 20228134 19811656 19303280 18890433 18332814 17748073 17389480 17133985 16860902
3994 16860902 16832572 16859820 17030591 16948555 17076045 17274875 17557658 17606197 17867490 18256048
3984 18256048 18598376 18913956 19188719 19548701 20256879 21156325 21787939 22547782 22985710
3975 22985710 23713748 24372257 25233307 26317268 27296848 28460908 29439172 30460924 31714495
3966 31714495 32818348 34091044 34807995 35435611 35655694 35439072 34726837 34076924 32910950
3957 32910950 31828836 30516067 29192605 27894315 26853456 25627832 24387625 23387719
3949 23387719 22332778 21104889 20022657 19330173 18667859 17712725 16911501 16292416 15665013
3940 15665013 15304235 14525339 13957498 13623956 13245355 12682053 12419024 12056111 11882456
3931 11882456 11575862 11411057 11087943 10714675 10437758 10422290 10032930 9843188 9897716 9716041
3921 9716041 9749992 9492152 9373246 9635962 9529651 9368020 9108303 8948189 8923362 8799953
3911 8799953 8589737 8487606 8534919 8293209 8282406 8300652 8469518 8334624 8108812 8156398
3901 8156398 8143682 8309722 8449644 8122399 7982163 8207061 8270072 8366045 8344387 8307525
3891 8307525 8244402 8018417 7860024 7927689 8133884 8372963 8464221 8414655 8502332 8650622
3881 8650622 8777865 8666174 8696327 9015062 9368825 9506291 9331429 9550765 9945641 10128319
3871 10128319 10279517 10504707 11029296 11338328 11770506 12142111 12940020 13864708 14530418
3862 14530418 15484626 16432335 17508546 17836389 17688212 17002428 16283084 15371472 14479208
3853 14479208 13785889 13305753 12764869 12724034 12659510 12404359 12442946 12661787 12769460 12924208
3843 12924208 13395232 13550134 13864894 14231356 14361142 14444231 14459892 14528383 14611770 14850605
3833 14850605 15345034 15504964 15535890 15741107 16221276 16369314 17098425 17428949 18206356 18805498
3823 18805498 19318937 20037730 20500997 21313820 21803903 22133631 22503613 22988689 23523257
3814 23523257 23808518 24001126 23891198 23464619 23368631 23190789 22613202 21894310 21362331 20974555
3804 20974555 20675166 20097059 19082678 18373320 17828313 17350527 16731735 15926746 15459592
3795 15459592 14848347 14541735 14138267 13483754 13198529 12936954 12376139 12024271 11520492
3786 11520492 11126026 10684046 10547344 10074195 9783218 9696558 9273567 8858731 8520785 8349985
3776 8349985 8136461 7988736 8080904 7655752 7588934 7354587 7080330 7180465 6943152 7037760
3766 7037760 6935639 6536061 6378574 6258313 6261017 6066604 5909643 5646333 5363014 5530292
3756 5530292 5597266 5437201 5224782 5217437 5032598 4723205 4599905 4497814 4300284 4404444
3746 4404444 4360603 4150792 4216160 3977173 3844173 3802333 3632648 3442112 3527791 3606177
3736 3606177 3517481 3731345 3826262 3579026 3587168 3774325 3253563 3110839 3072397 3298293
3726 3298293 3157009 2914674 3079633 3003080 3108460 3241795 3167899 3135679 3093060 3105731
3716 3105731 2992754 2838954 2827042 3008196 2791098 2620266 2937439 3052984 2869366 2670462
3706 2670462 2617167 2777003 2864010 3031676 3056144 2839040 2887660 2722394 2794789 2917970
3696 2917970 2923003 2679775 2610407 2845262 2802198 2898416 2938674 3155460 2964393 2793252 2561712
3685 2561712 2826494 2774453 2576713 2921200 2860259 2891464 3036405 2938424 2728479 2756768
3675 2756768 2757099 2691122 2786723 2766491 2926216 2801809 2714814 2648787 2685703 2552033 2327402
3664 2327402 2607325 2613936 2596943 2543534 2619242 2604251 2607404 2683186 2606652 2510276 2470182 2352708
3652 2352708 2294386 2257902 2226744 2319117 2386526 2371813 2331368 2259729 2290788 2481582 2236885
3641 2236885 2103112 2065824 2174658 2127862 2032633 1780159 1787921 1989300 1951420 1912298 1857199
3630 1857199 1896001 2039533 1880358 1715869 1661486 1813007 1976735 1817507 1922400 1824754
3620 1824754 1852008 1757283 1512802 1660843 1589187 1483747 1609273 1527279 1642406 1685629
3610 1685629 1574801 1731245 1808026 1695196 2017329 1857418 1856641 1888987 1690551 1741222 1749016
3599 1749016 1484167 1687132 1932642 1617038 1403833 1536029 1761907 1711798 1802062 1923116
3589 1923116 1623596 1589318 1486191 1567048 1704365 1765192 1974701 2329393 2149982 1881840
3579 1881840 1979776 2063893 1920599 1953596 1717455 1988167 2093808 2187861 2250793 2104786
3569 2104786 1860982 2203105 2122484 2169567 2490269 2282497 2345865 2409970 2362565 2279095 2249719
3558 2249719 2344561 2404941 2489697 2589695 2482199 2406682 2400972 2478626 2263845 2305015 2402665
3547 2402665 2408372 2572557 2691601 2687078 2539680 2477572 2702791 2653237 2821820 2847674 2865169
3536 2865169 2741653 2824236 2905514 3015654 3008808 2860175 2881525 2737886 2877053 3091456
3526 3091456 3001715 2582333 2565410 2689298 2620817 2680534 2509115 2529999 2451567 2581971 2519139
3515 2519139 2642199 2531545 2638928 2709905 2689156 2708372 2569449 2434045 2540539 2478666
3505 2478666 2325338 2690486 2887907 2649382 2625992 2506180 2661150 2711991 2677339 2723822
3495 2723822 2571410 2468381 2318258 2094048 1955635 1997445 2243650 2210512 2145718 2093983
3485 2093983 1937639 1985903 1870839 1734053 1784384 1985523 1862178 1839277 1972576 1947458
3475 1947458 1801572 1890340 1912806 1739876 1731779 1781241 1786575 1686478 1536530 1644281 1730447
3464 1730447 1508880 1432386 1641075 1516542 1525602 1766244 1619892 1722106 1488499 1356236
3454 1356236 1416233 1630173 1702514 1802474 1707491 1666576 1428211 1469345 1585396 1481712 1423918
3443 1423918 1530513 1730691 1943204 1964462 1770353 1736824 1707929 1931610 1748585 1759384
3433 1759384 1778810 1950041 1724277 1693625 1679157 1859161 1807311 1565562 1349568 1613812
3423 1613812 1799927 1710336 1433226 1384118 1658895 1497717 1283681 1404054 1506309 1603100
3413 1603100 1652648 1304129 1267140 1673766 1686889 1493003 1531087 1319268 1277716 1454729
3403 1454729 1570232 1857094 1864460 1812578 2117881 2409621 2407833 2189609 2141404 2029332 1907135
3392 1907135 2020271 1929396 1981865 1916812 2053624 2280334 2101810 1903942 1721916 1856275
3382 1856275 1922556 1995583 2249309 2210275 2032191 1979127 2104522 2169832 2248451 2278005 2114413
3371 2114413 2158891 2272800 2456433 2407530 2427696 2124156 2050240 2103281 2110297 2222664 2094665
3360 2094665 2130221 2111279 2326523 2485600 2331303 2302717 2361525 2408097 2464190 2337711 2491465
3349 2491465 2797111 2753398 2568463 2634768 2613275 2785370 3051496 3129799 3045936 2874002
3339 2874002 2778938 2894155 2877664 3082796 3232918 3241113 3175309 3252823 3459009 3538559 3441925
3328 3441925 3639758 3817656 3761226 3845303 4155930 4246514 4579358 4756945 4792192 4820437
3318 4820437 5080106 5140807 5348449 5759378 5499683 5565885 5652804 5561528 5462417 5584683
3308 5584683 5574251 5752712 5886510 6024234 6208302 6267627 6518779 6409706 6607074 7027105
3298 7027105 7236078 7497909 7597756 7806946 8009449 8354241 8532216 8422336 8661609 8788179
3288 8788179 9081211 9509588 9801560 10237259 10548954 11039381 11203868 11375876 11618415 11658642
3278 11658642 11536134 11810118 12121533 12348620 12203479 12557377 12971051 13442522 13726559
3269 13726559 14143305 14550896 15252604 15639160 16017702 16356593 16908869 17674839 18180791
3260 18180791 18817599 19270026 19735375 20651028 21613209 22976216 23924013 24898798 25875191
3251 25875191 27054278 28685115 30085393 31678507 33356248 35265608 37473533 40483507
3243 40483507 43301110 46222960 49779113 53186462 56519206 60061464 62768338 64837245
3235 64837245 65832020 65720242 64429503 61807982 58343989 54211811 49614919 45159011
3227 45159011 40888751 37110356 33839108 30812960 28157451 26135635 24350124 22575118
3219 22575118 21142649 20101297 19367911 18307909 17399653 16887262 16706319 15980865 15580739
3210 15580739 15468177 15516910 15565643 15607079 16008545 16101322 16768030 17299520 17782848 18354863
3200 18354863 18808606 19296864 19208184 18373195 17370649 15967052 14845630 13744757 12643355
3191 12643355 11850344 10980402 10596627 10315126 9827412 9216351 8909354 9082760 8600731
3182 8600731 8301679 8075123 7996279 7953525 7797349 7973606 7996799 7960894 8195391 8341307
3172 8341307 8741422 8805872 9076279 9376439 9403827 9402148 9248934 8878415 8469676 7895937
3162 7895937 7154871 6569625 6283198 6093831 5611642 5093747 4829922 4701831 4354869 4123429
3152 4123429 4023374 3800106 3812547 3694937 3699062 3549409 3144592 2918827 2735707 2798683
3142 2798683 2909117 2616712 2519579 2459876 2412318 2367503 2508530 2265868 2201125 2152194 2199578
3131 2199578 2235733 2241282 2316261 2295526 2258704 2219452 2139922 2084706 2230361 2064984 1948118
3120 1948118 1726048 1936705 1708674 1716406 1758353 1653374 1604206 1419046 1311118 1104268
3110 1104268 1334623 1617427 1300844 1095557 1403316 1435939 1274166 1410405 1227673 1259750
3100 1259750 1247717 1068155 1031872 1228327 1279604 1436257 1468340 1346228 1374115 1300909 1215804
3089 1215804 1376100 1357370 1244229 1103675 1239397 1118578 1046572 998517 1037877 857685
3079 857685 937036 1441031 1450979 1251336 1039444 865881 861286 755126 627025 577704 718817
3068 718817 900761 1018611 1049126 895355 725060 783521 796288 767790 965722 835925
3058 835925 1028150 1050887 889211 787194 1004982 988658 822205 681348 295345 336062
3048 336062 511496 644779 619297 691769 878240 886118 803805 666360 679275 920565 857819
3037 857819 644398 630509 868773 869023 650795 686501 553419 411590 461932 480665 597120
3026 597120 757383 619343 598972 751745 681711 652799 815368 859776 691731 760546 846457
3015 846457 987629 808450 837906 547859 457724 502142 672916 936860 984664 814229
3005 814229 742221 765314 730028 1018397 966313 779031 865800 941812 944989 1053782 936291
2994 936291 725280 666794 713622 714249 855544 719815 796968 747179 889113 722202 807384
2983 807384 811270 712309 968186 1004314 954289 999330 1172989 1340211 1338131 1301903 1246127
2972 1246127 1236055 1059694 995809 917838 1188611 1164105 1260059 1352948 1420368 1453312 1332586
2961 1332586 1375945 1221341 1351896 1435136 1407714 1293141 1199727 1463626 1649370 1512357
2951 1512357 1397873 1429704 1572830 1641380 1565527 1573747 1685534 1674369 2011390 1982150 1880876
2940 1880876 1925671 2252230 2322602 2165884 2068297 2327947 2511504 2321777 2737092 3127162
2930 3127162 3311745 3395050 3592554 3723303 3710079 3479135 3623661 3717468 3854909 3869251
2920 3869251 3765680 3751380 3691428 3804977 3920911 3867642 3746086 3700354 3675167 3689924 3598733
2909 3598733 3429380 3500302 3706264 4038875 4343921 4460896 4576677 4897316 5109099 5336936
2899 5336936 5657408 5870871 6380381 6433220 6528667 6313055 5859994 5570108 4881725 4311515
2889 4311515 4078047 3683791 3443932 3393605 3316868 3173284 3185792 3048156 3008350 2763754
2879 2763754 2631376 2813144 2722481 2908038 3039970 3028294 3218340 2856920 2928255 2980028
2869 2980028 2879046 3006294 3137525 3083099 3048382 3155698 2984633 2876025 2600971 2354860
2859 2354860 2135837 2128559 2100810 2084788 1806540 1919045 1814121 1602796 1660173 1530450
2849 1530450 1661013 1679025 1366392 1288507 1203001 1097346 1082844 1015039 822577 981849
2839 981849 1118962 862055 790221 842058 881553 917967 822926 819506 839769 639993 564023
2828 564023 713680 610262 591276 718778 556215 596649 601331 640217 748476 754777 505508
2817 505508 456959 373450 418235 140376 211769 305780 439592 424008 322120 242259 358534
2806 358534 384262 294121 183371 130350 319097 181559 171798 182560 -21286 278410 286634
2795 286634 166110 348913 212051 360359 317029 321783 236500 151219 219406 225883 244081
2784 244081 293051 244713 79580 477 111011 265679 409515 197212 59763 85350
2774 85350 28677 252692 280525 114163 126716 74048 89139 54836 167569 335428 275329
2763 275329 378739 492146 478239 444762 361949 421574 545526 521769 123578 157128 159828
2752 159828 102230 128484 38095 128864 -2845 -201657 -126814 82267 -128961 44565 246714
2741 246714 390221 412947 127044 -16817 65543 53434 1142 177624 -180128 -17772
2731 -17772 164315 -55140 136270 126228 41296 43513 -146149 -99440 -62665 82784 165831
2720 165831 201685 -49238 -239069 -94984 19424 82370 71107 118841 17037 132943
2710 132943 134745 232159 68138 -28509 -23836 69131 62457 -32720 -68439 -261819 -206929 -330922
2698 -330922 -100819 -213058 -79705 -169987 -297640 -119822 -72208 -105001 38661 151761
2688 151761 -37108 -182045 186592 284842 212576 143404 35468 -30708 17603 -102773 -118081
2677 -118081 30354 20591 104374 -41379 -275294 -239410 34039 -151805 56282 11697 -124690
2666 -124690 17224 83162 -45190 -80349 -7179 146230 227272 196786 136866 -227096 52100
2655 52100 98892 86643 -99337 -259680 -37902 45664 108643 89322 243716 -47542 -139159
2644 -139159 -143656 -38515 119853 45665 -134142 -193318 -92384 38360 87290 153628 370605
2633 370605 -50338 -128710 58208 -28017 -109179 71593 71626 88777 77934 -103090 -49049
2622 -49049 121719 295049 220820 141735 -78394 -242321 -295967 103504 86044 -43205 -135829
2611 -135829 -43178 192025 135426 -84267 215264 237135 322241 76483 -8923 111648 -179582
2600 -179582 -204425 -238906 -207218 -144803 -382628 -235366 -280240 -512549 -373683 -256820 -138094
2589 -138094 24606 -7026 -96288 185416 2817 -92419 -95940 -425945 -397832 -198307 151975
2578 151975 186395 287625 -133893 -139848 -55862 -108038 -346110 23179 265079 29037 75832
2567 75832 -31873 -204819 -66875 287880 148858 174882 -77209 49755 -86668 -147099
2557 -147099 -359623 -158938 55381 139730 55851 13422 -75077 42995 61521 76463 -2111
2546 -2111 -17404 105416 -168321 -152885 -131006 -80148 -98585 -287122 -257287 -273075 -304758
2535 -304758 -190522 -292768 -106287 108451 27564 -109196 -278489 -172948 -74183 72160
2525 72160 32110 -29492 -104804 -246719 -590253 -573218 -171381 -153068 -194452 -143840 73706
2514 73706 -25522 9385 71175 109556 -116089 -179447 15682 156116 221118 51681 -119547
2503 -119547 -261382 -27718 -32339 -247983 -323735 -132181 -156340 10377 58777 -70521 -95356
2492 -95356 9877 -175691 -49743 -42344 -79155 -146427 -29246 47895 -120033 -57357 69331
2481 69331 -7971 -140033 -57540 -302247 -351087 -198685 -265531 -28446 94378 -20566 -61828
2470 -61828 -87317 -69695 -86372 -239156 -262952 -364082 -341313 -100353 133205 -55368 29776
2459 29776 167245 -246769 -264682 -71649 -76603 -144707 4125 6438 231166 128146 10773
2448 10773 -56781 -111900 -33096 -135010 -303955 -202917 -279074 -113669 8942 92620 92364
2437 92364 -84888 -153244 -198821 -145694 83352 113237 246205 126670 7152 -25929 94256
2426 94256 227495 87861 10516 929 113481 282726 -65655 -246582 -169441 -139610 -88558
2415 -88558 -151677 -128433 148171 -79292 -138448 -39534 -215232 -169031 -44562 -207288 -95442
2404 -95442 90077 46007 94305 -81325 199227 -76299 -247434 -149728 42874 -28060 34161
2393 34161 202937 48227 -61879 -285968 178596 218747 133177 220339 -205766 24471
2383 24471 139054 37677 94258 -25259 49518 -168387 53981 184676 69495 132278
2373 132278 454328 208540 134047 283836 244047 322171 381172 478788 548002 454610 129089
2362 129089 1280 -24866 145163 116388 17443 -58021 72395 32467 26917 -128993 1267
2351 1267 8564 13387 93980 -129696 -244382 -382157 -235695 -141962 166140 372445 330432
2340 330432 292716 29694 55043 -143612 -118979 -11879 -13419 -57194 39623 223610 171542
2329 171542 73034 -167168 -89357 -139375 22567 74482 169633 40005 81340 -31741 85038
2318 85038 48973 -159831 -36619 -23623 -182333 -403463 -74557 44742 -144808 -147210 -6332
2307 -6332 68141 383388 63925 210620 271397 358709 188757 149378 66707 8496 98404
2296 98404 -110313 -304156 -161261 -91792 -38636 137597 167934 99826 549 48459 -183902
2285 -183902 -7383 75931 -9046 64204 65823 10255 139245 150606 16690 136014 229773
2274 229773 110504 -2714 -117066 -151621 58346 62539 25585 58508 -21592 -102229 12897
2263 12897 29982 4050 155969 53940 100935 177569 43774 116134 -88559 36603 24907
2252 24907 116412 234408 265572 260383 161707 158687 114677 -46918 111155 86654 123868 56109
2240 56109 2390 78807 -115717 155751 14614 227856 172015 217430 426956 418795 403851
2229 403851 283394 205458 408022 355973 351854 241571 271783 288369 427893 283287 39017
2218 39017 216917 193067 193329 251271 327666 140317 90830 469722 398323 324965 554849
2207 554849 746136 621356 537255 741666 553510 405958 519595 603542 695740 614284
2197 614284 385707 117568 186776 429663 421492 480669 718194 676003 489546 476165 762766
2186 762766 696358 784644 807935 724425 934928 1002036 948058 901066 714615 714420 1018692
2175 1018692 1220445 1194033 1158788 1089707 1210747 1192123 1209005 1221008 1371350 1517695 1485686
2164 1485686 1493389 1557659 1701977 1812222 2189890 1915147 1968219 1989902 1983737 2141431 2266568
2153 2266568 2047597 1899376 1990705 2159346 2436276 2533173 2737750 2749987 2751764 2825162 2643511
2142 2643511 2719138 3021826 3150567 3200969 3576704 3687860 3584037 3867792 3924719 4131405
2132 4131405 4439260 4456519 4746049 5143256 5156766 5349122 5860012 6389931 6867103 7155977
2122 7155977 7313170 8024158 8702577 9160976 9729202 10333873 11284138 12189145 13059793 13835487
2112 13835487 14832137 15630927 16542116 18050351 20247747 23089121 26850883 31312405 37004979
2103 37004979 44339077 54326925 67558548 80955682 91882156 93939492 79675157 61441994
2095 61441994 47801392 37631633 30537569 25172232 21528309 18762990 16666880 15007217
2087 15007217 13969288 13013004 12266212 11608038 10982332 9958998 8828421 8292077 7792668
2078 7792668 7007985 6542882 6292645 6046093 5683665 5509022 5325751 5078357 4345090 4060717
2068 4060717 3804182 3883265 3670923 3566457 3571358 3248774 2889604 2795846 3001100 2948491
2058 2948491 2799765 2586029 2446189 2451378 2197510 2019009 2015841 1999021 2224643 1940770
2048 1940770 1719229 1815149 1863153 1817215 1447060 1519639 1514145 1464936 1269599 1141363 1078522
2037 1078522 1009373 1065836 911311 1183300 1201145 1084890 1423980 1275153 1204053 1174416
2027 1174416 816221 913652 709732 824008 857364 773798 913857 829857 1003010 982404
2017 982404 948339 788601 661230 500240 407579 452449 319511 426045 422283 488104 428323
2006 428323 442148 507009 502920 288448 291433 208282 207825 290181 411664 453345 325459 269330
1994 269330 402519 274311 62693 470024 343283 371583 556231 548058 362546 376772
1984 376772 478935 152044 473893 531241 467132 586857 507568 428869 334503 181395 189842
1973 189842 304450 460588 671412 672822 614056 763830 757654 590916 356975 251656 228897
1962 228897 195748 20307 179501 262378 -139319 -158558 23596 249477 280170 247234 11005
1951 11005 -18677 -5085 106998 -72978 104940 105037 72269 333394 445117 214258 66586
1940 66586 -109586 -67757 99084 100092 -48495 -280880 -188132 -41852 79687 -120263 232137
1929 232137 322771 197260 119348 119423 -22528 108934 69475 -85334 -257893 -140416 114055
1918 114055 -60478 -227930 -70470 109209 165619 160672 186913 66277 112906 119704 133277
1907 133277 215219 283388 167381 -31814 -55098 28303 175064 -24837 18760 61459 157804
1896 157804 81197 135689 153161 340151 82233 152959 226354 191920 -18322 -160493 -54766
1885 -54766 -113874 24979 41645 122925 333604 272215 128180 -2998 35753 20798 -7966
1874 -7966 176063 54956 -52913 -11331 328854 327548 25687 -54537 193010 206931 112777
1863 112777 129310 45016 -91482 -253816 -238160 -205375 -85913 -56356 -46752 39409 -131016
1852 -131016 -150154 -88284 114659 104659 19110 -13146 -44229 -75311 46823 354282 92203
1841 92203 -71161 266270 360495 155192 214797 74014 -86654 -90770 16871 164994 330064
1830 330064 305048 443282 558961 504444 529529 332533 241879 310005 302271 316701 307492
1819 307492 119010 139373 161954 77263 -102377 -143455 59474 183242 10232 32571 6649
1808 6649 97419 301441 122077 285255 489758 143115 -124660 -123515 -106926 -81355 -212175
1797 -212175 -256610 12747 55170 208342 -178590 -351194 -326432 -233728 -116688 -172524 -55157
1786 -55157 143290 354052 330500 277896 67446 51562 -26770 -173528 -245939 -73251 -114814
1775 -114814 -17035 -52955 -53547 -139551 -131815 393940 70550 -116628 160571 129013 -34575
1764 -34575 -50934 17026 -101 115429 239347 316960 226391 69034 46645 24388 17866
1753 17866 3157 -100911 207431 37659 -52710 294497 32189 44876 -34715 -78902 106386
1742 106386 46828 -290229 -97713 -58313 -103472 10183 134280 44582 37688 -80115 -115212
1731 -115212 -90157 -136426 -65036 -71131 -9670 -63157 -25339 -116969 -219067 -24076 -46384
1720 -46384 -160200 -142003 -14413 -54638 -103628 -245153 -183722 -10487 -330063 -265272 -11078
1709 -11078 115219 175371 92094 -132068 -265849 -222945 -69738 11669 71801 147143 153260
1698 153260 65301 268540 270993 150371 -100662 -81202 -62061 180622 -21949 34066 48800
1687 48800 3445 185041 250090 179661 31372 89197 -124311 -322333 -159863 -93213 -22862
1676 -22862 -127522 -300661 -42447 27873 113267 3799 -106051 -123337 -370327 -335282 -398054
1665 -398054 -152540 -177593 93385 54061 -71823 25857 11332 83148 66965 12721 56140
1654 56140 73461 -163865 -259974 -361943 -48880 57103 37069 229322 325289 208699 -95226
1643 -95226 36021 -53861 -165240 24218 8392 -72143 -21972 38478 -261648 -106231 -217369
1632 -217369 -145288 -296641 -177592 84428 220451 113302 208111 142683 174120 84642 89707
1621 89707 44240 -143076 -211616 -232944 -50414 -97963 -66097 83004 87049 118715 138550
1610 138550 199998 -7390 -206755 -124188 -188674 -204378 -70215 133686 223064 257081 4953
1599 4953 -255485 -156410 49460 -15645 -214735 -133299 217939 71497 68656 -59374 -43730
1588 -43730 -12099 -200237 -119733 -189928 -71701 27938 -41350 62412 55213 136158 -83041
1577 -83041 -187090 -140507 -41787 -67307 2531 -10935 -137169 48912 -4391 230225 210244
1566 210244 54017 23077 -106862 -134715 -175910 -28965 -74709 -103590 84148 -16405 -167024
1555 -167024 -246343 -75327 -59783 119286 178202 28972 -247345 -177506 -127077 44957 67281
1544 67281 172932 16825 -210707 -225588 -295893 -248736 29876 47626 32558 -81157 -160213
1533 -160213 -53678 -342606 -252249 -98452 8714 -72314 -75590 -28318 312790 419506 145162
1522 145162 147049 151906 9270 -245823 58762 334274 199819 395229 204896 643
1512 643 -240634 -240014 -248660 -294822 -215597 -47759 -25500 122071 169367 185556 220505 101116
1500 101116 -141409 -131696 -57899 -83436 -81383 -42859 -103574 -374640 -172657 -44090 -57497
1489 -57497 33129 244421 276490 99819 167592 172923 230092 179622 -15574 -306407 -115975
1478 -115975 -264012 -69461 117999 184937 185920 4508 26070 -189712 -114560 -230106 -148662
1467 -148662 97808 -52598 -39318 -73924 -20173 -17127 -142836 8902 -36518 -231689 -170016
1456 -170016 -162889 17278 65636 -39435 -211226 106188 120289 34887 -225591 -193551 12267
1445 12267 -110581 -96489 -36500 71476 -102143 137691 245767 142736 18872 92004
1435 92004 121090 21777 -317573 -215001 38031 126068 207747 51220 -52108 -65128 177458
1424 177458 422444 42194 69645 18861 117550 -42830 1882 79739 -166008 -151631 -95015
1413 -95015 -152501 -25714 -141878 16274 160777 9250 -186086 -268521 -113592 -265072
1403 -265072 29158 86710 -33043 -166791 -255967 89580 16279 -117625 -399474 -141271
1393 -141271 -57876 111942 229870 125635 132462 143967 -56489 2431 -132105 -238378 -29699
1382 -29699 -52064 -24655 -110828 -16234 -133920 -240037 -235162 -166295 -288127 -325808 -46182
1371 -46182 143010 -8703 -89747 -199286 35184 8508 -150497 -251309 -407314 -317630
1361 -317630 -107930 105329 20954 -60702 -37974 -67364 -180870 -184350 -262432 -70013 56446
1350 56446 -35011 89486 -25571 -96316 -22431 -24788 -145817 -386456 -564156 -189564 -141658
1339 -141658 -331605 -366454 -293501 -228091 -74022 -230702 -147606 -28359 -84873 -163952 -85562
1328 -85562 -73691 -166190 -342369 -287107 -105309 -27983 -128476 -177825 141692 45332 149861
1317 149861 291465 236527 108941 -119423 -38075 98874 -158848 -410217 -462174 -159079
1307 -159079 -145175 -140985 -75941 -103136 153027 23872 159890 262333 -70179 -257297 -119876
1296 -119876 194294 67303 -338596 -404441 3272 -45678 -56733 -111351 30197 89154 -101919
1285 -101919 62959 2236 -198613 -9593 141469 7278 -40676 -121410 -57388 111482
1275 111482 137719 63558 -77469 -224950 -355603 -198599 -186261 -227228 -270747 -93344 90746
1264 90746 64667 289330 29786 41840 -82934 37485 25810 56065 -144269 -125539 -122259
1253 -122259 -163050 -49369 209117 29692 -130158 -333763 -248439 76072 -44583 -57236
1243 -57236 75793 -32188 -245941 -184373 89806 180997 151083 63508 53672 270313 237371
1232 237371 116952 172578 97970 -67992 21200 74241 44147 -129567 -155885 -113358 -12053
1221 -12053 -66211 -6012 -291454 -277767 -270414 -146853 65413 73299 51512 -32328 -165555
1210 -165555 89454 -66717 -141130 -36057 147132 205 -84026 -65535 86070 -75116
1200 -75116 -195157 -54722 -98150 -134612 98020 63912 -61778 80884 -36017 -208487
1190 -208487 -163596 -137149 14238 -11063 104134 -119668 -295088 6735 229942 115789
1180 115789 -56193 -139926 -129161 -41111 -34268 221618 23233 -8433 161860 235795 191327
1169 191327 313072 61841 33231 35196 148590 114646 60155 180424 -15636 134720 191987
1158 191987 199274 139258 165290 241330 225752 101435 -166169 -255043 -78004 -184250 -187008
1147 -187008 -92456 -266422 80337 93679 -104634 95739 53710 -3913 -44359 -285241 -479110
1136 -479110 -425357 -321860 -249876 -172984 87137 102186 -384820 -385584 -121968 60426 82735
1125 82735 68269 74416 115782 23535 197377 212004 81309 -152702 -200272 -164888 -33919
1114 -33919 63502 376642 193279 46487 -9476 -75788 17183 -140567 12377 -126558 -112809
1103 -112809 -17681 -97603 61149 3290 80111 -27610 -269142 -62994 -87458 -97060 -192893
1092 -192893 -332865 -33708 78244 26290 59772 57264 144132 43602 -192560 -171914 136122
1081 136122 216633 32747 -83147 -242 91247 191735 16045 53905 -25642 2192 219014
1070 219014 125942 83676 53480 -20688 35736 36430 -73312 149820 251347 87279 39898
1059 39898 -116920 -225198 18231 113809 158493 -148339 -169781 -125790 19990 199353 213068
1048 213068 81533 -77076 -185702 -355257 -213300 -202083 -226038 50991 -97820 -337701
1038 -337701 -224440 -173826 47119 -52418 -57459 34249 221579 261090 157907 124934 56267
1027 56267 -51769 167887 79776 -508507 -435236 -61677 -42756 -188086 -7160 -7678 -95732
1016 -95732 -10260 -71347 -166117 142141 171164 122211 342316 3231 59481 75007 -141023
1005 -141023 -69155 76868 5413 158544 200341 -11533 -164967 -135996 -124557 33356 -90988
994 -90988 -160334 -152631 -163948 -78048 -187684 -94516 35841 -22573 -66611 -67981 -58094 -160449
982 -160449 204411 244343 -160620 -142972 -176492 -138791 -63008 2865 -194036 -66157 26685
971 26685 44650 -191346 -276177 7079 23725 -236272 -154895 27514 -41989 110952 187251
960 187251 192307 -26343 -85129 -31443 -121716 -127235 61104 137444 196377 37238 142288
949 142288 170647 -54841 64532 -72330 -302567 -289872 -186517 143492 153815 -58989
939 -58989 -70874 205235 467762 175060 102206 179016 28293 -155422 -230177 -150278 14114
928 14114 143208 27745 65054 88680 -16826 -80210 -53815 -232771 -286084 -57251 -96984
917 -96984 -277080 -339977 -165020 -191423 -126413 -227404 121993 243722 -53154 -23081 83936
906 83936 -72803 -39388 -75018 -47044 -195727 -126296 -138501 -191346 -39084 -43509 -93238 -184204
894 -184204 9738 30775 168388 88182 196774 306533 109090 153710 194230 204020 -18238
883 -18238 -118606 -85782 54318 6794 -144057 -377707 -463292 -149826 -105424 -31007 -71291
872 -71291 -314414 -207105 -118286 15689 -93946 -39093 -23752 -236250 -124942 -105181 -27874
861 -27874 44583 43019 23235 -243962 -244517 -216195 -191572 -142868 -308059 -246541 -204746 67852
849 67852 199473 257853 247561 107871 -69579 -88557 16985 35301 -10236 -45871 -102109
838 -102109 95638 29393 52003 124632 22336 57184 185619 -92861 -100411 147121 24587
827 24587 9206 131688 92833 130660 85160 1147 180720 -6586 -219922 -20880 -134116
816 -134116 -252458 -96395 100086 -108533 -206157 -49423 3415 -16973 110178 344870
806 344870 296488 94344 -186514 -113088 -99531 -32930 -103263 -270817 -231916 84733 189893
795 189893 314186 36219 107052 115092 32871 102084 -5976 -17415 -115425 -130821 5010
784 5010 55279 31442 126867 -43972 -105971 -95481 -228930 -286895 111878 134176 342427
773 342427 437087 84244 304085 422815 125589 91929 232590 30946 30962 108902 -128898
762 -128898 -80987 -19180 -121478 -223351 -320345 -71152 54417 -101477 -5849 151548 100421
751 100421 5334 211097 -35491 -176056 -112163 87443 69649 52313 -63089 13882 178173
740 178173 112967 162691 -31732 -80781 30966 -51508 -67403 136786 101078 8668 -13064
729 -13064 -130994 217207 116990 -137986 129378 -98373 -182855 -265511 116426 346319
719 346319 132320 -23046 -24884 -182555 -105927 -160154 -22528 300704 82575 1567 -99828
708 -99828 143960 117861 71837 157299 53960 -21235 -1132 40342 3999 166089 229196
697 229196 55889 -176093 -32193 2635 40787 -244489 -359494 -69902 143095 283697
687 283697 -14649 -173863 -57534 164830 297112 138344 49069 62229 79732 40182 -11003
676 -11003 -61039 -252420 -274414 -283678 -118882 84731 -49146 44322 196284 323995 274560
665 274560 56502 10475 146886 391396 135081 148492 337652 132576 33018 72920 -28759
654 -28759 -76156 62922 21766 263637 260434 150500 73010 175820 179420 127577 40928 199107
642 199107 -24256 -112178 -259700 -226103 -146532 -111383 62327 -81052 -58713 -236645 -242961
631 -242961 -65613 72302 -72212 -46886 -230866 -212246 -98281 -90461 30790 21508 -193258
620 -193258 -252194 -188353 -172752 102030 -258165 -537968 -316476 -78053 105552 124208 18511
609 18511 -166588 -203923 -191848 -85380 -8120 187900 228168 126867 -84561 18071 -24711
598 -24711 88597 23805 -79156 -77531 12150 266889 415748 177995 142828 184477 81267
587 81267 69131 2300 -156956 -41715 54441 358971 445672 282290 149787 129118 237630
576 237630 305513 204753 -45748 47773 -16589 1416 -196950 -182689 104443 94493 46072
565 46072 -52223 -226894 -131760 -75584 -225625 -232245 -99987 -77329 -92003 -107353 -378330
554 -378330 -212151 -319145 -138825 -135296 -144195 24479 -1128 -45177 24642 58241 52881 233698
542 233698 204509 198407 78325 81898 -227244 -29863 190094 43838 -216864 -157536 13173
531 13173 -8059 53308 54992 124401 97691 23011 71851 127660 64976 160873 258256 342763
519 342763 303603 -60854 4227 -120847 40087 -100203 -156219 -102187 93473 125520 55886
508 55886 181102 46464 100005 240916 157584 22685 4187 142024 26440 132706 83265
497 83265 -119951 -185860 -96945 -52910 62301 130908 -2911 -13788 -5849 136353 -70557
486 -70557 -310849 -253734 -187983 -312767 -193463 -68618 125010 202007 172763 233306 -164415
475 -164415 -210348 -175030 -100988 38835 -195131 -107513 -174881 -557723 -231762 -91504 93156
464 93156 111739 38177 -43074 -64241 -119079 -78978 4111 -225732 -193245 59893 390853
453 390853 244218 184745 26341 67115 -31157 333683 127898 50492 23913 -109147 -380731
442 -380731 -329278 -176969 37222 458782 333278 187240 27526 178299 199426 99377
432 99377 297327 336065 54892 162929 201875 -21663 148012 268375 412962 215540
422 215540 -63010 -112889 -32361 187074 309543 64379 -88262 -138136 -29388 28201 33300
411 33300 19050 -13737 97413 144578 -34967 119842 197305 62091 4137 -73175 -45756
400 -45756 -136643 78294 90862 -95127 17864 -118039 -345738 -268313 -81833 33092 95603
389 95603 50900 -110262 29760 43259 167138 249986 296831 139319 -94779 -274977 -291620
378 -291620 -241454 7371 -18662 -181544 -257393 -130892 -182888 22263 178478 -57066 -118914
367 -118914 108381 184958 131189 31338 -259748 -70832 87411 236916 183674 61475 118032
356 118032 -203987 -180100 -203508 -225929 -106912 -228772 -166517 -55148 20033 35907 83338
345 83338 19508 166220 25557 49169 -142729 -41018 259658 43753 -2116 166935 361629
334 361629 25117 -9580 27770 78274 226379 200429 -25780 -330735 -280346 -8106 -88682
323 -88682 -214698 34085 46520 32720 -61652 162935 254523 58705 70671 128857 241344
312 241344 194225 93664 -36411 -38693 -130255 126927 202079 99718 105102 2914 -27159
301 -27159 -114201 17368 -78266 -234650 -84551 82230 80830 109624 49037 -182354 117368
290 117368 -12359 -189360 -162886 -180697 -80987 -230760 -499327 -268808 -78157 -177964 -142714
279 -142714 289220 71573 -127951 -205551 -140218 126078 161708 112107 -81825 -114892 -156533
268 -156533 -135275 -45026 -29110 -95686 229446 -4746 108145 48051 61425 130023 48743
257 48743 106076 -48600 -27687 -195972 -328185 -29769 84302 144077 27230 199854 52969
246 52969 12596 -17547 -215407 -56889 192792 96113 -31682 155450 121633 293331 231776
235 231776 146937 130115 160944 396715 371723 80112 146902 143101 105703 212976 194086
224 194086 169446 -108354 -138079 -94976 -255141 -23769 -39674 -128660 -31075 172641 160995
213 160995 133734 4033 -116104 -172628 -324146 -247155 -193678 -165277 -32295 -87903 -96718
202 -96718 -188832 -269121 -23253 -264906 -469246 -361864 -123924 -79235 -149787 -156942 -223688
191 -223688 114995 68510 -56916 828 -32678 89254 60497 209060 -15275 -27501 4475
180 4475 -110110 43447 92492 31438 70912 147404 -101334 -169381 374 43392 -157546
169 -157546 59716 113392 -303977 -208557 -200049 -256518 -266449 43 90534 -43743 -116698
158 -116698 37736 131293 15236 151627 48268 -29840 45765 188484 284156 106422 69658
147 69658 49634 217574 147964 174584 186960 -17274 25702 64494 -24919 5184 -43417 -227782
135 -227782 75226 -32701 -12119 -25882 -67834 -8195 131208 -88221 -125638 27604 -100695
124 -100695 -130162 -170737 -119279 -71728 -99852 208120 177933 -27766 -129999 -191610 -46132
113 -46132 106983 191025 198271 314267 89756 56687 241769 118699 148579 182044 158837
102 158837 -15197 61606 91149 191134 154921 -4758 27532 67032 10740 -32020 172345
91 172345 63549 -10452 -187032 -186474 -161850 -204349 -61151 -112691 -21827 -36870 -185477 18597
79 18597 6198 -2289 -21140 -135925 -91314 -38933 107834 99213 34167 116016 97439 3338
67 3338 -107195 4729 59130 -24878 90761 72805 69528 -155120 -178027 -14501 91530
56 91530 81452 100646 18830 -135288 -164087 -187065 53886 75652 43958 -39376 -96664 -21309
44 -21309 -81351 -122605 -25572 28661 112755 17767 -93189 -191832 -136245 -31074 65338 109320
32 109320 63478 71592 -2873 23481 51665 -101315 -128789 44262 -59908 -54661 -65389 -164620
20 -164620 -65649 -54320 45748 54940 32784 68381 78744 -44973 -63361 -52819 50270 30025
8 30025 -105381 67174 35071 -78327 157671 132454 173000 18545
0 18545
$$ Imaginary data points
##PAGE= N=2
##DATA TABLE= (X++(I..I)), XYDATA
16383 -891711 -879949 -1075268 -1187243 -948506 -857177 -740262 -868277 -833480 -867322 -698126
16373 -698126 -711753 -685407 -797727 -721901 -660171 -842344 -691166 -540990 -594245 -578533 -508072
16362 -508072 -418649 -341911 -272685 -444982 -408157 -261732 -225882 -307318 -437601 -347109 -341424
16351 -341424 -285191 -255156 -269925 -182307 -189018 -154037 -130096 -15646 -51056 -82915 -64247
16340 -64247 -40926 -19103 11947 76776 72806 223815 424528 518277 368317 260420 482955
16329 482955 494183 561828 474715 334001 274542 420691 692932 528255 503285 585899 505832
16318 505832 633855 565538 768087 814596 818136 813072 853798 889147 802372 953419 1048720
16307 1048720 989223 874524 1144306 849629 737019 930000 1029292 1014896 1013245 1080944
16297 1080944 979171 997118 1061037 1029241 1036657 1210767 1345893 1414656 1221129 1275695 1334692
16286 1334692 1150146 1384202 1412365 1183975 1192079 1219958 1404850 1581169 1438190 1514716
16276 1514716 1554821 1586881 1577707 1608009 1649872 1648872 1371735 1588943 1667186 1515020 1471023
16265 1471023 1510060 1589195 1599441 1575016 1715533 1828561 1899679 1742625 1774426 1949080
16255 1949080 1974762 1987771 2031166 1958734 1854667 1913010 1768054 1810788 1959885 1985362 1786455
16244 1786455 1707486 1667123 1839143 2182506 2082087 2216583 2227999 2125762 2195260 2162750
16234 2162750 2154565 2296696 2309899 2245344 2350949 2395627 2330792 2065407 2123668 2196129 2348215
16223 2348215 2596593 2318533 2259187 2419001 2511775 2571682 2459723 2538281 2433707 2373745
16213 2373745 2362104 2461832 2496064 2491669 2517280 2408500 2267994 2238329 2433391 2374602 2411986
16202 2411986 2452828 2350991 2368531 2434343 2296889 2305327 2606463 2695996 2886024 2680453
16192 2680453 2621291 2670209 2587740 2639701 2696196 2651672 2865071 2826659 2646355 2558559 2539955
16181 2539955 2518602 2540735 2561733 2430598 2524240 2820626 2982083 2676335 2738173 2812003
16171 2812003 2826588 2821725 2772651 2692492 2729989 2943175 2871553 2679291 2617030 2661366 2585251
16160 2585251 2810452 2970688 3064974 3028906 3013086 2887824 3001342 3015514 2979258 2842012
16150 2842012 2997693 2803096 2702247 2761445 2848506 2995929 2686306 2775064 2877219 2886358
16140 2886358 2847568 2738677 2758045 2933405 2654250 2902722 3046998 3090523 3212002 2943284
16130 2943284 2896923 2870431 2832962 3158454 3067671 2857246 2808545 2722985 2891410 3053770
16120 3053770 2885167 3178882 3076026 3208849 2935636 2829246 2894696 3103814 3054786 3098672
16110 3098672 3321711 3097270 2793408 2879875 2998489 2855676 2734935 2808028 2952275 2866993
16100 2866993 2866476 2752155 3089684 3073079 3232961 3252272 3322304 3193664 3041498 3088733 3161552
16089 3161552 3228033 3111329 3074902 3022797 3149190 3128367 3025071 3102413 3045361 3232121
16079 3232121 3220436 3345452 3389839 3247224 3234096 3109329 2969195 2992242 3062288 3143447
16069 3143447 2994312 3271357 3099837 2913468 3089329 3277691 3360155 3244276 2986845 3007466
16059 3007466 3157048 3268287 3222339 3121656 3012091 3011232 3106968 3208438 3309629 3236934
16049 3236934 3412706 3356285 3200169 3286507 3413320 3343184 2960007 2983561 3252307 3124597
16039 3124597 2977814 3037748 2960803 3215235 3324249 2966264 2911293 3146983 2879812 2864824
16029 2864824 3284578 3274626 3183164 3063762 3178677 3189535 3245012 3252197 3184908 3155373 3205289
16018 3205289 3156417 3399203 3348917 3209061 2982746 2829776 3051418 3262508 3417797 3492913
16008 3492913 3136710 3064495 3101454 3088894 3029336 3311538 3333507 3275368 3317030 3337120 3220167
15997 3220167 3166756 3489525 3499928 3188141 3018796 3127997 3284422 3210051 3267907 3254324
15987 3254324 3041037 3159866 3284347 3305480 3317493 3176524 3270981 3295496 3128319 3084625
15977 3084625 3085111 2898333 2875927 2934802 3014000 2842663 2999041 3118356 3157889 3107794 3048137
15966 3048137 3102061 3311023 3303857 3137826 3076923 3224784 3329986 3334035 3296433 3205250 3223819
15955 3223819 3011865 2994475 3057364 3098026 3131434 3165516 3152223 3339201 3160028 3206081 3316957
15944 3316957 3369647 3256475 3432329 3181995 3131797 3146471 3022798 3014995 3101438 3271017
15934 3271017 3421977 3331076 3428115 3388047 3292902 3325765 3427718 3169880 3324390 3351843
15924 3351843 3245792 3223115 2983996 3065329 2908056 3038863 3122603 3329439 3358011 3310405
15914 3310405 3204877 3145244 3116851 3036712 3366952 3289268 3374396 3198708 3283508 3377722 3260453
15903 3260453 3065248 3201615 3329023 3194104 3107121 3169664 3369492 3350334 3114874 3114351
15893 3114351 3183485 3225453 3204455 3130079 3271054 3159608 3229108 3137796 3054375 3015623 2929702
15882 2929702 3304637 3201546 3128072 3292491 3298299 3367352 3174198 3128633 3076916 2965158
15872 2965158 2929604 3166713 3288276 3386894 3425355 3378281 3158909 3136562 3025865 3071980
15862 3071980 2981903 2905109 3140923 3226970 3250261 3454871 3098356 3185952 3164348 3290715
15852 3290715 3358143 3291304 3245083 3150961 3121553 3052833 2821784 2911506 3328906 3271320 3076201
15841 3076201 3010780 3063741 3199057 3261770 3178931 3290444 3222492 3138705 3070679 3218899 3450554
15830 3450554 3267111 3205647 3260312 3221070 3316287 3279399 3282083 3061608 2998991 3133923 3204647
15819 3204647 3098725 3254035 3263647 3238818 3082393 3165454 3087152 2955025 2917499 2928496 3124080
15808 3124080 3320180 3424932 3541818 3528171 3299926 3295448 3383353 3305185 2850782 3002997
15798 3002997 3207541 3407794 3367862 3258136 3411976 3403034 3308554 3481884 3380977 3401820
15788 3401820 3388038 3215148 3398368 3425442 3405338 3511054 3248049 3485366 3608330 3423187
15778 3423187 3324132 3313327 3104594 3147177 3136133 3199393 3233874 3052145 2965497 3264755 3139147
15767 3139147 3463913 3670184 3403482 3601395 3466599 3528979 3235186 3231861 3203135 3151420
15757 3151420 3119908 3176920 3336117 3083863 2976051 3322578 3240216 3320088 3272141 3250174
15747 3250174 3266324 3498943 3488045 3429624 3414026 3356529 3366607 3304263 3492224 3345354 3058739
15736 3058739 2773703 3019088 3458191 3493069 3549727 3336014 3205133 3149449 3155491 3169027
15726 3169027 3275851 3090814 3250621 3249812 3176610 3172443 3243562 3331355 3534343 3270452 3170197
15715 3170197 3457286 3347828 3255072 3339388 3517778 3125875 3227490 3341035 3297697 3390567
15705 3390567 3109292 3246913 3108515 3097499 3207577 3268519 3343416 3205900 3209768 3341786
15695 3341786 3544168 3325813 3312166 3160289 3145085 3262829 3185726 3435330 3357303 3115828
15685 3115828 3158928 3052943 3116586 3206715 3220519 3343810 3216920 3291294 3314187 3229047 3460524
15674 3460524 3669085 3506385 3417767 3455427 3362651 3138692 3341393 3481446 3328489 3353610
15664 3353610 3314576 3221794 3153950 3230731 3301699 3479908 3180596 3387141 3493641 3359434
15654 3359434 3330744 3400167 3596349 3701642 3446666 3361662 3313163 3286528 3125725 3180278
15644 3180278 3445944 3490379 3359195 3215064 3165085 3258651 3224065 3194217 3116086 2979926
15634 2979926 2872600 3023715 3181801 3198073 3039170 3068034 3237936 3398108 3381174 3199113
15624 3199113 3300798 3379565 3285487 3450107 3538128 3248928 2892070 3076074 3309190 3335486
15614 3335486 3364425 3263170 3256742 3366604 3430266 3153379 3302801 3328561 3125067 3210474
15604 3210474 3410125 3469457 3346924 3462113 3449247 3328285 3444371 3386452 3513131 3590990
15594 3590990 3493810 3347003 3404249 3482331 3368108 3445223 3637619 3220451 3191969 3475564
15584 3475564 3697978 3626696 3553789 3481458 3492686 3490685 3295818 3280858 3226269 3304651 3262649
15573 3262649 3260149 3071322 2800999 3041502 3412073 3539261 3460911 3613537 3483552 3329815
15563 3329815 3558862 3466283 3462701 3423789 3245965 3271028 3253167 3502381 3599475 3349179 3130758
15552 3130758 3231898 3276611 3262144 3444077 3489867 3215401 3355249 3534496 3559896 3704740
15542 3704740 3550779 3352689 3118433 3275958 3235880 3300756 3268089 3124048 3052760 3040456
15532 3040456 3337222 3474828 3386122 3306677 3354559 3487389 3379362 3416237 3461626 3157901
15522 3157901 3227157 3363586 3312422 3062207 3211485 3342795 3118112 2958702 3070803 3024473
15512 3024473 3144610 3020767 3092483 3271538 3280786 3399686 3430036 3332038 3389717 3327046 3409413
15501 3409413 3443750 3204771 3230859 3307317 3581133 3564493 3449380 3487661 3652853 3365797
15491 3365797 3131258 3021687 3212041 3404180 3442739 3484337 3559204 3432579 3239361 3336799
15481 3336799 3199991 3241008 3393960 3592110 3423827 3279881 3260772 3361878 3266697 3190143
15471 3190143 3151460 3248486 3504863 3291218 3501720 3531182 3337290 3318121 3427996 3353913
15461 3353913 3413205 3512030 3499637 3284133 3319918 3277954 3186410 3222484 3207745 3313616 3150401
15450 3150401 3049611 3297861 3427663 3481927 3285155 3223401 3401417 3428503 3485756 3409509
15440 3409509 3400905 3246461 2920480 3371348 3618638 3350438 3252988 3608716 3530708 3624404
15430 3624404 3536373 3503042 3473123 3258894 3510756 3305095 3217598 3069597 3147118 3344138
15420 3344138 3592290 3970013 3807119 3483278 3522267 3437249 3557234 3582092 3455638 3401166
15410 3401166 3292575 3478138 3621288 3564607 3414785 3556647 3541905 3436358 3433714 3331421
15400 3331421 3475027 3531204 3651093 3543209 3479826 3288366 3001690 3213045 3409950 3421800
15390 3421800 3530113 3346603 3221424 3259507 3306432 3413713 3232105 3160931 3228269 3198154
15380 3198154 3206437 3190261 3255444 3333356 3405809 3342781 3558446 3470714 3211822 3280850 3350890
15369 3350890 3341149 3081649 3395023 3482332 3186970 3368535 3572119 3605502 3540573 3503538
15359 3503538 3353377 3434992 3439270 3413702 3415034 3328111 3374430 3507469 3181847 3037477 2949812
15348 2949812 3138904 3491330 3542221 3450874 3272364 3114363 3368227 3657131 3592712 3466229
15338 3466229 3304405 3304439 3211539 3157973 3522623 3435697 3410066 3533205 3373300 3420762 3452374
15327 3452374 3420017 3392278 3595502 3535648 3391164 3414411 3346753 3111189 3343759 3414297
15317 3414297 3331835 3479451 3464116 3423320 3387164 3363052 3520126 3429444 3422846 3486384 3707588
15306 3707588 3520941 3277755 3495337 3494610 3454047 3458701 3356073 3208571 3407048 3596238
15296 3596238 3398929 3481589 3206899 3430639 3753721 3538899 3474662 3317201 3250420 3212925
15286 3212925 3175913 3197277 3253796 3388843 3383851 3364732 3472122 3538420 3481778 3601660 3756627
15275 3756627 3501389 3235333 3271956 3342252 3295245 3179563 3283927 3544067 3576222 3557345
15265 3557345 3683339 3686064 3451662 3586574 3435260 3302811 3248208 3268696 3300986 3459045
15255 3459045 3512858 3347082 3404369 3462232 3659964 3627420 3515705 3398077 3427158 3572573
15245 3572573 3657349 3610252 3573251 3322625 3419365 3475454 3239743 3414111 3588109 3353907
15235 3353907 3413326 3359097 3360145 3517861 3260633 3389646 3567369 3539108 3421138 3440102
$$ [...]
##END NTUPLES=NMR SPECTRUM
##END=
