##TITLE=1H_CG-1164-1
 CDCl3
 8 sc, 
 20.10.2022
##JCAMPDX= 6.0         $$ Bruker NMR JCAMP-DX V2.0
##DATA TYPE= NMR SPECTRUM
##DATA CLASS= NTUPLES
##ORIGIN= UXNMR, Bruker Analytische Messtechnik GmbH
##OWNER= root
$$ XWIN-NMR		Version 3.5
$$ Thu Oct 20 14:32:53 2022 Russian Standard Time (UT+4h)  she@DPX200
##.OBSERVE FREQUENCY= 200.1313499994
##.OBSERVE NUCLEUS= ^1H
##.ACQUISITION MODE= SIMULTANEOUS
##.ACQUISITION SCHEME= undefined
##.AVERAGES= 8
##.DIGITISER RES= 18
##SPECTROMETER/DATA SYSTEM= spect
##.PULSE SEQUENCE= zg30
##.SOLVENT NAME= CDCl3
##.SHIFT REFERENCE= (INTERNAL, CDCl3, 0, 15.7326)
##AUDIT TRAIL= $$ (NUMBER, WHEN, WHO, WHERE, WHAT)
$$ ##TITLE= Audit trail, XWIN-NMR		Version 3.5
$$ ##JCAMPDX= 5.01
$$ ##ORIGIN= Bruker BioSpin GmbH
$$ ##OWNER= she
$$ F:/spectra/data/she/nmr/H-F/1/pdata/1/auditp.txt
$$ ##AUDIT TRAIL=  $$ (NUMBER, WHEN, WHO, WHERE, WHAT)
(   1,<2022-10-20 14:31:40.89 +0400>,<she>,<DPX200>,
      <created by zg, POWCHK disabled, PULCHK disabled
       configuration hash MD5:
       00 E9 B6 7A A2 85 ED C7 34 08 36 98 17 FE 4E 26
       data hash MD5: 16K
       CB F2 0B B1 05 07 3D 88 21 D3 46 0A F1 04 74 8A>)
(   2,<2022-10-20 14:31:44.01 +0400>,<she>,<DPX200>,
      <Start of raw data processing
       efp BC_mod = 2 LB = 0.24 FT_mod = 6 PKNL = 1 PHC0 = -18039 PHC1 = 16.0007 SI = 16K 
       data hash MD5: 16K
       AF C6 96 8B C5 1D FD 40 5E 77 79 D7 AD C9 9B 21>)
(   3,<2022-10-20 14:32:04.75 +0400>,<she>,<DPX200>,
      <pk PHC0 = 5.311333 PHC1 = -5.6 
       data hash MD5: 16K
       55 FB 27 DE 89 F3 51 92 3D 17 17 36 23 6A D6 E8>)
(   4,<2022-10-20 14:32:07.98 +0400>,<she>,<DPX200>,
      <abs ABSG = 5 
       data hash MD5: 16K
       1F 54 51 87 BF 8D A0 DA 9B 6E 17 F6 3F E4 81 99>)
$$ ##END=
$$ 
$$ hash MD5
$$ 2F 67 F4 0A 13 7E 40 5E E1 7F 75 16 85 F2 8A 08
##$RELAX= 
##$RELAX= 
##$RELAX= 
##$RELAX= 
##$RELAX= 
##$RELAX= 
$$ Bruker specific parameters
$$ --------------------------
##$DU= <F:/spectra>
##$EXPNO= 1
##$NAME= <H-F>
##$PROCNO= 1
##$TYPE= <nmr>
##$USER= <she>
##$AMP= (0..31)
100 100 100 100 100 100 100 100 100 100 100 100 100 100 100 100 100 100 
100 100 100 100 100 100 100 100 100 100 100 100 100 100 
##$AQSEQ= 0
##$AQ_mod= 1
##$AUNM= <au_zg>
##$AUTOPOS= <>
##$BF1= 200.13
##$BF2= 200.13
##$BF3= 200.13
##$BF4= 200.13
##$BF5= 200.13
##$BF6= 200.13
##$BF7= 200.13
##$BF8= 200.13
##$BYTORDA= 1
##$CFDGTYP= 0
##$CFRGTYP= 5
##$CHEMSTR= <none>
##$CNST= (0..31)
1 1 145 1 1 1 1 1 1 1 1 1 1 1 1 1 1 1 1 1 1 1 1 1 1 1 1 1 1 1 1 1 
##$CPDPRG= <>
##$CPDPRG1= <>
##$CPDPRG2= <>
##$CPDPRG3= <>
##$CPDPRG4= <mlev>
##$CPDPRG5= <mlev>
##$CPDPRG6= <mlev>
##$CPDPRG7= <mlev>
##$CPDPRG8= <mlev>
##$CPDPRGB= <>
##$CPDPRGT= <>
##$D= (0..31)
0 1.2 0 0 0 0 0 0 0 0.06 0 0.03 0 0 0 0 0.0002 0 0 0 0 0 0 0 0 0 0 0 0 
0 0 0 
##$DATE= 1666261900
##$DBL= (0..7)
120 120 120 120 120 120 120 120 
##$DBP= (0..7)
150 150 150 150 150 150 150 150 
##$DBP07= 0
##$DBPNAM0= <>
##$DBPNAM1= <>
##$DBPNAM2= <>
##$DBPNAM3= <>
##$DBPNAM4= <>
$$ [...]
##$SUBNAM3= <"">
##$SUBNAM4= <"">
##$SUBNAM5= <"">
##$SUBNAM6= <"">
##$SUBNAM7= <"">
##$SUBNAM8= <"">
##$SUBNAM9= <"">
##$SW= 18.0517283424941
##$SWIBOX= (0..15)
0 0 2 0 0 0 0 0 0 0 0 0 0 0 0 0 
##$SW_h= 3612.71676300578
##$TD= 16384
##$TD0= 1
##$TE= 0
##$TE2= 300
##$TE3= 300
##$TEG= 300
##$TL= (0..7)
0 120 120 120 120 120 120 120 
##$TP= (0..7)
150 150 150 150 150 150 150 150 
##$TP07= 0
##$TPNAME0= <>
##$TPNAME1= <>
##$TPNAME2= <>
##$TPNAME3= <>
##$TPNAME4= <>
##$TPNAME5= <>
##$TPNAME6= <>
##$TPNAME7= <>
##$TPOAL= (0..7)
0.5 0.5 0.5 0.5 0.5 0.5 0.5 0.5 
##$TPOFFS= (0..7)
0 0 0 0 0 0 0 0 
##$TUNHIN= 0
##$TUNHOUT= 0
##$TUNXOUT= 0
##$USERA1= <user>
##$USERA2= <user>
##$USERA3= <user>
##$USERA4= <user>
##$USERA5= <user>
##$V9= 5
##$VALIST= <valist>
##$VCLIST= <CCCCCCCCCCCCCCC>
##$VD= 0
##$VDLIST= <DDDDDDDDDDDDDDD>
##$VPLIST= <PPPPPPPPPPPPPPP>
##$VTLIST= <TTTTTTTTTTTTTTT>
##$WBST= 1024
##$WBSW= 4
##$XGAIN= (0..3)
0 0 0 0 
##$XL= 0
##$YL= 0
##$YMAX_a= 125601
##$YMIN_a= -216272
##$ZGOPTNS= <>
##$ZL1= 120
##$ZL2= 120
##$ZL3= 120
##$ZL4= 120
##$ABSF1= 15.74028
##$ABSF2= -2.311569
##$ABSG= 5
##$ABSL= 3
##$ALPHA= 0
##$AQORDER= 0
##$ASSFAC= 0
##$ASSFACI= 0
##$ASSFACX= 0
##$ASSWID= 0
##$AUNMP= <proc_1d>
##$AZFE= 0.1
##$AZFW= 0.1
##$BCFW= 0
##$BC_mod= 2
##$BYTORDP= 0
##$COROFFS= 0
##$CY= -3
##$DATMOD= 1
##$DC= 0
##$DFILT= <>
##$DTYPP= 0
##$F1P= 0
##$F2P= 0
##$FCOR= 1
##$FTSIZE= 16384
##$FT_mod= 6
##$GAMMA= 0
##$GB= 0
##$INTBC= 1
##$INTSCL= 3.70164e-10
##$ISEN= 128
##$LB= 0.24
##$LEV0= 0
##$LPBIN= 0
##$MAXI= 10000
##$MC2= 0
##$MEAN= 0
##$ME_mod= 0
##$MI= 1.114404
##$NCOEF= 0
##$NC_proc= -6
##$NLEV= 6
##$NOISF1= 3.799351
##$NOISF2= 2.8
##$NSP= 0
##$NTH_PI= 0
##$NZP= 0
##$OFFSET= 15.73257
##$PC= 1
##$PHC0= -18033.69
##$PHC1= 10.4007
##$PH_mod= 1
##$PKNL= yes
##$PPARMOD= 0
##$PSCAL= 0
##$PSIGN= 0
##$REVERSE= no
##$SF= 200.130007799602
##$SI= 16384
##$SIGF1= 3
##$SIGF2= 2
##$SINO= 5.538805
##$SIOLD= 16384
##$SREGLST= <1H.CDCl3>
##$SSB= 0
##$STSI= 16384
##$STSR= 0
##$SW_p= 3612.71676300578
##$SYMM= 0
##$S_DEV= 0
##$TDeff= 16384
##$TDoff= 0
##$TI= <>
##$TILT= no
##$TM1= 0
##$TM2= 0
##$TOPLEV= 0
##$USERP1= <user>
##$USERP2= <user>
##$USERP3= <user>
##$USERP4= <user>
##$USERP5= <user>
##$WDW= 1
##$XDIM= 16384
##$YMAX_p= 344224669
##$YMIN_p= -369710
$$ End of Bruker specific parameters
$$ ---------------------------------
##NTUPLES= NMR SPECTRUM
##VAR_NAME=  FREQUENCY,     SPECTRUM/REAL,   SPECTRUM/IMAG
##SYMBOL=    X,             R,               I
##VAR_TYPE=  INDEPENDENT,   DEPENDENT,       DEPENDENT
##VAR_FORM=  AFFN,          ASDF,            ASDF
##VAR_DIM=   16384,         16384,           16384
##UNITS=     HZ,            ARBITRARY UNITS, ARBITRARY UNITS
##FACTOR=    0.220516191357247, 1,           1
##FIRST=     3148.55929567188, 0,            0
##LAST=      -464.157467333902, 0,           0
##MIN=       -464.157467333902, -369710,     0
##MAX=       3148.55929567188, 344224669,    0
$$ Real data points
##PAGE= N=1
##DATA TABLE= (X++(R..R)), XYDATA
$$ [...]
9487 206870 208659 282043 263201 190124 125874 88204 100576 113135 139856 31994 189840
9476 189840 273542 276263 278884 343308 219303 210102 167803 215505 207178 220265 298291 330849
9464 330849 328410 381696 448293 445361 437742 453517 478322 412249 337858 305363 425560 465967
9452 465967 406239 520463 536277 460443 493797 493644 483918 488168 503991 385973 456268 389622
9440 389622 420690 472492 485345 559740 612617 623968 690904 698099 524959 515699 555191 489006
9428 489006 584185 633001 549057 498517 443630 558427 718786 671023 566169 579041 736676
9417 736676 639209 584295 494712 517394 591214 613142 541445 626930 574711 539192 571720 574255
9405 574255 475243 481975 557408 593408 544921 566899 668946 690024 754686 597809 585537
9394 585537 520402 635388 585029 603861 586310 451099 406561 474034 451338 419945 544790
9383 544790 407672 434073 499038 463785 413880 512311 576092 642197 656258 639108 779099
9372 779099 701447 753706 732597 513208 579467 588822 616152 706443 655501 654859 747051 724208
9360 724208 699955 682494 546665 676488 700049 790890 730124 693268 644521 650293 665745
9349 665745 632044 624586 705167 826159 919446 826453 815825 844907 684120 653721 721766
9338 721766 720854 883798 818341 797371 925811 921437 1064075 1073509 1092174 1145420 1111880 1047497
9326 1047497 1022400 1138100 1160026 1196009 1315385 1159352 1232985 1391647 1273670 1289878
9316 1289878 1460363 1558349 1588093 1559620 1487600 1478138 1557020 1754021 1896982 2011721 2025707
9305 2025707 2029727 2205203 2329832 2537000 2759449 2930240 3086683 3220706 3288576 3481791
9295 3481791 3658595 3795039 3913299 4227563 4250809 4119051 4005975 3839479 3685070 3809797
9285 3809797 4175942 4620537 5136125 5488950 5643306 5452310 5089166 4718868 4356025 4055930
9275 4055930 3898848 3742827 3930006 3997836 3967752 3753904 3702568 3655166 3678031 3701861 3636993
9264 3636993 3767978 3874303 4087979 4300487 4530954 4651872 4745504 4714805 4844185 4990742
9254 4990742 5100490 5456083 5884587 6072215 6115125 5944093 5800782 5631941 5703392 5922919
9244 5922919 6083473 6208268 6374905 6613572 6625244 6338328 5769008 5324449 4977000 4570675
9234 4570675 4213658 3807402 3530919 3358944 3210007 3035164 2898919 2926689 2895499 2831064
9224 2831064 2771129 2708046 2563936 2474319 2517231 2633215 2639083 2557014 2566518 2670621 2680763
9213 2680763 2673724 2751472 2838354 2835373 2805711 2906274 3128554 3421263 3631116 3763807 3739982
9202 3739982 3501155 3128228 2893891 2662010 2638300 2559289 2487867 2530183 2472644 2434170 2446721
9191 2446721 2433393 2410607 2510844 2543566 2633032 2549102 2424471 2368422 2413852 2405576 2290666
9180 2290666 2414883 2435013 2472665 2447481 2350769 2442759 2563696 2696825 2767824 2728909 2738219
9169 2738219 2700999 2691226 2767158 2889545 2832989 2887733 2820992 2937220 3031824 2963024 2885294
9158 2885294 2975041 3069607 3062468 3043537 3078097 3331321 3382329 3408823 3500080 3698043 3687483
9147 3687483 3737519 3743442 3976755 4201064 4251001 4316999 4264100 4279824 4400952 4414633 4455316
9136 4455316 4717362 4827739 4979148 5121595 5165919 5244288 5267855 5429824 5527133 5752215
9126 5752215 5819753 5896464 6046962 6322333 6517809 6757726 7016091 7147323 7403044 7585991
9116 7585991 7774310 7982881 8202709 8565877 8996502 9328737 9729612 10097376 10501731 11094711
9106 11094711 11549278 11950269 12500134 13008268 13492672 14158293 15117697 16288688 17558209
9097 17558209 18856081 19797470 20446864 20998063 22063689 23492950 25339645 27438707 29901568
9088 29901568 33397307 38540995 44950295 52664030 60060301 65042098 64539650 59522924
9080 59522924 53360723 47501226 43539172 41164889 40281176 40135059 40357120 40259270 39123522
9071 39123522 36974798 35400729 34863093 35584784 37248463 39783830 42320001 44187814
9063 44187814 44051055 42166928 39809879 37700324 36709933 36478098 37497885 39668637 42395597
9054 42395597 45465493 48050250 49492051 49423038 48509975 48347685 49783384 53378972 59303720
9045 59303720 67198660 75816959 82275032 83330089 78325021 67566989 56721450 48990366
9037 48990366 43682969 40609009 38832501 37811612 37319739 36787220 36208117 36078984 36427846
9028 36427846 37196082 38130325 40037039 42240986 43929330 43577011 40557988 35027930 29540061
9019 29540061 25471790 22434527 20135626 18264125 16880087 15827191 15059627 14457486
9011 14457486 14040534 13689442 13034693 12079318 11166678 10442684 9821600 9377020 8978993
9002 8978993 8516898 8149026 7935107 7705655 7431049 7032000 6805137 6582376 6363946 6107947
8992 6107947 5847245 5745873 5609489 5492796 5349478 5279961 5107972 5060183 4915157 4781581
8982 4781581 4829303 4709048 4566772 4516550 4486182 4350905 4323372 4301354 4217244 4086059 4031807
8971 4031807 3992894 3807275 3749317 3844200 3752516 3683285 3583299 3567924 3408744 3383431 3428865
8960 3428865 3387921 3431275 3290414 3430044 3540037 3464324 3429820 3386388 3331293 3311921 3153208
8949 3153208 3092185 3035931 3118407 3299783 3242649 3184734 3220688 3203692 3225976 3204123 3108786
8938 3108786 3116755 3063400 3113362 3187580 3026575 3053724 3121027 3186813 3156233 3240455 3231269 3191693
8926 3191693 3241484 3307907 3390973 3412442 3494792 3541106 3527507 3468616 3545394 3605531 3541819
8915 3541819 3552525 3533696 3715700 3722968 3654170 3716046 3900724 4002302 4011542 4066301 4054794
8904 4054794 3948766 4013984 4076760 4172733 4180080 4225518 4201210 4126404 4167832 4351194 4373207
8893 4373207 4441404 4477120 4428834 4585573 4779737 4881924 4978838 5066858 5073591 5045566 5128394
8882 5128394 5254920 5301745 5462383 5650584 5748138 5837173 6060365 6260292 6309763 6362438
8872 6362438 6424203 6578166 6728216 6845184 7077687 7182396 7383596 7539518 7744106 7887256
8862 7887256 8124072 8296523 8597221 8826144 9136505 9295119 9521924 9845677 9966726 10374193
8852 10374193 10686341 10854000 11305091 11968065 12638837 13321401 13846929 14496571 14984567
8843 14984567 15233109 15484436 15733724 16038288 16372669 16902640 17480692 17840983 18212695
8834 18212695 18602453 18994445 19426219 19981686 20553186 21282338 22005871 23016254 24486553
8825 24486553 25920291 27302013 28256741 28799806 29431389 30189063 31351570 32857194 34781561
8816 34781561 37282204 40847803 45626143 51385395 57281352 62077043 63785700 61867458
8808 61867458 58194323 54795016 53186517 53123044 54207837 56592467 60005889 64860406
8800 64860406 71454029 79391012 87991227 95016385 96940240 90764606 81190234 71454439
8792 71454439 63919536 59014736 56361856 55232406 55009620 54625407 53566702 51156308
8784 51156308 48137484 46286902 45527217 45671977 46042052 45989998 45210051 44487074 44405440
8775 44405440 45366646 47240578 50301092 54025250 57545677 59978743 61130620 60329124
8767 60329124 59165587 58536590 57900173 56370375 54837020 54605011 56075613 59523901 64550716
8758 64550716 69812595 74068092 74952118 71879773 64178901 54158048 46310397 40493652
8750 40493652 36437115 33496462 31085793 29198767 27808598 26693110 25969424 25338879
8742 25338879 24907978 23995431 22911559 21881263 20837637 19701730 18405025 17382558
8734 17382558 16651920 15944634 15285092 14842624 14347100 13934433 13487388 13108282 12859408
8725 12859408 12714929 12687246 12627250 12483927 12498435 12352639 12377972 12196808 12310585 12421396
8715 12421396 12445423 12579216 12827657 13054060 13480457 14224205 14977762 15825677 16851281
8706 16851281 18005537 19487068 21864304 25766112 30583565 36018922 39830443 41361237
8698 41361237 37216798 29657646 24000067 19895898 17071965 14722212 13160006 11960715
8690 11960715 11038559 10347799 9739895 9206204 8850332 8441275 8180552 7936672 7838766 7602320
8680 7602320 7539783 7330006 7300546 7308513 7269070 7251171 7217927 7271451 7162188 6956369 6717482
8669 6717482 6407467 5988779 5738655 5545471 5294757 5090369 4856632 4744824 4554518 4428493
8659 4428493 4361205 4293681 4240359 4201681 4107519 4018009 3896188 3940492 3925683 3781930 3783170
8648 3783170 3723027 3498452 3534123 3502681 3405506 3330338 3167721 3275659 3369169 3214880 3162869
8637 3162869 3175042 3068411 3141195 2969022 3040783 3022711 2830262 2863348 2807684 2913157 2826895
8626 2826895 2726806 2627637 2461814 2393702 2361450 2274377 2222280 2254622 2335154 2314710 2313898
8615 2313898 2329902 2251276 2262940 2221019 2115089 1964984 2015889 1988722 2004053 2040093 2109758
8604 2109758 2031174 1893653 1773595 1743001 1881020 1806221 1752476 1782740 1820411 1867670 1854693
8593 1854693 1860676 1827201 1751933 1720974 1819207 1860298 1873786 1942972 1957876 1866169 1810563 1944790
8581 1944790 1926813 1940144 2060302 1993795 2057385 2177445 2282947 2200504 2028091 2073502 2066247
8570 2066247 2008849 2053440 2100791 2080982 2097721 2178903 2273614 2192434 2284188 2288030 2148228
8559 2148228 2146056 2219311 2207363 2027705 1996113 2080612 2004124 2003460 2060557 2120463 2107783 2120659
8547 2120659 2227755 2377041 2445270 2572887 2819997 3094547 3261376 3518178 3525106 3283017
8537 3283017 3037454 2841060 2546692 2386048 2337187 2340860 2282578 2259321 2192730 2128633 2178412
8526 2178412 2116593 2079090 1964277 1942584 1979447 2067592 2080889 2138834 2060044 2098730 2010184
8515 2010184 1944109 1950235 1898488 1898808 1914436 1968513 2045180 2111386 2222590 2376212 2571586
8504 2571586 2852369 3112491 3293644 3243081 3145389 2792117 2410057 2283231 2116622 2082540
8494 2082540 1881857 1872301 1908675 1887010 1822773 1658599 1740370 1762981 1819076 1825084 1844329
8483 1844329 2003453 1969834 1948881 1873307 1830930 1816015 1789985 1693568 1556014 1434923 1438897
8472 1438897 1420481 1326373 1275949 1124913 1173543 1246424 1191023 1137923 1143318 1187654 1164679
8461 1164679 1162002 1191073 1078783 1090561 1159163 1179701 1097975 1121387 1191489 1167299 1119548
8450 1119548 1059359 1117843 1133749 1262777 1307560 1291959 1245283 1275006 1295357 1322402 1216166
8439 1216166 1207610 1265485 1183252 1128984 1139010 1263660 1235490 1069764 1047590 1054694 1007897
8428 1007897 1064474 1261297 1121664 905850 934729 977792 951044 908287 879532 920987 881144
8417 881144 927372 1055170 1048115 1028970 1013078 1005239 843020 759063 832838 870575 870055 856941
8405 856941 895659 967927 879861 884189 875026 893814 850255 833565 859042 906395 950567 812734
8393 812734 777212 726749 769810 859516 839327 913396 972448 987382 796706 900182 975557
8382 975557 847414 885764 1027432 964029 873476 907273 863817 837640 831504 865519 895844
8371 895844 775995 776878 808233 841488 833414 717524 630044 673927 794945 727146 610249
8360 610249 651070 762048 800666 725636 711783 657044 644756 597491 658749 656147 656627 758467
8348 758467 630674 632386 641802 676951 736511 715041 722473 641364 757303 645781 524697
8337 524697 510187 580960 569973 609898 682839 641188 686177 677561 762406 754491 785125 877511
8325 877511 828654 859056 811432 878941 933482 998115 1158109 1162234 1239176 1267055 1299085 1227432
8313 1227432 1420865 1485148 1632758 1884818 2178607 2394542 2432569 2451345 2375669 2118170
8303 2118170 2047710 1957189 2024151 2048383 2187405 2412167 2684465 2857457 2722722 2378893
8293 2378893 2103939 1742461 1470765 1301318 1002096 938171 900128 914045 807732 750160
8283 750160 867169 921663 973378 808630 662855 719148 551071 511380 502048 579260 452719
8272 452719 529792 492653 375522 301622 259654 273921 217289 243326 362619 467746 515493
8261 515493 566207 486657 419868 461676 400001 390115 393413 272121 371888 350922 405289 464110
8249 464110 383557 436940 354265 325500 490447 554566 556334 535523 512747 416785 370857 358443
8237 358443 413286 512145 384576 389569 481988 425399 457263 442658 532944 455706 458665 519976
8225 519976 643097 687178 666525 716982 627006 517374 585286 529433 481378 491534 653999
8214 653999 686979 611244 694765 806675 720665 807045 890873 936390 1075492 1239659 1557179
8203 1557179 1629924 1635700 1575626 1448304 1125676 1086349 1088018 1075149 925570 1094501 693224
8192 693224 2095479 2637156 1851113 1857623 1366858 1280498 1079520 1104592 1052852 1138089 1082184
8181 1082184 1034320 1103843 975776 857478 919607 790117 769156 883896 813591 824491 987833
8170 987833 1033795 1058727 1146382 1242703 1240899 1380855 1556660 1488025 1435566 1298158 1130009
8159 1130009 1016419 926646 1031338 1079115 1059611 1203197 1330507 1204930 1082035 853764
8149 853764 757597 902431 978238 852158 719394 657520 628385 578357 568940 621689 543605
8138 543605 531782 527722 474304 381055 202633 230433 304465 321368 315040 316935 375427 377222
8126 377222 343963 407797 508493 331410 369982 198083 366575 446015 383543 362031 354736
8115 354736 395005 491043 525319 494189 472505 516361 486637 397575 395971 406051 376016 403114
8103 403114 461078 373341 399703 340759 519191 347999 328988 298736 307144 235154 302651
8092 302651 425612 407566 394331 344309 267238 145708 284732 306426 190993 252411 214024
8081 214024 226234 227286 155618 180116 211517 298841 168292 223033 239330 151167 228484 269964
8069 269964 215249 386447 414841 291230 132416 172301 39158 -19040 40020 84101 124065
8058 124065 184356 188419 194460 265339 268072 265463 207438 112543 100703 126637 107599 -19310
8046 -19310 -36063 191655 53773 -15524 30881 47483 55412 16042 27384 -105810 -30513
8035 -30513 50288 81276 112116 79423 32199 121588 9714 -31372 31815 57422 163890
8024 163890 133988 149002 45952 153856 176557 125483 61679 126789 -23954 -108726 42800
8013 42800 4531 1832 95741 4832 87245 10432 61565 -21557 76695 -92096 -47092 16597
8001 16597 -12211 40360 18593 -51414 10548 38722 -82154 -93258 -73831 -90688 -97236 36149
7989 36149 -15780 14943 -78538 -90736 -88167 97714 104630 34128 67077 -6470 -9113 99990
7977 99990 47649 57735 68231 99547 66722 -29843 -101426 -2350 85820 -21192 -134218
7966 -134218 -78129 -182825 -163806 -88515 3066 -67780 -161258 -150785 -28776 -96383 -9391
7955 -9391 55059 -59563 -84505 26888 46985 -12984 -119816 -196747 -162466 -105684 -76717
7944 -76717 -35313 82075 43467 -12506 -34824 10618 -6717 -43336 -65815 -15203 -19342 37326
7932 37326 -68716 -20983 -20988 -91060 -89329 -80493 -45721 11780 -8599 -64796 -85553 -61718 70882
7919 70882 72089 -52786 -13083 26426 -67373 -112132 -90121 63438 102302 14988 128369
7908 128369 118240 -85160 -91764 -11211 -53127 -240612 -240366 -43106 -110328 -55474 -23128 -95651
7896 -95651 -127822 -82101 44648 43373 -41647 -44753 27084 38651 -8724 -38913 62784 89119
7884 89119 -35606 -59504 -65392 -57959 -21055 -45611 -36571 -6432 83917 -70556 -173225 -100807
7872 -100807 -35701 -61971 13473 22939 -18865 -32650 30051 -24987 10965 91521 -23096 9677
7860 9677 -83025 -53810 -13476 -22065 -14604 -79336 77 8059 -48357 -98664 75705 43501
7848 43501 -43132 -46565 -66808 -40857 -167099 -99473 -14416 29584 121295 58857 5182 29180
7836 29180 113075 30313 53464 53273 23288 95335 88680 58355 71704 27535 -75054 8825
7824 8825 -30046 -69118 -121932 -15347 -68656 -35632 -7489 -29086 98241 69353 27540 93976
7812 93976 -234563 -196814 -69333 -36868 -46847 -114690 -178831 -128727 16178 -97018 -122195
7801 -122195 -6590 -48994 -74283 -68538 -53790 -41888 -90830 -64141 -92085 -118450 -190257 -108972
7789 -108972 -35098 32004 33682 70105 -11428 -91588 -99670 -25272 -9200 -3445 51245 7950
7777 7950 -15116 9520 20258 18156 -1910 51641 -52497 -100289 1424 11819 -159956 -152440
7765 -152440 -11497 -77604 -2001 -59824 -53515 37419 64145 56446 -146808 -237765 -193233 -154597
7753 -154597 -134078 -67936 -110254 -93338 54260 102435 -7350 -69866 -54899 -52605 -204863
7742 -204863 -279941 16854 -28054 -139186 -185366 -325795 -168397 414 67560 24409 36650
7731 36650 -8217 -114382 -10099 -53689 -35587 -29896 43250 99512 17217 169289 118775
7720 118775 186212 249439 143955 142008 224545 148316 100567 85325 -4411 60672 86297 178312
7708 178312 186566 88226 153571 122724 -67332 -4988 58822 128664 27536 -7935 -107826
7697 -107826 -184906 -146936 -60650 66111 40059 -2114 27862 -90997 -49076 -85775 -54091
7686 -54091 8393 -10029 -18279 -81878 -133748 -23011 -3450 -72132 -131798 -121365 -44465 -62249
7674 -62249 128748 90573 19711 17519 -13751 -80685 -10933 -78954 -115522 55988 95053 -88513
7662 -88513 -5347 -14468 28083 -168283 -116600 18945 -154374 -159149 -61249 -129778 -62266 -37088
7650 -37088 -21600 -74034 -74524 1116 776 -2934 -102603 -108122 -128361 35087 60589 -63110 -31275
7637 -31275 -67469 -66310 -23763 -81254 -90303 -72628 22442 -9348 -31239 -44304 -17030 73769
7625 73769 76770 79330 -68420 -120530 18867 61688 39281 -118471 -74548 -46222 -52478 -166568
7613 -166568 -89230 -41431 -16996 13277 -92141 -81484 -17022 -80158 -67562 -85257 -93434 -154460
7601 -154460 -176764 -71110 32711 -68391 -130953 31424 61464 -55451 -97199 13519
7591 13519 11352 37744 -68040 -30771 -38080 -16608 -3068 -115760 49150 11753 -133979
7580 -133979 -57212 -11332 -24266 -74324 4682 6505 -27270 13262 -37346 13442 73112 21048
7568 21048 46543 27905 -124651 -202853 -103612 -87396 -118007 -36006 -162570 -121426 -166869
7557 -166869 -223622 -81537 -6550 66630 142794 8586 -56360 6777 -69479 -45291 -19091
7546 -19091 16355 51315 -63561 -29904 -46567 -146266 -162233 -175206 -23414 -22091 -43663 36358
7534 36358 -6914 -6033 52622 102793 93209 27186 -37589 -61170 150677 170954 155382 170705
7522 170705 135804 123902 167786 196597 154641 215799 153724 14704 53812 77118 -32
7511 -32 -33355 -100347 -127993 -156697 -141346 -80669 -142012 -8848 152484 176473 168402 69860
7499 69860 5857 -77228 -63993 9204 118058 179757 204524 201658 154315 226925 141736 111344
7487 111344 170084 176406 90626 218671 215960 222443 239266 215569 250007 155205 168074 28749
7475 28749 174038 244708 212658 253200 266430 358047 383088 452935 505940 434859 370768 261574
7463 261574 196052 111551 50343 116148 134131 72803 43880 133633 176004 203205 94575
7452 94575 -18663 122316 140701 29251 118995 163218 227260 54561 -27170 -8613 -54222
7441 -54222 -7319 69923 35122 13879 65871 65856 110349 118622 131827 118392 -6820 -43249
7429 -43249 -13599 3368 65759 15081 -37918 -16525 61085 -57343 -9068 24231 10740 104814
7417 104814 167805 92112 91513 18406 -9542 6435 36343 127970 54029 -34053 -113630 -90361
7405 -90361 6609 -4047 -21095 -7799 -83383 -134251 -25613 -10178 72639 27858 1912 1535
7393 1535 -15278 -99154 -176603 -130012 -76515 62275 84734 136760 -101394 -144483 -28112
7382 -28112 -30815 -22950 6369 -81680 -121270 -42683 62971 183529 127942 59919 31133 -46837
7370 -46837 15953 161313 161426 109287 52380 -47186 5830 82962 65900 55033 92226 70002
7358 70002 69222 117180 148204 125382 62225 -42967 36771 109532 59906 52255 79818 65265
7346 65265 18877 28305 60535 74227 116728 118537 42418 112669 160505 125285 213217 182150
7334 182150 185405 181995 32699 32589 110451 62007 -22747 67753 70024 44709 57644 31721
7322 31721 47514 119240 102212 95211 73372 9968 105339 102068 148837 161034 140859 199485
7310 199485 258814 303644 228777 189719 184029 306587 334317 203435 246899 287901 245306
7299 245306 97592 34480 198637 236965 298932 313744 319684 340210 393224 254100 271899
7288 271899 339572 296732 247530 230801 241296 209417 190932 175813 221256 276012 359453 435238
7276 435238 323325 383301 373357 259941 155569 232908 384304 422051 292281 210146 219008
7265 219008 122465 221682 296013 343278 327065 291459 240446 398864 384312 379689 332787 281444
7253 281444 288899 272040 366204 372134 300277 301660 309212 390265 368044 334513 471966 482720
7241 482720 368461 400958 402585 420709 502439 499417 431332 402157 393037 365311 337960 321122
7229 321122 458617 459242 420218 407630 360089 380103 498726 506489 392527 394976 419658 447628
7217 447628 379580 460150 597344 676862 736364 700701 754271 912234 789309 737206 830335
7206 830335 782297 831396 730587 741314 799543 794934 735657 788276 938198 1025758 964052
7195 964052 933525 876528 910754 1016973 982680 942778 930668 957347 1115375 1113654 1014575
7184 1014575 1130286 1042811 1080214 1205563 1215139 1291818 1343979 1366778 1475867 1482810 1591151
7173 1591151 1654054 1608078 1611546 1709849 1708741 1761408 1979430 1894116 1925569 1926511 2012964 2034556
7161 2034556 2048279 2231578 2212834 2277450 2431009 2527076 2786451 2903081 3000762 3099474 3156566
7150 3156566 3342885 3557309 3599334 3798047 3997350 4026336 4227531 4360081 4576367 4722381
7140 4722381 4928111 5127858 5330856 5642353 5935595 6368451 6896774 7448553 8072350 8818720
7130 8818720 9665090 10648098 11738059 12952553 14647383 16838014 19571570 23030521 27174967
7121 27174967 31254465 34219109 34973270 33386531 29765798 25273708 21037653 17619666
7113 17619666 15146280 13234294 11810036 10902112 10223422 9756296 9314713 9156847 9055867
7104 9055867 8813606 8700720 8645317 8651972 8594222 8533009 8524417 8807562 9027856 9005322 9090525
7093 9090525 9392255 9548225 9789699 10086251 10461681 10849416 11242163 11772461 12641270 13712230
7083 13712230 14722404 16006614 17573152 19377017 21530187 24119392 27086428 30711120
7075 30711120 35518445 42062500 50223471 59491952 68364686 74724534 75792541 71411544
7067 71411544 62835209 52164784 42298911 34273182 28246405 23686314 20363087 17769606
7059 17769606 15839106 14320487 13165498 12236087 11273678 10356406 9639525 8822859 8146376
7050 8146376 7701988 7363932 6929863 6448188 5974364 5652699 5434352 5210577 4948152 4725451
7040 4725451 4351552 4163339 4019749 3622825 3470158 3342418 3275294 3175681 3137165 3159684
7030 3159684 3045807 2870144 2689042 2672876 2526024 2486221 2457104 2363496 2306915 2198085
7020 2198085 2165505 2063588 1980046 2015696 1944231 1799398 1850163 1754348 1599492 1506932 1482168
7009 1482168 1551915 1631193 1613114 1497660 1569140 1553260 1369602 1318759 1213272 1191671 1127631
6998 1127631 1138230 1121075 986606 1065080 981529 975128 934602 838992 905058 932949 945226
6987 945226 936323 812043 728156 787472 737424 812159 781174 696371 679452 681456 623693 617264
6975 617264 577682 502798 471136 472205 558872 473123 437694 453850 546808 506818 457760 389882
6963 389882 380402 476440 524459 519628 554800 483883 419332 471944 385087 478929 453062 309614
6951 309614 310728 288056 245679 286273 153496 216790 303253 315868 259680 269898 208344 187983
6939 187983 286717 297887 256215 272218 277794 270047 255007 368055 264462 186720 214670 238876
6927 238876 330438 360554 322224 355384 368667 385806 425749 390198 302435 237024 297980 294720
6915 294720 379999 373863 418301 445244 642071 639924 647711 564109 384043 317544 213668 183638
6903 183638 109342 162130 196517 175011 175083 169419 150409 245000 101388 77576 179637 205653
6891 205653 188586 255366 202861 100081 142041 197514 129130 184141 -4998 14698 129768
6880 129768 141013 138551 146943 127576 38795 208803 265596 278640 80787 90876 10988 21940
6868 21940 120761 147625 101736 18234 87491 226065 214739 279744 203752 197225 131057 144600
6856 144600 179258 121544 99180 114532 80253 218744 244778 187631 146977 211003 259009
6845 259009 381367 503348 599087 725849 806197 792100 648810 547225 437891 304356
6835 304356 200154 82193 266024 290907 213099 259366 275743 238597 161400 113295 126742
6824 126742 173457 228799 292329 107773 110626 159966 41830 64370 92820 105215 8290
6813 8290 -26107 35660 -48735 69448 37280 -34559 90105 40679 32565 -34493 -47190 -18880
6801 -18880 76930 143878 105001 160280 -15562 50508 68314 124174 118971 116539 111088 187418
6789 187418 101073 16382 51371 56351 40504 153857 126280 114707 165800 168703 113203 132231
6777 132231 33685 -145195 -143415 -42525 31701 -6999 -22282 51599 51281 76549 -20750 -23711
6765 -23711 -68609 21660 30506 -56033 145014 210516 141640 118213 40583 93776 81671 19060
6753 19060 -79275 -85803 9215 -49188 45373 -77029 1118 -86823 -10847 74051 66699 52862
6741 52862 81390 -28719 -62336 -166 -30698 133217 5626 25461 -15453 116825 208428
6730 208428 120256 65180 170139 146535 119388 232604 244467 161901 181663 218449 173299
6719 173299 217745 84557 112708 83025 77361 18807 22457 7930 -38723 -57655 189321 209090
6707 209090 186417 254738 147187 101462 -10494 -84610 -30772 -97487 -46826 17114 -88685
6696 -88685 -115805 -4701 29926 45175 39401 -56936 6287 150827 65840 17691 63264 -17525
6684 -17525 17359 93613 129441 132755 175341 74169 185234 176766 97349 96019 80121 263126
6672 263126 297212 263742 297138 301930 256820 155770 121889 121511 131427 175435 180229 149593
6660 149593 131593 84242 -32440 4805 -17013 -10935 -61167 -10920 -40400 -73525 47794
6649 47794 25419 94189 2912 -17207 26773 45791 -41602 -65015 110930 70729 -103480
6638 -103480 -166722 -66876 37480 7730 15694 41468 127064 118484 -33013 -62819 -56273 53475
6626 53475 120116 71515 54253 -52345 -154353 -69067 -23900 -85238 -31976 40880 49291 103942
6614 103942 35198 6285 10085 -71788 28400 51895 30907 92140 -72774 -40899 -15681
6603 -15681 -63221 -77030 -95877 -2748 17542 7103 -66054 -61005 69192 -27844 -12067 69619
6591 69619 -33797 -98005 -89436 -48051 -62146 -23584 -85208 -126537 -59629 46038 -24141 -47530
6579 -47530 -117950 -72995 56100 52581 -32818 31152 29910 -23570 -11245 -41764 -152375 -168411
6567 -168411 -153623 -104756 10598 -115708 -51971 -47487 -32089 -98813 -39923 -39405 -100138 -106824
6555 -106824 69948 76411 -31851 -25816 36594 93504 -50022 -42182 -34109 -1545 132249 122576
6543 122576 60252 4322 -135781 -96782 -25097 39064 38668 56977 124787 65011 25073 -2505
6531 -2505 38937 154955 111186 114448 59837 -25480 -64941 -150352 -210135 -89878 -7735 -24088
6519 -24088 51612 49309 78847 49471 40599 12880 7429 35725 -101000 -61307 16166 -27482
6507 -27482 -22161 -87690 -107069 -9944 -125579 -128810 -145415 -116426 -122301 5608 62877 42645
6495 42645 1898 -102139 -18288 22613 121020 109763 91956 105054 30742 -46115 -3867 -11337
6483 -11337 -13007 -37123 -98407 -5137 45905 29877 -50544 -151706 -79530 -49729 -214218 -260239
6471 -260239 -71430 18997 -93514 -11616 79680 -82978 -128414 -84586 -170361 -99804 -108698
6460 -108698 49287 51362 -19517 -12797 -35094 9288 -43016 16785 -2948 -27166 46453 17798
6448 17798 -113930 -54966 -16085 139124 144469 18118 -83210 -45078 2390 -50320 -24442
6437 -24442 19871 85587 257 -40734 56506 27482 74296 60744 24831 -20536 -118669 52358
6425 52358 152915 152246 135135 36539 91291 122934 128730 82951 -66589 -17749 -2790 -41827
6413 -41827 -19986 132756 152040 67868 53888 67080 105022 77691 137807 195795 141766 61398
6401 61398 113749 208503 85584 118970 140243 -53426 -100255 -25642 189791 98224 49872
6390 49872 18510 18413 29436 -19950 -40791 40391 31045 60132 93276 -19279 5254 86304
6378 86304 10025 167727 99953 42062 35517 -48272 -10321 4868 -1839 -37443 -33098 -72294
6366 -72294 16570 140731 146112 100222 176923 180281 158457 88414 119570 67185 13843 -35991
6354 -35991 37427 44436 -10717 -61551 -140908 -45781 -98728 -15111 112309 93273 186320 134182
6342 134182 109241 21144 28166 156952 103855 28026 -5232 114937 111349 141452 -64134
6331 -64134 -93246 12960 11738 70815 -20578 -105463 -51748 106726 177723 146696 -948
6320 -948 118164 208544 214854 149714 27710 64573 52791 -40338 -28036 -42469 12776 -10452
6308 -10452 41929 27591 27662 44722 140864 137406 99454 73208 113005 102305 49639 111788 152095
6295 152095 196226 106377 181482 197674 177790 137629 37048 18020 -19393 86399 183621
6284 183621 48643 -67359 73474 53910 54517 85346 168541 191208 175101 159395 273418
6273 273418 336298 212801 136114 121589 139825 129627 133432 201401 112131 75248 103040 85796
6261 85796 238255 256615 293433 336869 268580 161249 108501 110626 37036 129765 122516 163793
6249 163793 101122 175742 249771 215129 285499 264858 339076 316086 252198 287647 351586 358000
6237 358000 389150 285616 396243 388165 317947 274455 236284 267372 235519 170373 290635
6226 290635 202409 329218 395820 264750 162779 214056 214489 357302 199121 193321 301102
6215 301102 353764 302977 266064 434987 490122 498051 440218 514845 520311 391789 387487 444223
6203 444223 588281 558133 617325 738637 594213 508509 521882 571376 568850 528398 450889
6192 450889 468619 452547 409500 480629 397540 326181 275634 206229 384600 447263 362513
6181 362513 439030 505003 548382 463523 540936 644548 664537 692274 620040 695223 700541 829410
6169 829410 853770 919284 884029 812655 883652 875043 771514 858066 827627 876446 935130 809488
6157 809488 766365 893633 975913 948448 884018 937336 916213 939231 926496 973832 855200
6146 855200 795608 881790 1005690 988816 1097608 1200681 1149421 1139706 1165262 1265440 1327543
6135 1327543 1372674 1325593 1385177 1425330 1537965 1609668 1659992 1828218 1860946 1980167 2178470
6124 2178470 2213531 2206282 2290642 2381579 2534736 2657449 2799179 3032825 3229384 3451335
6114 3451335 3652389 4105568 4598862 5113343 5826391 6746849 7859307 8911398 9654611
6105 9654611 9812602 9273601 8381598 7458887 6977613 6886194 6942042 7176437 7676858 8557667
6095 8557667 9463092 9986256 9962013 8990695 7710688 6698695 5798271 5172160 4756747
6086 4756747 4321647 3932939 3745320 3648439 3530788 3517890 3386140 3317564 3299714 3236777
6076 3236777 3346855 3347911 3373438 3298407 3399861 3587329 3572380 3693624 3884340 3985170
6066 3985170 4107248 4443271 4833446 5128814 5552263 6114678 6727840 7604750 8694663
6057 8694663 10062077 11453688 12728991 13297646 12855243 11674171 10499339 9716742 9279574
6048 9279574 9203447 9472627 10122995 10914724 11887125 12786737 12894274 11979323 10442249 8884628
6038 8884628 7443874 6355475 5438404 4869979 4439262 3993228 3859690 3640246 3399713
6029 3399713 3328823 3265277 3064781 2906143 2798902 2649359 2507825 2476519 2435241 2476950
6019 2476950 2513563 2547077 2551353 2629109 2570774 2522127 2443852 2352762 2407015 2366607 2189253
6008 2189253 2026686 1998371 2098546 2021264 1969459 1977834 1959145 1941699 1969149 1840479 1861902
5997 1861902 1937575 2126441 2153738 1994358 2012251 2114673 2060232 2091479 2259671 2254338 2462238
5986 2462238 2506687 2586583 2587357 2744202 2645942 2532354 2565870 2549393 2533210 2452195 2502892
5975 2502892 2491402 2514382 2665766 2745358 2815279 2994643 3052074 3062399 3314754 3460608 3732975
5964 3732975 3894719 3814216 3839018 3807319 3775751 3581002 3534689 3578572 3797407 3948446 4068823
5953 4068823 4234930 4350171 4573100 4647640 4594425 4623779 4662256 4568898 4626476 4713294 4766421
5942 4766421 4965260 5111770 5335183 5713683 6051114 6447102 6762938 7283815 7711436 8225608
5932 8225608 8619454 8799006 8691859 8373732 8227451 8178681 8341713 8527316 8761888 9120234
5922 9120234 9507343 10009078 10695405 11220573 11827190 12535180 13397745 14733708 16223304
5913 16223304 17842681 19451454 20891287 21944558 22951953 24196651 25962664 27881929
5905 27881929 29445186 29668189 28021835 25571892 23340017 21594453 20215105 18879404
5897 18879404 17590639 16576300 15778742 15420151 15168168 14981314 15016113 15230084 15451978
5888 15451978 15935957 16440552 17141129 18067349 19290534 20721163 22383252 24511922 26755946
5879 26755946 29438131 32885912 37617911 44183585 51825583 59809243 65903762 67290123
5871 67290123 61674962 52213799 43802251 37122510 32399150 28761364 25891483 23690585
5863 23690585 21906909 20608282 19757572 19181742 18790445 18543656 18452742 18479226 18725790
5854 18725790 19268106 19869592 20921223 22288192 23905198 25754969 27874658 30280743
5846 30280743 33667675 38369580 44765258 52264011 60201037 66055993 67121921 61030856
5838 61030856 50894536 41794350 34676916 29545845 25528453 22647702 20383179 18478421
5830 18478421 17060503 16020638 15168643 14530478 13892106 13626152 13241228 12961836 12840379
5821 12840379 12748421 12982095 13173240 13591297 14150631 14660730 15350020 16334355 17779303
5812 17779303 19681589 22113564 24514866 26221053 26364986 24561338 21739444 18988565
5804 18988565 16646024 14614078 12906110 11466033 10233754 9261171 8605375 8095322 7602940
5795 7602940 7432368 7122245 6805178 6511557 6291833 6126720 6062482 5856568 5718597 5635927
5785 5635927 5496716 5220737 5052315 4938079 4816827 4959895 4966842 4990268 5004955 5047593
5775 5047593 5053521 4952969 4948108 5058031 5277969 5594200 5824061 6040816 6340197 6766949
5765 6766949 7344144 8137777 9207439 10424971 11722783 12684677 12970570 12099060 10580752
5756 10580752 9214434 8132903 7423752 6722817 6055088 5762071 5615528 5469348 5333107
5747 5333107 5199346 5205206 5283432 5293000 5424840 5726761 5961465 6277519 6644244 7217917
5737 7217917 8017391 9060817 10345592 11636323 12727292 13090607 12206956 10649218 9095517
5728 9095517 7919172 6989393 6199367 5620128 5278612 5094870 4861562 4883075 4741817 4754480
5718 4754480 4750068 4935060 5145870 5255640 5575931 5925969 6494029 7400799 8357962 9188626
5708 9188626 9665813 9196124 8201486 7094848 6128685 5289436 4895100 4483531 4071253
5699 4071253 3741924 3666961 3636622 3606256 3539597 3514366 3435987 3575037 3752197 3871152 4049177
5688 4049177 4326329 4654041 5103759 5858973 6819355 7815911 8786478 9348833 9119884 7937175
5678 7937175 6643678 5532149 4597819 3968868 3457836 3135662 2883190 2679079 2514226
5669 2514226 2334327 2044312 2035741 1896512 1737759 1622227 1685246 1610496 1391824 1395701 1419955
5658 1419955 1444288 1472598 1358951 1368527 1246082 1087282 1151442 1086383 997654 1076470 1130045
5647 1130045 1141581 1222701 1156128 1074929 1077256 1072874 1038940 1126970 1208161 1098816 1078474 997963
5635 997963 965891 998478 951439 811137 875678 889184 801526 862196 939463 899944 863607
5624 863607 955114 892677 848542 840893 781416 849260 706235 617387 742873 748139 726413 791718
5612 791718 843219 774364 802987 812270 809269 811568 854202 813772 793822 897770 861671 830174
5600 830174 808345 842601 1021232 962105 957711 981779 1038522 1172741 1217868 1105947 1185428
5589 1185428 1268226 1257386 1185575 1223746 1301318 1238119 1275299 1293017 1277410 1424116 1582228
5578 1582228 1571415 1599725 1524440 1505062 1561168 1657098 1702425 1820192 1824795 1896438 1921886
5567 1921886 2081364 2270909 2392272 2395764 2577017 2771707 2914719 3149895 3314842 3741999
5557 3741999 4108551 4653725 5041936 5253335 4941390 4314986 3794220 3429333 3309043 3139679
5547 3139679 3109130 3087349 3201597 3155809 3189162 3315859 3428517 3431994 3435131 3380586 3372149
5536 3372149 3311000 3256481 3130867 3088049 3133597 3045542 2944092 2942639 2842294 2845532 2906175
5525 2906175 2832901 2903816 3039470 3093681 3232032 3429394 3424260 3401264 3522161 3473717 3436527
5514 3436527 3417747 3414494 3492750 3378765 3384863 3426803 3480504 3404304 3261893 3195293 3166323
5503 3166323 3147262 3106036 3115223 3183978 3129562 3037644 3006365 3180886 3094114 3044412 2993482
5492 2993482 3094649 3034028 3105859 3039770 3056883 3178104 3283457 3351059 3317199 3329646 3203607
5481 3203607 3092362 2970657 2818995 2872608 2796681 2740760 2679348 2543038 2532527 2530864 2503421
5470 2503421 2432393 2342580 2391867 2451942 2428018 2456999 2404934 2480204 2359947 2466628 2580775
5459 2580775 2480730 2571574 2589852 2751339 2796617 2767844 2924812 2881912 2825681 2931114 3139900
5448 3139900 3280897 3437882 3602230 3943459 4327786 4635819 4949181 5276885 6015528 6893845
5438 6893845 7885155 9069595 10288700 11279401 11715394 11428845 10764311 10279873 9923133
5429 9923133 10076344 10132016 10004109 9414020 8533655 7620423 6711565 6136815 5802986 5591385
5419 5591385 5434014 5484903 5731692 6088805 6495632 6976853 7265336 6860764 6233179 5646615
5409 5646615 5251579 4969931 4830976 4895808 5169729 5479027 5799930 5915051 5554016 5103523
5399 5103523 4541452 3946538 3523727 3116363 2774345 2485786 2276676 2249095 2078466 2019392
5389 2019392 1956935 1944934 1830426 1822760 1792685 1791045 1855548 1890907 1779388 1756545 1889501
5378 1889501 2019807 1995970 1861072 1870598 1712247 1706097 1731025 1750176 1587427 1615674 1595839
5367 1595839 1634223 1752075 1870400 1882300 2034696 2244664 2393826 2392487 2266424 2176307
5357 2176307 2134709 1936581 1706639 1652946 1633734 1705869 1690542 1758253 1647528 1508942 1571827
5346 1571827 1621152 1566150 1583460 1594081 1503609 1543359 1666027 1727977 1969539 2124371 2369480
5335 2369480 2363779 2194871 1843879 1568544 1526269 1439081 1363914 1091003 1045198 1143489 1150240
5324 1150240 1153273 1105637 997519 1096750 1152875 1126175 1139967 1202425 1255542 1277073 1261266
5313 1261266 1116389 1136942 1171906 1075664 938922 980041 891103 756205 902910 1058383
5303 1058383 865885 898254 940702 873270 919060 884279 864861 898226 840129 911694 923278
5292 923278 959270 984033 968046 993535 1034987 1131313 1177643 1242262 1208663 1251326 1261442 1264547
5280 1264547 1181801 1117491 1130728 1063663 1033396 918665 892682 941881 1036933 968120 868741
5269 868741 754923 843419 937498 1021417 1054003 997964 1048087 948666 990849 1026609 1057146
5258 1057146 1057102 1097652 1118618 1186816 1232007 1170931 1166465 1241877 1234693 1180578 1252429 1237560
5246 1237560 1351114 1365029 1472632 1664378 1538021 1590571 1602818 1649848 1680464 1804777
5236 1804777 1960093 2067270 2076646 2206173 2343730 2442775 2381335 2431176 2632048 2762922
5226 2762922 2845801 3108062 3323775 3485232 3608809 4028673 4462724 4702739 4843252 4869025
5216 4869025 4826866 4878976 4777355 4370433 4203558 4036058 3789466 3513935 3316465 3119038
5206 3119038 3031567 2892535 2883723 2663452 2732545 2746350 2691989 2780974 2793763 2892859 2871938
5195 2871938 2903352 3009045 3160542 3279566 3283365 3296998 3566808 3816834 4092013 4211585
5185 4211585 4368439 4573498 4673818 4838132 5230446 5633536 5997207 6499933 6717279 6776953
5175 6776953 6846385 6812831 6922238 7315886 7809069 8415242 9293703 10433633 11674008 13047841
5165 13047841 14120279 14598435 14828403 14898227 14349734 13927402 13826707 13975188 14219433
5156 14219433 14680952 15382542 15980116 16203720 16003445 15808684 15326770 14944885 14763897
5147 14763897 14796088 14470876 13838456 13470241 13550009 13934329 14887447 16082770 16682013 16493234
5137 16493234 15667861 14935521 14297712 13867560 13703586 13671196 13749532 13720811 13522690 12986494
5127 12986494 12203613 11366837 10402449 9673837 9306473 9189569 9195514 9196148 8824419 7883250
5117 7883250 6893913 6217928 5757202 5503636 5301747 5151545 5167841 5352147 5428742 5409438
5107 5409438 5317273 4952478 4382823 3794444 3410773 3263153 3109624 2832239 2657687 2615411
5097 2615411 2440694 2318844 2196427 2286987 2140360 2042115 1968424 1869623 1938725 1957313 2023102
5086 2023102 1924385 1968312 2034112 2018631 1975555 1970607 1899633 1905266 1780135 1620248 1413129
5075 1413129 1422158 1508538 1433888 1447349 1285502 1222395 1193832 1151337 1273554 1295204 1139998
5064 1139998 1140098 1135071 1207674 1259260 1275709 1293190 1275151 1242279 1063058 1063455 1069717 1145711
5052 1145711 1107129 1190791 1112758 1023602 980762 868364 889908 954226 1015096 947409 925620
5041 925620 892701 876618 848796 896680 891923 967476 961487 881244 865862 838293 726172 663362
5029 663362 746121 771161 721894 686822 689037 656487 678275 624205 548873 590412 578728 589423
5017 589423 611447 461797 537330 478772 477899 508866 648619 638194 528080 420934 491448
5006 491448 408713 355585 457667 369486 419806 507149 520065 408930 387666 373269 453580
4995 453580 467157 572939 599204 502922 438473 517595 614466 612771 612413 609520 555882 628031
4983 628031 562879 395577 436784 543837 503943 555855 410377 332582 420075 493621 521326
4972 521326 528017 519340 560774 553215 437956 500412 463200 532509 529467 499711 525886 511322
4960 511322 530883 447512 600531 557617 513363 438125 377744 471068 564729 604729 472951
4949 472951 417002 440731 528664 560634 539530 507192 471536 413312 562701 550835 584356
4938 584356 672482 681783 572482 549229 655627 557365 688432 790108 802461 803384 881319
4927 881319 859414 726480 623804 595562 626252 549083 655225 721878 648226 548540 697182
4916 697182 803493 689528 711147 679422 721016 653698 555366 657595 761695 767898 846401
4905 846401 799292 813699 813962 675532 860677 987948 956279 900330 993144 790494 832180
4894 832180 1032216 1119838 1113567 1040230 1007732 950996 1112405 1122522 1106349 1157760 1183240
4883 1183240 1161140 1169427 1213430 1178240 1330515 1263100 1341611 1372700 1495547 1585956 1551743
4872 1551743 1555518 1579207 1588702 1662330 1737824 1816549 1883184 1812608 1806445 1795233 1860937 1928237
4860 1928237 2094925 2072589 2099689 2042020 2129521 2287621 2278682 2215809 2365359 2353809 2357252
4849 2357252 2322913 2361177 2574967 2680797 2556407 2581008 2632160 2514062 2468855 2601792
4839 2601792 2450891 2506848 2567195 2669704 2702366 2812795 2837554 2768290 2672187 2668272 2741724
4828 2741724 2642853 2731851 2732051 2752317 2672182 2687966 2581331 2716603 2738822 2792695 2623179
4817 2623179 2587149 2650825 2628184 2624031 2658630 2676870 2624077 2623569 2613531 2478772 2488402 2484285
4805 2484285 2409933 2341581 2411726 2391288 2394660 2481752 2429442 2358726 2372456 2380281 2577739 2622045
4793 2622045 2559928 2610429 2459865 2502847 2666888 2898344 2897191 2926611 3066714 3211659 3242819
4782 3242819 3281075 3313588 3217377 3205720 3398904 3657202 3827485 4009153 4192626 4450374
4772 4450374 4735755 5131258 5548482 6159827 7153083 8249824 9518560 10748765 11561448
4763 11561448 11361197 10216785 8897220 7921416 7305288 6932789 6755815 6774693 6853689
4754 6853689 7150143 7637661 8030875 8629329 9450049 10506655 11835188 13545036 15491493
4745 15491493 17369962 18356097 18447082 17965545 16389709 14061282 11968428 10365691 9196111
4736 9196111 8346056 7800141 7618718 7376473 7254157 7163730 7364452 7714150 8108309 8833008
4726 8833008 9986345 11281876 12393268 12692263 11752357 10134990 8627945 7336705 6318767
4717 6318767 5521202 5016163 4576778 4038548 3575529 3329508 3151947 2978099 2827120 2611202
4707 2611202 2587524 2456497 2322702 2105752 2020970 2013363 1950712 1990766 1974552 2028038 1872857
4696 1872857 1793950 1687291 1590280 1606972 1614113 1514434 1555605 1517682 1438707 1543544 1507985
4685 1507985 1473125 1390208 1340972 1213921 1288970 1385770 1287233 1167448 1292052 1283879 1225256
4674 1225256 1301284 1186508 1103077 1125339 1206137 1377979 1267912 1209028 1219081 1214206 1198017
4663 1198017 1159295 1155965 1178556 1056227 1057486 1068529 1115104 1008996 955358 1096217 1101248
4652 1101248 1168168 1150838 1218856 1199423 1144153 1052901 1053771 1170743 1138533 1199599 1191223 1160929
4640 1160929 1185624 1219936 1252404 1312614 1426904 1482004 1479853 1437039 1417071 1354382 1301097
4629 1301097 1406003 1592723 1596617 1577876 1565152 1524501 1605984 1727873 1919318 1940454 1962010
4618 1962010 1983645 1969407 2032426 2070128 2217052 2348223 2392804 2466892 2511445 2563190 2698681
4607 2698681 2676475 2869378 3079710 3211499 3276303 3457290 3622336 3934598 4187901 4478253
4597 4478253 4907191 5236692 5628658 6181162 7014791 8160077 9519629 10964140 12469958
4588 12469958 13686705 13912768 13024851 11974573 11004805 10150883 9845899 9920483 10445605
4579 10445605 11385431 12582816 13788932 14534070 14512465 13595384 12215218 11135965 10551962
4570 10551962 10578123 11184497 11833857 12444126 12737782 12520709 11706425 10650642 9656122
4561 9656122 8987075 8624324 8375517 8563979 9159395 9893147 10611389 10846591 10387518 9397663
4551 9397663 8136250 7106414 6239666 5537612 4901085 4250045 3987580 3830272 3599670
4542 3599670 3434281 3302694 3300593 3231855 3109842 3060924 2870636 2696951 2562125 2679232
4532 2679232 2688242 2681990 2636956 2596667 2548475 2528650 2561152 2570237 2606312 2551944 2603468 2734277
4520 2734277 2859689 2998521 3161454 3580161 4136614 4489241 4766153 4755873 4316006 3723465
4510 3723465 3262373 2856241 2588615 2406314 2279844 2088348 1937088 1842650 1626248 1577096
4500 1577096 1505931 1501746 1498505 1556567 1608662 1446519 1498687 1545278 1363903 1372013 1371251 1345451
4488 1345451 1452116 1454375 1526614 1483302 1352159 1374430 1438978 1462917 1678564 1738051 1732145
4477 1732145 1841174 1812314 1752221 1863540 1782834 1699245 1527251 1359827 1211471 1261655
4467 1261655 1234607 1247163 1254514 1288817 1226353 1203631 1226846 1194043 1247789 1404063 1435864
4456 1435864 1371854 1423732 1435777 1643943 1588032 1755199 2005420 2043408 1987590 2153183 2488004
4445 2488004 2790907 3032771 3088714 2939134 2799816 2544480 2394462 2215052 2062204 1989885
4435 1989885 2027735 2067949 2057979 1973645 1959592 1918872 1816236 1680545 1516092 1484821 1545507
4424 1545507 1458917 1390205 1423057 1331514 1330835 1403583 1355927 1325705 1338753 1296502 1167054 1159264
4412 1159264 1190384 1228089 1187565 1213206 1279722 1295719 1309259 1291621 1315032 1165954 1125187
4401 1125187 1205576 1255590 1310520 1475489 1434733 1489969 1552727 1572660 1651284 1771374 1854621
4390 1854621 1822933 1981565 2050345 2053148 2121262 2061114 1900031 1979359 1924315 1833895 1865653
4379 1865653 1861906 1857966 1820145 1939493 1948900 1887274 1987035 2075090 2172266 2430174 2483316 2501480
4367 2501480 2471645 2661612 2734439 2618124 2619855 2548253 2479959 2444390 2367264 2293917 2401386
4356 2401386 2514241 2582185 2474512 2389020 2431677 2570786 2623514 2652822 2889628 3016630
4346 3016630 2995532 3197911 3234399 3194563 3243875 3388629 3492164 3672597 3821713 3836131
4336 3836131 4094194 4116698 4228688 4426470 4614133 4887901 5351020 5652988 5984299 6464917
4326 6464917 6891425 7425581 8007000 8864339 10032258 11476212 13056865 14488862 15582492
4317 15582492 15858657 15393992 14358270 13325341 12326728 11534940 10745379 9899842 9194797
4308 9194797 8495193 7796520 7414093 7050642 6843976 6789615 6725200 6664043 6654718 6854178
4298 6854178 6951448 7165875 7433500 7820381 8329645 9021549 9790569 10703370 11716739 13027225
4288 13027225 14374867 15407456 15687189 14735989 13133323 11438326 10076259 8997611
4280 8997611 8162844 7600157 7090316 6854839 6649310 6373208 6194691 6192838 6120841 6154177
4270 6154177 6128258 6008569 5888257 5843817 5923234 6003692 6055909 6190525 6271664 6453837 6749642
4259 6749642 7102358 7443324 7815714 8306321 9032714 9857145 10617564 11630295 12541490
4250 12541490 12762842 12327741 11382375 10183989 9182852 8387860 8007039 7716061 7263319
4241 7263319 7165496 7118024 7129626 7060767 7135608 7357422 7553878 7597253 7530031 7566648 7569410
4230 7569410 7531617 7639916 7719786 7860149 8047219 8120963 8350791 8646511 8813012 8899619
4220 8899619 9094481 9372047 9450553 9716152 9902972 10002168 10211035 10551220 10753683 10962098
4210 10962098 11280259 11519805 11710301 11991320 12296243 12521863 12807947 13210408 13424088
4201 13424088 13790868 14278706 14709072 15206242 15859120 16397084 17066382 17880518 18784728
4192 18784728 19683320 20524173 21576629 22492391 23552809 24519705 25528462 26552886 27635983
4183 27635983 28698342 29904521 31146497 32528767 34141890 35842197 37486944 39473739
4175 39473739 41470973 43786536 46369359 49437804 52933029 56987887 61856328 67861119
4167 67861119 75085532 83847936 93995101 105617405 119110451 135734366 158055998
4160 158055998 188917472 228918147 275164658 317929686 344224669 339782021 305637789
4153 305637789 254361342 203551436 164149176 134897507 113304649 96806218 84223370
4146 84223370 74278325 66720783 60699707 56103484 52198278 48696412 45175469 41828830
4138 41828830 38593278 35854661 33389220 31264621 29517082 27960549 26498757 25070792
4130 25070792 23628145 22353129 21229345 20310678 19275418 18324265 17512375 16677107 16148464
4121 16148464 15649021 15154709 14596325 14033235 13730361 13451367 13096672 12667895 12461366
4112 12461366 12187414 12000914 11627392 11429196 11067499 10919839 10679293 10602914 10466639 10411470
4102 10411470 10317453 10286090 10330450 10521727 10750245 11070028 11424723 11761129 12014801 12152697
4092 12152697 12178358 12098822 11635882 11166042 10548068 9636347 8796919 8239110 7673558 7074110
4082 7074110 6623875 6332236 6105856 5772025 5654039 5409218 5459108 5344269 5098137 4833313
4072 4833313 4664044 4515866 4304564 4213735 4169655 4106885 4110221 3923432 3734763 3598957
4062 3598957 3480788 3412408 3337433 3250276 3126749 3107068 3127372 3072151 3021829 2995375 2898155
4051 2898155 2830463 2871022 2874393 2859425 2706228 2705138 2753048 2616765 2460261 2495568 2418070
4040 2418070 2358199 2302108 2215753 2124291 2173730 2186007 2017937 2012836 2094394 2140092 2193049
4029 2193049 2179235 2122026 2060261 1968733 1920260 1965359 1972102 1896100 1742819 1721791 1736711
4018 1736711 1812262 1791390 1750260 1690196 1610562 1548291 1576305 1510001 1385639 1315874 1371108
4007 1371108 1263092 1342848 1374227 1399512 1409188 1354162 1344270 1378818 1326541 1298349 1222471 1176955
3995 1176955 1172903 1155775 1105507 1122493 1011213 987052 1172674 1157046 1196501 1349281 1259411
3984 1259411 1094266 1002009 978195 1067052 1080359 1145743 1041181 1093446 1104766 1000456 1019072
3973 1019072 1154722 1081510 968099 949498 888365 888547 829245 851575 930893 950150 980380
3962 980380 909516 985807 1118527 1131453 1325501 1263225 1124024 1037806 997427 1056964 1035766
3951 1035766 1026203 1027226 973264 887126 1002379 996880 1085002 1087370 1127605 1101101 894303 943099
3939 943099 1004431 967654 944991 918970 1053697 1052497 1217438 1075791 912492 999495 1057835
3928 1057835 965099 1054939 1073069 927049 1031450 1092319 1037830 931597 839891 773357 826524
3917 826524 968485 867918 837769 901735 1020978 985800 866496 779164 906627 910603 888598
3906 888598 940433 905372 850717 843459 879963 954933 984081 977330 1031483 1032462 906441 893207
3894 893207 984616 1125466 1165644 1087206 1133209 1174585 1139907 1112078 1180719 1099722 1139235
3883 1139235 1138949 1031042 984469 1025382 1157313 1286468 1305014 1293118 1297109 1441902 1602876
3872 1602876 1553549 1675179 1844698 1967799 2267319 2577628 2814111 2816775 2830067 2511716
3862 2511716 2346580 2059554 1774749 1575672 1500914 1578960 1526301 1544369 1578433 1521811 1388224
3851 1388224 1507362 1508027 1597351 1610249 1477387 1566567 1600454 1597616 1573072 1568276 1583810 1521905
3839 1521905 1455147 1549211 1505797 1503164 1510031 1588589 1577968 1546016 1593929 1591730 1607932 1633551
3827 1633551 1712724 1741459 1819027 1936643 1833996 1870422 1955039 2022895 2018137 2049993 2172348
3816 2172348 2155625 2197402 2205987 2201666 2188022 2284977 2359700 2377141 2431614 2592285 2756694
3805 2756694 2714679 2861015 2972091 2989432 2943885 3113602 3269901 3356979 3523746 3651178
3795 3651178 3718596 3745052 3891343 3988582 4231162 4427397 4558551 4605824 4709870 4909746
3785 4909746 5242613 5417228 5685218 5989914 6166143 6476348 6936243 7303116 7599545 8041826
3775 8041826 8559058 9138807 9521229 9870489 10306397 10839038 11268764 11676844 12158088 12419722
3765 12419722 12755155 13141279 13240152 13351129 13093939 12902332 12736194 12370461 11917160 11381850
3755 11381850 10952178 10414332 9898136 9341611 8747194 8195211 7841589 7410558 6927692
3746 6927692 6604734 6215936 5782190 5485530 5195687 5100940 4763132 4533217 4354937 4139736
3736 4139736 3963824 3834633 3641379 3583751 3489536 3397558 3382509 3311948 3302568 3201818 3028163
3725 3028163 2906630 2758453 2591581 2523894 2457524 2433616 2363967 2324502 2244557 2284361 2170002
3714 2170002 2174186 2189033 2100652 2036895 2063043 2015113 2035452 2198307 2149197 2175100 2167195 2085327
3702 2085327 2222191 2381075 2372153 2549449 2639346 2528263 2372759 2223957 2112160 1982568
3692 1982568 1870219 1779266 1747819 1661778 1668096 1658317 1603636 1489651 1460575 1407026 1513063
3681 1513063 1519506 1598302 1628199 1504900 1446653 1386825 1471904 1611259 1620487 1629051 1742920
3670 1742920 1626972 1705746 1705521 1781420 1805894 1714593 1700164 1766007 1785684 1736255 1720986 1659132
3658 1659132 1572280 1491974 1340474 1319411 1396803 1451574 1375179 1350225 1427969 1492679 1384946
3647 1384946 1316421 1328138 1375569 1381002 1488580 1562478 1401807 1272680 1292672 1316260 1361317
3636 1361317 1350651 1364878 1517235 1523373 1528278 1440892 1233035 1246353 1397508 1377951 1235720
3625 1235720 1222117 1333034 1292445 1259502 1249964 1236036 1206099 1292860 1194770 1078166 1107678
3614 1107678 1152928 1191487 1209471 1308763 1263708 1186669 1248426 1413717 1433496 1337487 1302632
3603 1302632 1365760 1377651 1317513 1389643 1395335 1459701 1445199 1434591 1394995 1332845 1389390 1521864
3591 1521864 1485830 1487038 1548819 1452252 1520653 1589766 1574134 1602739 1548134 1533947 1380311
3580 1380311 1432650 1528856 1524618 1551338 1655574 1649582 1710810 1611482 1519503 1577784 1586109 1616155
3568 1616155 1731334 1702504 1708316 1801795 1820900 1843520 1871898 1848288 1750007 1757518 1877937
3557 1877937 1952934 1932140 1892772 1808970 1805979 1937026 1962684 1989809 2042082 1905100 1858157
3546 1858157 1971703 1973399 2057211 2038317 1994036 1915337 1935758 1960357 2024509 2188259 2164386
3535 2164386 2312320 2354051 2417341 2393597 2492910 2572602 2518151 2553423 2573764 2558930 2634089
3524 2634089 2733035 2721633 2597451 2757171 2855831 2938898 2923807 3034934 3126131 3025062 3124327
3513 3124327 3214508 3221663 3209895 3252388 3480986 3606803 3596618 3608539 3773717 3789635 3890074
3502 3890074 3943925 4032000 4129319 4143413 4305905 4426488 4583286 4633909 4683679 4748878 4868073
3491 4868073 4907243 5115558 5196216 5196518 5436204 5640531 5741792 5859293 6097422 6246800
3481 6246800 6346338 6711988 7086087 7135145 7508385 7748392 7986142 8283091 8563280 8878071
3471 8878071 9129734 9411750 9707406 10038456 10361807 10868691 11289964 11733631 12260467 12614825
3461 12614825 13077772 13696817 14342706 15092797 16048421 16991937 18292430 19740716 21535253
3452 21535253 23732311 25955043 28446068 31584096 35661230 41146652 48392129 57141342
3444 57141342 65726976 72196771 73230581 66911492 57370617 48676410 42056804 37371657
3436 37371657 33814472 31357617 29698160 28479118 27771624 27485067 27337561 27305997 27457212
3427 27457212 27811027 28385302 29382158 30696646 32448016 34741192 37637069 41074917 44887182
3418 44887182 49203708 54567225 61704380 71945302 85967417 102622410 119362754 131546481
3410 131546481 132486312 117543570 96941580 79145115 65546261 55571424 48141000 42536097
3402 42536097 38273639 35123258 32696902 30895845 29369542 28182446 27173127 26485938
3394 26485938 25942621 25609339 25672822 25978409 26514862 27418057 28583482 30091528 31830424
3385 31830424 34000131 37046782 41539592 47654946 55024840 62453243 67549900 67506650
3377 67506650 60480550 50579301 41809114 34848446 29845483 26033835 23091692 20848317
3369 20848317 18892010 17446590 16279874 15333256 14380641 13721917 13158505 12479668 11886423
3360 11886423 11514105 11240652 10758431 10421188 10141350 9887050 9357719 9086231 8852390
3351 8852390 8559082 8218423 7970739 7673420 7567886 7309384 7075227 6971929 6936522 6680143
3341 6680143 6518419 6379433 6390196 6416756 6254001 6190523 6140491 5948961 5967210 5928076 5847057
3330 5847057 5811611 5876127 5716435 5882546 5939545 5835748 5886202 5817248 5859166 5855051 5848326
3319 5848326 5661634 5593135 5798148 5916094 6012367 6199164 6443098 6693094 6912358 7041034
3309 7041034 7080520 7340116 7803121 8136267 8377290 8411819 8045354 7481044 7053086 6773381
3299 6773381 6450860 6208439 6041131 6046177 5971890 5817617 6038311 6147274 6117603 6187325
3289 6187325 6196530 6227617 6255167 6440365 6578447 6766020 7138448 7480369 8013301 8438706
3279 8438706 8851177 9375234 9668652 9984810 10569602 11456388 12119872 12460314 12020012 10978277
3269 10978277 9972503 9151500 8528408 8052833 7777119 7731317 7658887 7774579 7946360 7872908
3259 7872908 8030634 8232394 8402916 8708442 8964987 9229973 9598867 10060015 10407625 10830974
3249 10830974 11466356 12068540 12652826 12991464 13199515 13248996 13036832 12862891 12627194 12307866
3239 12307866 11551762 10666917 9639107 8806456 8082764 7637152 7226777 6840169 6428642
3230 6428642 6165885 5959304 5714702 5467892 5270405 5183104 4998354 4928033 4798534 4501150
3220 4501150 4435159 4423924 4256292 4175616 4181095 4081946 3953259 3807297 3700215 3624030 3527745
3209 3527745 3461691 3464933 3520847 3397063 3258392 3163481 3118167 3039635 3128382 3023746 2930411
3198 2930411 2962344 2950263 2871013 2858586 2812668 2824674 2729338 2563623 2500094 2469287 2548798
3187 2548798 2562599 2582854 2582248 2490934 2529457 2543787 2437663 2266622 2314604 2384279 2261810
3176 2261810 2103594 2015095 2104658 2070050 2069748 2227015 2115281 2052679 2123409 2013296 1987811
3165 1987811 2078291 2111053 2071649 1993296 1957160 1922221 1875268 1972078 2053287 2016328 2056953
3154 2056953 2050444 2111812 2080921 2118720 2115332 1953970 1894055 1929255 1809738 1608231 1619275
3143 1619275 1689471 1805212 1823196 1789808 1814001 1787652 1676294 1521903 1505753 1558117 1589792
3132 1589792 1631265 1666390 1675091 1801756 1933777 1930665 1864587 1939755 1944903 1969947 2159636
3121 2159636 2221798 2133425 1992900 1834855 1678399 1663881 1674144 1624421 1588457 1553620 1527770
3110 1527770 1534020 1531552 1492701 1502285 1509467 1336185 1277144 1374830 1514823 1345663 1268160 1303722
3098 1303722 1233609 1234294 1281246 1466341 1487821 1420116 1422027 1518527 1451320 1465243 1482348 1449332
3086 1449332 1369147 1257912 1263329 1239862 1308076 1279771 1318804 1132488 920365 1100189 1145689
3075 1145689 1037978 1049217 1087868 1197711 1120665 1067332 1078468 1098624 992900 939405 1141337
3064 1141337 1192146 1144614 1095397 1131719 1159545 1093661 1098752 1038823 1103220 1032781 1064008 1111459
3052 1111459 1114889 1159189 1060224 1128351 1196200 1070984 1032005 1009547 1038548 1150986 1146860
3041 1146860 1149221 1117331 1231463 1269036 1177678 1074848 1029975 1079521 1232845 1214139 1228965
3030 1228965 1211278 1278512 1252620 1252349 1330232 1385918 1430431 1477250 1470636 1567938 1502845 1441242
3018 1441242 1551482 1417047 1347573 1384803 1457090 1352224 1311875 1322036 1278913 1394996 1546043
3007 1546043 1543665 1421511 1283156 1380593 1426022 1388052 1485972 1448090 1510213 1550164 1595323
2996 1595323 1746709 1699967 1839802 1881203 2046965 2078417 2170590 2258088 2217945 1947471 1938695
2985 1938695 1993500 1856515 1759590 1638176 1677329 1736220 1819694 1999572 2033982 2002219 1990624
2974 1990624 1883188 1709304 1646824 1639040 1622404 1571242 1484737 1548263 1692766 1679151 1610208
2963 1610208 1754771 1883280 1945348 1814345 1966315 1933023 2004959 2101194 1983362 1949135
2953 1949135 1903777 1784353 1834384 1874980 1849230 1859664 1833517 1859194 2018586 2067350 2056093
2942 2056093 1942576 2110503 2209445 2115267 2125857 2167450 2196553 2223813 2244475 2300774 2223713
2931 2223713 2340499 2333316 2270750 2282273 2337291 2430132 2465092 2388035 2364577 2374423 2528130
2920 2528130 2654150 2621969 2562630 2674565 2712049 2733354 2764233 2964653 3115674 3023122 3126772
2909 3126772 3245450 3407217 3531395 3680770 3651368 3714962 3629623 3551373 3372105 3325169
2899 3325169 3294623 3308874 3110640 3037121 2859690 2931571 2926343 2979674 2955410 3064673 2967995
2888 2967995 3011838 3104907 3139617 3196750 3225537 3338299 3277527 3292620 3374157 3351221 3350824 3397846
2876 3397846 3241639 3157546 3176617 3213038 3017802 2881147 2784129 2788436 2696561 2545960 2403486
2865 2403486 2325146 2413178 2427777 2434802 2377888 2273213 2324941 2178860 2241831 2254140 2249073
2854 2249073 2290943 2221777 2190566 2110411 2084203 2113977 1944098 1919635 1803113 1780158 1759428
2843 1759428 1616281 1562173 1497786 1462371 1511320 1468275 1406870 1344353 1240332 1225240 1392910
2832 1392910 1374994 1311413 1238865 1200561 1160267 1151027 1135969 1075341 1057651 934540 942129 1038201
2820 1038201 1116754 1029850 1033563 1023224 950693 904469 997003 911818 797106 749974 702086
2809 702086 711483 894828 927086 943231 788254 839243 909680 665809 583744 621651 626368
2798 626368 654794 638271 547606 495757 534909 636517 609181 604079 609430 698464 744602 638367
2786 638367 609692 571260 523455 544516 508396 569149 618379 600084 500540 536735 507907 468284
2774 468284 363986 399771 382717 348461 320885 349215 351515 385912 359492 321158 300110 310965
2762 310965 404968 399607 499893 470396 419821 317453 393954 541954 520532 314566 201684
2751 201684 267348 411019 372352 221461 338854 294930 243825 376205 375687 276821 231288
2740 231288 233504 223873 343159 302290 69295 81529 103265 188902 261488 271792 200274 196670
2728 196670 170671 220168 270367 242417 207988 182470 180535 302449 353796 189716 64134
2717 64134 132428 245001 239692 231867 216924 256988 231580 152292 198548 178417 98997 112815
2705 112815 157768 64707 158577 316007 145168 99210 73362 118060 150549 113802 88177
2694 88177 123742 123208 170331 190256 119951 34118 108436 237901 246804 155525 134480 101379
2682 101379 75521 -2926 135858 114163 1691 -70872 -64518 -69781 45795 66682 55707
2671 55707 92699 174883 219409 234433 225461 198285 131603 -14496 -15361 43385 73181 215896
2659 215896 169767 -3004 -27386 -37320 53323 122068 52815 98579 130558 102699 86057 24352
2647 24352 114256 51736 197052 123719 18811 81787 217580 290406 178757 145604 135293
2636 135293 174831 126541 -948 82361 -10707 -2764 61107 97988 70232 112976 70578 22560
2624 22560 2466 6715 72891 9151 -4651 33982 75617 73884 144983 255873 234647 80968
2612 80968 40923 96160 48737 185129 174464 175567 147830 45803 68638 135012 117142 56820
2600 56820 65985 63458 28994 -48962 48419 58165 55489 15004 61382 -50787 43327 62043
2588 62043 -86431 -134119 -48284 -81334 2007 65868 18073 134754 88571 110976 164904
2577 164904 88589 68829 22519 -107142 8218 21654 38628 26741 52714 -11783 77620
2566 77620 143470 123181 88718 -21469 37745 125060 24365 14232 6910 70695 72030 53286
2554 53286 -30249 -31216 117381 24828 52199 50449 -13002 -15126 48715 76301 129737 8423
2542 8423 20438 -20285 29275 38418 -20141 71028 10592 3626 94252 61752 113498 146194
2530 146194 79017 104247 65063 -88185 -72330 54785 -11856 58592 153183 146494 23813
2519 23813 -16624 121618 -38764 -121776 -112927 -97110 -55693 -131166 -49662 35571 55934 157289
2507 157289 152309 92443 237027 136059 67595 212907 88144 -31565 12254 45778 20011
2496 20011 75639 68235 -14593 74096 137434 139728 -100608 -34991 -26326 27311 -7519 90352
2484 90352 33162 25508 66201 83160 146433 54100 81813 15836 89400 52072 53764 72852
2472 72852 59451 -38338 -20365 88044 150507 107865 119014 83721 91939 102216 117212 78306
2460 78306 75474 -23204 70579 20368 58001 -28020 -26326 31291 -111811 -75022 -17514 60410
2448 60410 136256 22374 -36041 -75542 -40446 24004 19189 -58706 -77953 112056 25128 -26963
2436 -26963 -9717 -89954 -178626 -55070 71226 137132 65724 -171750 -94657 -89598 -138922
2425 -138922 44027 50222 16849 -26733 27412 128495 65621 -81342 -76191 1999 37497
2414 37497 80595 -47405 -2717 25477 17607 85731 34455 3805 -64099 -16300 -52131 -85797
2402 -85797 40606 66331 148496 191147 114844 43460 94888 9952 -67838 -66359 26150 76286
2390 76286 -23169 -6327 61439 63901 59734 147536 64284 49663 142485 199180 115273 184218
2378 184218 182047 239824 307704 229637 147789 334595 392514 302523 285139 184243 113761
2367 113761 124293 70760 -41298 104314 164819 60532 91482 117615 135883 52133 -86794
2356 -86794 -44374 51819 32266 61206 -22080 -56009 -2252 70087 65446 47571 63930 32463
2344 32463 52042 59618 -95022 -95796 -126759 -45462 30417 77773 50474 -104932 -52818 67996
2332 67996 168629 84627 38581 27319 37311 -7334 79854 91207 60123 12705 62268 115460
2320 115460 98474 87137 113622 130297 3222 21972 -10022 -3546 37965 15484 82830 11028
2308 11028 -70704 25535 162416 131339 109972 116083 134484 134116 200411 145089 73799 82608
2296 82608 134178 95310 45917 135559 198259 250598 191014 -52479 -94523 -56269 149893
2285 149893 165005 -8942 149765 156277 -34503 60889 129238 26228 67827 201141 239703
2274 239703 147796 93300 122463 280847 159358 92291 120267 79682 108630 63417 96241
2263 96241 163758 161487 171696 242228 274462 354590 178493 32397 102079 116462 81639 273152
2251 273152 257575 124241 70730 147515 219654 173755 157460 -7127 96962 231791 174332
2240 174332 197052 164878 85700 101357 162863 158554 105464 153926 88541 216399 145645 201507
2228 201507 277269 252936 215814 168024 100031 50213 -17122 83383 214851 272714 258160
2217 258160 142465 223263 305947 334893 293709 264640 260827 314221 339282 326253 323338 340475
2205 340475 304676 302580 335175 270016 352978 400863 410790 358851 411458 469045 479772 550119
2193 550119 543246 409400 504968 534518 476471 463312 540870 661905 567822 543625 596292
2182 596292 761813 741638 720194 706674 775778 732193 763805 864388 938926 992618 992630 886051
2170 886051 1021514 1069640 1217601 1215235 1162570 1034029 1050292 1106513 1142094 1195112 1268175
2159 1268175 1291806 1253559 1332132 1474652 1472631 1510760 1558152 1525023 1647923 1777721 1758594
2148 1758594 1853562 1975090 1969785 2071513 2204367 2351242 2505392 2607186 2652122 2730085
2138 2730085 2936902 3032609 3111543 3348277 3405530 3582177 3835502 4135561 4375613 4538377
2128 4538377 4857334 5107539 5366582 5676145 6116827 6590201 7150164 7704966 8252006 8726149
2118 8726149 9094562 9846133 10988771 12417085 13935018 15759241 17977556 20781170 24924512
2109 24924512 31178164 38939072 46664984 51655286 52204912 43847212 33597452 26354204
2101 26354204 21056394 17534112 14691751 12501617 10801811 9538971 8677023 8140345
2093 8140345 7711650 7408429 7001550 6657731 6004687 5484232 4964487 4585149 4175072 3873987
2083 3873987 3652551 3394417 3100299 3057056 2781893 2649191 2548638 2354637 2199974 2179359
2073 2179359 2026673 1932963 1895912 1942022 1941951 1795279 1769449 1677149 1491416 1563589 1556931 1542866
2061 1542866 1409067 1231762 1153524 1131336 1047425 1142550 1079309 927822 960354 1086974 1040945
2050 1040945 937214 847022 918014 929369 933056 952942 843967 764273 683400 731238 784193
2039 784193 811815 675358 691256 658125 723359 660742 598597 585615 531631 494099 487338 475333
2027 475333 398475 451738 432895 377840 342006 340829 287765 339230 365072 311267 396482 323545
2015 323545 370263 352900 317427 322853 260495 272718 342789 355101 267283 313683 249047 260998
2003 260998 290720 323935 204806 294409 222872 282444 342955 264992 152627 92007 85571
1992 85571 242409 319791 323827 247518 170010 185484 239601 166419 212597 272439 118463 142692
1980 142692 212977 196159 42327 186989 174454 153516 182772 226654 203982 225039 238208
1969 238208 128334 150662 250875 95253 2986 76391 192939 119450 59867 77247 92219
1958 92219 67706 60579 21144 -75020 65804 119045 112309 41081 -15446 59495 101667 132023
1946 132023 211986 198225 62806 133239 123500 233942 95200 38824 108216 89557 96702
1935 96702 54952 84896 75149 36118 136382 63998 68005 12127 28206 -23916 -21293 36458
1923 36458 11173 3875 -33794 40376 77278 -51573 -99741 -4042 158759 90869 87452 88918
1911 88918 5708 59268 -6565 -55015 -90032 -51391 -124791 -20850 -6043 -61427 -51715 14852
1899 14852 32994 8542 59472 114499 40267 47681 31390 122310 31977 84023 1500 37999
1887 37999 16367 -154088 -22904 9893 61295 -27480 -29418 -13735 7111 -42945 32967 81418
1875 81418 15419 -28161 84450 165553 113100 -22028 18327 -5339 -8769 157464 116821
1864 116821 187572 109414 -26398 67345 179967 41405 1085 -5111 63066 147155 137140
1853 137140 77883 140060 118074 41333 13481 -80548 -48243 -30840 100428 102458 104989 47466
1841 47466 25459 65686 164422 228103 412162 354249 328424 174105 99986 244243 43024
1830 43024 73989 73587 -9014 -94707 -30704 13276 44478 44574 -32375 74909 23076 -54416 -111432
1817 -111432 -126837 -62907 -114920 -13541 -41050 -59471 31717 7303 59022 68351 -10989 -22180
1805 -22180 -52813 -41732 -59124 -10106 25261 79174 -37592 -5035 51152 31723 57475 -77634
1793 -77634 -109278 -60619 -60031 15861 -10644 -51677 31404 51071 58820 85114 53812 52196 -396
1780 -396 70922 -19656 67834 52212 27841 57742 1522 -94063 -9417 14692 -10108 -81947
1768 -81947 -37149 74059 80711 130285 74123 46441 -9714 -77064 -143460 -93324 -102446 8874
1756 8874 10102 77598 144433 118081 100912 91858 24313 22400 1840 104922 205638 186204
1744 186204 -86992 -47649 -111811 -88057 -61557 -72049 -140683 10333 42760 14834 35210
1733 35210 19830 -52903 -33789 63794 43474 23871 -62248 27423 -829 83102 81356 -66974
1721 -66974 -97093 91144 7825 -30113 55458 208091 92269 -45162 -67988 -43847 -62893
1710 -62893 -30420 15330 5687 64853 -31639 128945 161246 -568 -37570 -28003 -18463 25616
1698 25616 40106 39102 87963 -16001 -79277 -60572 6208 84006 40890 11220 -41464 -88093
1686 -88093 -124016 -147571 -50643 -7246 38949 32320 -6237 -91014 -158087 -80893 -93900 -55968
1674 -55968 -111657 -54749 -15757 10856 -38774 -20795 21441 57816 25546 12321 64634 53936
1662 53936 165141 186634 49131 50461 -736 -32726 -43955 8076 9210 -118352 -30471 -35507
1650 -35507 98781 144303 47621 -64275 -121569 -81107 -909 -109063 -215109 -140892 -93944
1639 -93944 -74127 -4558 50074 191051 123372 1070 -48330 -4026 -77513 -109034 -203203
1628 -203203 -35328 103640 105931 -32485 -59368 50552 -45508 -42784 -36957 18326 -104831
1617 -104831 -48834 -12465 -51016 -88722 -30176 111938 145292 103424 84629 33788 26657 52822
1605 52822 -50128 -53082 112649 96263 -35222 8190 16726 -11613 32596 -46673 -8893 -102524
1593 -102524 -153184 -117957 -56724 -1906 42808 85002 3530 -86563 -24176 9580 1466 -40415
1581 -40415 -133761 6998 30963 29940 -84963 -118295 -137562 -94929 90945 29113 51324
1570 51324 37987 17424 -85787 -82307 -115906 -132681 -101158 -126798 -31000 -74486 -33327 66145
1558 66145 16125 -34369 4625 9817 -127144 -149798 -68007 3524 28335 -87851 -191424
1547 -191424 -88630 20131 -67937 -140230 -205328 -132671 -48578 15518 -47559 -155850 -191060
1536 -191060 -113027 17635 -69270 -109176 -12373 14596 -191165 -90964 1097 16534 70524
1525 70524 -45770 -11779 -84427 -117803 -140759 39658 68713 43063 -40090 -62666 36303
1514 36303 130032 46782 -2994 32949 56909 58320 -44101 -59500 106716 -10103 -22145
1503 -22145 -99828 -94315 -44081 -105285 -100602 -25934 87774 178244 131403 -125627 -12663 70526
1491 70526 -42543 -89037 43976 -60958 -18018 -23916 -6799 -35823 -7634 -24025 -89403
1480 -89403 39173 56603 108400 94773 -32131 9304 -79101 -89572 -119040 -168916 -17654
1469 -17654 -38683 -166526 -132228 -170295 -184183 -36540 69169 -3849 21808 135754 54330
1458 54330 74810 24387 7550 58211 -10938 -62472 56207 -3030 -26786 63194 -51899
1447 -51899 3094 -65123 -94169 -75524 1035 -49687 2352 110661 69939 -37769 -62730
1436 -62730 -98480 -20158 9815 -59553 -45976 12315 -63475 -37194 -97093 -13996 37981 -16402
1424 -16402 -69140 -53925 18588 -72848 -34702 -131790 37468 9663 -46187 -87885 -113926 -207704
1412 -207704 -172917 -106638 -96428 -18534 -4161 -59562 -118335 -97912 -2774 -99175 -142102 -39059
1400 -39059 -11352 10135 -6670 -49945 1320 -34105 -30002 -20477 17951 103537 -167 -114137
1388 -114137 -21171 -87887 -126591 -104194 -23245 66262 3483 51020 63633 167851 89983
1377 89983 26181 -24832 -3525 -54630 -19185 -68568 -110915 -1265 86110 83167 74437 46158
1365 46158 16184 11890 -69954 -79319 81357 -13621 -156779 -145993 -125329 5851 -171767
1354 -171767 -215317 -132651 -37344 -124949 -193950 -212892 -211702 -263900 -118550 6654 56338
1343 56338 -2115 -46321 -78522 -120781 77555 163323 17259 -27001 -26719 -83497 -20832 -25370
1331 -25370 -25502 -63431 -146785 -110933 -8424 129642 48413 20666 -4908 -96091 41417 9585
1319 9585 20920 60368 52642 8257 -9978 -87821 -194114 -105032 1269 -13603 7183 40030
1307 40030 -27737 -27167 -85834 -103071 -117737 -62912 1021 77483 49259 125849 147234 114483
1295 114483 80565 91823 118671 -9006 25246 -133778 -84731 2048 550 -31413 20357
1284 20357 63187 79996 70480 19868 69869 52897 -42513 -24142 106226 24877 -66763 48177
1272 48177 34292 16753 35182 5038 26419 153471 79368 63871 -12555 56467 99510 44909
1260 44909 7632 -64500 -4849 41686 58470 72720 81062 47709 14614 -57518 -63240 -72005
1248 -72005 12700 -67715 -4718 8927 40892 -58077 -55926 -18974 -33918 -24635 30545 -21166
1236 -21166 -3542 -30757 -95608 -118768 -77964 -7328 -52415 -8126 -11150 -16753 -115887 -62390
1224 -62390 91834 16811 -177001 -84414 8713 -37964 -130547 -6969 -63648 -132182 -195484
1213 -195484 -138041 -126558 -145814 -54488 -47829 -53207 -44219 -5453 14842 57671 12365 27254
1201 27254 596 29104 201798 124291 180615 165041 56041 141300 129962 13037 -65453
1190 -65453 -46504 -14482 -89241 -92766 -110872 -88222 -119297 -51245 -26359 -10290 55123 43707
1178 43707 5256 -94681 -104496 -77468 -88252 -85681 -46333 99886 49423 12045 6472 2468
1166 2468 17026 57166 62372 -71512 -7147 100098 119433 -3947 6941 -43871 -32343 51790
1154 51790 -12862 42056 124816 -5606 -105081 43118 131546 127184 170416 28434 39554
1143 39554 65308 101068 -102878 -88467 -22496 -64362 -38059 -1224 74824 9006 1579 -72570
1131 -72570 -2588 94583 5926 24650 37686 -114047 -236173 -130762 70526 -37311 -95571
1120 -95571 47828 72559 193813 265731 182410 56523 20708 -96012 -43717 -55129 -67302
1109 -67302 68013 126488 35401 -28798 -40524 28424 -65536 -126649 -94688 -55360 87985
1098 87985 77950 29409 10608 -12284 -22356 -84387 -36399 -36227 15353 -14172 66455 37535
1086 37535 -22836 26994 -73549 -46954 -32247 -69447 -128564 -66079 -129399 4 22442
1075 22442 85075 26129 36397 50543 -21159 -109780 -174224 -98134 -124 9211 27051 59315
1063 59315 70939 -13140 -122063 -11270 46780 37880 -58842 -86336 -5111 -119602 -32203
1052 -32203 37995 -71369 42174 137373 149034 48965 39199 10888 13579 17334 60058 81239
1040 81239 127394 126752 62313 65226 120129 106751 5475 -80828 -83693 -48244 -98297 -75884
1028 -75884 59561 131845 -21079 -156969 -26971 129093 -35406 63156 65453 -5220 104991
1017 104991 112773 -15842 64149 33029 -19176 -37335 -152679 -134410 -94418 -84567 -30660 1187
1005 1187 -22607 31630 75663 73927 50903 64409 54295 -45602 -124683 -56745 14895 -16472
993 -16472 -54244 723 37300 -8721 -142973 -89602 -18776 -1623 36461 87832 36645 -71806
981 -71806 -127720 -88845 12935 18827 -39233 -49566 -55512 108495 113242 -6485 -44858 -89849
969 -89849 68208 124703 40314 -7501 28634 28580 -26935 -11861 160763 105238 65763 -48172
957 -48172 49522 97234 135451 82305 -110733 -90016 -96114 -81686 -126617 -29678 12710 -43073
945 -43073 -79118 -66172 -29312 16246 70847 -37911 -67968 32766 -69213 -65455 -82065 -121200
933 -121200 43965 -13715 -48477 -72027 45253 147967 -10056 -31864 -49194 -116189 -64916
922 -64916 -126991 -176275 -102961 -39041 -62480 -39992 1987 -8760 70263 86868 118889 -18552
910 -18552 -71294 -50551 -32573 24458 109901 111314 62046 49342 -45819 36415 60691 21635
898 21635 109399 -28797 -28674 -89993 -47786 -19456 -48098 21497 100049 22588 -5986 -47535
886 -47535 -64726 15515 -19126 50464 -9721 -7275 42546 -24966 -44608 -39955 66761 -23528
874 -23528 -39491 -19884 -31759 61273 67293 -1538 24837 124358 108375 94602 40290 -125
862 -125 6264 -67336 -70445 -123029 -104267 -58725 -15797 -3757 -39365 -36196 30447 39700 -41466
849 -41466 -92685 -40127 53162 124216 104738 89210 -55126 -89235 -67518 -85253 -111789 -4415
837 -4415 -6097 -2519 128748 152873 99816 23434 8441 12408 -32870 -108645 18260 -104997
825 -104997 -137866 -25331 -31878 109773 47358 -39645 71795 77993 109952 64444 73608 68536
813 68536 111170 84898 23010 -23577 22441 -1043 -18103 -111233 151196 181129 56423 111794
801 111794 16488 -68639 -47297 34655 -29074 -64735 -25984 96898 149200 103258 147571 -28986
789 -28986 -122308 -67775 -43899 -95718 9453 21265 -58415 -72000 -11620 26025 33039 28150
777 28150 -26132 -136913 -52876 -95138 -85367 -51136 -1997 -2877 -39551 -70660 42489 17455
765 17455 -96359 -92148 -12208 35643 -130429 -85808 -41104 35823 -40416 -69186 2151 28115
753 28115 -87043 -41983 1115 60729 191346 136154 -45069 -64806 21751 68440 -91766
742 -91766 -135639 -11361 -58492 -21182 31267 -84377 -47085 -61335 -93183 -61174 -76719 -94266
730 -94266 -107635 -17961 -117925 -168700 -38305 -116 13449 -107588 -156147 -46094 -107468
719 -107468 -150975 -28042 83263 107863 24937 20901 -76997 -71235 -101329 -102313 -69103 52371
707 52371 38088 46755 31087 137611 126123 140633 -3997 -125057 -90388 -67182 -37375 38857
695 38857 -4330 95938 55138 71329 191275 153171 67357 -108540 -59890 -88381 -57806
684 -57806 -18706 -36191 -134642 42362 29131 15130 98511 103911 -48637 -68340 -23851 26382
672 26382 -40979 -50165 -85367 -36888 -60010 1121 18888 -50505 13125 -54298 9112 70428
660 70428 83101 44595 -116034 -72117 -75410 -6110 -71481 -95583 122340 71454 -37164 -104872
648 -104872 -64676 -48172 -51849 -69341 81101 89616 96928 58158 30277 -12360 -133027 -49975
636 -49975 -90399 -37331 -41407 -80677 30995 8902 23592 84696 132259 63818 29615 -59017
624 -59017 39950 35592 91191 41179 -67200 -128610 -152336 -83006 -81640 -116698 -11792 44703
612 44703 149440 199156 -16504 -117952 -118755 8503 -65904 -56030 -64654 -95144 -58835 -80893
600 -80893 -27786 65083 -38946 -95253 -66849 -73747 -9711 43891 37358 -27923 -7408 -52657
588 -52657 -74233 14589 -8175 23602 -13279 -86910 7307 105151 167878 145149 44927 -34205
576 -34205 2824 66548 115263 130186 77237 138234 20959 238 68978 37130 50840 54077
564 54077 44751 -43666 -155962 -67632 40323 111168 98953 96637 77497 24743 -71099 66731
552 66731 159159 134101 -49325 -126641 4388 12973 102542 81308 -22191 48097 2949 16838
540 16838 28091 -15532 -147591 -131442 -91813 -114368 80186 70365 62928 37351 4008 60033
528 60033 87137 124115 132481 143226 54148 -80157 -8028 114705 -7659 -55160 14212 33402
516 33402 41731 101724 92680 60125 39646 12705 26298 78794 99195 93562 59142 -33882 -70405
503 -70405 -42550 9003 -115270 -102499 -39703 -33794 42951 42997 52559 -477 17168 -75580 -165973
490 -165973 -12380 44026 30097 -28429 -54229 -69653 -107913 -111040 -45768 -99366 -75971 -42400
478 -42400 -5810 -63162 -188118 -102211 -3918 -107343 -175317 -176489 -184256 -133423 -65382 -48696
466 -48696 42243 22650 -9876 -9370 -80583 -29896 116157 143463 -63184 -114203 -22955 -97431
454 -97431 59628 8145 -80811 -54492 52820 -9691 -185480 -244136 -45133 -45139 -29617 5156
442 5156 176539 119518 130259 169833 32911 7234 39414 -34698 -88522 40116 62380 61176
430 61176 130276 154113 107766 6735 -16370 29675 62324 55065 35010 214651 155752 21805
418 21805 -27224 17418 -6795 -24134 -59422 -45977 -112458 -49075 -136810 -128467 -99306 -16914
406 -16914 -92828 -113532 -82370 131616 102585 82432 33261 -12119 60767 42596 75674 85795
394 85795 91328 40354 23315 39526 34177 -12336 4576 -25090 132207 118832 22518 -29144
382 -29144 54586 -16135 -140656 -198639 -20333 105017 78310 92963 85686 115187 -27775
371 -27775 -13775 -67626 33387 153070 70000 37407 -7762 -1390 -39644 -179188 -133894 17581
359 17581 -48423 16593 61341 -58024 -58915 -136466 -118193 -11671 77323 -74699 -96489 -77946
347 -77946 -41668 -11767 63449 85883 -5565 -28383 9593 -27066 -31921 17626 -37984 37554
335 37554 -38336 -11126 23570 -76384 -103228 -57873 11853 107183 16398 -21550 20097 83948
323 83948 59671 109736 14616 34628 112339 116848 138802 60297 13154 -36292 -7361 -87634
311 -87634 54949 40587 -38439 53158 60354 -112981 -144884 7169 67952 -4023 44087 -36410
299 -36410 -93200 -86136 -101605 -6845 -30417 83109 41406 32326 36765 38288 102461 121969 26101
286 26101 -10955 -27745 31314 78924 -72338 -94969 7319 77429 64899 99263 89657 -877
274 -877 -42851 -6366 -83616 -14814 11916 57398 127542 65938 91015 82922 -10633 -41149 -49356
261 -49356 7068 165405 60474 148711 20484 -23917 -44923 -4822 66773 -22506 -4053
250 -4053 -32945 -45842 -125629 -60598 -46342 10839 -97364 11049 14250 5533 72291 18403
238 18403 -88172 -44449 66133 -11252 -37593 -86490 95496 128033 29866 56229 -15220
227 -15220 -69204 29856 20570 121952 13557 94086 12333 -160794 -157191 2339 -719 11096
215 11096 16500 -77602 4857 52737 63449 132038 10575 -3632 117332 24099 21791 -42246
203 -42246 -15820 -74634 -193810 -196206 -87430 -41823 30772 48102 111041 57683 -17987 16218
191 16218 -4311 -24854 132250 111192 34316 49425 -23193 -47774 158090 153331 69760 15371
179 15371 -11354 65158 70435 111534 44093 89341 156453 1195 -34323 -246 -42779 -37059
167 -37059 -142675 -138145 -198780 -140969 -129147 -9958 66613 -5032 -62367 -71630 -75414 -46919
155 -46919 70909 42617 42085 88004 94239 109571 88473 36665 97090 -18118 -1150 59342
143 59342 65578 24062 51430 70038 25170 33799 18761 -629 45700 7376 -96519 -138805
131 -138805 -19301 81875 93151 75597 40697 -30252 -43819 -20001 -43485 -51014 -58702 -2419
119 -2419 6828 -2721 -34496 -34037 23226 19388 76917 23205 -21489 -104762 -177474 -174769 -72038
106 -72038 -27045 -53384 -39803 -40205 -29269 -2093 13588 16946 34592 99873 105490 83237 87188
93 87188 -16327 -70931 -46517 27625 151682 122208 30055 269 -8579 -20569 37453 84379
81 84379 17612 95381 110955 11664 43484 116854 25210 -14245 74569 61957 37507 68275
69 68275 -19385 1309 -981 -53619 -45295 22776 -28869 19720 -2420 8464 6588 55608 62509
56 62509 -1269 -28930 12722 36996 34002 42159 27041 13253 -4494 -12485 45709 50666 -2221
43 -2221 -27132 -16320 12243 39725 7332 -115596 -38185 -50060 5547 71141 47624 52257
31 52257 70198 35900 22237 -13201 39884 -16285 -60463 -62224 -91542 19473 19702 -39869 -28917
18 -28917 88328 110375 -3807 64698 58778 9960 -3935 36197 27824 67957 7102 -34839
6 -34839 -17064 41689 -12811 -21700 1133 38959
0 38959
$$ Imaginary data points
##PAGE= N=2
##DATA TABLE= (X++(I..I)), XYDATA
16383 -675621 -633594 -536493 -490830 -564446 -523762 -460557 -447407 -414477 -479478 -503083 -454614
16372 -454614 -428648 -356550 -392216 -393025 -384752 -416506 -427995 -401109 -350451 -355474 -374480 -332109
16360 -332109 -307725 -279016 -254841 -305612 -306758 -283205 -220407 -187580 -232401 -244632 -175162 -182665
16348 -182665 -214726 -217759 -172914 -145861 -227825 -215851 -145013 -56489 -27685 35251 19388 -42709
16336 -42709 -51773 -34595 -56202 -57795 46513 -15171 16987 22976 73056 88256 185752 193389
16324 193389 94001 17521 115901 143838 168384 274441 257369 232817 198010 259953 264902
16313 264902 228184 291554 114409 226719 338835 298863 327096 216553 209533 290188 406136
16302 406136 441442 433723 431860 379404 377118 360098 357498 325346 292299 425903 511939 557006
16290 557006 565778 494590 495551 519577 576425 557752 579754 603291 497686 441519 498933 531831
16278 531831 582694 558190 554316 579021 538981 566770 652798 667066 660662 617784 547948 585551
16266 585551 597992 597538 581087 683895 663046 593827 579646 632140 671855 769253 773094 841961
16254 841961 824555 809656 743614 727999 747536 834886 807400 709915 674263 647489 688838
16243 688838 668544 788174 878189 824498 787334 884588 892756 1012488 943657 836796 873415
16232 873415 892890 947245 1025339 1094599 1004691 940418 923877 959370 1032731 1022983 1009704 1007275
16220 1007275 1038016 960938 908728 894249 1099256 1074056 1024011 986264 1055433 1068628 980671
16209 980671 994030 928331 1001730 1016653 1068726 961747 965973 953280 1021063 1017889 1082451 1135799
16197 1135799 1212471 1247803 1140487 1162468 1157311 1126817 1187072 1221208 1228166 1222346 1179015 1190765
16185 1190765 1158736 1179467 1162221 1193825 1271533 1180879 1360713 1333774 1111909 1094355 1092332
16174 1092332 1108563 1149708 1187192 1217321 1247286 1208145 1218423 1316261 1352049 1316712 1233954
16163 1233954 1162747 1264831 1256743 1247666 1184307 1248341 1288081 1152156 1116325 1188170 1313579
16152 1313579 1296871 1239081 1262629 1254345 1215873 1257261 1208166 1153539 1263003 1176702 1200389
16141 1200389 1225673 1187749 1302469 1211358 1219732 1311025 1424454 1334786 1332839 1315955 1280240
16130 1280240 1225612 1291537 1228026 1158621 1213671 1126520 1225895 1323543 1355106 1334921 1366772
16119 1366772 1357786 1356142 1229304 1153553 1201242 1291206 1264426 1166717 1294480 1382091 1367864
16108 1367864 1371385 1353499 1319790 1385369 1417572 1386411 1308956 1193751 1265993 1444997 1441645
16097 1441645 1355243 1468869 1362759 1480690 1477437 1403079 1362113 1482189 1504451 1390459
16087 1390459 1434136 1431625 1423761 1442103 1442911 1382273 1317045 1329435 1430693 1465942 1385577 1333127
16075 1333127 1221870 1223503 1256298 1364676 1326242 1277222 1272011 1262037 1364541 1426711 1462388
16064 1462388 1480434 1512406 1399992 1387467 1352795 1284331 1270935 1222411 1294560 1309625 1386492
16053 1386492 1465942 1414206 1405465 1434196 1481083 1480876 1518174 1478455 1449254 1448249 1487603 1345033
16041 1345033 1261877 1235863 1346553 1314624 1383556 1344238 1295146 1331312 1414776 1533052 1585613
16030 1585613 1660718 1591620 1445780 1532625 1382727 1359312 1294652 1425802 1519356 1311588
16020 1311588 1377043 1334058 1352852 1457632 1590797 1489595 1448112 1365425 1382238 1430725 1436159
16009 1436159 1407903 1355621 1399289 1404164 1445593 1503460 1392927 1378678 1318362 1302684 1361531
15998 1361531 1282886 1169126 1165530 1175200 1433752 1429415 1362882 1371312 1432479 1445895 1333823
15987 1333823 1383160 1306121 1371413 1372308 1371945 1335200 1394446 1390753 1428022 1309734 1204173 1248773
15975 1248773 1335652 1473570 1445839 1538819 1512872 1499323 1464844 1408744 1425888 1365773 1454196
15964 1454196 1419798 1322958 1459563 1509600 1498729 1442697 1322583 1438674 1369526 1411719 1462286
15953 1462286 1410119 1434122 1489393 1525559 1389412 1351387 1326079 1301305 1323552 1397730 1328023
15942 1328023 1474711 1507524 1484489 1407674 1339377 1391663 1480422 1436277 1366842 1361927 1459090
15931 1459090 1461917 1333794 1302077 1281765 1318927 1241776 1286996 1308356 1248655 1227800 1254777
15920 1254777 1321262 1367307 1325523 1338789 1417783 1402513 1313939 1362415 1433683 1367000 1409461
15909 1409461 1416170 1424342 1406196 1273753 1380688 1212740 1338932 1306585 1383813 1454598 1375222
15898 1375222 1449604 1485697 1404153 1382468 1441965 1364963 1270595 1263454 1372648 1408896 1398739
15887 1398739 1348223 1341316 1380624 1399134 1380125 1443200 1450111 1444010 1290205 1301728 1395977 1495246
15875 1495246 1399975 1382417 1579901 1558802 1459066 1425206 1438014 1431339 1425647 1464815 1423968
15864 1423968 1461952 1366468 1401623 1476171 1572787 1402691 1251342 1376140 1449471 1469197 1384443
15853 1384443 1234883 1325664 1351236 1425207 1558321 1519419 1407509 1381563 1339237 1293194 1419447
15842 1419447 1361228 1383766 1394432 1440380 1423482 1481575 1504830 1397190 1429053 1445927 1467254
15831 1467254 1321233 1351737 1508312 1482064 1472583 1327101 1408837 1342640 1202033 1264473 1369574
15820 1369574 1523770 1351674 1244838 1417038 1489126 1422946 1403500 1542628 1505159 1455318
15810 1455318 1421279 1522747 1506398 1467624 1349108 1329137 1424817 1408420 1423447 1336694 1397139
15799 1397139 1505997 1493949 1445897 1551524 1425582 1321422 1379807 1484457 1478722 1435419
15789 1435419 1432376 1545449 1550366 1581874 1576384 1483995 1493333 1451736 1565968 1591491 1437417
15778 1437417 1376562 1427199 1429257 1482584 1414824 1455208 1491126 1436772 1432179 1462267 1378828 1399152
15766 1399152 1421644 1427732 1555232 1553179 1543910 1480407 1457303 1396016 1407457 1418124 1418182 1447947
15754 1447947 1525555 1403339 1376493 1374553 1417850 1388290 1403302 1457269 1428142 1398936 1353183
15743 1353183 1340266 1374408 1329059 1348332 1347255 1402150 1288824 1392144 1456205 1338625 1448143
15732 1448143 1401208 1361166 1309484 1429800 1424763 1449388 1356638 1395205 1448062 1459842 1516519
15721 1516519 1566934 1392596 1511542 1569841 1539825 1492717 1426561 1489392 1622655 1428975
15711 1428975 1395258 1415170 1325197 1371280 1343646 1452117 1393989 1439903 1437969 1322373 1390364
15700 1390364 1529321 1476713 1479404 1505730 1406920 1404782 1368346 1457874 1490711 1387307 1305196
15689 1305196 1464682 1494221 1385744 1392749 1381541 1541191 1456377 1424751 1512758 1610507 1560356
15678 1560356 1479010 1421204 1375287 1376207 1276723 1337666 1439873 1581840 1526283 1439625 1306444
15667 1306444 1280723 1326270 1327915 1397210 1330951 1228036 1364909 1436311 1454817 1492872 1459053
15656 1459053 1349044 1397066 1390323 1392195 1378043 1336995 1402954 1406847 1417827 1391064 1522547
15645 1522547 1429448 1396923 1354832 1336647 1389231 1464985 1538331 1522497 1346988 1360766 1438051
15634 1438051 1520372 1503288 1482454 1432594 1394719 1229993 1274089 1452880 1452496 1428646 1330680
15623 1330680 1397193 1412506 1499419 1441945 1439356 1532617 1479542 1471368 1476791 1429125 1399763 1408166
15611 1408166 1415043 1451049 1465730 1502124 1368751 1445974 1497524 1492618 1430185 1487488 1464555
15600 1464555 1340858 1482526 1413601 1321073 1362750 1445631 1580338 1473272 1513248 1503409 1462499
15589 1462499 1364053 1422870 1395915 1411942 1444982 1463279 1548614 1500328 1361398 1416784 1438141
15578 1438141 1497367 1542640 1470826 1561530 1506207 1449499 1350147 1372522 1371245 1429713 1400935
15567 1400935 1530114 1546525 1466563 1509164 1489815 1528531 1519445 1545329 1520339 1429036 1251101
15556 1251101 1236258 1368557 1373930 1383564 1436333 1497770 1365523 1453114 1482714 1381977 1355722
15545 1355722 1435856 1433115 1431986 1453200 1410080 1449664 1518402 1469809 1541205 1470899 1562500 1707719
15533 1707719 1705316 1584609 1443849 1309418 1362503 1400590 1386457 1412663 1462781 1453195 1442641
15522 1442641 1396989 1424986 1470457 1520949 1466305 1581609 1487506 1476741 1457445 1464018 1510685
15511 1510685 1388241 1253231 1271109 1399429 1330857 1325833 1213270 1328253 1407447 1378624
15501 1378624 1439672 1539022 1430148 1368333 1396784 1482952 1515922 1450640 1382411 1435831 1607165
15490 1607165 1621107 1538458 1487135 1456340 1455910 1472725 1531634 1475760 1332581 1290796 1491086
15479 1491086 1434916 1449446 1462697 1566539 1645611 1564117 1462027 1332533 1365958 1413313 1486629
15468 1486629 1418699 1385190 1418018 1418564 1308340 1313486 1399276 1326379 1416662 1463635 1512610 1525068
15456 1525068 1599668 1640896 1624325 1651831 1608444 1693553 1535285 1397124 1336613 1360211 1506419
15445 1506419 1546554 1509871 1509006 1517454 1622669 1653350 1546363 1466012 1381270 1374565 1278952 1396221
15433 1396221 1393502 1407344 1426717 1378005 1356867 1448032 1544637 1488712 1444639 1386355 1401240
15422 1401240 1341172 1315378 1389068 1453218 1510449 1453036 1405959 1455316 1616848 1616763 1507744
15411 1507744 1351016 1432510 1456943 1369186 1376690 1396245 1438777 1521533 1515230 1470317 1605620
15400 1605620 1592077 1457599 1421730 1459503 1433311 1404262 1537151 1600796 1672804 1516179 1547353
15389 1547353 1418374 1371021 1428459 1329344 1511733 1566985 1560305 1499953 1513096 1465027 1456196
15378 1456196 1404872 1336833 1396254 1433996 1532951 1552702 1476235 1563441 1464145 1416675 1427048
15367 1427048 1426043 1531700 1607539 1591914 1643506 1613337 1603350 1597338 1634198 1541611 1448378 1470317
15355 1470317 1504530 1504800 1595374 1685252 1603568 1599818 1669812 1595400 1475367 1591150 1598493 1577052
15343 1577052 1740376 1667452 1484354 1544946 1547887 1523471 1620918 1605964 1532442 1517227 1464122
15332 1464122 1504514 1440192 1353196 1375679 1357381 1465210 1514285 1530951 1480095 1439952 1476289
15321 1476289 1498040 1515650 1713027 1584945 1628986 1579521 1474270 1418121 1444077 1509042 1481235
15310 1481235 1429354 1543560 1477405 1349629 1460981 1490499 1519075 1497235 1591808 1506362 1559379
15299 1559379 1557762 1538181 1491087 1496736 1565149 1504162 1517151 1484617 1490797 1500569 1532037 1525215
15287 1525215 1573653 1570643 1464807 1621210 1652837 1659396 1479490 1408647 1479060 1617800 1460081
15276 1460081 1367465 1389366 1511859 1514009 1553028 1624187 1454578 1283709 1257099 1443651 1437983
15265 1437983 1463917 1588672 1563317 1617192 1536682 1452594 1493766 1524786 1566976 1540843 1500454
15254 1500454 1344251 1423663 1455429 1383610 1408631 1399506 1342063 1397807 1440499 1519952 1650348
15243 1650348 1762465 1754782 1598279 1568618 1494126 1412442 1457040 1543679 1540781 1532030 1486313
15232 1486313 1442495 1422750 1521120 1470376 1413452 1487148 1490764 1601759 1510534 1476591 1416339
15221 1416339 1348557 1399764 1480537 1465830 1504262 1463274 1476912 1554588 1425142 1469033 1473730
15210 1473730 1426603 1438618 1473845 1437484 1472369 1534679 1417247 1373906 1304184 1368258 1324825
15199 1324825 1320774 1567562 1622174 1416850 1408741 1464373 1484779 1484013 1550106 1536344 1527423 1551916
15187 1551916 1584635 1629966 1564606 1658071 1674435 1586009 1567982 1559842 1684300 1625084 1538764
15176 1538764 1550519 1520359 1489491 1572794 1689271 1587879 1586723 1526892 1517672 1531649 1541611
15165 1541611 1509337 1526377 1548016 1546602 1608604 1598295 1501064 1520012 1427300 1390109 1423037
15154 1423037 1515923 1460170 1543169 1526195 1530351 1550814 1478884 1582351 1508998 1589183 1624811
15143 1624811 1601140 1519328 1467240 1505514 1563441 1581865 1579452 1635090 1534128 1460940 1336717
15132 1336717 1344370 1426851 1529115 1590837 1543735 1481441 1466810 1510329 1617103 1638320 1543894
15121 1543894 1452436 1530489 1496282 1561119 1591990 1571106 1597937 1602031 1585355 1553492 1593097
15110 1593097 1528471 1474607 1403052 1482875 1515003 1606887 1581981 1590991 1621093 1678543 1577204
15099 1577204 1451761 1381605 1461988 1640598 1629844 1436433 1446966 1495910 1629602 1666394
15089 1666394 1710455 1550229 1540901 1527578 1528272 1556925 1445020 1498045 1459029 1298032 1401619
15078 1401619 1475592 1415063 1458801 1379454 1471529 1475574 1481644 1502693 1537822 1534741 1408145 1492216
15066 1492216 1657313 1719238 1627477 1559616 1527274 1406784 1431360 1613309 1796666 1733601
15056 1733601 1534370 1495436 1580473 1564208 1627311 1579047 1467481 1427418 1555781 1619150 1667302
15045 1667302 1612594 1682889 1549171 1532843 1524653 1469580 1404955 1452698 1593750 1662123 1673950
15034 1673950 1664780 1562885 1513160 1508573 1454545 1484168 1544620 1524058 1608925 1681893 1596493
15023 1596493 1708869 1618675 1637093 1651108 1581240 1653717 1652456 1547877 1574166 1462908 1460881
15012 1460881 1600102 1523037 1643898 1629725 1592887 1586520 1496131 1548854 1531245 1681337 1631077
15001 1631077 1555398 1608452 1591842 1605256 1574700 1559547 1500101 1373155 1475993 1524330 1547250
14990 1547250 1455333 1516820 1512019 1612008 1630546 1513301 1574018 1568320 1449979 1403759 1413558
14979 1413558 1452701 1543201 1469471 1359557 1475200 1419341 1560064 1510740 1549847 1522251 1539464
14968 1539464 1469657 1447727 1624922 1562768 1592304 1500515 1594935 1623769 1558453 1535318 1441667
$$ [...]
##END NTUPLES=NMR SPECTRUM
##END=
