##TITLE=1H_CG-1163
 CDCl3
 8 sc, 
 22.09.2022
##JCAMPDX= 6.0         $$ Bruker NMR JCAMP-DX V2.0
##DATA TYPE= NMR SPECTRUM
##DATA CLASS= NTUPLES
##ORIGIN= UXNMR, Bruker Analytische Messtechnik GmbH
##OWNER= root
$$ XWIN-NMR		Version 3.5
$$ Thu Sep 22 14:19:25 2022 Russian Standard Time (UT+4h)  she@DPX200
##.OBSERVE FREQUENCY= 200.1313499994
##.OBSERVE NUCLEUS= ^1H
##.ACQUISITION MODE= SIMULTANEOUS
##.ACQUISITION SCHEME= undefined
##.AVERAGES= 8
##.DIGITISER RES= 18
##SPECTROMETER/DATA SYSTEM= spect
##.PULSE SEQUENCE= zg30
##.SOLVENT NAME= CDCl3
##.SHIFT REFERENCE= (INTERNAL, CDCl3, 0, 15.7337)
##AUDIT TRAIL= $$ (NUMBER, WHEN, WHO, WHERE, WHAT)
$$ ##TITLE= Audit trail, XWIN-NMR		Version 3.5
$$ ##JCAMPDX= 5.01
$$ ##ORIGIN= Bruker BioSpin GmbH
$$ ##OWNER= she
$$ F:/spectra/data/she/nmr/H-F/1/pdata/1/auditp.txt
$$ ##AUDIT TRAIL=  $$ (NUMBER, WHEN, WHO, WHERE, WHAT)
(   1,<2022-09-22 14:18:02.39 +0400>,<she>,<DPX200>,
      <created by zg, POWCHK disabled, PULCHK disabled
       configuration hash MD5:
       00 E9 B6 7A A2 85 ED C7 34 08 36 98 17 FE 4E 26
       data hash MD5: 16K
       9D 18 BA 95 4F 26 B0 CC BB B5 62 97 56 D6 4B 52>)
(   2,<2022-09-22 14:18:05.62 +0400>,<she>,<DPX200>,
      <Start of raw data processing
       efp BC_mod = 2 LB = 0.24 FT_mod = 6 PKNL = 1 PHC0 = -18037.58 PHC1 = 16.20069 SI = 16K 
       data hash MD5: 16K
       11 AB 3C C4 D2 16 97 77 56 E0 F6 43 4C FB 55 F7>)
(   3,<2022-09-22 14:18:29.04 +0400>,<she>,<DPX200>,
      <pk PHC0 = 2.252098 PHC1 = -3.400001 
       data hash MD5: 16K
       9B 4A C0 A6 D4 09 42 20 FB 96 58 20 05 06 44 1D>)
(   4,<2022-09-22 14:18:33.07 +0400>,<she>,<DPX200>,
      <abs ABSG = 5 
       data hash MD5: 16K
       2E 29 56 5E E4 FF 77 26 C9 88 72 B1 B3 79 E3 3E>)
$$ ##END=
$$ 
$$ hash MD5
$$ BC 96 0B 67 95 73 BF F0 ED F7 E9 D1 DC FE A2 67
##$RELAX= 
##$RELAX= 
##$RELAX= 
##$RELAX= 
##$RELAX= 
##$RELAX= 
$$ Bruker specific parameters
$$ --------------------------
##$DU= <F:/spectra>
##$EXPNO= 1
##$NAME= <H-F>
##$PROCNO= 1
##$TYPE= <nmr>
##$USER= <she>
##$AMP= (0..31)
100 100 100 100 100 100 100 100 100 100 100 100 100 100 100 100 100 100 
100 100 100 100 100 100 100 100 100 100 100 100 100 100 
##$AQSEQ= 0
##$AQ_mod= 1
##$AUNM= <au_zg>
##$AUTOPOS= <>
##$BF1= 200.13
##$BF2= 200.13
##$BF3= 200.13
##$BF4= 200.13
##$BF5= 200.13
##$BF6= 200.13
##$BF7= 200.13
##$BF8= 200.13
##$BYTORDA= 1
##$CFDGTYP= 0
##$CFRGTYP= 5
##$CHEMSTR= <none>
##$CNST= (0..31)
1 1 145 1 1 1 1 1 1 1 1 1 1 1 1 1 1 1 1 1 1 1 1 1 1 1 1 1 1 1 1 1 
##$CPDPRG= <>
##$CPDPRG1= <>
##$CPDPRG2= <>
##$CPDPRG3= <>
##$CPDPRG4= <mlev>
##$CPDPRG5= <mlev>
##$CPDPRG6= <mlev>
##$CPDPRG7= <mlev>
##$CPDPRG8= <mlev>
##$CPDPRGB= <>
##$CPDPRGT= <>
##$D= (0..31)
0 1.2 0 0 0 0 0 0 0 0.06 0 0.03 0 0 0 0 0.0002 0 0 0 0 0 0 0 0 0 0 0 0 
0 0 0 
##$DATE= 1663841882
##$DBL= (0..7)
120 120 120 120 120 120 120 120 
##$DBP= (0..7)
150 150 150 150 150 150 150 150 
##$DBP07= 0
##$DBPNAM0= <>
##$DBPNAM1= <>
##$DBPNAM2= <>
##$DBPNAM3= <>
##$DBPNAM4= <>
$$ [...]
##$SUBNAM3= <"">
##$SUBNAM4= <"">
##$SUBNAM5= <"">
##$SUBNAM6= <"">
##$SUBNAM7= <"">
##$SUBNAM8= <"">
##$SUBNAM9= <"">
##$SW= 18.0517283424941
##$SWIBOX= (0..15)
0 0 2 0 0 0 0 0 0 0 0 0 0 0 0 0 
##$SW_h= 3612.71676300578
##$TD= 16384
##$TD0= 1
##$TE= 0
##$TE2= 300
##$TE3= 300
##$TEG= 300
##$TL= (0..7)
0 120 120 120 120 120 120 120 
##$TP= (0..7)
150 150 150 150 150 150 150 150 
##$TP07= 0
##$TPNAME0= <>
##$TPNAME1= <>
##$TPNAME2= <>
##$TPNAME3= <>
##$TPNAME4= <>
##$TPNAME5= <>
##$TPNAME6= <>
##$TPNAME7= <>
##$TPOAL= (0..7)
0.5 0.5 0.5 0.5 0.5 0.5 0.5 0.5 
##$TPOFFS= (0..7)
0 0 0 0 0 0 0 0 
##$TUNHIN= 0
##$TUNHOUT= 0
##$TUNXOUT= 0
##$USERA1= <user>
##$USERA2= <user>
##$USERA3= <user>
##$USERA4= <user>
##$USERA5= <user>
##$V9= 5
##$VALIST= <valist>
##$VCLIST= <CCCCCCCCCCCCCCC>
##$VD= 0
##$VDLIST= <DDDDDDDDDDDDDDD>
##$VPLIST= <PPPPPPPPPPPPPPP>
##$VTLIST= <TTTTTTTTTTTTTTT>
##$WBST= 1024
##$WBSW= 4
##$XGAIN= (0..3)
0 0 0 0 
##$XL= 0
##$YL= 0
##$YMAX_a= 127959
##$YMIN_a= -121397
##$ZGOPTNS= <>
##$ZL1= 120
##$ZL2= 120
##$ZL3= 120
##$ZL4= 120
##$ABSF1= 15.62349
##$ABSF2= -2.428357
##$ABSG= 5
##$ABSL= 3
##$ALPHA= 0
##$AQORDER= 0
##$ASSFAC= 0
##$ASSFACI= 0
##$ASSFACX= 0
##$ASSWID= 0
##$AUNMP= <proc_1d>
##$AZFE= 0.1
##$AZFW= 0.1
##$BCFW= 0
##$BC_mod= 2
##$BYTORDP= 0
##$COROFFS= 0
##$CY= -3
##$DATMOD= 1
##$DC= 0
##$DFILT= <>
##$DTYPP= 0
##$F1P= 0
##$F2P= 0
##$FCOR= 1
##$FTSIZE= 16384
##$FT_mod= 6
##$GAMMA= 0
##$GB= 0
##$INTBC= 1
##$INTSCL= 3.70164e-10
##$ISEN= 128
##$LB= 0.24
##$LEV0= 0
##$LPBIN= 0
##$MAXI= 10000
##$MC2= 0
##$MEAN= 0
##$ME_mod= 0
##$MI= 1.114404
##$NCOEF= 0
##$NC_proc= -6
##$NLEV= 6
##$NOISF1= 3.799351
##$NOISF2= 2.8
##$NSP= 0
##$NTH_PI= 0
##$NZP= 0
##$OFFSET= 15.73367
##$PC= 1
##$PHC0= -18035.33
##$PHC1= 12.80069
##$PH_mod= 1
##$PKNL= yes
##$PPARMOD= 0
##$PSCAL= 0
##$PSIGN= 0
##$REVERSE= no
##$SF= 200.130007579001
##$SI= 16384
##$SIGF1= 3
##$SIGF2= 2
##$SINO= 5.538805
##$SIOLD= 16384
##$SREGLST= <1H.CDCl3>
##$SSB= 0
##$STSI= 16384
##$STSR= 0
##$SW_p= 3612.71676300578
##$SYMM= 0
##$S_DEV= 0
##$TDeff= 16384
##$TDoff= 0
##$TI= <>
##$TILT= no
##$TM1= 0
##$TM2= 0
##$TOPLEV= 0
##$USERP1= <user>
##$USERP2= <user>
##$USERP3= <user>
##$USERP4= <user>
##$USERP5= <user>
##$WDW= 1
##$XDIM= 16384
##$YMAX_p= 283260988
##$YMIN_p= -420115
$$ End of Bruker specific parameters
$$ ---------------------------------
##NTUPLES= NMR SPECTRUM
##VAR_NAME=  FREQUENCY,     SPECTRUM/REAL,   SPECTRUM/IMAG
##SYMBOL=    X,             R,               I
##VAR_TYPE=  INDEPENDENT,   DEPENDENT,       DEPENDENT
##VAR_FORM=  AFFN,          ASDF,            ASDF
##VAR_DIM=   16384,         16384,           16384
##UNITS=     HZ,            ARBITRARY UNITS, ARBITRARY UNITS
##FACTOR=    0.220516191357247, 1,           1
##FIRST=     3148.77954331205, 0,            0
##LAST=      -463.937219693734, 0,           0
##MIN=       -463.937219693734, -420115,     0
##MAX=       3148.77954331205, 283260988,    0
$$ Real data points
##PAGE= N=1
##DATA TABLE= (X++(R..R)), XYDATA
$$ [...]
7332A09011l8623j55649K14437M2640j54707O0314P4756j20369P0831M8365k01691
$$ 109011 70388 -85261 129176 171816 17109 77423 152179 31810 102641 151006 -50685
7321e0685J28480p1271n9284J2465j19207O1745O6669q6351J6014Q5499j5277
$$ -50685 77795 6524 -52760 -40295 -159502 -97757 -31088 -117439 -101425 -15926 -31203
7310c1203j11613P4249K479k1477k6415p7155Q5248K9624n0603j9413K8606J32708
$$ -31203 -142816 -68567 -66088 -87565 -113980 -191135 -105887 -76263 -126866 -146279 -117673 15035
7298A5035j52144P7520k8228K130O5946m9298M2204l2660l0865o4441K2367J65606
$$ 15035 -137109 -59589 -87817 -85687 -19741 -69039 -26835 -59495 -90360 -154801 -132434 33172
7286C3172M3264J03295j61359j26122J22227j49680O357M5534O9758J6889M3938
$$ 33172 76436 179731 18372 -107750 14477 -135203 -128846 -83312 -13554 3335 47273
7275D7273k5921j5735J1676k2965l5716J87588j12899p1028P8665K7745l7692
$$ 47273 21352 5617 17293 -5672 -41388 146200 33301 -37727 40938 68683 30991
7264C0991r542l9678J366J5251N3149O8965o5151j18629J00561J08332j31053
$$ 30991 21449 -18229 -16863 -1612 51537 120502 55351 -63278 37283 145615 14562
7253A4562l4455o1012q145J6914l0427O0973J11885j35943j8720q0909p4014N5029
$$ 14562 -19893 -80905 -89050 -72136 -102563 -41590 70295 -65648 -84368 -165277 -239291 -184262
7241a84262Q0302l9016K0012J09069k9510L6447O6367n7557J13100J0978j45187
$$ -184262 -103960 -142976 -122964 -13895 -43405 -6958 59409 1852 114952 125930 -19257
7230a9257J6790R041J5732j57905M8904J17482J37233n5853m9726M1747k18560
$$ -19257 -2467 6574 22306 -135599 -86695 30787 168020 112167 62441 104188 -114372
7219a14372O2728K011J4503J85724k9369o1608R0450J6217m1854q4197o2929J18531
$$ -114372 -51644 -49633 -35130 150594 121225 59617 150067 166284 124430 40233 -22696 95835
7207I5835l0506q1535k9617R2124O6081O816j127q9456K7264K2369Q3785O4914
$$ 95835 65329 -16206 -45823 46301 112382 119198 118071 28615 55879 78248 162033 226947
7195B26947o5173K5187j11994J9504q8286k7163J36278J29243m1635j1654R1241
$$ 226947 161774 186961 74967 94471 6185 -20978 115300 244543 202908 191254 282495
7184B82495j24058K1831o1800o2322J55207P1272j76314r7654K9626Q7679K23316
$$ 282495 158437 180268 118468 56146 211353 282625 106311 8657 38283 125962 349278
7173C49278K9967Q1749p9786k1738q5474j7592j6523M2270L2983q7926N7073O697
$$ 349278 379245 460994 381208 359470 273996 256404 239881 282151 315134 227208 284281 290978
7161B90978J8606m650l116J12051q7444L5612M3541K6282J68393O8551j34771
$$ 290978 309584 304934 301818 413869 326425 362037 405578 431860 600253 668804 534033
7150E34033j51545q2929J41181K83788k28880p8833N5936m6218J9085J89574n5607
$$ 534033 382488 299559 440740 724528 495648 416815 472751 426533 445618 635192 579585
7139E79585J9315L0495J11484l6485K8743P2501k7495m0482J64107J52665j63433
$$ 579585 598900 629395 740879 704394 733137 805638 778143 737661 901768 1054433 891000
7128H91000k1382K03244m2089k8602J17332l4974j27555j4036J9377J52171J3939
$$ 891000 869618 1072862 1030773 1002171 1119503 1084529 956974 942938 962315 1114486 1128425
7117A128425J20494O229j83513m5075o8303N473J16776J06525j82786n8955q2193
$$ 1128425 1248919 1255148 1071635 1026560 958257 963730 1080506 1187031 1004245 945290 863097
7106H63097L643K65051j8775J49845J72431l5573R1512J59155J44534j86016k05292
$$ 863097 866740 1131791 1113016 1262861 1435292 1399719 1491231 1650386 1794920 1608904 1403612
7095A403612q4975Q126r3106j13292k60170l3954j33193J31082j33869k6221q3251
$$ 1403612 1318637 1326763 1233657 1120365 860195 826241 693048 824130 690261 664040 580789
7084E80789k26487J10006L9677m3895j44273K7437J56088q995J7210J08650j39384
$$ 580789 354302 464308 503985 460090 315817 343254 499342 490347 507557 616207 476823
7073D76823j42346o2182l5256j53633O1397k4432J88389r3178j3017P7130q746
$$ 476823 334477 272295 237039 83406 144803 120371 308760 215582 202565 279695 270949
7062B70949O0788j16231j76060l1824P2247J26295j1086j02279n3500L81O0821
$$ 270949 331737 215506 39446 7622 79869 206164 195078 92799 39299 39680 100501
7051A00501Q7224j1403k13297P0011k8687r2607K75539j11018r2242N0511Q4238
$$ 100501 187725 176322 -36975 33036 4349 -88258 187281 76263 -15979 34532 118770
7040A18770J51498O7347k0460j03512m8955j76665q7679O5900M4104j92186J17585
$$ 118770 270268 337615 317155 213643 164688 -11977 -99656 -33756 10348 -181838 -64253
7029f4253N0761J1650K58K7967q4886k6600J55321J30205o5888n0419j26186k10310
$$ -64253 -13492 -1842 -1584 26383 -58503 -85103 70218 200423 134535 84116 -42070 -252380
7017b52380J86523N2178J44631M7034r7788j44355M0226J8328N235o940R12J96770
$$ -252380 -65857 -13679 130952 177986 80198 -64157 -23931 -5603 -368 -7308 -6396 190374
7005A90374j23768q6426p2591n5433J47220O7111j75798J08086N0424k00072O9847
$$ 190374 66606 -19820 -92411 -147844 -624 66487 -109311 -1225 49199 -150873 -81026
6994h1026P2889J18362R1649k09772k4473m8034M8822J35470M1911j81212Q1292
$$ -81026 -8137 110225 201874 -7898 -32371 -80405 -31583 103887 145798 -35414 45878
6983D5878l887j49574n0859l0217J72284n8185m849n1221Q038R5574K8920m2427
$$ 45878 41991 -107583 -158442 -188659 -16375 -74560 -79409 -130630 -122592 -27018 1902 -40525
6971d0525L1791o1763j9473m5966J20362r60M8510K3198m9471K8752M7054K4042
$$ -40525 -8734 -70497 -89970 -135936 -15574 -16534 31976 55174 5703 34455 81509 105551
6959A05551J24051q5515j26292q5332l3219N120j2560K9564m3948L4387J12203
$$ 105551 229602 144087 17795 -67537 -100756 -95636 -108196 -78632 -122580 -88193 24010
6948B4010J8065j58003o7478N8545J14792m4452n9744o5510J19783n8387P6199
$$ 24010 42075 -115928 -183406 -124861 -10069 -54521 -114265 -179775 -59992 -118379 -42180
6937d2180L8883R4526o8566j10252M5194J04360r8258L9528m659p2831Q0677j13528
$$ -42180 -3297 91229 22663 -87589 -42395 61965 -36293 3235 -1424 -74255 6422 -107106
6925a07106n4312M3946J28297j81923J4777J15121k7577M4670p3955r756R5767
$$ -107106 -161418 -117472 10825 -171098 -156321 -41200 -68777 -24107 -98062 -107818 -12051
6914a2051O4725j32611q9472k2252L03881J27765j46267J2336o0026Q8134J8230
$$ -12051 52674 -79937 -169409 -191661 112220 239985 93718 106054 46028 134162 152392
6903A52392q6689l9103L1001M1481j81572o9087j6474j2453J37210k9853J37775
$$ 152392 65703 26600 57601 99082 -82490 -151577 -168051 -180504 -43294 -73147 64628
6892F4628P0122r3270M0834L8931j09073m9492O8349n0587j4064O5302n6568r1297
$$ 64628 134750 41480 82314 121245 12172 -37320 31029 -19558 -33622 31680 -24888 -116185
6880a16185J81695j31288K5079K3101P489R0815p0039O1062j7549O1088j8461
$$ -116185 65510 -65778 -40699 -17598 -10109 80706 10667 71729 54180 115268 96807
6869I6807j01359p2388O789k7583M8236p5684J9464O8001l1908J63756O5630j46827
$$ 96807 -4552 -76940 -70151 -97734 -49498 -125182 -105718 -37717 -69625 94131 159761 12934
6857A2934J00986j02223J5398J00016L9075j88608J55897o2945j52747M1944J52967
$$ 12934 113920 11697 27095 127111 166186 -22422 133475 70530 -82217 -40273 112694
6846A12694j07928o6304K2214L6837K4235m3461j17081O9020l9386l2588J31886
$$ 112694 4766 -61538 -39324 -2487 21748 -21713 -138794 -69774 -109160 -141748 -9862
6835i862m7018J58858Q9625r029j33226m0661m5649J08026k1081j82923J2009
$$ -9862 -56880 101978 191603 182574 49348 8687 -36962 71064 49983 -132940 -120931
6824a20931N1841n1149Q9682O0356O957j33411m108K6481J44425J160m6066j37212
$$ -120931 -69090 -120239 -30557 29799 36756 -96655 -100763 -74282 70143 71303 25237 -111975
6812a11975J69982O5049j5348p4912m4648k3101K14784r8447k43834m690M6060
$$ -111975 58007 123056 107708 32796 -11852 -34953 179831 81384 -162450 -167140 -121080
6801a21080J18487K942l1606o9816J45767n8022O5096J49486N0768j66673j30456
$$ -121080 -2593 349 -31257 -101073 44694 -13328 51768 201254 252022 85349 -45107
6790d5107J38970N4184j19249p4529L0781j5395K4695n2500n8122k3988m7484
$$ -45107 93863 148047 28798 -45731 -14950 -30345 -5650 -58150 -116272 -140260 -187744
6779a87744K7477o094K54700j98947m3278m3521Q9811J20515o1700J58133k13370
$$ -187744 -160267 -166361 88339 -110608 -153886 -197407 -107596 12919 -48781 109352 -104018
6768a04018K5256K2937O9043l540p6359p2825k236R4829m7629p1837J21102J7417
$$ -104018 -78762 -55825 13218 9678 -66681 -139506 -141742 -46913 -94542 -166379 -45277 -27860
6756b7860M1519j45865j06756R3546q769N7898L5995l6695M5719R0181o7543L6189
$$ -27860 13659 -132206 -238962 -145416 -154185 -96287 -60292 -96987 -51268 38913 -28630 7559
6744G559m4928k1495j6299n4237N037J00267j08028M1015o23N0336Q8500j58975
$$ 7559 -37369 -58864 -75163 -129400 -124363 -24096 -132124 -91109 -91732 -41396 47104 -111871
6732a11871K6218L7261N156m5613J29993r7708p7220K1272L5831J6982M093M8978
$$ -111871 -85653 -48392 -43236 -88849 41144 -56564 -133784 -112512 -76681 -59699 -55606 -6628
6720f628O0388j44569M6178m4849J06818J20227l3706O8090m5928O6314j62895
$$ -6628 53760 -90809 -44631 -89480 17338 137565 103859 171949 126021 192335 29440
6709B9440q6034L2195J24451l3141j55776Q4361l812j21248J01841r1852O2421
$$ 29440 -56594 -24399 100052 66911 -88865 -4504 -8316 -129564 -27723 -119575 -57154
6698e7154J63188N4228k11121J3286K697n5552J38499J7182k755r417K4956Q9323
$$ -57154 106034 160262 -50859 -37573 -34876 -90428 48071 65253 62498 53081 78037 167360
6686A67360L4229k00263O1049k2982N289m7391j54828Q0147o3585R2109J93652
$$ 167360 201589 1326 62375 39393 44682 -2709 -157537 -77390 -140975 -48866 144786
6675A44786j66840J21190O2790L5779n2632j85588p821j13351P7297L1549k7755
$$ 144786 -22054 99136 161926 197705 145073 -40515 -48336 -161687 -84390 -52841 -80596
6664h0596K4133R1832j56861j25533R8111R8456p0444n59p9082J32551Q7296j89300
$$ -80596 -56463 35369 -121492 -247025 -148914 -50458 -120902 -121461 -200543 -67992 19304 -169996
6652a69996J04395P9850p144k820j91210J46752J33085n593q2518J0434l775j21312
$$ -169996 -65601 14249 7105 4285 -186925 -40173 92912 87319 4801 15235 11460 -109852
6640a09852O0051K5889j8623j10960p7494N2410J56934q5054k4058O8936q9806
$$ -109852 -49801 -23912 -42535 -153495 -230989 -178579 -21645 -106699 -130757 -61821 -151627
6629a51627J29894P1348r537j24346J52054j02297k24093O8428N5922q340K4421
$$ -151627 -21733 49615 40078 -84268 67786 -34511 -258604 -190176 -134254 -142594 -118173
6618a18173K07072M979q7392j00221Q6484j24910o9589O7732p5090m055J35487
$$ -118173 88899 93878 6486 -93735 -7251 -132161 -201750 -134018 -209108 -213163 -77676
6607g7676M4033J0802q2061J1908r8875O7465N9012Q1217M7663j26329j20137
$$ -77676 -33643 -22841 -104902 -92994 -191869 -124404 -65392 15825 63488 -62841 -182978
6596a82978J57286o9698j3100J54064r4963n6206O6106J05147q9252K6114l0658
$$ -182978 -25692 -95390 -108490 45574 -49389 -105595 -39489 65658 -23594 2520 -28138
6585b8138Q0880m2203L5312k2691j7455K4165r5325J27538p8851J6432J22580
$$ -28138 52742 10539 45851 23160 5705 29870 -65455 62083 -16768 -336 122244
6574A22244J23814r3256j32620K504J19728p0302j79408K1353O4897L4897o8489
$$ 122244 246058 152802 20182 22686 142414 72112 -107296 -85943 -21046 13851 -54638
6563e4638k9826M8807o2294J11800Q664j97298J0497K8269k5646n8510R5646P9399
$$ -54638 -84464 -35657 -97951 13849 22513 -174785 -164288 -136019 -161665 -220175 -124529 -45130
6551d5130j7581N3389J10352j21184o701n8401P011J10091j45365O6032j434l6770
$$ -45130 -62711 -9322 101030 -20154 -26855 -85256 -78245 31846 -113519 -47487 -48921 -85691
6539h5691J11544Q744O5430J33508L4217j15294k5482p650n5394k8012j19502
$$ -85691 25853 34597 100027 233535 267752 152458 126976 119326 63932 35920 -83582
6528h3582L312N5651J5660M2412J09687K2344l3685j4377l2862o1566m6440O4001
$$ -83582 -80270 -24619 -8959 33453 143140 165484 131799 117422 84560 22994 -23446 40555
6516D0555q4301k7826R9077O002k3416o603j74643r3820J88354P0748M4546L3088
$$ 40555 -43746 -71572 27505 33507 10091 3488 -171155 -264975 -76621 -5873 38673 71761
6504G1761j00752M151q2496N3156l6604M3070R3583M8781j5658n1883O4108M9025
$$ 71761 -28991 -24840 -107336 -54180 -90784 -47714 45869 94650 78992 27109 91217 140242
6492A40242q8702n9209r3211L6219n3502J55166J00750n915n6336j6230J64917
$$ 140242 51540 -7669 -100880 -64661 -118163 37003 137753 131838 75502 59272 224189
6481B24189j18680n0174r590o7339p4014J36372j8544j35538J20781J1992j0094
$$ 224189 105509 55335 45745 -21594 -95608 40764 22220 -113318 7463 19455 9361
6470I361O2821n1530l7440m3509l3136R2807n9663j1931M7319j18727L4474M2175
$$ 9361 72182 20652 -16788 -60297 -93433 -626 -60289 -72220 -24901 -143628 -109154 -66979
6458f6979k4120J9206J23129L6523N7337q0111J12920l6491o7444j6909j5789
$$ -66979 -91099 -71893 51236 87759 145096 64985 177905 141414 73970 57061 41272
6447D1272j13095n8099K58162K444p2038Q530n2511P4090r471m5784J13637j52705
$$ 41272 -71823 -129922 128240 130684 58646 67176 14665 88755 79284 33500 147137 -5568
6435e568j30275J33070J51490q7691j73114l0294N5040j06734j618o9158m288
$$ -5568 -135843 -2773 148717 61026 -112088 -142382 -87342 -194076 -195694 -264852 -269140
6424b69140K44599n3694K9171J0498K5259R8677l4670o5620O5597O6966K3309
$$ -269140 -24541 -78235 -49064 -38566 -13307 85370 50700 -14920 50677 117643 140952
6413A40952j07069q0597J4465k1067n7376M7807j9928R375P3710j2986j68479
$$ 140952 33883 -46714 -32249 -53316 -110692 -62885 -82813 -73438 272 -12714 -181193
6402a81193J919R7534P9534N2352j0831N7033Q8831j17550o0063M5490M5910l653
$$ -181193 -179274 -81740 -2206 50146 39315 96348 185179 67629 7566 53056 98966 95313
6390I5313j30473m4053N9267J48473r8357J50742N1481r5065M452j2617l7412
$$ 95313 -35160 -79213 -19946 128527 30170 180912 232393 137328 141780 129163 91751
6379I1751l9012j16393m5602K11814l5993M1073J02892q8630j59481j79345J16356
$$ 91751 52739 -63654 -109256 102558 66565 107638 210530 121900 -37581 -216926 -100570
6368a00570K31956l207j07061o2474l5893M664Q183m9925p9456J26521n8344J05534
$$ -100570 131386 128179 21118 -41356 -77249 -72585 -64402 -114327 -193783 -67262 -125606 -20072
6356b0072K8517K1409j13926l3853N9327k5952R6115l7975o3329K6712Q104Q1297
$$ -20072 8445 29854 -84072 -117925 -58598 -84550 11565 -26410 -89739 -63027 -54923 26374
6344B6374J07432L3271L04k13720K4454P9819n0009R368J5459m7494n0035q1883
$$ 26374 133806 167077 167381 -46339 -21885 57934 7925 17293 32752 -14742 -64777 -146660
6332a46660O5328R8328O52k214K1340k9275p8795J5150J24803J28670L833K4368
$$ -146660 -81332 16996 17648 15434 36774 7499 -71296 -56146 68657 197327 201160 225528
6320B25528k01717O192l4795M5355J73917j5096n755j49557j24438o6789o7244
$$ 225528 23811 30003 -4792 40563 214480 199384 193629 44072 -80366 -147155 -214399
6309b14399k9588j05046K38067p6649j52754J98312N3382O9653l1330K5556q1072
$$ -214399 -243987 -349033 -110966 -187615 -340369 -142057 -88675 -19022 -50352 -24796 -105868
6298a05868J02604J86936K7115j43363j57683j64378J11866Q4494j6802L8659
$$ -105868 -3264 183672 210787 67424 -90259 -254637 -142771 -58277 -75079 -36420
6288c6420j397q6280J01237N3479M3098n558j78577J32627j53920j26901J32572
$$ -36420 -37817 -124097 -22860 30619 73717 68159 -110418 22209 -131711 -258612 -126040
6277a26040k4276j7616M9914Q8969J01763r3888l2951L000m2503J1136j49667
$$ -126040 -150316 -167932 -118018 -29049 72714 -21174 -54125 -51125 -93628 -82492 -232159
6266b32159Q1229J31822M4044M0141j61009M6184K5204k8617L04607j30544j7143
$$ -232159 -150930 -19108 24936 65077 -95932 -49748 -24544 -53161 251446 120902 103759
6255A03759q5159l0227j21j4420J75097K9986j40270p0894P9869J0957Q6665n9977
$$ 103759 18600 -11627 -11748 -26168 148929 178915 38645 -32249 47620 58577 145242 85265
6243H5265j8808J3717L8719K618l0102o0103j05658m6568J08978J08756j0991
$$ 85265 66457 80174 118893 121511 91409 31306 -74352 -120920 -11942 96814 85823
6232H5823j9690N8790j00388M0082j78774k0650J40635n6232l4508M3305J27489
$$ 85823 66133 124923 24535 64617 -114157 -134807 5828 -50404 -84912 -41607 85882
6221H5882J5721J02744j12974l5646j21342q3213R8118r723k2507m2738m3446
$$ 85882 101603 204347 91373 55727 -65615 -148828 -50710 -60433 -82940 -125678 -169124
6210a69124J48150r634Q4934K9223j54080J58779l8896l279j72858R0156J75738
$$ -169124 -20974 -30608 54326 83549 -70531 88248 49352 46073 -126785 -36629 139109
6199A39109o9332L9459P2412n6027j31437o1175o6104J47165Q9052Q1965j60543
$$ 139109 69777 109236 181648 125621 -5816 -66991 -133095 14070 103122 185087 24544
6188B4544j70496K17662Q1617j3535q0401k45551K39726J76576j61119L1919l1589
$$ 24544 -145952 71710 153327 139792 59391 -186160 53566 230142 69023 100942 69353
6177F9353k9414J2303J07853p0908K066n6548n9499m6335M6293K30796j17435
$$ 69353 39939 52242 160095 89187 91253 34705 -24794 -71129 -24836 205960 88525
6166H8525m6931r4115j49020J98944J67335j24204R9793J2395m5235K0507R7055
$$ 88525 41594 -52521 -201541 -2597 164738 40534 140327 152722 107487 127994 225049
6155B25049n9817j47704P0386N3024l8414q7094P4867O8652m1334q3504K8285
$$ 225049 165232 17528 87914 140938 102524 15430 90297 158949 117615 34111 62396
6144F2396p0411j90638N7052J38474j9931O0675M0086j01205P9216l6562j99407
$$ 62396 -8015 -198653 -141601 -3127 -23058 37617 77703 -23502 55714 19152 -180255
6133a80255J31284K8343O9965K9171J73789k1520j33955j41875r4606M3073J24023
$$ -180255 -48971 -20628 49337 78508 252297 230777 96822 -45053 -139659 -96586 27437
6122B7437N4310n4983M2202j4730Q4437j09374O4411j6834p8133k1224l083P9910
$$ 27437 81747 26764 68966 54236 138673 29299 93710 76876 -1257 -22481 -25564 54346
6110E4346j06659P9654J14796m2095k8429J5518K7115m5436K3492j5645p002R4806
$$ 54346 -52313 27341 142137 100042 71613 87131 114246 68810 92302 76657 69655 164461
6098A64461j28389l5174J3657K8958J53162q810L5416k01417P2187Q9358p2663
$$ 164461 36072 898 14555 43513 196675 187865 223281 21864 94051 183409 110746
6087A10746K6125J0923R403J8370M2429n1479R071R183r8530r8657J07756r885
$$ 110746 136871 147794 157197 175567 217996 166517 175588 184771 86241 -12416 95340 85455
6075H5455m4627k9959K5653m0989J05033K4821r7962L6245m6197J7646M180p3465
$$ 85455 40828 10869 36522 -4467 100566 125387 27425 63670 17473 35119 39299 -34166
6063c4166R549O3011M3083L4222M7540J17035p7751j03916O9442j47703N3389
$$ -34166 -24617 38394 81477 115699 163239 280274 202523 98607 168049 20346 73735
6052G3735L7051r6498J41796J5938m4841j3805Q0008r807J9251R4677j10983p3574
$$ 73735 110786 14288 156084 172022 127181 113376 193384 183577 202828 297505 186522 112948
6040A12948Q005K5833r4576m4763L4755k6447M0537o3423l9792M1685J41749j67408
$$ 112948 120953 146786 52210 7447 42202 15755 56292 -7131 -46923 -5238 136511 -30897
6028c0897j613J12403M1913J01566o2472n5111l7845m0268P2295j14912J412J33510
$$ -30897 -32510 79893 121806 223372 160900 105789 67944 27676 99971 -14941 -13529 119981
6016A19981J17420r6897o5149j00431K4263Q2866L0832L1329j8403q6070j24174
$$ 119981 237401 140504 75355 -25076 -813 82053 112885 144214 125811 39741 -84433
6005h4433K640J0728K0002L4259J7984O6444Q1681P4273Q4603j39299m7360L4461
$$ -84433 -81793 -71065 -51063 -16804 1180 67624 149305 223578 308181 168882 121522 155983
5993A55983r1661J9818m4010J48165n1407j30836n1021r3528J06459J32210O4272
$$ 155983 64322 84140 40130 188295 136888 6052 -44969 -138497 -32038 100172 164444
5982A64444k8476q014J05780K21569r0964p1718m6291k7185j09599J2230J54502
$$ 164444 135968 127954 233734 455303 364339 292621 246330 219145 109546 121776 276278
5971B76278p5150j24200K34964J22962n2388o4514j16034l1330m0966m7134K7337
$$ 276278 201128 76928 311892 434854 382466 317952 201918 170588 129622 82488 109825
5960A09825J4645O6071o2027J01609p4754j01044P4599l2996n1567J62314K4353
$$ 109825 124470 190541 128514 230123 155369 54325 128924 95928 44361 206675 231028
5949B31028K158M235J1058n8342p2869K12230k752k91708n1953J75904q688j66791
$$ 231028 233186 237421 248479 190137 117268 329498 326746 35038 -16915 158989 150301 -16490
5937a6490P1442J18126K617J68643K6701l40181J30012J89232l5830P4065L5842
$$ -16490 54952 173078 175695 344338 371039 30858 160870 350102 314272 388337 424179
5926D24179o5757K7492M4459J13199j9099j16313k4685K24142L7522j55795j31463
$$ 424179 358422 385914 430373 543572 524473 408160 383475 607617 645139 489344 357881
5915C57881q8479O6336M6179o7428q484P6806q8059l4696j5135P8973K46151Q1909
$$ 357881 269402 335738 381917 314489 306005 382811 294752 260056 244921 323894 570045 651954
5903F51954j38131j2808M5766j3230J27278J49919L8612o9163m4698M26353M4078
$$ 651954 513823 501015 546781 533551 660829 810748 849360 780197 735499 1161852 1205930
5892A205930k0520n8662N8665p7277k19610J9642j62707j04609Q2508j2975l8346
$$ 1205930 1185410 1126748 1185413 1108136 888526 908168 745461 640852 723360 710385 672039
5881F72039N2904r4631j67682Q4506o9222N1893k5227Q7178J4847M6457j00276
$$ 672039 724943 630312 462630 547136 477914 529807 504580 591758 606605 653062 552786
5870E52786K7897M8710P1441K5190j03781m6356K39456K41028P8299R635P8136
$$ 552786 580683 629393 700834 726024 622243 575887 815343 1056371 1134670 1144305 1222441
5859A222441l0451L4886j38914j98715l1026p1077J1508K3055k08300o6526L167
$$ 1222441 1191990 1226876 1087962 889247 858221 787144 798652 821707 613407 546881 550048
5848E50048L6088M1480r4829n7146j21327J37930K2520L0131j22383n482Q5513
$$ 550048 586136 627616 532787 475641 354314 492244 514764 544895 422512 417030 502543
5837E02543o7740p6349J14673k4468N5917N42j1891o4388Q2136J04586J41617
$$ 502543 434803 358454 473127 448659 504576 505118 493227 428839 510975 615561 757178
5826G57178j34214j57316l3407L6017P6041n2293Q010q5046o3562P2713n3020
$$ 757178 622964 465648 432241 468258 544299 492006 500016 414970 351408 424121 371101
5815C71101L6706m9358J6599o3037J12884m9154q0523j38634R1448k2610k19857
$$ 371101 407807 358449 375048 312011 424895 375741 295218 156584 248032 225422 5565
5804E565J22261J06980O2634M3107N0874q4451k1R443r0957k9561P712k0643J34473
$$ 5565 127826 234806 297440 340547 391421 306970 306949 316392 225435 195874 203586 182943 317416
5791C17416j56133p2198p1886J87078J45787j55097j16359M9062N0404J4145L7985
$$ 317416 161283 89085 17199 204277 350064 194967 78608 127670 178074 192219 230204
5780B30204q928k3570L4163k079n4618J3613L6182O9159L3847N906j8956j78317
$$ 230204 221276 197706 231869 229790 175172 188785 224967 294126 327973 333879 314923 136606
5768A36606k2950P8053Q783o7042j85190J68013o4865J68653J02412j4344Q2604
$$ 136606 113656 191709 200492 133450 -51740 116273 51408 220061 322473 308129 390733
5757C90733j84192q6611j57126K84780J31647j34875l4735l9273M1681p6966J10580
$$ 390733 206541 119930 -37196 247584 379231 244356 209621 170348 212029 135063 245643
5746B45643m5387R769k637K9136J41525j17440k47187m0515K7376J13969o080
$$ 245643 200256 210025 207388 236524 378049 260609 13422 -27093 283 114252 108172
5735A08172o6725K5277r860q84j2761q9014Q7445J91163j6175r8518m1662J23948
$$ 108172 41447 66724 56864 55980 43219 -45795 41650 232813 216638 118120 76458 200406
5723B00406m7232J1801J15246L7232K0590k2515j08641l4958p8192J6721L3334
$$ 200406 153174 164975 280221 317453 338043 315528 206887 171929 93737 110458 143792
5712A43792K4895N8814k4628k0572N6374m04J62404p1965n385j76028K5113K7971
$$ 143792 168687 227501 202873 182301 238675 238271 400675 328710 323325 147297 172410 200381
5700B00381Q1495P4570j34660l8012N7186m5511j04327J6833K8077J82539j1393
$$ 200381 281876 356446 221786 183774 240960 195449 91122 107955 136032 318571 307178
5689C07178N2976p435k00278M7050m2042O4966k3052j32577K25615L1030k5649
$$ 307178 360154 352719 152441 199491 157449 222415 199363 66786 292401 323431 297782
5678B97782k3720r1034J46718P2671m9939O1612k03855j83026K06611J80596j8736
$$ 297782 274062 183028 329746 402417 352478 414090 210235 27209 233820 414416 395680
5667C95680n3449n245M22q716p3458m3888N82n2264J19937r4602P9388J43036
$$ 395680 342231 336986 337408 328692 255234 211346 211928 159664 279601 184999 264387 407423
5655D07423L5351j42120j8834j5514J72515J02527j09506o8712j55266N8171q922
$$ 407423 442774 300654 281820 266306 438821 541348 431842 363130 207864 266035 257113
5644B57113J09162p003n4340n1289q704Q5590J61489p2603J3884k6964q8073J9822
$$ 257113 366275 359272 304932 253643 244939 330529 492018 419415 433299 406335 318262 338084
5632C38084j85348l1951j0513J68507J64322m9411k9369n040J00896o2695j15971
$$ 338084 152736 120785 110272 278779 443101 393690 364321 359281 460177 397482 281511
5621B81511m0903k9339J34837o715j50810O086J27871K8520j27565j05418R6804
$$ 281511 240608 211269 346106 339391 188581 194667 322538 351058 223493 118075 214879
5610B14879J93196j95641O048J63775j53442P9442k3816p8960k7660m8315L8690
$$ 214879 408075 212434 218482 382257 228815 308257 284441 205481 177821 129506 168196
5599A68196J46187m4832J7571O3561K155L9037J72460j40655L4238P7747j87854
$$ 168196 314383 269551 287122 350683 352838 391875 564335 423680 457918 535665 347811
5588C47811L5996P3827j24196J0227J1848o5830O7530q7523L6795J00025M193
$$ 347811 383807 457634 333438 343665 355513 289683 357213 269690 306485 406510 410703
5577D10703J22303j0380n3548j18471Q7924N550N6102p0418k3271J7241j3050
$$ 410703 533006 522626 469078 350607 438531 444081 500183 429765 406494 423735 410685
5566D10685j5188Q7603J34119k02052M7584N4744L8467o8446J73920J22129o6419
$$ 410685 395497 483100 617219 415167 462751 517495 555962 487516 661436 783565 717146
5555G17146j26837n359J20529L5453k8291o9434l367M7523j64531O0642L2579
$$ 717146 590309 584950 705479 740932 712641 643207 639840 687363 522832 583474 616053
5544F16053j40773r351J36038j00530k2571J11122P306k8460J16451J31141R3941
$$ 616053 475280 465929 601967 501437 478866 589988 597294 568834 685285 816426 910367
5533I10367Q5459K1496q4170J52617P5449O1777J07530l8700J117R2051O9301
$$ 910367 995826 1017322 933152 1085769 1161218 1222995 1330525 1291825 1292942 1384993 1454294
5522A454294m673n1861r0782j17578j86604j04791p2931J13906O7454j9898j11632
$$ 1454294 1449621 1397760 1306978 1189400 1002796 898005 825074 938980 1006434 986536 874904
5511H74904P0367o6140K3559o4626L2326n005n3724j1551j71641p725J03631L6212
$$ 874904 945271 879131 902690 838064 870390 865385 811661 800110 628469 620744 724375 760587
5499G60587j27235R8795J46351J11548o9264k32265m534J51530r8381L4652Q017
$$ 760587 633352 732147 878498 990046 920782 688517 683983 835513 737132 771784 779801
5488G79801r3101j50148k1613K6064n3699r2057P8094K06785M0571p1246k1353
$$ 779801 686700 536552 514939 541003 487304 395247 473341 680126 720697 649451 628098
5477F28098J68719l0876k7901N7181q7428q9344J6393J00153J48332K0264o2215
$$ 628098 796817 765941 738040 795221 707793 618449 634842 734995 883327 903591 841376
5466H41376q4751J88139J29240j1220r8689j71200j19636K1313J35576j05407
$$ 841376 756625 944764 1074004 1062784 964095 792895 673259 694572 830148 724741
5456G24741l3624P22o024m756L0016J25301O6385M2909O7286p7857k3038n9371
$$ 724741 691117 691839 685815 681059 711075 836376 902761 945670 1012956 935099 912061 852690
5444H52690r2607M3622L4526j09953R3627q312m3117P6340n458r7344K29305N9306
$$ 852690 760083 803705 838231 728278 821905 813593 770476 846816 841358 744014 973319 1032625
5432A032625p4976N7107J6794p1009R3640J3121J5169o5458k42704n842J57938
$$ 1032625 957649 1014756 1031550 960541 1054181 1067302 1082471 1017013 774309 768467 926405
5421I26405L5076J90524J41386o9933O0620N9868l3164j58310P0631K8580m9004
$$ 926405 961481 1152005 1293391 1223458 1284078 1343946 1310782 1152472 1223103 1251683 1202679
5410A202679j18289M2260r7815L1852q0804R3179q4075O601j06360O5282M7549
$$ 1202679 1084390 1126650 1028835 1060687 979883 1073062 988987 995588 889228 954510 1002059
5399A002059m7939O8744J06704o7633J27679j2485n9520J46233L8650m7649N7638
$$ 1002059 954120 1022864 1129568 1061935 1189614 1177129 1117609 1263842 1302492 1254843 1312481
5388A312481J01687j12049j13537O4351J09592M0122N4466K4747j37241k38592
$$ 1312481 1414168 1302119 1188582 1252933 1362525 1402647 1457113 1481860 1344619 1106027
5378A106027M1941J80738l6395j0628r2165J48465J42273J83223K32847k12795
$$ 1106027 1147968 1328706 1292311 1281683 1189518 1337983 1480256 1663479 1896326 1683531
5368A683531k88682R4047P3505j03165m7473o6146J20970J91865Q1706O0441j11666
$$ 1683531 1394849 1488896 1562401 1459236 1411763 1345617 1466587 1658452 1740158 1800599 1688933
5357A688933o3194J07965o3775K6955J04877J32574M1845L2776k27508M1277J03143
$$ 1688933 1625739 1733704 1669929 1696884 1801761 1934335 1976180 2008956 1781448 1822725 1925868
5346A925868K8922N4550R2981j08191M7136P0282P3883j24694J0815j60460n4398
$$ 1925868 1954790 2009340 2102321 1994130 2041266 2111548 2185431 2060737 2071552 1911092 1856694
5335A856694J67638M2445J99613l8464n2322J11706M8046J58464O521j416J1788
$$ 1856694 2024332 2066777 2266390 2227926 2175604 2287310 2335356 2493820 2500341 2498925 2510713
5324B510713P8271L6390j207M180J06006J68124j2003Q2343J33165Q4040J61208
$$ 2510713 2588984 2625374 2624167 2628347 2734353 2902477 2890474 2972817 3105982 3190022 3351230
5313C351230p7806K8472j6905N8289J73771K32731J35505j1318K02249J16531
$$ 3351230 3273424 3301896 3284991 3343280 3517051 3749782 3885287 3873969 4076218 4192749
5303D192749j76058J61398K08822J76826P0126m6843R3707l795J3899K71585K33059
$$ 4192749 4016691 4178089 4386911 4563737 4633863 4587020 4680727 4676932 4690831 4962416 5195475
5292E195475M1167K50077o0701K77896K49293l1060J30597J95474K03431J91143
$$ 5195475 5236642 5486719 5426018 5703914 5953207 5922147 6052744 6248218 6451649 6642792
5282F642792K44869J94852L61030M0955q3557J89653K78892K91952N4245J43318
$$ 6642792 6887661 7082513 7443543 7484498 7400941 7590594 7869486 8161438 8215683 8359001
5272H359001J63530J83587K52558L29819L20398L96709L40656L06440M50577M99308
$$ 8359001 8522531 8706118 8958676 9288495 9608893 10005602 10346258 10652698 11103275 11602583
5262A1602583N04731N13827M55809N67374M69441N95996P27888O35246O69158
$$ 11602583 12107314 12621141 13076950 13644324 14113765 14709761 15437649 16072895 16742053
5253A6742053O97857M88505O18191P60504Q98071P95682P93065Q90102J002948
$$ 16742053 17439910 17928415 18546606 19307110 20205181 21000863 21793928 22684030 23686978
5244B3686978J075499R90225J194094J432371J622513J896436K391483K631110
$$ 23686978 24762477 25752702 26946796 28379167 30001680 31898116 34289599 36920709
5236C6920709L094643L828063M483344N521967O502503P919621R507445J1482747
$$ 36920709 40015352 43843415 48326759 53848726 60351229 68270850 77778295 89261042
5228H9261042J3695563J5011319J5743640J5213875J2951563Q902172K496900
$$ 89261042 102956605 117967924 133711564 148925439 161877002 170779174 173276074
5221A73276074k923430o960098j2076561j6344491j6853446j5937291j4514268
$$ 173276074 170352644 163392546 151315985 134971494 118118048 102180757 87666489
5214H7666489j2570932j0237530p939598o410927n166055m318481l612949k982268
$$ 87666489 75095557 64858027 56918429 50507502 45341447 41022966 37410017 34427749
5206C4427749k550012k452420k158211j904616j591017j435246j343174j496766
$$ 34427749 31877737 29425317 27267106 25362490 23771473 22336227 20993053 19496287
5198A9496287j155265j091692j221937q59908q52711o66618n25273p98638n98434
$$ 19496287 18341022 17249330 16027393 15167485 14314774 13648156 13122883 12324245 11725811
5189A1725811m11518l12632l63768l49528l50245n09081k59979k83446l78900
$$ 11725811 11314293 11001661 10637893 10288365 9938120 9429039 9169060 8885614 8506714
5180H506714j64897k98981j86493j98578o5475j16761k55012k85701k81841j57039
$$ 8506714 8341817 8042836 7856343 7657765 7592290 7475529 7220517 6934816 6652975 6495936
5170F495936k63132k3566r1672j26343k20635j80211n2373k26596j60089k61540
$$ 6495936 6232804 6209238 6117566 5991223 5770588 5590377 5538004 5311408 5151319 4889779
5160D889779q0414O7413j20763j60579j4894k3959o4035j19659j01667K8374j94594
$$ 4889779 4809365 4876778 4756015 4595436 4580542 4556583 4492548 4372889 4271222 4299596 4105002
5149D105002n8287j43515q8438j2671j88658k29969q5926J38787Q8362j7716l84216
$$ 4105002 4046715 3903200 3814762 3802091 3613433 3383464 3297538 3436325 3524687 3506971 3122755
5138C122755r042O8834j40197j15124P6466j47839j3602J52172j3395n3887k00989
$$ 3122755 3113713 3182547 3042350 2927226 3003692 2855853 2842251 2994423 2981028 2927141 2726152
5127B726152q976n0980m7591r4712R638J75578l8925j63126R464O5303o2155L785
$$ 2726152 2717176 2666196 2618605 2523893 2533531 2709109 2670184 2507058 2516522 2581825 2519670 2523455
5115B523455J09058q2941k6170p6643j18410Q2645J4712L4725J9002k6545m5397
$$ 2523455 2632513 2549572 2523402 2446759 2328349 2410994 2425706 2460431 2479433 2452888 2407491
5104B407491j90419p7168J38248q4936r9544K30390o0799j32044j16078N449j32117
$$ 2407491 2217072 2139904 2278152 2193216 2093672 2324062 2263263 2131219 2015141 2020590 1888473
5093A888473K4623K03503l0593r0158M072o9329q5820j50821J63910N1210K9948
$$ 1888473 1913096 2116599 2086006 1995848 1999920 1930591 1844771 1693950 1857860 1909070 1939018
5082A939018l6591m2071L5898j46176O0783l6914l7029j7778J04800N3188n4728
$$ 1939018 1902427 1860356 1896254 1750078 1810861 1773947 1736918 1719140 1823940 1877128 1822400
5071A822400j45975k8005J48296q3901j79936J00282l6824O310j61225Q3435M9851
$$ 1822400 1676425 1648420 1796716 1712815 1532879 1633161 1596337 1602647 1441422 1524857 1574708
5060A574708o3934J20014M1451j47499k8561J08886L0221R6598N7272J1094r0142
$$ 1574708 1510774 1630788 1672239 1524740 1496179 1605065 1635286 1731884 1789156 1800250 1710108
5049A710108j58342p039P7255R9551o2620o9154L292r2542l795K18946r9620j68601
$$ 1710108 1551766 1544727 1621982 1721533 1658913 1589759 1593051 1500509 1496714 1715660 1616040 1447439
5037A447439K8417j2212R1413l7530p7944o8383p44P9612j04444m2464j2480J80261
$$ 1447439 1475856 1463644 1555057 1517527 1439583 1371200 1370456 1450068 1345624 1303160 1290680 1470941
5025A470941J40988j02644n0135k0765j28915K208k1290K5612Q2358l0751M1514
$$ 1470941 1611929 1509285 1459150 1438385 1309470 1311678 1290388 1316000 1398358 1367607 1409121
5014A409121k8599j25542R6912K8178l2895J9190L3812R4289P280N5237l4844
$$ 1409121 1380522 1254980 1351892 1380070 1347175 1366365 1400177 1494466 1501746 1556983 1522139
5003A522139j6966o7051N6485j72173j19112J25925N3871k7146K3911l8555K7030
$$ 1522139 1505173 1438122 1494607 1322434 1203322 1329247 1383118 1355972 1379883 1341328 1368358
4992A368358l0103K7305N796j65526M6938Q0964O8821j3057j0846m7553J0727
$$ 1368358 1338255 1365560 1371356 1205830 1252768 1333732 1402553 1389496 1378650 1331097 1341824
4981A341824O9059o165J52847n90l02j44205r9621j88321m9724q5428M6372L6424
$$ 1341824 1410883 1404718 1557565 1556975 1556673 1412468 1312847 1124526 1074802 989374 1035746 1072170
4969A072170J6226R5727R2474j3134j75502m7129J56253K20438m6848k80299o6670
$$ 1072170 1088396 1184123 1276597 1263463 1087961 1040832 1197085 1417523 1370675 1090376 1023706
4958A023706J00852J62784L3720r3005J24418m3001p440l375M1320k9842j06158
$$ 1023706 1124558 1287342 1321062 1228057 1352475 1309474 1302034 1298659 1339979 1310137 1203979
4947A203979Q5840j9252j3758r087P374J07345N7101r7122o3019Q2465M0093J7492
$$ 1203979 1289819 1270567 1256809 1247722 1255096 1362441 1419542 1322420 1259401 1341866 1381959 1399451
4935A399451o7414J0777N2948m8674m0836J7753O0104j10225k906N1165J68068
$$ 1399451 1332037 1342814 1395762 1347088 1306252 1324005 1384109 1273884 1270978 1322143 1490211
4924A490211K04894P0772j34743o442K42406N9595M2244L0469l3047j03847j27759
$$ 1490211 1695105 1765877 1631134 1624692 1867098 1926693 1968937 1999406 1966359 1862512 1734753
4913A734753j39623Q3961m0080q3814k25856O7280K2322j55935J8890q4904r4792
$$ 1734753 1595130 1679091 1639011 1555197 1329341 1396621 1418943 1263008 1281898 1196994 1102202
4902A102202K26907K19423j49819k36870J6054J3868j24732p2325K20115J858
$$ 1102202 1329109 1548532 1398713 1161843 1177897 1191765 1067033 994708 1214823 1216681
4892A216681o5407l5672q5117R4757m6766N2361L6117J23699k31733k3802J20622
$$ 1216681 1151274 1115602 1030485 1125242 1078476 1130837 1166954 1290653 1058920 1035118 1155740
4881A155740k27782p0317O7246O8455j50825L3980l3698J42857R3182L5747p7132
$$ 1155740 927958 857641 924887 993342 842517 876497 842799 985656 1078838 1114585 1037453
4870A037453J99082N3883k49085j55359O8039Q5863M8087p6129j7343K104j35080
$$ 1037453 1236535 1290418 1041333 885974 954013 1039876 1087963 1011834 994491 996595 861515
4859H61515j147M5976J13242j26163N3344k6193j607P724N5773o8342j42026r3020
$$ 861515 860368 906344 1019586 893423 946767 920574 918967 926691 982464 914122 772096 679076
4847F79076M9765J53401J47303k007O1443j050p6872K4146k55988P7632J1546
$$ 679076 728841 882242 1029545 1027538 1088981 1087931 1011059 1035205 779217 856849 868395
4836H68395n9117l5973M8178L7539P7283L3311j47231k1222K1390L1223j66703
$$ 868395 809278 773305 821483 859022 936305 969616 822385 801163 822553 853776 687073
4825F87073J3305l1031M6604J64110M0767r9008j24061M7281N3907n3687o6320
$$ 687073 700378 669347 715951 880061 920828 821820 697759 745040 798947 745260 678940
4814F78940M0218N7186m4720p4833j96074l984J21058K63890p922k7092n1893
$$ 678940 719158 776344 731624 656791 460717 456733 577791 841681 833759 806667 754774
4803G54774j76533L6769J7970Q727P2750m7842k6223N0508J5772Q5414L2122j05305
$$ 754774 578241 615010 632980 641707 714457 666615 640392 690900 706672 792086 824208 718903
4791G18903J2427K5244j47439N1112m9656r6620K2534K2571J20981r984j94934
$$ 718903 731330 756574 609135 660247 610591 513971 536505 559076 680057 670073 475139
4780D75139K0304r541o220M3968k162K22119q2389j12590M5139J86727n7564k76332
$$ 475139 495443 485902 479682 523650 521488 743607 661218 548628 593767 780494 722930 446598
4768D46598q378J31991J48050j54586Q8088L6518j01783q7661N0484l5949r7222
$$ 446598 438220 570211 718261 563675 651763 688281 586498 498837 549321 513372 416150
4757D16150J62877q7058J4426K09087r0059q3391K0634p119l0546L5078K0393
$$ 416150 579027 491969 506395 715482 625423 542032 562666 555547 525001 560079 580472
4746E80472m6249m3671N4439J29881O1418k21695q7296O4648J575J32339L2451
$$ 580472 534223 490552 544991 674872 736290 514595 427299 491947 493522 625861 658312
4735F58312M3087j38412l1452k2292k5981o4357J45877L2972P8293P2092o594
$$ 658312 701399 562987 531535 509243 483262 418905 564782 597754 676047 748139 741545
4724G41545Q196k60970P4739M8913K6354r5253N515J87996j27697n8302N1029
$$ 741545 749741 488771 563510 612423 638777 543524 549039 737035 609338 551036 602065
4713F02065Q541o8947r542L0491j1073j66012K16781j0731Q2244q2041j4265J67024
$$ 602065 610606 541659 532117 562608 551535 385523 602304 591573 673817 591776 577511 744535
4701G44535j09425r3321j19341R4306k3903j9492M17M5353m8553j8984K2247o9569
$$ 744535 635110 541789 422448 516754 492851 473359 473776 519129 470576 451592 473839 404270
4689D04270K8748M0025j9636J55134k1177l6114k4780k9691j61588k2187J63005
$$ 404270 433018 473043 453407 608541 587364 551250 526470 496779 335191 313004 476009
4678D76009m8658L8456L4032J151P5700j41527k00846N0100M8444l8886J35081
$$ 476009 427351 465807 499839 500990 576690 435163 234317 284417 332861 293975 429056
4667D29056j16757R0924m6123K1233m5000k7130l44n3009R4461p665Q4822J2666
$$ 429056 312299 403223 357100 378333 333333 306203 305859 252850 347311 339646 424468 437134
4655D37134r3951k0625K5250N5118J12525j4198j43212L1149o133J3773j8707
$$ 437134 343183 322558 347808 402926 515451 501253 358041 389190 383057 396830 378123
4644C78123m8287j3477K3348M6481L9104R8307J2632j23731o3094J493L4727O6712
$$ 378123 329836 316359 339707 386188 425292 523599 536231 412500 349406 350899 385626 452338
4632D52338L7525r1180r0952p8841m365Q7103J56150l067j68329R0191O5647P3468
$$ 452338 489863 398683 307731 228890 224525 311628 467778 464711 296382 386573 452220 525688
4620E25688m9469j77736n9673J01590J42555j8116k6390n260p0392k7965R186
$$ 525688 476219 298483 238810 340400 482955 464839 438449 433189 362797 334832 344018
4609C44018o8889M753O4631P3213J12093m8465q8553n6421N6145L1471J92916
$$ 344018 275129 279882 344513 417726 529819 481354 392801 336380 392525 423996 616912
4598F16912k2574n6941J4100j38552q7872P3799K2804m7316M78R1237O3106k20612
$$ 616912 594338 537397 551497 412945 325073 398872 421676 374360 374838 466075 529181 308569
4586C08569j18803J28020L4021p1650k251K3665j23696O3093q954L3853O2896
$$ 308569 189766 317786 351807 280157 277906 301571 177875 240968 232014 265867 328763
4575C28763j20783k2852J78850O0667p100k76707O1031M2212j53483Q0663K27207
$$ 328763 207980 185128 363978 424645 417545 140838 201869 244081 90598 171261 398468
4564C98468M8784l6471r6377k8966J56457j07674O2664r0642j24452L8273K9348
$$ 398468 447252 410781 314404 285438 441895 334221 396885 306243 181791 220064 249412
4553B49412l7880M7952N9740Q0838J22683L0776j2821l6956j38041j42843Q2098
$$ 249412 211532 259484 319224 400062 522745 553521 540700 503744 365703 222860 304958
4542C04958j1114o6142Q9809O8455J14849j16449j69405J59149J34k71982J7680
$$ 304958 293844 227702 317511 385966 500815 384366 214961 374110 374244 102262 119942
4531A19942R6621l5350L6822M5831L0903J67386k00429n759N5819J20709j1716
$$ 119942 216563 181213 218035 263866 294769 462155 261726 255967 311786 432495 420779
4520D20779k13591K39033Q357j65243J04951m8120M7509R5492k2449m3559N5450
$$ 420779 207188 446221 454578 289335 394286 346166 393675 489167 466718 423159 478609
4509D78609J00849k13436K4332j6413K5952N2541l9389j5043M4362q4999M1766
$$ 478609 579458 366022 390354 373941 399893 452434 413045 398002 442364 357365 399131
4498C99131J5029n4992p985M3228j2938m4128q140L6110M3463r2689M1324J5725
$$ 399131 414160 359168 351183 394411 381473 337345 329205 365315 408778 316089 357413 373138
4486C73138N4745j40606O2833N8104j89023n19R3470J62565j11530N1584r1811
$$ 373138 427883 287277 350110 408214 219191 218672 312142 474707 363177 414761 322950
4475C22950k649M5018P7448j54985M1604m8015j23474Q9014L1597J74575M3385
$$ 322950 320301 365319 442767 287782 329386 281371 157897 246911 278508 453083 496468
4464D96468p1087j50848R8228k6647J48594L7678o151j61374N1854R9551J62420
$$ 496468 425381 274533 372761 346114 494708 532386 526235 364861 416715 516266 678686
4453F78686j53447k9133m9042N9532l8346r7501M9789P7899O7200k2183N089j18030
$$ 678686 525239 496106 447064 506596 468250 370749 420538 498437 565637 543454 548543 430513
4441D30513M4688j12435L3302J95859r4230p5l3953j13638R9695K19640r3929
$$ 430513 475201 362766 396068 591927 497697 497622 463669 350031 449726 669366 575437
4430E75437q867R883k34946r001N6793J94048Q4052j9792m0722r288o9380J6702
$$ 575437 566570 576453 341507 332506 389299 583347 667399 647607 606885 597597 528217 544919
4418E44919J14440k4637q1108j0268o0997L8785o2161Q3511P7632J1777k6493
$$ 544919 659359 634722 553614 543346 482349 521134 458973 542484 620116 631893 605400
4407F05400n147P7525M2793k1744R6936q996j65972K4136P6454O1069J01195K08103
$$ 605400 600253 677778 720571 698827 795763 786767 620795 644931 721385 782454 883649 1091752
4395A091752K71851K23549J82353R7682O2170R8489K7648n1861n9862j11226k37728
$$ 1091752 1363603 1587152 1769505 1867187 1929357 2027846 2055494 2003633 1943771 1832545 1594817
4384A594817k06578j47591j65627p2911r7522N8976j07022J16177O9601n4560
$$ 1594817 1388239 1240648 1075021 1002110 904588 963564 856542 972719 1042320 987760
4374I87760P8205O3077j6792j41332j21406j09123j14236k5821M5349m0388J24585
$$ 987760 1065965 1129042 1112250 970918 849512 740389 626153 600332 645681 605293 729878
4363G29878J52305r883j03864P8971N0194J03416M2235L3570j39476p7980j39384
$$ 729878 882183 872300 768436 847407 897601 1001017 1043252 1076822 937346 859366 719982
4352G19982M7177Q6333j82266k3372K7129N8038Q8528q5277p2861R960J5522J43942
$$ 719982 767159 853492 671226 647854 674983 733021 821549 736272 663411 673371 688893 832835
4340H32835L6209q318j00493K2595N4796o9276K7229n0124m7375P5382R1194j08378
$$ 832835 869044 860726 760233 782828 837624 768348 795577 745453 698078 773460 864654 756276
4328G56276o440m9165j0863R6152J72414j69787O220J49859j23659P5407j60058
$$ 756276 749836 700671 689808 785960 958374 788587 794807 944666 821007 896414 736356
4317G36356j20439R669J47774k929j42151o2252J33899N4033K41369p8567O8357
$$ 736356 615917 625586 773360 770431 628280 566028 699927 753960 995329 916762 985119
4306I85119O5358j14906r6869o5474J88229J57624N0341j79176j60792N5177J84002
$$ 985119 1050477 935571 838702 773228 961457 1119081 1169422 990246 829454 884631 1068633
4295A068633n8161O4479O2279r539J5409o6341n903M6444o6616K3672O9513M0464
$$ 1068633 1010472 1074951 1137230 1127691 1143100 1076759 1070856 1117300 1050684 1074356 1143869 1184333
4283A184333o2395m4780M8515p2318R6118L5078O1602j18161J18022J02682q6027
$$ 1184333 1121938 1077158 1125673 1053355 1149473 1184551 1246153 1127992 1246014 1348696 1262669
4272A262669m3393j62807K39665N7866p3396J5624M5264P6702K47384L0521j22053
$$ 1262669 1219276 1056469 1296134 1354000 1280604 1296228 1341492 1418194 1665578 1696099 1574046
4261A574046q4165K6193J49465j9551O6871M9585P1945N202k13039J22782J03742
$$ 1574046 1489881 1516074 1665539 1645988 1712859 1762444 1834389 1839591 1626552 1749334 1853076
4250A853076m802J40119o0684J33754M640R5978J65551r0810O8920Q7017N3362
$$ 1853076 1848274 1988393 1927709 2061463 2066103 2162081 2327632 2236822 2305742 2392759 2446121
4239B446121q923P4312k5805O629J32336J61757n8533o9605q2793J11782J03451
$$ 2446121 2437198 2511510 2485705 2492334 2624670 2786427 2727894 2658289 2575496 2687278 2790729
4228B790729K0590m3326L086J0605K0373r4881K0628K25979J48923o4051j37188
$$ 2790729 2811319 2767993 2771079 2781684 2802057 2707176 2727804 2953783 3102706 3038655 2901467
4217B901467J03408K19526J77776N860j37771o4383J22084J39182J53178J11438
$$ 2901467 3004875 3224401 3402177 3408037 3270266 3205883 3327967 3467149 3620327 3731765
4207C731765R8989J27432K06915O7694J19488K19548L41359L21835Q7717J21251
$$ 3731765 3830754 3958186 4165101 4232795 4352283 4571831 4913190 5235025 5322742 5443993
4197E443993J83869J61777K00550J96516K28567J53597K40526K84608J21352L33539
$$ 5443993 5627862 5789639 5990189 6186705 6415272 6568869 6809395 7094003 7215355 7548894
4187G548894L07790M69107L79941L55626L39212L10652O12795N83489O04626O57536
$$ 7548894 7856684 8325791 8705732 9061358 9400570 9711222 10324017 10907506 11512132 12169668
4177A2169668O59358N80063P00970R6346j41876m90586m59947m67754k16784R0799
$$ 12169668 12829026 13409089 14110059 14206405 14064529 13573943 13113996 12646242 12429458 12520257
4167A2520257k17350l0700q7110k30236J57849K9122N0383J38873j8556j14116
$$ 12520257 12302907 12272207 12185097 11954861 12112710 12141832 12192215 12331088 12312532 12198416
4157A2198416P2494K00552P7368k3393K96312J72775J33390J39360M3870K23075
$$ 12198416 12270910 12471462 12548830 12525437 12821749 12994524 13127914 13267274 13311144 13534219
4147A3534219K59850L98603L15874J22589N13801M79053O09135O80521O01516
$$ 13534219 13794069 14192672 14508546 14631135 15144936 15623989 16233124 16913645 17515161
4138A7515161O54733P27549O62077R44651R44352Q82921R79287R28418R58217
$$ 17515161 18169894 18897443 19559520 20504171 21448523 22331444 23310731 24239149 25197366
4129B5197366R87702J266319J024229J108411J026224J050637J074082J184539
$$ 25197366 26185068 27451387 28475616 29584027 30610251 31660888 32734970 33919509
4121C3919509J304967J710691J630698J921847K240240K441948K710619L319011
$$ 33919509 35224476 36935167 38565865 40487712 42727952 45169900 47880519 51199530
4113E1199530L983313M722629N925898P185881Q387793J0306599J2902730J5992027
$$ 51199530 55182843 59905472 65831370 73017251 81405044 91711643 104614373 120606400
4105A20606400J9788988K4326816K8144400K9577166K7339535K0961691J1724767
$$ 120606400 140395388 164722204 192866604 222443770 249783305 270744996 282469763
4098B82469763P91225j5601604k6073860k8108231k9846623k9429936k5011359
$$ 282469763 283260988 267659384 241585524 213477293 183630670 154200734 129189375
4091A29189375j9707268j5452270j1978927r459310p703713o027361m928077m192683
$$ 129189375 109482107 94029837 82050910 72591600 64887887 58860526 53932449 49739766
4083D9739766l508886l114353k811847k407441k347798k348185j995533k051642
$$ 49739766 46230880 43116527 40304680 37897239 35549441 33201256 31205723 29154081
4075B9154081j932140j984977j759613j510683j120596j270181r46591p28249
$$ 29154081 27221941 25236964 23477351 21966668 20846072 19575891 18629300 17901051
4067A7901051q16914p87180p10413p35024n98408p24139m48301m32800m25432
$$ 17901051 17084137 16296957 15586544 14851520 14253112 13528973 13080672 12647872 12222440
4058A2222440m01838k22408l91371m64065k81004k91522k98333j83190k68767
$$ 12222440 11820602 11598194 11206823 10742758 10461754 10170232 9871899 9688709 9419942
4049I419942l15505l46303j85756l00626k75869n30724k59207j17392l01400j61662
$$ 9419942 9104437 8758134 8572378 8271752 7995883 7465159 7205952 7088560 6787160 6625498
4039F625498q6615n4870l14172j09792r390k5318q8007k64102j29856n0373qq0656
$$ 6625498 6538883 6484013 6169841 6060049 6050659 6025341 5937334 5673232 5543376 5493003 5492995 5412339
4027E412339j09381k94687j13556l22985l32391j39646j27067J8160M6048l7052
$$ 5412339 5302958 5008271 4894715 4571730 4239339 4099693 3972626 3990786 4036834 3999782
4017C999782k08583j81617O4161K0817j24509n8644j08170j67506q1414m7182
$$ 3999782 3791199 3609582 3673743 3694560 3570051 3511407 3403237 3235731 3154317 3107135
4007C107135n9763m7553j96957O2066L2130j20618m4523q4959r2552J09744K02726
$$ 3107135 3047372 2999819 2802862 2864928 2897058 2776440 2731917 2646958 2554406 2664150 2866876
3996B866876K2062L6159O9357J25159J27754Q5223j60157j94792q3464q2307o4095
$$ 2866876 2888938 2925097 2994454 3119613 3247367 3332590 3172433 2977641 2894177 2811870 2747775
3985B747775j10253m3595j52945k25860k2289j50820j96901R9705n4342j21082
$$ 2747775 2637522 2593927 2440982 2215122 2192833 2042013 1845112 1944817 1890475 1769393
3975A769393L1475J15049j42146j84262j93118P0154J36296O7642p0651K6274
$$ 1769393 1800868 1915917 1773771 1589509 1396391 1466545 1602841 1670483 1599832 1626106
3965A626106j54218j81410O9014J20177p5700R6436O4251j02977k50310r5736
$$ 1626106 1471888 1290478 1359492 1479669 1403969 1500405 1564656 1461679 1211369 1115633
3955A115633J99432K982j05965r5032L7676J7186j24118L4754O6702p1231K3459
$$ 1115633 1315065 1318047 1212082 1117050 1154726 1171912 1047794 1082548 1149250 1078019 1101478
3944A101478m0190o7407R9157Q0915O3730j32418j87421l9933N4820J2455n8003
$$ 1101478 1061288 993881 1093038 1173953 1237683 1105265 917844 877911 932731 945186 887183
3933H87183J34671k1881Q8581m2108k49686J11234O1878J36279r681O183j0579
$$ 887183 1021854 999973 1088554 1046446 796760 907994 969872 1106151 1096470 1102653 1092074
3922A092074j7767j25041o9530J62127l5154p3991J09563j93180p6409Q967k68456
$$ 1092074 1074307 949266 879736 1041863 1006709 932718 1042281 849101 772692 781659 513203
3911E13203j2711M8110R6334M1398O8312j48983j25496M4178o3529P1939R1945
$$ 513203 500492 548602 644936 686334 754646 605663 480167 524345 460816 532755 624700
3900F24700m3054o5073J60662P3231k21992r2530Q2O5521J94754k49908N2903
$$ 624700 581646 516573 677235 750466 528474 435944 436026 501547 696301 446393 499296
3889D99296o6961j24316J40958M7014l820J43717m6567p6181L5329O7464j24754
$$ 499296 432335 308019 448977 495991 492171 635888 589321 513140 548469 615933 491179
3878D91179n9934Q6507k1909n3753j28707J02220M8274P3440r2391J7160m0658
$$ 491179 431245 517752 495843 442090 313383 415603 463877 537317 444926 462086 421428
3867D21428N1147j1184l624n1949J05222l4554r7998k4582J20367M7502R393J3255
$$ 421428 472575 461391 457767 405818 511040 476486 378488 353906 474273 521775 531168 544423
3855E44423p4587J0964j73099K2871O190q1310m898P3999O0731J6056M0428j83831
$$ 544423 469836 480800 307701 330572 336762 255452 250554 324553 385284 401340 441768 257937
3843B57937P1458J52475j13895j9740J16618m9890j4813P6112o485j42285N1730
$$ 257937 329395 481870 367975 348235 464853 414963 400150 476262 469777 327492 379222
3832C79222J6406O6769j04350N4272K2321Q7430k233k13071q4594J4416J0331
$$ 379222 395628 462397 358047 412319 434640 522070 519837 306766 222172 236588 246919
3821B46919J17978J16996Q9945p1156L669Q6870O2427J16083P3612M3802P5152
$$ 246919 364897 481893 571838 500682 504351 591221 653648 769731 843343 887145 962297
3810I62297R819K03278L19371M478Q4208J04443J23354P8057l98529k24667q1011
$$ 962297 972116 1175394 1494765 1499243 1583451 1687894 1811248 1889305 1490776 1266109 1185098
3799A185098k87672j13813o4921m1149k21330J53400l1751k382r0191l3332k0983
$$ 1185098 897426 783613 718692 677543 456213 609613 577862 575480 485289 451957 430974
3788D30974j78261k5475J37614Q2309l4299j70063K9525J86054j00242Q181j11886
$$ 430974 252713 227238 364852 447161 412862 242799 272324 458378 358136 366317 254431
3777B54431j6733J9333j03460P188q6870l9163j1819O2915R0739J76425m3666
$$ 254431 237698 257031 153571 160759 73889 34726 22907 85822 176561 352986 309320
3766C09320j35730o2711q0741K00069O7172N5233k34601p8709K4330m019L2679
$$ 309320 173590 110879 30138 230207 297379 352612 118011 39302 63632 59613 92292
3755I2292N9543L0999j03139J8986m9634l9059J63211k5874j08282J01621R4478
$$ 92292 151835 182834 79695 98681 49047 9988 173199 147325 39043 140664 235142
3744B35142r3176l8613j08369J22186J21369j27491m3594J25844J5229j06637
$$ 235142 141966 103353 -5016 117170 238539 111048 67454 193298 208527 101890
3734A01890J1101n2176P5742q59J12739r4637o1952k7318q377O9441l0947N7313
$$ 101890 112991 60815 136557 135698 248437 153800 91848 64530 56153 125594 94647 151960
3722A51960J55343j03578p8228O8854Q2966N382P5572o1138P0807j98109J3536
$$ 151960 307303 203725 125497 194351 277317 282699 358271 297133 367940 169831 183367
3711A83367R0322j37483o3727J981o4497O8948j14270j17J20802m0127j97408
$$ 183367 273689 136206 72479 74460 9963 78911 -35359 -35476 85326 45199 -152209
3700a52209J41097J74512j06668j33744N5523J35074l3800R755Q5866j21775m8511
$$ -152209 -11112 163400 56732 -77012 -21489 113585 79785 89540 175406 53631 5120
3689E120L6820l745m0562N3084j33975k9475M7361J25281Q4064J3318k2411o0183
$$ 5120 41940 38195 -2367 50717 -83258 -112733 -65372 59909 143973 157291 134880 74697
3677G4697j35849J61294J6663j12832M431l7932N7797j22948J78396L9167j73685
$$ 74697 -61152 100142 116805 3973 8404 -29528 28269 -94679 83717 122884 -50801
3666e0801p3905J04303Q925O1525p3037P7800J3777j1882N4254j16649n6749K61088
$$ -50801 -124706 -20403 -11478 50047 -22990 54810 68587 56705 110959 -5690 -62439 198649
3654A98649K9482q9412o5866j0242J7428K0995j55299J87823q0733q4232p5865
$$ 198649 228131 138719 72853 62611 80039 101034 -54265 133558 52825 -31407 -107272
3643a07272O4866R3674j5471Q495K03703j68467j0760K1316Q5310r7678j160M0266
$$ -107272 -42406 51268 35797 44292 247995 79528 68768 90084 175394 77716 76556 116822
3631A16822J1276j30396J4727p925M8424m1900M5984p2653j6598N9553M9488R2846
$$ 116822 128098 -2298 12429 4504 52928 11028 57012 -15641 -32239 27314 76802 169648
3619A69648L9495r0786m9069L9077p2739R4769j61226j5224p0846K38470K1188
$$ 169648 209143 118357 69288 108365 35626 130395 -30831 -46055 -116901 121569 142757
3608A42757j18003o8323Q1031n8132O4976j5682J9722q0070M1449J45687k18624
$$ 142757 24754 -43569 37462 -20670 44306 28624 48346 -31724 9725 155412 -63212
3597f3212O3980L6377j6478N5025l2354n0465l0061J72304j17316J435L8335r7477
$$ -63212 768 37145 20667 75692 43338 -7127 -37188 135116 17800 19235 57570 -39907
3585c9907Q9259j7903N3024k1054P2660J07163j36683J40461j31403j59828Q6992
$$ -39907 49352 31449 84473 63419 136079 243242 106559 247020 115617 -44211 42781
3574D2781K7313l3464Q6374m4830P2967n1003j47993L9078J93977j35632r8983
$$ 42781 70094 36630 123004 78174 151141 100138 -47855 -8777 185200 49568 -49415
3563d9415O6490q6687O7828M4169Q7078j11910k072q1991J0568J67035k03036
$$ -49415 17075 -69612 -1784 42385 129463 17553 15481 -66510 -55942 111093 -91943
3552i1943N2181K40099m6449j59410j00385J6853J24844m5729O0336n5164l1646
$$ -91943 -39762 200337 153888 -5522 -105907 -89054 35790 -9939 50397 -4767 -36413
3541c6413j72639l479J79079J43227O2945j47675O4926r0683R6560r6751M0742
$$ -36413 -209052 -212531 -33452 109775 172720 25045 89971 -712 95848 -903 39839
3530C9839J79623J1851j59016j17493J16226l0239j2484J01124j22486Q7087P4418
$$ 39839 219462 231313 72297 -45196 71030 40791 28307 129431 6945 94032 168450
3519A68450L1049L821p6593m2053p7232J88465n8260m1687q5196L0797J39920
$$ 168450 199499 203320 126727 84674 7442 195907 137647 95960 10764 41561 181481
3508A81481J11627n6455q9402p9201j7510o7634p7586p4698R8441J72324r4373
$$ 181481 293108 236653 147251 68050 50540 -17094 -94680 -169378 -70937 101387 7014
3497G014O2784K29200j82901j21997J51277O6822j1642J00064m8675q248m6187
$$ 7014 69798 298998 116097 -5900 145377 212199 200557 300621 251946 243698 197511
3486A97511M3485j31112k6102K6371K0657l1084J00006O403j88762J10680Q2254
$$ 197511 240996 109884 83782 110153 130810 99726 199732 206135 17373 128053 210307
3475B10307k2700L9058O2781M2134q9380K2243K36498m8890q2333k0863m6235
$$ 210307 187607 226665 289446 331580 242200 264443 500941 452051 369718 348855 302620
3464C02620j17573P7467l1173K8857m3046M7229K50073J25499M6379O3756R2483
$$ 302620 185047 262514 231341 260198 217152 264381 514454 639953 686332 750088 842571
3453H42571Q6044n929J54818Q6270J98287k03460q4600q5043P9723n0475q2512
$$ 842571 928615 922686 1077504 1163774 1362061 1158601 1074001 988958 1068681 1018206 935694
3442I35694j40610r3424k1364j2093M6007j23200J09486j3136K8605N4820j2961
$$ 935694 795084 701660 680296 668203 714210 591010 700496 687360 715965 770785 757824
3431G57824j36373M3818L7977N652K79476K76858J5957j19566O3781K68500Q9551
$$ 757824 621451 665269 703246 708898 988374 1265232 1281189 1161623 1225404 1493904 1583455
3420A583455J66336J99722K74935K83283l69163k01628j05182k37050k1469k04083
$$ 1583455 1749791 1949513 2224448 2507731 2138568 1936940 1831758 1594708 1573239 1369156
3410A369156l34082j26924k43444j8119J1115J7247q0410p1613P0745j0627Q0218
$$ 1369156 1035074 908150 664706 646587 657702 674949 594539 522926 593671 583044 663262
3399F63262p9700m662M2275O8810M468j68456J08192J00874K19603J04266j05756
$$ 663262 583562 578900 621175 689985 694453 525997 634189 735063 954666 1058932 953176
3388I53176O0553J8058j50286k0549Q2871l4329N8884n6104o4699k19998O3279
$$ 953176 1013729 1031787 881501 860952 943823 909494 968378 912274 847575 627577 690856
3377F90856j8436l33042j4233J8700K3639J84209j29733j15658k5981J4896O9750
$$ 690856 672420 339378 325145 343845 367484 551693 421960 306302 280321 295217 364967
3366C64967p9165P2228q4940j49606o6193j32483N5681Q3004k3697L5708J04863
$$ 364967 285802 358030 273090 123484 57291 -75192 -19511 63493 39796 75504 180367
3355A80367N1897K2442n79M6802L5472j63830j60025m0047Q9969o6650P9289K8840
$$ 180367 232264 254706 254127 300929 336401 172571 12546 -27501 62468 -4182 75107 103947
3343A03947k578m9826j34183k8756J08175J02231k5345J43199J12890j64882j13401
$$ 103947 101369 51543 -82640 -111396 -3221 99010 73665 216864 329754 164872 51471
3332E1471P0388j01479J36018J8925O9750j09140j362o3287K02376J03828j58981
$$ 51471 121859 20380 156398 175323 245073 135933 134571 71284 273660 377488 218507
3321B18507r5223l0886j09693R0502R0498r1377O0836K665K0656O7018J4510k936
$$ 218507 123284 92398 -17295 73207 163705 72328 133164 135829 156485 223503 238013 235077
3309B35077P1504j4508n9509Q353L0814L6096k8037j5010p0863m4236p7748R954
$$ 235077 306581 292073 232564 240917 271731 307827 279790 264780 193917 149681 71933 81887
3297H1887P9689p4787K73140L8234j8216K5948k8492j75847J2253K7172J08859
$$ 81887 161576 86789 359929 398163 379947 405895 377403 201556 213809 240981 349840
3286C49840J35485n0913J9136n5403J8096j21586L731J6091R0704L4721P2427
$$ 349840 485325 434412 453548 398145 416241 294655 298386 314477 405181 439902 512329
3275E12329J42075q7282j67984L857O6025q1146K5500k4809J45270P814J99210
$$ 512329 654404 567122 399138 402995 469020 387874 413374 388565 533835 541649 740859
3264G40859l0376Q6022J18077l6023K0445n6812J21832J00615L6384M4474J61257
$$ 740859 710483 796505 914582 878559 899004 842192 964024 1064639 1101023 1145497 1306754
3253A306754j3703P0901l02293r6470L0004q790J21625j15845j71181j61616J60462
$$ 1306754 1293051 1363952 1061659 965189 995193 986403 1108028 992183 821002 659386 819848
3242H19848J9333k74315k7088K48764l6488j64726j926Q9485n3612o9093K15493
$$ 819848 839181 564866 537778 786542 750054 585328 583402 672887 619275 550182 765675
3231G65675Q3176q0251n4407M5397q5373j21046j2546m4710n7856k38539l6554
$$ 765675 848851 768600 714193 759590 674217 553171 540625 495915 438059 199520 162966
3220A62966n756j8597J36680j06024q894j372J44136O2014l1172K7635j5557k8793
$$ 162966 157210 138613 275293 169269 160375 159003 303139 365153 333981 361616 346059 317266
3208C17266p7212J26308q3964n6745J10585Q7432j39582j01976R3817j03175P0009
$$ 317266 240054 366362 282398 225653 336238 423670 284088 182112 275929 172754 242763
3197B42763J86619j38049j9420o1409j03873N2011q079l8324R9983o7349o468
$$ 242763 429382 291333 271913 210504 106631 158642 150563 112239 212222 144873 138405
3186A38405o0578n1750P2977o4161K6001p8191j0236J50820P0457o356n985K8572
$$ 138405 77827 26077 99054 34893 60894 -17297 -27533 123287 193744 187388 181403 209975
3174B09975k1998j67353J7220q669q7124n2175Q9290n8961m413J72811p7692j31870
$$ 209975 187977 20624 37844 29175 -57949 -110124 -20834 -79795 -84208 88603 10911 -120959
3162a20959j11470M6123l3881K27094J58690k5935n5701j97657K18184k841o6577
$$ -120959 -232429 -186306 -220187 6907 165597 139662 83961 -113696 104488 101647 35070
3151C5070m5239L6160m4937P3805m3760q5373l0292O0448r4300K4543L1507j4284
$$ 35070 -10169 25991 -18946 54859 11099 -74274 -104566 -44118 -138418 -113875 -82368 -96652
3139i6652M6109L0106Q1231j72438J5663o597K97190k0107l1934Q9382r4535q6768
$$ -96652 -50543 -20437 60794 -111644 -95981 -102578 194612 174505 142571 231953 137418 50650
3127E0650K9671p1295l5975J07286L0889l6481J00961j05034j81585j65190j5919
$$ 50650 80321 9026 -26949 80337 111226 74745 175706 70672 -110913 -276103 -292022
3116b92022J32943J28162R8306N3429j68533J22230p0662j06938Q5046k47m7350
$$ -292022 -159079 -30917 67389 120818 -47715 74515 3853 -103085 -18039 -18286 -65636
3105f5636L7527k5471p7423k2849J8961N8637n3501M9181j8962J17051N2055j57
$$ -65636 -28109 -53580 -131003 -153852 -134891 -76254 -129755 -80574 -99536 17515 69570 69413
3093F9413q0509j50479L8883R2672m2385P1167N7672L655J0978k6428k2457P8689
$$ 69413 -11096 -161575 -122692 -30020 -72405 -1238 56434 60089 71067 44639 22182 100871
3081A00871M141j37684j08259J43344J00842j43191Q078p730j11090n6957P6610
$$ 100871 105012 -32672 -140931 2413 103255 -39936 -31858 -39588 -150678 -207635 -131025
3070a31025J72425l1316n6797N3457j00194K4333K0234N0888O0382q5227p742
$$ -131025 41400 10084 -46713 6744 -93450 -69117 -48883 2005 62387 -22840 -30582
3059c0582k7294j16147q7781J86267j20751O3626J10020q866Q0222J08176L1366
$$ -30582 -57876 -174023 -261804 -75537 -196288 -132662 -22642 -31508 48714 156890 188256
3048A88256k12312J4538J81765j72089j27524m8554R1739J65950J2883K0489p6222
$$ 188256 -24056 -9518 172247 158 -127366 -175920 -84181 81769 94652 115141 38919
3037C8919j76277J4614R3654R3903j44951o1854P8888j83321Q4303J50724m366
$$ 38919 -137358 -122744 -29090 64813 -80138 -141992 -63104 -246425 -162122 -11398 -15764
3026a5764n849p8347N5502R3919k702r1126L6268p6315J34041o6151j09673r0036
$$ -15764 -21613 -99960 -44458 49461 46759 -44367 -8099 -84414 49627 -16524 -126197 -216233
3014b16233J87006q5097K1513L8599M318k4625j9570J57789l0504m3242p5671
$$ -216233 -29227 -114324 -92811 -54212 -49894 -74519 -94089 63700 33196 -10046 -85717
3003h5717j04837J08601m5133R2813J32915j20512K9505P6906L828k22432R3099
$$ -85717 -190554 -81953 -127086 -34273 98642 -21870 7635 84541 88369 -134063 -40964
2992d0964j07326J67111j49438K4157l8575J45464J06682j17859O5668J00202
$$ -40964 -148290 18821 -130617 -106460 -145035 429 107111 -10748 54920 155122
2982A55122j00588m2925o3055J16384j777j4328M5772q7652m847k3609J1882m8410
$$ 155122 54534 11609 -51446 64938 63161 48833 94605 6953 2106 -21503 -9621 -58031
2970e8031J16285L8335N9983O6427o1061k30767J970J4003J58662l5564L8288
$$ -58031 58254 96589 156572 222999 161938 -68829 -66859 -52856 105806 70242 108530
2959A08530J31264o2901m2845q1662l0248p7279J20456L766o5280M2429K8394
$$ 108530 239794 176893 134048 52386 22138 -55141 65315 69081 3801 46230 74624
2948G4624P4929O799l2450j1289m0291L3048J94771j34406o3840K3752L1539J53453
$$ 74624 149553 156352 123902 112613 72322 105370 300141 165735 101895 125647 157186 310639
2936C10639m1163K34839M5283p4352o8991N5245j32431n0478n4614Q8255n9589
$$ 310639 269476 504315 549598 475246 406255 461500 329069 278591 223977 312232 252643
2925B52643n998o3661p157R8128J75105k0181n3389k8367o4384M898k2972J3979
$$ 252643 246645 182984 175827 273955 449060 428879 375490 347123 282739 287637 264665 278644
2913B78644M5417J22109R044k6851o9789J3185J48942J75264O8250P499j76170
$$ 278644 324061 446170 455214 428363 358574 371759 520701 695965 764215 771714 595544
2902E95544j10924O6115j4839n8013j2075p0844p9702J9701n1070J0403K26863
$$ 595544 484620 550735 535896 477883 465808 394964 315262 334963 283893 294296 521159
2891E21159k21642n8147J27438j716p524p4098k3394J9094m9874r727K6421J27403
$$ 521159 299517 241370 368808 367092 359568 285470 262076 281170 231296 221569 247990 375393
2879C75393L7362j70713q6512N8550O2266R4697p7976J805l871K9416k195p8132
$$ 375393 412755 242042 155530 214080 276346 371043 293067 294872 291001 320417 318222 240090
2867B40090j38982p2245l1260J66614J2309k13285J93881K6422q2441l2876k2349
$$ 240090 101108 28863 -2397 164217 176526 -36759 157122 183544 101103 68227 45878
2856D5878J39891J10897k37863K4192o1100j6363J49684l07091j0737L5232J04192
$$ 45878 185769 296666 58803 82995 21895 5532 155216 -151875 -162612 -127380 -23188
2845b3188J03616j38809P8314r8740j44115J25241k42671K17514J62678l1579
$$ -23188 80428 -58381 19933 -78807 -222922 -97681 -340352 -122838 39840 8261
2835H261J8161r476J8431k016j60234R7547O4764j44230O8201N6909m5882p0809
$$ 8261 26422 16946 35377 33361 -126873 -29326 35438 -108792 -40591 16318 -29564 -100373
2823a00373o666N7532k4795L8806Q0463l455j36592Q3626N5875R0794K9974k16571
$$ -100373 -107039 -49507 -74302 -35496 44967 41512 -95080 -11454 44421 135215 165189 -51382
2811e1382K4840J1434k0942J68673p2963P4566o1883j27863N3674N6774m8073
$$ -51382 -26542 -15108 -36050 132623 59660 134226 72343 -55520 -1846 54928 6855
2800F855k04469J8080P5481K1476m2983P8994p5080L0257N1237m3140r9368J7151
$$ 6855 -197614 -179534 -104053 -82577 -125560 -46566 -121646 -91389 -40152 -83292 -182660 -165509
2788a65509M2291K593M2936L5438m4342K4454n755j1762J6806n1609k3235J35210
$$ -165509 -123218 -120625 -77689 -42251 -86593 -62139 -67894 -79656 -62850 -114459 -137694 -2484
2776b484J67411o5907k5479Q3721j30587j02406l9013Q8455j23218L1207P4435
$$ -2484 164927 99020 73541 157262 26675 -75731 -114744 -26289 -149507 -118300 -43865
2765d3865N7492l9531p6046J2645M7335q3117o3882l3205M5138N6578o7901J8954
$$ -43865 13627 -25904 -101950 -89305 -41970 -125087 -188969 -222174 -177036 -120458 -188359 -169405
2753a69405J1555j361O7164N359o7097Q0270Q0562n9918n2039o702l8375J4138
$$ -169405 -157850 -159211 -92047 -86688 -153785 -73515 7047 -52871 -104910 -111612 -149987 -135849
2741a35849m0353K7692J5770l1660J08146j2562q3345o85p6685J186J09196J00008
$$ -135849 -176202 -148510 -132740 -164400 -56254 -68816 -152161 -152846 -229531 -228345 -119149 -19141
2729a9141j72867m9827J44686m4177J59517L9344p7222o3779j99086R9324P0058
$$ -19141 -192008 -241835 -97149 -141326 18191 57535 -19687 -83466 -282552 -183228 -113170
2718a13170m026r0339J09188N307o9660J05585n2063J35274N5197j08249k3000
$$ -113170 -117196 -207535 -98347 -93040 -162700 -57115 -109178 26096 81293 -26956 -49956
2707d9956l8580J832K02458j29731K6229J3949p9516J0017j13869j3940J20013
$$ -49956 -88536 -86704 115754 -13977 12252 26201 -53315 -43298 -157167 -171107 -51094
2696e1094j9803N8132k545J27029j43322r3116K2772L1461J29172K0252m3747
$$ -51094 -70897 -12765 -15310 111719 -31603 -124719 -101947 -70486 58686 78938 35191
2685C5191R459r2727R1317q9152k57475P3848M2459L9464P8075N6488r0453K8180
$$ 35191 44650 -48077 43240 -45912 -303387 -229539 -187080 -147616 -69541 -13053 -103506 -75326
2673g5326J8806o7508j22188O9646n7047O7441J01597j0465j04651j31478J93203
$$ -75326 -56520 -124028 -246216 -176570 -233617 -166176 -64579 -75044 -179695 -311173 -117970
2662a17970o9805L5464J28590N2096N0405j30720N593L5380o9196O6902j291o1558
$$ -117970 -187775 -152311 -23721 28375 78780 -51940 -46347 -10967 -80163 -13261 -14552 -76110
2650g6110q6759j40348M1030O8702J44349n11P3611r1940M3186J64144q8138l15967
$$ -76110 -162869 -303217 -262187 -193485 -49136 -49647 23964 -67976 -24790 139354 51216 -264751
2638b64751l9847O8043O9938O723J67764K720k10428l2728N0409J30646J8304
$$ -264751 -304598 -236555 -166617 -159894 7870 10590 -199838 -232566 -182157 -51511 -33207
2627c3207o5856J38163m3003j27908J72029m4929j21635P9366J26169q7238r6104
$$ -33207 -99063 39100 -3903 -131811 40218 -4711 -126346 -46980 79189 -8049 -104153
2616a04153N2257j31534J00640j5609J09352J07654j23059l867p9281j17573J22874
$$ -104153 -51896 -183430 -82790 -98399 10953 118607 -4452 -8319 -87600 -205173 -82299
2605h2299J07472J8909n445M8197l9364J11114j78885l0454N7564j09643N7684
$$ -82299 25173 44082 38637 86834 47470 158584 -20301 -50755 6809 -102834 -45150
2594d5150N0307j80877Q8051J00506p0826Q1841j44687j12525J61008J56768l0185
$$ -45150 5157 -175720 -87669 12837 -57989 23852 -120835 -233360 -72352 84416 54231
2583E4231j19795j27572L4176p907l6455M5763J63886N1613j78930l9589j6108
$$ 54231 -65564 -193136 -158960 -166867 -203322 -157559 6327 57940 -120990 -160579 -176687
2572a76687L1196O4770J8009N8392q1004q8630r4298J58079m385K5813J1450Q30
$$ -176687 -145491 -80721 -62712 -4320 -85324 -173954 -268252 -110173 -114558 -88745 -77295 -76465
2560g6465Q8295p7211P0216Q2701k0465q0891K6480o1989O4312q4655q5762J70403
$$ -76465 11830 -65381 4835 87536 67071 -13820 12660 -49329 14983 -69672 -155434 14969
2548A4969n6560R8615L0009j21951R204J8022j07597K29654q6094r492L7308K8233
$$ 14969 -41591 57024 87033 -34918 -25714 -7692 -115289 114365 28271 18779 56087 84320
2536H4320j85343R871r7134L8116J54087q7858L5092J8816M4035J53139j47603
$$ 84320 -101023 -91152 -188286 -150170 3917 -83941 -48849 -30033 14002 167141 19538
2525A9538l0180j46060K3141J26645n15l8086N9422n374j72193P3361P7558N7186
$$ 19538 -10642 -156702 -133561 -6916 -7431 -45517 13905 8531 -163662 -90301 -12743 44443
2513D4443J0731k7473j13742J3308J75090r6364j05550j44224J62328J09238J67522
$$ 44443 55174 27701 -86041 -72733 102357 5993 -99557 -243781 -81453 27785 195307
2502A95307j27043l06824J83072k8957L5465k2376O1621J13632k7935j20654o2035
$$ 195307 68264 -238560 -55488 -84445 -48980 -71356 -9735 103897 75962 -44692 -106727
2491a06727J32112J5128n1634p856j02983L3493P46K095J08088m9518O2553k8081
$$ -106727 25385 40513 -11121 -18977 -121960 -88467 -87721 -85626 22462 -27056 35497 7416
2479G416j48092J23179J16416p6201P3675O4843p3098p4082p4871N316j84788
$$ 7416 -140676 -17497 98919 22718 96393 161236 88138 14056 -60815 -55499 -240287
2468b40287J17747j05493J22206J85545L2619j43775J8713j02687r9745M1560
$$ -240287 -122540 -228033 -105827 79718 112337 -31438 -12725 -115412 -215157 -173597
2458a73597L1355r453J28024M2612K0388M6549L5335r8988P443J2107O8620m4129
$$ -173597 -142242 -151695 -23671 18941 39329 85878 121213 22225 29668 41775 110395 66266
2446F6266o6963R3920p025J38244j71529j71225l7770J9978M6124Q2981R4293
$$ 66266 -697 93223 86198 224442 52913 -118312 -156082 -136104 -89980 -6999 87294
2435H7294j07454R5405j698N664J2053j58311l908J9836M5541k2783J0686j37857
$$ 87294 -20160 75245 73547 79211 91264 -67047 -70955 -51119 -5578 -28361 -17675 -155532
2423a55532J50956n936j24056J18323J2187J3908J5640L5463k3468j16104j0722
$$ -155532 -4576 -10512 -134568 -16245 -4058 9850 25490 60953 37485 -78619 -89341
2412h9341J26037o9523n9629N1023l4824p119O1279j8742O5890l3782n6089P5968
$$ -89341 36696 -32827 -92456 -41433 -76257 -83376 -22097 -40839 25051 -8731 -64820 11148
2400A1148O8645k8778L3636j26529j02063J45250p8406Q654J41481Q101q2303
$$ 11148 79793 51015 84651 -41878 -143941 1309 -77097 -68443 73038 81139 -1164
2389a164j7802q23M5207M8413J1553j16123N2100R0977j42565L8260K12670L488
$$ -1164 -18966 -19789 25418 73831 85384 -30739 21361 112338 -30227 8033 220703 224191
2377B24191N8710q1849N9909J54509o691j7372P8101J448L2102L027j73931j41051
$$ 224191 282901 201052 260961 415470 408779 391407 469508 470956 503058 506085 332154 191103
2365A91103n486k6447N413K5231K1762K5055q7909k06461K2992J54604m7520m7561
$$ 191103 185617 159170 164583 189814 211576 236631 148722 -57739 -34747 119857 72337 24776
2353B4776k4059M8995r2259J29089J29403j37198M7318l7445P472p9748j883J53154
$$ 24776 717 49712 -42547 86542 215945 78747 126065 88620 96092 16344 14461 167615
2341A67615J49977L7354p3528n6112j44519o2530R389O0193m602K65052J47725
$$ 167615 317592 354946 281418 225306 80787 18257 27646 87839 83237 348289 496014
2330D96014j14989j06128r5563J977o3992j03497k6334M0137q0605l380m1909
$$ 496014 381025 274897 179334 181311 117319 13822 -12512 27625 -52980 -56360 -98269
2319i8269o8257O8625m334J24937Q0717R1512p9394o6987J9255p8925J43701q5623
$$ -98269 -166526 -97901 -102235 22702 103419 194931 115537 48550 67805 -11120 132581 46958
2307D6958k4849K7456O8107N7129k55768j2205J38925J00231n775o3451j7793
$$ 46958 22109 49565 117672 174801 -80967 -93172 45753 145984 140209 76758 58965
2296E8965k5044J95601R052k70692j31060j24535J10091J73404K6193j37703R5144
$$ 58965 33921 229522 238574 -32118 -163178 -287713 -177622 -4218 21975 -115728 -20584
2285b0584K6350L3600o7617r4438K25251M5052j75811n6737L70209o0713k87034
$$ -20584 5766 39366 -28251 -122689 102562 147614 -28197 -84934 285275 224562 -62472
2274f2472J76628J1986j57600N6360p3240j56682J59728J49870j9212N4256Q1247
$$ -62472 114156 126142 -31458 24902 -48338 -205020 -45292 104578 85366 139622 220869
2263B20869L3384k3266n9893R1593j417l0809o5120l8431J72326K165j43907L871
$$ 220869 254253 230987 171094 262687 261270 230461 165341 126910 299236 301401 157494 161365
2251A61365J05689M1840n9046J7147N6398o0799o2386K7525N5727J2015J6501
$$ 161365 267054 308894 249848 266995 323393 262594 200208 227733 283460 295475 311976
2240C11976L9801p226P4226j24538J20635M3548j12613O0709L5524q8139j55794
$$ 311976 351777 344551 418777 294239 414874 458422 345809 406518 442042 353903 198109
2229A98109J60146r3978k4426J01073J6225J68373r5754r8416q7185q0174J07936
$$ 198109 358255 264277 239851 340924 357149 525522 429768 331352 244167 163993 271929
2218B71929K2288J04701j17149L2613K349M4696L923J68996J2510m9246n4105
$$ 271929 294217 398918 281769 314382 316731 361427 365350 534346 546856 497610 443505
2207D43505J7898j5266J77818N3761R390n8841l1579K3484R9146R7188R6505j11779
$$ 443505 461403 446137 623955 677716 687106 628265 596686 620170 719316 816504 913009 801230
2195H01230j47319Q2006K11695j2676n4931j0224o8373j06681J12208K66808P8526
$$ 801230 653911 735917 947612 934936 880005 869781 801408 694727 806935 1073743 1152269
2184A152269R9039q1271j4193J74233m9030m5224J18852O8415J15950m1808J51428
$$ 1152269 1251308 1170037 1155844 1330077 1281047 1235823 1354675 1423090 1539040 1497232 1648660
2173A648660l6982L3805q5506Q2116M6981j07022J30406J86311L9428M5446j3120
$$ 1648660 1611678 1645483 1559977 1642093 1689074 1582052 1712458 1898769 1938197 1983643 1970523
2162A970523L6337m5230J05996L1342J1764n0875J12392J03697K29310q2015Q1872
$$ 1970523 2006860 1961630 2067626 2098968 2110732 2059857 2172249 2275946 2505256 2423241 2505113
2151B505113R1797K23139K5315J26207K49197J9626J16586N5343K37769J74827
$$ 2505113 2596910 2820049 2845364 2971571 3220768 3240394 3356980 3412323 3650092 3824919
2141C824919K82275L00130J03405K35368O1848K23457K31046J46273J86876M19529
$$ 3824919 4107194 4407324 4510729 4746097 4807945 5031402 5262448 5408721 5595597 6015126
2131F015126K29240K98815K27608K55113L21360L39884L02488N24023N07926N57013
$$ 6015126 6244366 6543181 6770789 7025902 7347262 7687146 7989634 8513657 9021583 9578596
2121I578596Q17257R32076P86631P46944N85537Q56722J264266J713866K153087
$$ 9578596 10395853 11327929 12114560 12861504 13447041 14303763 15568029 17281895 19434982
2112A9434982K773091K804575L409769M654454P380647R942837J2923889J3141030
$$ 19434982 22208073 25012648 28422417 33076871 40457518 50400355 63324244 76465274
2104G6465274P621693j168093j5072887j5258333j0866380p790415n247041m243177
$$ 76465274 84086967 82918874 67845987 52587654 41721274 33930859 28683818 24440641
2096B4440641l332230k689129k019733j639142j103506o88935n76120m74655o94964
$$ 24440641 21108411 18419282 16399549 14760407 13656901 12967966 12391846 11917191 11222227
2087A1222227r44734q59394q07238n52611o23105n55254n56547m16560m81838
$$ 11222227 10277493 9418099 8610861 8058250 7435145 6879891 6323344 5906784 5424946
2078E424946l47283l37673l43887k20766n3669k04226q2535k94749r6878j33736
$$ 5424946 5077663 4739990 4396103 4175337 4121668 3917442 3834907 3540158 3443280 3309544
2068C309544j01108k72463k1228r0099j39332l5276N2559k43366p744r965o4133
$$ 3309544 3208436 2935973 2914745 2824646 2685314 2650038 2702597 2459231 2451487 2441522 2377389
2057B377389p3497k57903l0786j76653l5919m9673j54009J25178j26621j17786
$$ 2377389 2303892 2045989 2015203 1838550 1802631 1752958 1598949 1724127 1597506 1479720
2047A479720j25446K8813M4645p467k15343J04047k783l5072o9808j15327J50773
$$ 1479720 1354274 1383087 1427732 1420265 1204922 1308969 1306186 1271114 1201306 1085979 1236752
2036A236752k0072P2446k9770j88729j0867K3350q6128O1820j84111r4973j0246
$$ 1236752 1216680 1289126 1259356 1070627 1059760 1083110 996982 1058802 874691 779718 769472
2025G69472j5526J6491K8160j74020N901J26748M715l2261l5243M1718K1887j92387
$$ 769472 753946 770437 798597 624577 630478 757226 761941 729680 694437 736155 758042 565655
2013E65655K7755N0948J3855m6077p0245M913o735K1700J82917l7346r6600r0073
$$ 565655 593410 644358 658213 612136 541891 546804 540069 561769 744686 707340 610740 520667
2001E20667q1860J38441j24963j84011J33050R1063r9877l6442J23607J25576
$$ 520667 438807 577248 452285 268274 401324 492387 392510 356068 479675 605251
1991F05251j09264n6327l5225J27296j1386j67919j98040N2035K1093j30107R1420
$$ 605251 495987 439660 404435 531731 520345 352426 154386 206421 227514 97407 188827
1980A88827J07798L3233o4894K1647o7034n5485P599P8086k9268O8200R92o1095
$$ 188827 296625 329858 264964 286611 219577 164092 171691 249777 220509 288709 289701 228606
1968B28606J9848Q062J2039J6996K119o3066N3897P3327k193n5098r4630p218
$$ 228606 248454 256516 268555 285551 287670 224604 278501 351828 349635 294537 199907 192689
1956A92689O3795l622p9130k4572K129p8650J9280J13062J66047p5062K0650j69973
$$ 192689 256484 252862 173732 149160 151289 72639 91919 204981 371028 295966 316616 146643
1944A46643r60O8549k6154o6015o2472J16226J55063j23072K2013J06539l499
$$ 146643 145683 214232 188078 122063 59591 175817 330880 207808 229821 336360 332861
1933C32861m4573k05096j35314Q8032J14733J58349M2778j98282O12N8733m1100
$$ 332861 288288 83192 -52122 35910 150643 308992 351770 153488 154100 212833 171733
1922A71733j40197J5252Q2997o2235n8508J08178J06465r7856j74773K07072o56
$$ 171733 31536 46788 129785 67550 9042 117220 223685 125829 -48944 158128 157472
1911A57472m6388p5275L3656m2810j26497J72363m2803J3775J26799l4577J5002
$$ 157472 111084 35809 69465 26655 -99842 72521 29718 43493 170292 135715 150717
1900A50717k5713j45820L7333J24796P9886j34840j32927P8028O7599M5325L5959
$$ 150717 125004 -20816 16517 141313 221199 86359 -46568 31460 99059 144384 180343
1889A80343n8481r1607L7662J74196k10892j37575M8896M1874J37966Q94j00055
$$ 180343 121862 30255 67917 242113 31221 -106354 -57458 -15584 122382 123276 23221
1878B3221m9473l0943J10934P8126K4101m2227j64584j02758P0425J19248n5889
$$ 23221 -26252 -57195 53739 131865 155966 113739 -50845 -153603 -83178 36070 -19819
1867a9819m7323M1003j00202l7790q562J03256J47873j03497J15182J32391M9060
$$ -19819 -67142 -26139 -126341 -164131 -172693 -69437 78436 -25061 90121 222512 271572
1856B71572n6998j22980k7301o3031q0466J7542M9929K37160j14793R2584j06002
$$ 271572 214574 91594 64293 1262 -79204 -61662 -11733 225427 110634 203218 97216
1845I7216k2259l0945J0432Q7344O1364j15290K3071J87645L1100p828O1290J14492
$$ 97216 74957 44012 54444 141788 203152 87862 110933 298578 329678 321850 383140 497632
1833D97632j48721o9423j88707L3858q7977n6708Q0103m0135N6688n5714l5460
$$ 497632 348911 279488 90781 124639 36662 -20046 60057 19922 76610 20896 -14564
1822a4564O681k8263J5598J25602r422k46425L411O1973k815j19336J21558K24744
$$ -14564 -7883 -36146 -20548 105054 95632 -150793 -147382 -85409 -88224 -207560 -86002 138742
1810A38742o4034j63151M8384L3896J10908J34317o9447j77766M7839K5327Q036
$$ 138742 74708 -88443 -40059 -6163 104745 239062 169615 -8151 39688 65015 73051
1799G3051j10869J21671R7785k7132j19363j01756L6449q4347N5069J95183j9432
$$ 73051 -37818 83853 181638 154506 35143 -66613 -30164 -114511 -59442 135741 116309
1788A16309q2135j31312n5014m6001R3979J23913N9271P5616p4588p1897l2852
$$ 116309 34174 -97138 -152152 -198153 -104174 19739 79010 154626 80038 8141 -24711
1777b4711O573M0388q3432l9671l5319J11332J54266k21749k8044j27928R0429
$$ -24711 -18138 22250 -61182 -100853 -136172 -24840 129426 -92323 -120367 -248295 -157866
1766a57866J03500l4940n3313k1317M4740J19116l0254p8266l5249j1725O6141
$$ -157866 -54366 -89306 -142619 -163936 -119196 -80 -30334 -108600 -143849 -155574 -89433
1755h9433k42073N5082K78298M3043P633k57075J02845J30685q8297m5828J48588
$$ -89433 -331506 -276424 1874 44917 52550 -204525 -101680 29005 -59292 -105120 43468
1744D3468K3777j03605R5491j25148m2446J15413n1337N1837J32603j19404j24797
$$ 43468 67245 -36360 59131 -66017 -108463 6950 -44387 7450 140053 20649 -104148
1733a04148j29402J23753J12659j41900j5528O0922M775p8058J72984J08140j4618
$$ -104148 -233550 -109797 2862 -139038 -154566 -93644 -88869 -166927 6057 114197 99579
1722I9579k14623q504p659N2864N4086j500M5016j32556n428R8849J3668M6925
$$ 99579 -115044 -123548 -131207 -78343 -24257 -25757 19259 -113297 -118725 -19876 -6208 40717
1710D0717k43139M1284J17262n2831o9841P5349J46491M0799l1141q3220l5057
$$ 40717 -202422 -161138 -43876 -96707 -166548 -91199 55292 96091 64950 -18270 -53327
1699e3327R8013J27660k66373J6968O4456J51072K7991j65024j16544J06125k28550
$$ -53327 44686 172346 -94027 -77059 -12603 138469 166460 1436 -115108 -8983 -237533
1688b37533j13314R5497K5408j1706K13468O073m4119M3873p0586N035j9327J01906
$$ -237533 -350847 -255350 -229942 -241648 -28180 -22107 -66226 -22353 -92939 -87904 -107231 -5325
1676e325J00924P0234p3061j23924n5429O2654K4676J0375J7578l8376M8883o9453
$$ -5325 95599 165833 92772 -31152 -86581 -23927 749 11124 28702 -9674 39209 -30244
1664c0244O5791j86621o8966J29223q821p5401J17041J8217J5542J3264j31588
$$ -30244 35547 -151074 -220040 -90817 -99638 -175039 -57998 -39781 -24239 -10975 -142563
1653a42563P9560J60924K9003l9245J778j31072m4762J25288p8501j69891K01120
$$ -142563 -63003 97921 126924 87679 89457 -41615 -86377 38911 -39590 -209481 -8361
1642h361q7946J6386J43761q806j03033p6236k5312k8520K1471J0632L1810O7308
$$ -8361 -96307 -79921 63840 55034 -47999 -124235 -149547 -178067 -156596 -145964 -114154 -46846
1630d6846R0957j69807p6389M5877J0551J72703M0361K2573J8685j06781j22798
$$ -46846 44111 -125696 -202085 -156208 -145657 27046 67407 89980 108665 1884 -120914
1619a20914l4548J11826J26505O694r2854k7690p6094p1149K231J00826J1094
$$ -120914 -155462 -43636 82869 89563 -3291 -30981 -107075 -178224 -175993 -75167 -64073
1608f4073l8032j6610J37239l4694l6845N5998K3611o7119q6543K4679J43062
$$ -64073 -102105 -118715 18524 -16170 -53015 2983 26594 -40525 -127068 -102389 40673
1597D0673j51084o144R003j13961J86384N1110k6919J19632J5659k3488J5773
$$ 40673 -110411 -116555 -107552 -221513 -35129 15981 -10938 108694 124353 100865 116638
1586A16638j19700k1858J45275J8125j52185j84196j2754J25928j4529L779O105
$$ 116638 -3062 -24920 120355 138480 -13705 -197901 -210655 -84727 -99256 -95477 -89372
1575h9372q7725n590L6382n70P3271n114L6238k0001L6483j96849J56795p0328
$$ -89372 -177097 -182687 -146305 -146875 -73604 -78718 -42480 -62481 -25998 -222847 -66052 -136380
1563a36380r4652J0327m5900J17165K23454r1484m9227j91951k3688P8753Q9699
$$ -136380 -231032 -220705 -266605 -149440 74014 -17470 -66697 -258648 -282336 -203583 -113884
1552a13884j01547O1154K01265p1296r5992K06382K7727p9485q7959L059M1271
$$ -113884 -215431 -154277 46988 -24308 -120300 86082 113809 34324 -53635 -50576 -9305
1541i305q8179O4511O516K9955M7033l9704J6916k3347r9590n9320l1335K4978
$$ -9305 -97484 -32973 -26457 3498 50531 10827 27743 4396 -95194 -154514 -185849 -160871
1529a60871N1471J04927J563J6630R0090j00209j25821J05980J46436j20062n7619
$$ -160871 -109400 -4473 -2910 13720 103810 3601 -122220 -16240 130196 10134 -47485
1518d7485L6425M0818K5362j79186k7064k399N144r1997L09127m9738l7409o0358
$$ -47485 -11060 29758 55120 -124066 -151130 -153529 -148385 -240382 68745 19007 -18402 -78760
1506g8760P218J07858k05651j3041J97367j34068J58161j28112R7730J4740j25510
$$ -78760 -71542 36316 -169335 -182376 14991 -119077 39084 -89028 8702 23442 -102068
1495a02068j2061P139L7048j36815J90393n0454j29455L1378j03070j2910O9411
$$ -102068 -114129 -106990 -69942 -206757 -16364 -66818 -196273 -164895 -267965 -280875 -211464
1484b11464J78916J9547N6326m1604j55153J09304n4409R4093k2939k859R9247
$$ -211464 -32548 -13001 43325 1721 -153432 -44128 -98537 -4444 -27383 -30242 69005
1473F9005O2348p6391j23635R0595L8003j49245m7637J4433r5248K40301J1673
$$ 69005 131353 54962 -68673 21922 59925 -89320 -136957 -122524 -217772 22529 34202
1462C4202J598l3067o8893J6217m6302j16343J08905O5914k6715M5272l645j27116
$$ 34202 35800 2733 -66160 -49943 -96245 -212588 -103683 -37769 -64484 -19212 -22857 -149973
1450a49973M3255L1282l1528j2344O3574J43468m5418n72r311l0158p9310k3603
$$ -149973 -106718 -75436 -106964 -119308 -55734 87734 42316 41744 32433 2275 -77035 -100638
1438a00638j8806R077r9012P0348N9239J7445q0218J24235q8546m8875K24625
$$ -100638 -119444 -110367 -209379 -139031 -79792 -62347 -142565 -18330 -106876 -155751 68874
1427F8874Q1326j90171R3352q114o7977k3165m9190N2059l3801J25486J79373
$$ 68874 150200 -39971 53381 45267 -22710 -45875 -95065 -43006 -76807 48679 228052
1416B28052r1837j93126k9641l7024J56247q1619O6809L276n2349l9593K6010
$$ 228052 136215 -56911 -86552 -123576 32671 -48948 17861 21137 -31212 -70805 -44795
1405d4795l783o9811M6564M6290J43792m0369j26551Q4237j12067Q156J24312
$$ -44795 -48578 -118389 -71825 -25535 118257 77888 -48663 35574 -76493 -68337 55975
1394E5975k21231l793K17609o4681j30214L6991J04151n7775j53938K13312m659
$$ 55975 -165256 -169049 48560 -16121 -146335 -109344 -5193 -62968 -216906 -3594 -8253
1383h253j8735j04503j27421K10822P4173l3093k9709N5890O0563k47926L8005
$$ -8253 -26988 -131491 -258912 -48090 26083 -7010 -36719 19171 79734 -168192 -130187
1372a30187J18998j03583q3813L1327N9707l877m2302L4706j74875J40011J96782
$$ -130187 -11189 -114772 -198585 -167258 -107551 -111428 -153730 -119024 -293899 -153888 42894
1361D2894m5863n2793K8610J08204m9774p7073k3685k2392P9323J6518J3372j1046
$$ 42894 -2969 -55762 -27152 81052 31278 -45795 -69480 -91872 -12549 3969 17341 6295
1349F295J9093k48329j52440J22122J66688l3585M2791K23001R9411m8967r9988
$$ 6295 25388 -222941 -375381 -253259 -86571 -120156 -77365 145636 245047 196080 96092
1338I6092j11242o2591M9044l186J01377Q0619j03291N6853r3204J4668J25366
$$ 96092 -15150 -77741 -28697 -31883 69494 150113 46822 103675 10471 25139 150505
1327A50505n3694r6326K6080j0303p8276J65388K336M718j98859p2043R3263J31909
$$ 150505 96811 485 26565 16262 -62014 103374 105710 110428 -88431 -160474 -67211 64698
1315F4698J9248l0967o8556M7462R2588j1039j01512M8555j95359r94J8896k4207
$$ 64698 83946 52979 -15577 31885 124473 113434 11922 60477 -134882 -135876 -116980 -141187
1303a41187J47743o3893n6469j264l5281j5482J6770Q3616Q3197j01904k8199
$$ -141187 6556 -57337 -113806 -115070 -150351 -165833 -149063 -65447 17750 -84154 -112353
1292a12353P3822O3201r3154j30857k9178M807J37465o9362l4301Q5587J16389
$$ -112353 -38531 24670 -68484 -199341 -228519 -223712 -86247 -155609 -189910 -104323 12066
1281A2066Q2593j97079j06698P6271J08198O4029M2454j1116k02957L6787J78054
$$ 12066 94659 -102420 -209118 -132847 -24649 39380 81834 70718 -132239 -95452 82602
1270H2602J49781j25663n3071p1840M9837j42741L6508Q1352l820J43011p2328
$$ 82602 232383 106720 53649 -18191 31646 -111095 -74587 6765 2945 145956 73628
1259G3628r297K7646l8578q1370R5984k9435j47624P2268n0825J48523N7469n9930
$$ 73628 64331 91977 53399 -27971 68013 38578 -109046 -36778 -87603 60920 118389 58459
1247E8459o0989J19714J0907k94780n3987r6363J95232N4028P0131j7158L0884
$$ 58459 -2530 117184 128091 -166689 -220676 -317039 -121807 -67779 2352 -14806 16078
1236A6078j24704M9258J19103p6634j23657j4252J83191L5031m8187J91215j52831
$$ 16078 -108626 -59368 59735 -16899 -140556 -154808 28383 63414 15227 206442 53611
1225E3611m8140l420p3306o4903M3626J14170k3573q3436p7857O521n9976J38699
$$ 53611 5471 2051 -71255 -136158 -92532 21638 -1935 -85371 -163228 -156707 -216683 -77984
1213g7984j8653K37J10962J9663q9916O6917j14386m3852J74659K6447r8783K545
$$ -77984 -96637 -96400 14562 34225 -55691 11226 -103160 -147012 27647 54094 -44689 -42144
1201d2144L14243j73740O0456j0581K802j17517O6846N9603k50654Q5934J2716
$$ -42144 272099 98359 158815 148234 151036 33519 100365 159968 -90686 -4752 7964
1190G964k2371r0827Q4855j49233N7084o3369Q5976L1222l8941j6155j5617K45190
$$ 7964 -14407 -105234 -20379 -169612 -112528 -175897 -89921 -58699 -97640 -113795 -129412 115778
1178A15778j0984r8825Q049Q236J41733j97719q9410J24805o283J2253o478p875
$$ 115778 104794 5969 14018 22254 163987 -33732 -123142 1663 -4620 7633 1155 -6720
1166f720q5973J1574L8916j41220k1434J48985Q4594j76417n3711K68187j0346
$$ -6720 -92693 -81119 -42203 -183423 -204857 -55872 28722 -147695 -201406 66781 56435
1155E6435j40022P4995L1913n8002r7721l907J69048J28588j93940j01735J60070
$$ 56435 -83587 -8592 23321 -34681 -132402 -136309 32739 161327 -32613 -134348 25722
1144B5722L0584p4414M1958n7921O5814n4462k7033K68040p4736j25175J8830
$$ 25722 56306 -18108 23850 -34071 31743 -22719 -49752 218288 143552 18377 37207
1133C7207J9398p0385q7567j47153J17686l8987N4433J48615N9339p6203o3404
$$ 37207 56605 -13780 -101347 -248500 -130814 -169801 -115368 33247 92586 16383 -47021
1122d7021P733l2179p558J20411J14153n7245N6522j08664o6472L9887L5393n587
$$ -47021 -39288 -71467 -79025 41386 155539 98294 154816 46152 -20320 19567 54960 49373
1110D9373L7124L1098M4053r4119n8175J20458j53980J28168r0903m7235k9233
$$ 49373 86497 117595 161648 67529 9354 129812 -24168 104000 13097 -34138 -63371
1099f3371J47843m6272o04j16011J65993J03563L0652J21318j59617j41785j57482
$$ -63371 84472 38200 37596 -78415 87578 191141 221793 343111 183494 41709 -115773
1088a15773J8014R890M4575K149l9012J22090j8037J04640p6735j01193O4610
$$ -115773 -97759 -87869 -43294 -41145 -80157 41933 23896 128536 51801 -49392 15218
1077A5218o3331O1266k8141J32123p796P1681j36859q5542j28553J31021J19194
$$ 15218 -48113 13153 -14988 117135 109339 181020 44161 -41381 -169934 -38913 80281
1066H0281p6499K0712j305n3783J30255j98953O4111Q9051m5155r8488j6765K7202
$$ 80281 3782 24494 23189 -30594 99661 -99292 -35181 53870 8715 -89773 -106538 -79336
1054g9336j5982R2619j8839L7717J4870m6193k22049K24199O0462j06010L9209
$$ -79336 -95318 -2699 -21538 16179 31049 -15144 -237193 -12994 47468 -58542 -19333
1043a9333N2716l7742l2654R1021j2560Q792m3844M7885M53j73736j3310P0003
$$ -19333 33383 -4359 -37013 54008 41448 50240 6396 54281 54734 -119002 -132312 -62309
1031f2309O5537Q3713r4129P5083m1467J1209j39264N4482k9311J3323o7527O6311
$$ -62309 3228 86941 -7188 67895 26428 37637 -101627 -47145 -76456 -63133 -130660 -64349
1019f4349N5593N4398l3417l0705J5625q6375j18324J03970J13116k39368p762
$$ -64349 -8756 45642 12225 -18480 -2855 -89230 -207554 -103584 9532 -229836 -237598
1008b37598K5879J69095j29629J15248j434L0274l5934M0971r9384K422K6708
$$ -237598 -211719 -42624 -172253 -57005 -58439 -28165 -64099 -23128 -122512 -120090 -93382
997i3382Q4816m676p6429r2536k9315N6999J91906M9635o0156n2807o6393J7399
$$ -93382 -8566 -13242 -89671 -182207 -211522 -154523 37383 87018 26862 -25945 -92338 -74939
985g4939p7225J48696l7532M961j50529N5417J11903J02597j1736p0944k0766
$$ -74939 -152164 -3468 -41000 -36039 -186568 -131151 -19248 83349 71613 669 -20097
974b0097J65625o6720j46145J44881Q1547p0375K838p0708l5559J69478j65790
$$ -20097 145528 78808 -67337 77544 159091 88716 91554 20846 -14713 154765 -11025
963a1025j14639P7216K9164p8060J24112m1602L8477j05320j58898l6106J38516
$$ -11025 -125664 -48448 -19284 -97344 26768 -14834 23643 -81677 -240575 -276681 -138165
952a38165M6479R765O0707j31788O98K60169M440j34464m1765K1248J03754k0358
$$ -138165 -91686 -81921 -21214 -153002 -152304 107865 112305 -22159 -63924 -42676 61078 40720
940D0720m9299n1475l1910m871J50301j68272j4313K1931j60630J12386J57116
$$ 40720 -8579 -60054 -91964 -96835 53466 -114806 -129119 -107188 -267818 -155432 1684
929A684J9196j8038k01564j0733J07187K14821Q4129k92587m981m5841J08871
$$ 1684 20880 2842 -198722 -209455 -102268 112553 196682 -95905 -100886 -146727 -37856
918c7856J41789j32278q7454Q4325J2549j30568K5818p2031J29511M2934J54415
$$ -37856 103933 -28345 -115799 -31474 -18925 -149493 -123675 -195706 -66195 -23261 131154
907A31154o3503j88144J29583Q0891k672r5352N6942j08535J00550M870n1705
$$ 131154 67651 -120493 9090 89981 87309 -8043 48899 -59636 40914 45784 -5921
896e921l3173l7826N1377J17506r6992j66722Q8409K6152J09570O8547j31713
$$ -5921 -39094 -76920 -25543 91963 -5029 -171751 -83342 -57190 52380 120927 -10786
885a0786j87201K49923J42073j29901m0230j53881J06473Q3764q1054P9101R7103
$$ -10786 -197987 51936 194009 64108 23878 -130003 -23530 60234 -20820 58281 155384
874A55384m1355r1058j3738K5087n0429O0679j1414r6662R679q596N1833m7831
$$ 155384 114029 22971 9233 34320 -16109 44570 33156 -63506 -53827 -62423 -10590 -58421
862e8421J05455j3456P1585K3320r6581q0266P2634N2806r1481O4659O7541k04600
$$ -58421 47034 33578 105163 128483 31902 -48364 24270 77076 -14405 50254 117795 -86805
850h6805n3028L3598l1575k1119N9421R1152P9407J6485o3724j05966p1107J31356
$$ -86805 -139833 -106235 -137810 -158929 -99508 -8356 71051 87536 23812 -82154 -153261 -21905
838b1905R8Q8603k16180P8334R0084M5783k2230r4990J0981M9634j62398P2928
$$ -21905 -21807 66796 -149384 -71050 19034 64817 42587 -52403 -41422 8212 -154186 -81258
$$ [...]
##END NTUPLES=NMR SPECTRUM
##END=
