##TITLE=1H_CG-1161-4
 CDCl3
 8 sc, 
 28.06.2022
##JCAMPDX= 6.0         $$ Bruker NMR JCAMP-DX V2.0
##DATA TYPE= NMR SPECTRUM
##DATA CLASS= NTUPLES
##ORIGIN= UXNMR, Bruker Analytische Messtechnik GmbH
##OWNER= root
$$ XWIN-NMR		Version 3.5
$$ Tue Jun 28 14:04:42 2022 Russian Standard Time (UT+4h)  she@DPX200
##.OBSERVE FREQUENCY= 200.1313499994
##.OBSERVE NUCLEUS= ^1H
##.ACQUISITION MODE= SIMULTANEOUS
##.ACQUISITION SCHEME= undefined
##.AVERAGES= 8
##.DIGITISER RES= 18
##SPECTROMETER/DATA SYSTEM= spect
##.PULSE SEQUENCE= zg30
##.SOLVENT NAME= CDCl3
##.SHIFT REFERENCE= (INTERNAL, CDCl3, 0, 15.7315)
##AUDIT TRAIL= $$ (NUMBER, WHEN, WHO, WHERE, WHAT)
$$ ##TITLE= Audit trail, XWIN-NMR		Version 3.5
$$ ##JCAMPDX= 5.01
$$ ##ORIGIN= Bruker BioSpin GmbH
$$ ##OWNER= she
$$ F:/spectra/data/she/nmr/H-F/1/pdata/1/auditp.txt
$$ ##AUDIT TRAIL=  $$ (NUMBER, WHEN, WHO, WHERE, WHAT)
(   1,<2022-06-28 14:03:38.90 +0400>,<she>,<DPX200>,
      <created by zg, POWCHK disabled, PULCHK disabled
       configuration hash MD5:
       00 E9 B6 7A A2 85 ED C7 34 08 36 98 17 FE 4E 26
       data hash MD5: 16K
       5C CF 09 36 02 F9 B1 01 63 3C C4 18 E9 B3 AB 2C>)
(   2,<2022-06-28 14:03:41.18 +0400>,<she>,<DPX200>,
      <Start of raw data processing
       efp BC_mod = 2 LB = 0.24 FT_mod = 6 PKNL = 1 PHC0 = -18064.44 PHC1 = 22.00069 SI = 16K 
       data hash MD5: 16K
       A9 98 38 C3 CE 12 29 B7 03 07 A0 79 E2 74 2C 1F>)
(   3,<2022-06-28 14:03:59.10 +0400>,<she>,<DPX200>,
      <pk PHC0 = 6.701304 PHC1 = -9.999999 
       data hash MD5: 16K
       A4 DF C9 23 2F F6 54 F4 9B D5 8A 04 FE 97 86 5B>)
(   4,<2022-06-28 14:04:02.90 +0400>,<she>,<DPX200>,
      <abs ABSG = 5 
       data hash MD5: 16K
       7E 7C B3 47 C3 D9 CC 89 D1 A9 A1 05 4E B1 82 F4>)
$$ ##END=
$$ 
$$ hash MD5
$$ 8C B9 E2 D4 35 6C 6C A7 73 89 2D C9 7F 52 1F 08
##$RELAX= 
##$RELAX= 
##$RELAX= 
##$RELAX= 
##$RELAX= 
##$RELAX= 
$$ Bruker specific parameters
$$ --------------------------
##$DU= <F:/spectra>
##$EXPNO= 1
##$NAME= <H-F>
##$PROCNO= 1
##$TYPE= <nmr>
##$USER= <she>
##$AMP= (0..31)
100 100 100 100 100 100 100 100 100 100 100 100 100 100 100 100 100 100 
100 100 100 100 100 100 100 100 100 100 100 100 100 100 
##$AQSEQ= 0
##$AQ_mod= 1
##$AUNM= <au_zg>
##$AUTOPOS= <>
##$BF1= 200.13
##$BF2= 200.13
##$BF3= 200.13
##$BF4= 200.13
##$BF5= 200.13
##$BF6= 200.13
##$BF7= 200.13
##$BF8= 200.13
##$BYTORDA= 1
##$CFDGTYP= 0
##$CFRGTYP= 5
##$CHEMSTR= <none>
##$CNST= (0..31)
1 1 145 1 1 1 1 1 1 1 1 1 1 1 1 1 1 1 1 1 1 1 1 1 1 1 1 1 1 1 1 1 
##$CPDPRG= <>
##$CPDPRG1= <>
##$CPDPRG2= <>
##$CPDPRG3= <>
##$CPDPRG4= <mlev>
##$CPDPRG5= <mlev>
##$CPDPRG6= <mlev>
##$CPDPRG7= <mlev>
##$CPDPRG8= <mlev>
##$CPDPRGB= <>
##$CPDPRGT= <>
##$D= (0..31)
0 1.2 0 0 0 0 0 0 0 0.06 0 0.03 0 0 0 0 0.0002 0 0 0 0 0 0 0 0 0 0 0 0 
0 0 0 
##$DATE= 1656410618
##$DBL= (0..7)
120 120 120 120 120 120 120 120 
##$DBP= (0..7)
150 150 150 150 150 150 150 150 
##$DBP07= 0
##$DBPNAM0= <>
##$DBPNAM1= <>
##$DBPNAM2= <>
##$DBPNAM3= <>
##$DBPNAM4= <>
$$ [...]
##$SUBNAM2= <"">
##$SUBNAM3= <"">
##$SUBNAM4= <"">
##$SUBNAM5= <"">
##$SUBNAM6= <"">
##$SUBNAM7= <"">
##$SUBNAM8= <"">
##$SUBNAM9= <"">
##$SW= 18.0517283424941
##$SWIBOX= (0..15)
0 0 2 0 0 0 0 0 0 0 0 0 0 0 0 0 
##$SW_h= 3612.71676300578
##$TD= 16384
##$TD0= 1
##$TE= 0
##$TE2= 300
##$TE3= 300
##$TEG= 300
##$TL= (0..7)
0 120 120 120 120 120 120 120 
##$TP= (0..7)
150 150 150 150 150 150 150 150 
##$TP07= 0
##$TPNAME0= <>
##$TPNAME1= <>
##$TPNAME2= <>
##$TPNAME3= <>
##$TPNAME4= <>
##$TPNAME5= <>
##$TPNAME6= <>
##$TPNAME7= <>
##$TPOAL= (0..7)
0.5 0.5 0.5 0.5 0.5 0.5 0.5 0.5 
##$TPOFFS= (0..7)
0 0 0 0 0 0 0 0 
##$TUNHIN= 0
##$TUNHOUT= 0
##$TUNXOUT= 0
##$USERA1= <user>
##$USERA2= <user>
##$USERA3= <user>
##$USERA4= <user>
##$USERA5= <user>
##$V9= 5
##$VALIST= <valist>
##$VCLIST= <CCCCCCCCCCCCCCC>
##$VD= 0
##$VDLIST= <DDDDDDDDDDDDDDD>
##$VPLIST= <PPPPPPPPPPPPPPP>
##$VTLIST= <TTTTTTTTTTTTTTT>
##$WBST= 1024
##$WBSW= 4
##$XGAIN= (0..3)
0 0 0 0 
##$XL= 0
##$YL= 0
##$YMAX_a= 88239
##$YMIN_a= -80416
##$ZGOPTNS= <>
##$ZL1= 120
##$ZL2= 120
##$ZL3= 120
##$ZL4= 120
##$ABSF1= 15.77443
##$ABSF2= -2.277419
##$ABSG= 5
##$ABSL= 3
##$ALPHA= 0
##$AQORDER= 0
##$ASSFAC= 0
##$ASSFACI= 0
##$ASSFACX= 0
##$ASSWID= 0
##$AUNMP= <proc_1d>
##$AZFE= 0.1
##$AZFW= 0.1
##$BCFW= 0
##$BC_mod= 2
##$BYTORDP= 0
##$COROFFS= 0
##$CY= -3
##$DATMOD= 1
##$DC= 0
##$DFILT= <>
##$DTYPP= 0
##$F1P= 0
##$F2P= 0
##$FCOR= 1
##$FTSIZE= 16384
##$FT_mod= 6
##$GAMMA= 0
##$GB= 0
##$INTBC= 1
##$INTSCL= 0
##$ISEN= 128
##$LB= 0.24
##$LEV0= 0
##$LPBIN= 0
##$MAXI= 10000
##$MC2= 0
##$MEAN= 0
##$ME_mod= 0
##$MI= 1.114404
##$NCOEF= 0
##$NC_proc= -7
##$NLEV= 6
##$NOISF1= 3.799351
##$NOISF2= 2.8
##$NSP= 0
##$NTH_PI= 0
##$NZP= 0
##$OFFSET= 15.73146
##$PC= 1
##$PHC0= -18057.74
##$PHC1= 12.00069
##$PH_mod= 1
##$PKNL= yes
##$PPARMOD= 0
##$PSCAL= 0
##$PSIGN= 0
##$REVERSE= no
##$SF= 200.130008019811
##$SI= 16384
##$SIGF1= 3
##$SIGF2= 2
##$SINO= 5.538805
##$SIOLD= 16384
##$SREGLST= <1H.CDCl3>
##$SSB= 0
##$STSI= 16384
##$STSR= 0
##$SW_p= 3612.71676300578
##$SYMM= 0
##$S_DEV= 0
##$TDeff= 16384
##$TDoff= 0
##$TI= <>
##$TILT= no
##$TM1= 0
##$TM2= 0
##$TOPLEV= 0
##$USERP1= <user>
##$USERP2= <user>
##$USERP3= <user>
##$USERP4= <user>
##$USERP5= <user>
##$WDW= 1
##$XDIM= 16384
##$YMAX_p= 280317908
##$YMIN_p= -3883669
$$ End of Bruker specific parameters
$$ ---------------------------------
##NTUPLES= NMR SPECTRUM
##VAR_NAME=  FREQUENCY,     SPECTRUM/REAL,   SPECTRUM/IMAG
##SYMBOL=    X,             R,               I
##VAR_TYPE=  INDEPENDENT,   DEPENDENT,       DEPENDENT
##VAR_FORM=  AFFN,          ASDF,            ASDF
##VAR_DIM=   16384,         16384,           16384
##UNITS=     HZ,            ARBITRARY UNITS, ARBITRARY UNITS
##FACTOR=    0.220516191357247, 1,           1
##FIRST=     3148.33713943657, 0,            0
##LAST=      -464.379623569208, 0,           0
##MIN=       -464.379623569208, -3883669,    0
##MAX=       3148.33713943657, 280317908,    0
$$ Real data points
##PAGE= N=1
##DATA TABLE= (X++(R..R)), XYDATA
$$ [...]
$$ plain form
7666 21113 178582 -14087 109355 44104 -313153 -359483 -256181 -68322 -118001 -275532
7656 -275532 -219826 -110254 -116580 -129889 16473 104130 900 -78999 -13214 170747 -259130
7645 -259130 -155898 -188066 -128182 -90734 -92309 27697 -20790 -206939 45335 5399 -138989
7634 -138989 -286083 -244504 -163414 9015 81167 72193 4674 -262807 -409771 -320562 -251939
7623 -251939 -274849 -179644 -99038 -19861 93049 -52470 -302985 -168173 -158489 -198056 -172892
7612 -172892 -125884 -42893 1157 -110492 -127824 -140017 -7217 15754 120683 177609 87637
7601 87637 -135747 -41467 -293093 -190247 -124943 -41201 22698 257868 276305 138968 -194192
7590 -194192 -162309 -138681 -200316 -19558 -79430 -54511 79927 -253248 -151984 -41574 -150961
$$ packed form
7666B1113J57469j92669J23442o5251l57257m6330J03302J87859m9679j57531
7656b75532N5706J09572o326j3309J46362Q7657j03230p9899O5785J83961m29877
7645b59130J03232l2168N9884L7448j575J20006m8487j86149K52274l9936j44388
7634a38989j47094M1579Q1090J72429P2152q974o7519k67481j46964Q9209O8623
7623b51939k2910R5205Q0606P9177J12910j45519k50515J34812R684l9567K5164
7612a72892M7008Q2991M4050j11649j7332j2193J32800K2971J04929N6926q9972
7601H7637k23384R4280k51626J02846O5304Q3742O3899K35170J8437j37337l33160
7590a94192L1883K3628o1635J80758n9872K4919J34438l33175J01264J10410j09387
$$ plain form
7579 -150961 -221104 -12600 -39663 -235358 -241236 -277058 -403028 -502507 -258054 -39231 107291
7568 107291 255812 327242 -74078 -91129 -414244 -340613 -67162 -111322 157439 201343 154691
7557 154691 53528 -155175 -323097 -222566 -327512 -365217 -231042 -25607 94964 -119372
7547 -119372 132124 149902 92441 27974 -104991 -42432 7149 -145051 109429 124083 222902
7536 222902 136494 -58092 75187 35208 -23258 -100695 -355810 -405320 -369059 -474059 -384883
7525 -384883 -387190 -362998 58259 31762 -161000 65473 -44178 -123771 14592 -238100 -3277
7514 -3277 -213888 -229911 -84717 -73922 -49352 -163283 -203424 -51122 84574 154944 77701
7503 77701 -30514 -158259 -67188 -285029 -376552 -247296 -290237 45348 -57527 -129832 -187258
$$ packed form
7579a50961p0143K08504k7063j95695n878l5822j25970r9479K44453K18823J46522
7568A07291J48521P1430m01320j7051l23115P3631K73451m4160K68761M3904m6652
7557A54691j01163k08703j67922J00531j04946l7705J34175K05435J20571k14336
7547a19372K51496J7778n7461o4467j32965O2559M9581j52200K54480J4654R8819
7536B22902q6408j94586J33279l9979n8466p7437k55115m9510L6261j05000Q9176
7525c84883k307K4192M21257k6497j92762K26473j09651p9593J38363k52692K34823
7514c277k10611j6023J45194J0795K4570j13931m0141J52302J35696P0370p7243
7503G7701j08215j27745R1071k17841r1523J29256m2941L35585j02875p2305n7426
$$ plain form
7492 -187258 -277826 -218930 -430235 -360241 90418 29590 95901 249448 113716 43984 95374
7481 95374 -120488 -166706 -258433 3727 188195 39369 187580 182836 -69238 -217070 -269599
7470 -269599 -316953 -234439 -387996 -259198 -193938 -24507 -32790 171422 157200 69086 153288
7459 153288 36224 45081 -214318 -149370 -90383 34564 -48224 64595 299586 153927 34455
7448 34455 -10210 -402988 -317625 -182853 -129992 -10699 10985 68432 160555 -26366 -114677
7437 -114677 -171582 129630 86085 50073 -37621 23488 39469 23916 -107039 -162269 -163136 -142083
7425 -142083 -228527 -119546 -3263 33502 -270544 -174740 -66765 48238 156657 128899
7415 128899 319236 94554 130754 -141740 -22097 117282 132464 263917 219143 465696
$$ packed form
7492a87258r0568N8896k11305O9994M50659o0828O6311J53547j35732o9732N1390
7481I5374k15862m6218r1727K62160J84468j48826J48211m744k52074j47832n2529
7470b69599m7354Q2514j53557J28798O5260J69431q283K04212j4222q8114Q4202
7459A53288j17064Q857k59399O4948N8987J24947q2788J12819K34991j45659j19472
7448C4455m4665l92778Q5363J34772N2861J19293K1684N7447R2123j86921q8311
7437a14677n6905L01212m3545l6012q7694O1109J5981j5553j30955n5230q67K1053
7425a42083q6444J08981J16283L6765l04046R5804J07975J15003J08419k7758
7415A28899J90337k24682L6200k72494J19643J39379J5182J31453m4774K46553
$$ plain form
7405 465696 366211 290108 490632 416052 861747 888498 753018 427701 362917 661934 513666
7394 513666 421191 599744 320338 411555 153421 365686 312079 -6890 190039 11437
7384 11437 -241828 -79824 109091 212265 154869 93553 -86106 -99632 -118492 -246976 -74234
7373 -74234 -199560 83550 124580 -67046 -1428 52494 104297 95282 44912 152407 157690
7362 157690 -74227 70077 -82161 -60157 -51658 62690 20629 71089 -19594 128129 -79888
7351 -79888 -228231 -262197 -237421 -159942 -163145 17270 146830 154594 290982 123775 -65850
7340 -65850 -24695 -132876 -279320 -280838 -316187 -397998 -147000 -268121 -186957 -116379 -124280
7329 -124280 -163105 -109265 -26485 98829 -267987 -245436 -282797 -155146 -160461 -29121 -32838
$$ packed form
7405D65696r9485p6103K00524p4580M45695K6751j35480l25317o4784K99017j48268
7394E13666r2475J78553k79406R1217k58134K12265n3607l18969J96929j78602
7384A1437k53265J62004J88915J03174n7396o1316j79659j3526j8860j28484J72742
7373g4234j25326K83110M1030j91626O5618N3922N1803r015n0370J07495N283
7362A57690k31917J44304j52238K2004Q499J14348m2061N0460r0683J47723k08017
7351g9888j48343l3966K4776P7479l203J80415J29560P764J36388j67207j89625
7340f5850M1155j08181j46444j518l5349q1811K50998j21121Q1164P0578p901
7329a24280l8825N3840Q2780J25314l66816K2551l7361J27651n315J31340l717
$$ plain form
7318 -32838 46062 -4514 97595 -191396 -102315 -124702 -78913 87299 81978 -56750 -169442
7307 -169442 8316 -104534 -252273 -267540 -30199 141290 67027 -25545 70558 -55043
7297 -55043 -101427 -178081 -274772 -188551 -138379 -207875 -199865 -261397 -119239 -2295 64473 26589
7285 26589 -230664 -284934 -289370 -274471 -249472 -134223 -161067 -78257 -13954 -205891 -149808
7274 -149808 -174638 -159313 39664 -17853 -39344 -71465 -175388 -78605 -175487 -151306 -12216
7263 -12216 -154341 -124670 8477 -163884 -141885 -161673 29035 36078 -24816 -162429 -250306
7252 -250306 -471020 -359782 -118198 -99737 -124329 29420 47311 -74441 -68961 -141416 -179674
7241 -179674 -237506 -140918 -219868 -100003 47192 -89433 -112283 -329415 -133950 -118907 -152019
$$ packed form
7318c2838P8900n0576J02109k88991Q9081k2387M5789J66212n321j38728j12692
7307a69442J77758j12850j47739j5267K37341J71489p4263r2572R6103j25601
7297e5043m6384p6654r6691Q6221N0172o9496Q010o1532J42158J16944O6768l7884
7285B6589k57253n4270m436J4899K4999J15249k6844Q2810O4303j91937N6083
7274a49808k4830J5325J98977n7517k1491l2121j03923R6783r6882K4181J39090
7263a2216j42125K9671J33147j72361K1999j9788J90708P043o0894j37613q7877
7252b50306k20714J11238K41584J8461k4592J53749J7891j21752N480p2455l8258
7241a79674n7832R6588p8950J19865J47195j36625k2850k17132J95465J5043l3112
$$ plain form
7230 -152019 -17952 130475 153948 122106 147642 173336 142764 -307630 -20885 -104994 -201634
7219 -201634 -299929 -254527 -126004 -122440 -178463 52116 137768 -61954 -254404 -142056 -157428
7208 -157428 -165638 -51119 -43243 76644 -115159 181928 265062 128079 66674 -20667 -19576
7197 -19576 99081 -206764 -79953 -139061 -92255 20399 -265563 -194357 -73916 -252234
7187 -252234 56702 27403 159723 -69168 -281931 -330216 -225149 -206454 -114119 122440
7177 122440 89497 -54512 -144202 -196382 -189219 -117604 -190724 -43088 -125166 -188051 -28974
7166 -28974 97363 28577 -94558 -88599 -108959 -199722 -234579 -105290 -31915 97564 97376 93850
7154 93850 108185 -117176 44405 -135621 -103845 -149860 -83972 799 -69852 -111478 -72342
$$ packed form
7230a52019J34067J48427K3473l1842K5536K5694l0572m50394K86745q4109r6640
7219b01634r8295M5402J28523L564n6023K30579Q5652j99722j92450J12348j5372
7208a57428q210J14519P876J19887j91803K97087Q3134j36983o1405q7341J091
7197a9576J18657l05845J26811n9108M6806J12654k85962P1206J20441j78318
7187b52234L08936k9299J32320k28891k12763m8285J05067J8695R2335K36559
7177A22440l2943j44009q9690n2180P163P1615p3120J47636q2078o2885J59077
7166b8974J26337o8786j23135N959k0360r0763l4857J29289P3375J29479j88l526
7154I3850J4335k25361J61581j80026L1776m6015O5888Q4771p0651m1626L9136
$$ plain form
7143 -72342 -18888 145180 -220470 9223 45914 -36314 -70540 -164579 1451 -2505 53159
7132 53159 -62320 -98589 -54942 -49440 139227 123894 161258 145906 14349 29443 -43202
7121 -43202 -209647 -80508 47995 -39932 -65312 92454 -70963 -25740 50142 12601 -43555
7110 -43555 52209 -307456 -92298 299411 196930 74336 45062 157823 143813 -124915
7100 -124915 -280161 -209211 -32030 185443 252557 377997 155837 171135 42511 -187610
7090 -187610 -175346 -166194 -189503 -36845 -47234 15573 -28154 -11574 144859 96122 -82481
7079 -82481 -183892 -50061 -111292 -69594 156074 159966 243046 -2275 271880 422732 256312
7068 256312 424132 510518 276782 140468 -68518 98488 94677 -37539 -8113 20736 -53405
$$ packed form
7143g2342N3454J64068l65650K29693L6691q2228l4226r4039J66030l956N5664
7132E3159j15479l6269M3647N502J88667j5333L7364j5352j31557J5094p2645
7121d3202j66445J29139J28503q7927k5380J57766j63417M5223P5882l7541n6156
7110d3555R5764l59665K15158L91709j02481j22594k9274J12761j4010k68728
7100a24915j55246P0950J77181K17473O7114J25440k22160J5298j28624k30121
7090a87610J2264R152k3309J52658j0389O2807m3727J6580J56433m8737j78603
7079h2481j01411J33831o1231M1698K25668L892Q3080k45321K74155J50852j66420
7068B56312J67820Q6386k33736j36314k08986J67006l811j32216K9426K8849p4141
$$ plain form
7057 -53405 -125126 -157837 -74925 142753 -127913 -34411 150586 -6597 -299282 -293752 -288435
7046 -288435 -291143 -214792 -116684 18835 199803 56563 -103756 -115870 -159286 -124805 -130694
7035 -130694 -197161 -230062 -71191 -61390 -12534 -220078 -401186 -382410 -234448 -367351 -173655
7024 -173655 -174694 171817 120985 -123263 -46642 -89883 -270851 -211151 -307039 -155934 -132470
7013 -132470 -261614 -202752 -134493 -186267 -208738 -94356 99693 -42759 -183114 -91481 -234079
7002 -234079 -274936 -290144 -325678 -73325 432 -117554 104300 96971 -29925 -131156 -219897
6991 -219897 -228590 -188023 -212989 -172634 -295721 -326934 -239148 -240050 -114613 -67660 -105329 17924
6979 17924 -38275 -314513 -340063 -265934 -93979 132368 -17505 95843 -19142 -153771
$$ packed form
7057e3405p1721l2711Q2912K17678k70666R3502J84997j57183k92685N530N317
7046b88435k708P6351R8108J35519J80968j43240j60319j2114m3416L4481n889
7035a30694o6467l2901J58871R801M8856k07544j81108J8776J47962j32903J93696
7024a73655j039L46511n0832k44248P6621m3241j80968N9700r5888J51105K3464
7013a32470j29144N8862O8259n1774k2471J14382J94049j42452j40355R1633j42598
7002b34079m0857j5208l5534K52353P3757j17986K21854p329j26896j01231q8741
6991b19897q693M0567k4966M0355j23087l1213Q7786r02J25437M6953l7669J23253
6979A7924n6199k76238k5550P4129J71955K26347j49873J13348j14985j34629
$$ plain form
6969 -153771 -279196 -348200 -414450 -178292 -116519 269555 27239 -142187 -4075 -123377
6959 -123377 -179769 118235 -168651 -202554 -103056 72693 -21170 -102356 57216 156613 -1166
6948 -1166 -33413 79554 40531 -121709 10687 31091 66281 -304694 -259245 -286883 -50305
6937 -50305 83559 107980 93886 -6660 -122930 -55617 77874 -130160 -121407 -383831 -45427
6926 -45427 -131652 -101050 -9897 173881 -98736 -202132 -195180 26174 -37494 -27444 -8099
6915 -8099 52722 -74227 7927 161396 233007 -6095 226716 200514 169449 -8003 -78105
6904 -78105 -101855 72485 112175 97506 -76494 -174255 -52391 -54662 -54920 -142886 -249033 -276772
6892 -276772 -2528 -55450 29611 81777 225198 165158 -201053 79940 80256 -117243 -119022
$$ packed form
6969a53771j25425o9004o6250K36158O1773L86074k42316j69426J38112j19302
6959a23377n6392K98004k86886l3903R9498J75749r3863q1186J59572R9397j57779
6948a166l2247J12967l9023j62240J32396K0404L5190l70975M5449k7638K36578
6937e0305J33864K4421j4094j00546j16270O7313J33491k08034Q753k62424L38404
6926d5427q6225L0602R1153J83778k72617j03396O952K21354o3668J0050J9345
6915h099O0821j26949Q2154J53469P1611k39102K32811k6202l1065j77452p0102
6904g8105k3750J74340L9690j4669j74000r7761J21864k271k58q7966j06147k7739
6892b76772K74244n2922Q5061N2166J43421o0040l66211K80993L16j97499j779
$$ plain form
6881 -119022 5929 -36837 -111301 -201886 -210515 -117761 -61477 -232705 3062 295125 -95821
6870 -95821 -477121 -271630 -90824 -81327 86140 24025 195853 146740 144648 74240 -137279
6859 -137279 -182436 -258561 -270653 -53811 -116084 38850 253081 211920 -22169 103455 -199489
6848 -199489 -209037 -373224 -137654 -23908 135507 111986 -11021 -243265 -141298 -132106 -168071
6837 -168071 -164832 99805 37768 -38760 -130957 -32692 -79106 -183058 63283 -60682 -133027
6826 -133027 -154777 -141351 -259790 -121506 -125555 -64207 -137467 -189104 -263389 -251859 -199632
6815 -199632 -354669 -294633 1747 -15435 128417 -21967 62986 -151129 -68935 -54215 -124328
6804 -124328 -99959 -15688 129341 109101 -35186 27280 -121248 -342305 -232658 -237912 -92967
$$ packed form
6881a19022J24951m2766p4464r0585q629R2754N6284j71228K35767K92063l90946
6870i5821l81300K05491J80806R497J67467o2115J71828m9113k092p0408k11519
6859a37279m5157p6125j2092K16842o2273J54934K14231m1161k34089J25624l02944
6848a99489r548j64187K35570J13746J59415k3521j23007k32244J01967R192l5965
6837a68071L239K64637o2037p6528r2197R8265m6414j03952K46341j23965p2345
6826a33027k1750J3426j18439J38284m049O1348p3260n1637p4285J1530N2227
6815a99632j55037O0036K96380j7182J43852j50384Q4953k14115Q2194J4720p0113
6804a24328K4369Q4271J45029k0240j44287O2466j48528k21057J09647n254J44945
$$ plain form
6793 -92967 94104 311141 431177 300427 397465 40210 -250978 -267295 -251018 -116714
6783 -116714 11913 191431 279820 164935 110633 -139570 -186691 -110393 -196110 -249363 -282868
6772 -282868 -297821 79778 102435 13061 41596 -59182 -28537 -67040 -183175 -260095 -238740
6761 -238740 -125571 -28174 18413 40377 -31197 -50655 -137274 -81175 933 -5840 -10567 -43669
6749 -43669 216457 92095 99194 -27308 -356804 -144815 22995 23609 -157325 -76852 90510
6738 90510 200052 172244 286182 46859 -94103 -109032 -96632 -54137 41409 83496 97399
6727 97399 -22370 1786 -316317 -407340 -114507 -5327 109537 189631 238686 128405 -78124
6716 -78124 -84753 -166496 -44623 128989 142984 135930 112455 81679 66908 34771 -171764 -154972
$$ packed form
6793i2967J87071K17037J20036j30750R7038l57255k91188j6317J6277J34304
6783a16714J28627J79518Q8389j14885n4302k50203m7121P6298q5717n3253l3505
6772b82868j4953L77599K2657q9374K8535j00778L0645l8503j16135p6920K1355
6761b38740J13169R7397M6587K1964p1574j9458q6619N6099Q2108o773m727l3102
6749d3669K60126j24362P099j26502l29496K11989J67810O14j80934Q0473J67362
6738I0510J09542k7808J13938k39323j40962j4929J2400M2495R5546M2087J3903
6727I7399j19769K4156l18103r1023K92833J09180J14864Q0094M9055j10281k06529
6716g8124o629q1743J21873J73612J3995p054k3475l0776j4771l2137k06535J6792
$$ plain form
6704 -154972 -61209 2585 -138424 21254 93114 127802 -29911 -41040 55890 -106613 113028
6693 113028 159249 78060 100426 75074 55394 31776 108915 95622 -256366 -146735 26323
6682 26323 208990 209448 63513 61240 283275 127249 -31849 -103987 43544 -78936 -48734
6671 -48734 157911 65174 174631 329051 100612 -167986 -267247 6376 -235970 -246180
6661 -246180 -182886 -184956 8576 13524 107140 83446 75863 116349 -315177 -398571 -1175 106656
6649 106656 279680 -31648 57201 -47286 -308776 -464766 -432153 -326093 -149333 -47499
6639 -47499 335852 137551 118323 -83297 -157262 -42186 -217888 -301504 -281953 -48061 -79847
6628 -79847 19626 94236 -15248 52948 266604 71147 -82896 -231454 -13290 135262
$$ packed form
6704a54972R3763O3794j41009J59678P1860L4688j57713j1129R6930j62503K19641
6693A13028M6221q1189K2366k5352j9680k3618P7139j3293l51988J09631J73058
6682B6323J82667M58j45935k273K22035j56026j59098p2138J47531j22480L0202
6671d8734K06645r2737J09457J54420k28439k68598r9261K73623k42346j0210
6661b46180O3294k070J93532M948R3616k3694p583M0486m31526q3394L97396J07831
6649A06656J73024l11328Q8849j04487k61490j55990L2613J06060J76760J01834
6639d7499L83351j98301j9228k01620p3965J15076j75702q3616J9551K33892l1786
6628g9847R9473P4610j09484O8196K13656j95457j54043j48558K18164J48552
$$ plain form
6618 135262 97330 183489 240140 268326 183054 32701 -237522 -232073 -327013 -341888 -317816
6607 -317816 -51594 222114 465566 365655 450765 269766 -13451 -80012 -18662 -91816 -56931
6596 -56931 -100880 24644 204447 80102 69503 -47534 -178584 22500 149244 167745
6586 167745 131890 46780 -61645 -214520 -198824 21698 114841 -73878 -172288 38968 -47041
6575 -47041 -247574 -329110 -577175 -655614 -553459 -268324 -285809 38751 108184 60660 152520
6564 152520 86876 32048 97417 -280647 -284132 -385032 -343637 -176417 -156 331169 273189
6553 273189 78037 62566 211449 -38641 -453287 -370371 -195648 -189531 -149610 137874 188791
6542 188791 56513 37108 62395 -96762 -277959 -337502 -446754 -293250 -319854 -222025 33731
$$ packed form
6618A35262l7932Q6159N6651K8186q5272j50353k70223N449r4940j4875K4072
6607c17816K66222K73708K43452r9911Q5110j80999k83217o6561O1350p3154L4885
6596e6931m3949J25524J79803j24345j0599j17037j31050K01084J26744J8501
6586A67745l5855q5110j08425j52875J5696K20522R3143j88719r8410K11256q6009
6575d7041k00533q1536k48065p8439J02155K85135j7485L24560O9433m7524R1860
6564A52520o5644n4828O5369l78064l485j00900M1395J67220J76261L31325n7980
6553B73189j95152j5471J48883k50090m14646Q2916J74723O117L9921K87484N0917
6542A88791j32278j9405K5287j59157j81197n9543j09252J53504k6604R7829K55756
$$ plain form
6531 33731 102077 30976 -43225 -35432 78829 -160881 -323111 -461411 -475757 -119457 -97808
6520 -97808 75443 233138 249395 147323 55600 75214 -66453 -331416 -241445 -129680 -156377
6509 -156377 -100625 86388 318165 156801 23843 88483 77393 -122420 -92702 -67994 -75848
6498 -75848 3051 16769 167176 124519 -144802 -158075 55396 -97418 -119831 -115090 -126172
6487 -126172 -342142 -145380 70856 -100009 -106500 -37656 43334 -26667 -126493 -173255 -137559
6476 -137559 -153285 123421 56655 -131647 -38641 29862 -230097 -66088 66617 114614 -7229
6465 -7229 -185662 -86359 -11638 -239566 -179215 -137828 -255281 -281350 -143264 64081 120970
6454 120970 -194112 -82153 73088 -175613 -52693 -86961 174212 -134965 139475 123990
$$ packed form
6531C3731O8346p1101p4201P793J14261k39710j62230j38300j4346L56300K1649
6520i7808J73251J57695J6257j02072r1723J9614j41667k64963Q9971J11765k6697
6509a56377N5752J87013K31777j61364j32958O4640j1090j99813K9718K4708p854
6498g5848P8899J3718J50407m2657k69321j3273K13471j52814k2413M741j1082
6487a26172k15970J96762K16236j70865o491O8844Q0990p0001r9826m6762L5696
6476a37559j5726K76706o6766j88302R3006O8503k59959J64009J32705M7997j21843
6465g229j78433R9303P4721k27928O0351M1387j17453k6069J38086K07345N6889
6454A20970l15082J11959J55241k48701J22920l4268K61173l09177K74440j5485
$$ plain form
6444 123990 -223018 -210650 -28150 -61654 -29312 -133364 -104343 -40646 -148889 -65411 -203835
6433 -203835 -207916 -78221 -15145 72915 -119581 -117917 -45971 243284 221355 36572 -66260
6422 -66260 -230802 -264244 -200187 -62486 -109293 -15877 42843 197738 76091 29358 -15707
6411 -15707 -30895 -166455 -284157 -262691 -332866 -97634 -60962 -338603 -98546 -54068 10843
6400 10843 16282 -129286 70114 4093 -351265 -105971 -78661 116470 -13573 2958 15849
6389 15849 52911 118768 282298 163268 -120066 -224368 -123168 -175885 5509 141833
6379 141833 63094 31661 -235170 57022 -66373 -393137 -400269 -339431 -191341 -352790 -196851
6368 -196851 -114763 -96086 119681 236956 85044 216950 122415 5212 -3465 -261351 -175506
$$ packed form
6444A23990l47008J2368J82500l3504L2342j04052K9021O3697j08243Q3478j38424
6433b03835m081J29695O3076Q8060j92496J664P1946K89255k1929j84783j02832
6422f6260j64542l3442O4057J37701m6807R3416N8720J54895j21647m6733m5065
6411a5707j5188j35560j17702K1466p0175K35232L6672k77641K40057M4478O4911
6400A0843N439j45568J99400o6021l55358K45294K7310J95131j30043J6531J2891
6389A5849L7062O5857J63530j19030k83334j04302J01200n2717J81394J36324
6379A41833p8739l1433k66831K92192j23395l26764p132O0838J48090j61449J55939
6368a96851Q2088J8677K15767J17275j51912J31906r4535j17203q677k57886Q5845
$$ plain form
6357 -175506 26157 92096 139061 336103 188 34832 -79462 -235631 -454598 -368384
6347 -368384 -386500 -89424 -25458 65124 246502 111460 112851 -70156 -175153 -340817 -457522
6336 -457522 -204345 -241580 -116465 57581 36291 -51385 -50974 -12112 -51935 -272625 -96691
6325 -96691 -104828 -247768 -112486 -152537 -35844 11231 -36267 20902 266771 99264 69257
6314 69257 -33478 35954 -101898 -325423 69439 4440 -242992 -65749 -81310 -6482 406368
6303 406368 232817 263559 5777 -41764 162031 124426 -97797 -109825 -112179 -355252 191689
6292 191689 7521 36684 122429 -246246 -366362 -216320 -216304 -77566 -76796 34619 -6878
6281 -6878 -160332 111459 -28644 -17502 102261 -54089 -135717 -38825 -11484 -39150 49325
$$ packed form
6357a75506K01663O5939M6965J97042l35915L4644j14294j56169k18967Q6214
6347c68384j8116K97076O3966R0582J81378j35042J391j83007j04997j65664j16705
6336d57522K53177l7235J25115J74046k1290q7676M11L8862l9823k20690J75934
6325i6691q137j42940J35282m0051J16693M7075m7498N7169K45869j67507l0007
6314F9257j02735O9432j37852k23525L94862o4999k47432J77243j5561P4828M12850
6303D06368j73551L0742k57782m7541K03795l7605k22223j2028k354k43073N46941
6292A91689j84168K9163Q5745l68675j20116J50042J6J38738P70J11415m1497
6281f878j53454K71791j40103J1142J19763j56350q1628R6892K7341k7666Q8475
$$ plain form
6270 49325 24950 135452 -50344 -92339 -146903 -196650 -269896 -196712 -9709 -153698 -159547
6259 -159547 16933 24779 -85316 -162669 -374835 -271855 -336796 -247089 -287774 -215131 -165592
6248 -165592 -145086 -299610 -232265 37914 -192629 -6904 -19965 -40798 -9674 -310920 -173790
6237 -173790 -237195 -392080 -241085 -219490 -202304 -35879 -71338 229157 -384 -200327
6227 -200327 -214932 1712 1748 -93565 -255849 -146210 -85853 -197528 81570 -40176 -111649
6216 -111649 -121422 71233 95515 -4160 -113340 267454 158233 -227869 -271637 -283990 -110705
6205 -110705 -271554 -117338 -106028 -12092 -57788 -135503 42793 -84915 -87130 -98628 -136177
6194 -136177 45284 120 45739 121426 209636 143288 -99848 -151820 -18815 -36887 -344336
$$ packed form
6270D9325k4375J10502j85796m1995n4564m9747p3246P3184J87003j43989n849
6259a59547J76480P846j10095p7353k12166J02980o4941Q9707m0685P2643M9539
6248a65592K0506j54524O7345K70179k30543J85725j3061k0833L1124l01246J37130
6237a73790o3405j54885J50995K1595J7186J66425l5459L00495k29541j99943
6227b00327j4605K16644L6r5313j62284J09639O0357j11675K79098j21746p1473
6216a11649r773J92655K4282r9675j09180L80794j09221l86102m3768j2353J73285
6205a10705j60849J54216J1310R3936m5696p7715J78296j27708k215j1498l7549
6194a36177J81461m5164M5619P5687Q8210o6348k43136n1972J33005j8072l07449
$$ plain form
6183 -344336 -264490 -196588 -9052 -140117 64202 -27234 -240398 -372907 -115777 -187509
6173 -187509 -358572 -413287 -83368 -230297 -392888 -129184 100002 17404 -23205 54797
6163 54797 3563 -85639 260 -10450 51076 16155 -111221 -86082 -212934 -110325 -27849
6152 -27849 -103297 -173451 -20306 -87055 -170135 -171307 -388284 -461772 -248985 -321192 -3413
6141 -3413 -72867 -177753 188089 248221 40816 56714 -94673 -36473 -123716 -194043 -90600
6130 -90600 96192 49350 218344 140216 -16243 -146489 -108206 -196315 -366831 -228768 -94925
6119 -94925 3985 -72421 -26792 42705 49535 -145435 -154756 -166922 -102815 -160921 -41865 -70256
6107 -70256 -62996 -142123 -48916 -58027 -46569 -204758 -147040 -120130 -143325 -59890 -13677 -178081
$$ packed form
6183c44336P9846O7902J87536j31065K04319r1436k13164j32509K57130p1732
6173a87509j71063n4715L29919j46929j62591K63704K29186q2598m0609P8002
6163E4797n1234q9202Q5899j0710O1526l4921j27376K5139j26852J02609Q2476
6152b7849p5448p0154J53145o6749q3080j172k16977p3488K12787p2207L17779
6141c413o9454j04886L65842O0132k07405J5898j51387N8200q7243p0327J03443
6130i0600J86792m6842J68994p8128j56459j30246L8283q8109j70516J38063J33843
6119i4925R8910p6406M5629O9497O830j94970r321j2166O4107n8106J19056k8391
6107g0256P260p9127R3207r111J1458j58189N7718K6910k3195Q3435M6213j64404
$$ plain form
6095 -178081 -130007 58871 -261061 -120218 12283 79168 231302 233971 169098 -31411 -210899
6084 -210899 -121447 -129353 -1813 -33313 105562 91863 -33249 -67675 64932 -119138 -188566
6073 -188566 -71751 64321 -166796 -231255 -161432 -58395 -119280 11669 -109093 -245981
6063 -245981 -193390 -99846 -58989 -48845 139779 157925 -13907 -148568 -146493 -23498 -69151
6052 -69151 -129090 -60889 -140973 -109676 -265255 -208895 -176272 -212415 -13860 125674 -19981
6041 -19981 -198693 -199146 -38868 -222262 -159778 58226 -11230 -49799 12364 214976 47276
6030 47276 45517 -3367 189757 119106 -58668 -10982 5878 -118300 147616 45075 -83615
6019 -83615 40846 57944 25641 -14733 244839 517 -209776 -316593 40548 -20131 -40228
$$ packed form
6095a78081M8074J88878l19932J40843J32501O6885J52134K669o4873k00509j79488
6084b10899Q9452p906J27540l1500J38875j3699j25112l4426J32607j84070o9428
6073a88566J16815J36072k31117o4459O9823J03037o0885J30949j20762j36888
6063b45981N2591R3544M0857J0144J88624J8146j71832j34661K075J22995m5653
6052f9151n9939O8201q0084L1297j55579N6360L2623l6143J98555J39534j45655
6041a9981j78712m53J60278j83394O2484K18004o9456l8569O2163K02612j67700
6030D7276j759m8884J93124p0651j77774M7686J6860j24178K65916j02541j28690
6019h3615J24461J7098l2303m0374K59572k44322k10293j06817L57141o0679k0097
$$ plain form
6008 -40228 -26610 322892 30049 24396 -158770 29821 -341480 -195868 -96479 -12218 7539
5997 7539 20358 191502 6390 -140480 -192380 -281037 -171455 -183032 -193582 -488 33764
5986 33764 14194 279876 190142 -140825 -126568 -420446 -294663 -35401 -33373 151482 361598
5975 361598 213295 303450 -28825 139142 -14187 47042 -236370 -220181 -89824 -52291
5965 -52291 59212 200991 271454 91125 -34534 -110508 -274569 -71545 -116784 151761
5955 151761 228147 173968 84357 170558 202380 -13568 -11998 152654 -50243 -164392 -96402
5944 -96402 98715 202157 -102116 157870 -164321 -163045 -89422 -24263 -105887 89455 194085
5933 194085 287504 260499 143430 56442 51781 295086 366817 345878 341620 389976 339877 343783
$$ packed form
6008d0228J3618L49502k92843n653j83166J88591l71301J45612R9389Q4261J9757
5997G539J2819J71144j85112j46870n1900q8657J09582j1577j0550J93094L4252
5986C3764j9570K65682q9734l30967J4257k93878J25783K59262K028J84855K10116
5975C61598j48303R0155l32275J67967j53329O1229k83412J6189J30357L7533
5965e2291J11503J41779P0463j80329j25659p5974j64061K03024m5239K68545
5955A51761P6386n4179q9611Q6201L1822k15948J570J64652k02897j14149O7990
5944i6402J95117J03442l04273K59986l22191J276P3623O5159q1624J95342J04630
5933A94085R3419k7005j17069q6988m661K43305P1731k0939m258M8356n0099L906
$$ plain form
5921 343783 90167 183292 137424 -43526 80631 277916 401762 426576 524354 499977 308103
5910 308103 289107 251534 359649 362330 386623 659207 767122 600478 820475 679860 729563
5899 729563 715593 805482 992107 1102568 1164645 1112867 1195241 875042 820925 717815 709105
5888 709105 587493 379124 335559 222884 65137 222344 349814 543937 581949 604023
5878 604023 818205 798208 780970 700147 564398 307589 353186 340928 266292 166727 253551
5867 253551 295614 -72943 145902 260747 239519 224782 179137 -56082 -125315 -120790 -1821
5856 -1821 133630 125765 170532 7377 265662 366244 561706 333194 241366 527199 426767
5845 426767 304591 297075 570226 566289 622663 364677 86161 64617 -49348 -44366 138581
$$ packed form
5921C43783k53616R3125m5868j80950J24157J97285J23846K4814R7778k4377j91874
5910C08103j8996l7573J08115K681K4293K72584J07915j66644K19997j40615M9703
5899G29563j3970Q9889J86625J10461O2077n1778Q2374l20199n4117j03110q710
5888G09105j21612k08369m3565j12675j57747J57207J27470J94123L8012K2074
5878F04023K14182j9997j7238q0823j35749k56809M5597j2258p4636r9565Q6824
5867B53551M2063l68557K18845J14845k1228j4737m5645k35219o9233M525J18969
5856a821J35451p865M4767j63155K58285J00582J95462k28512r1828K85833j00432
5845D26767j22176p516K73151l937N6374k57986k78516k1544j13965M982J82947
$$ plain form
5834 138581 -63147 47002 124396 319639 304026 -40651 -100507 -38040 13786 239597 179487
5823 179487 138885 116060 147306 155594 221583 -32236 115788 146743 323502 107907 206342
5812 206342 425631 289918 284463 222277 252995 261989 125610 190817 183287 43264 116942
5801 116942 -30155 157061 9123 253452 66641 81826 90903 -35808 141496 102742
5791 102742 14429 47080 -147919 171689 -4561 -115920 -141773 -84014 -150183 -61872 22826
5780 22826 198793 67467 -137164 -110885 -185467 -112107 3383 -148360 -194387 -121113 -107701
5769 -107701 -36341 -70996 68503 221745 74888 -7001 -59127 -3780 197333 162759 -60159
5758 -60159 3696 -75614 137368 285257 105474 68141 -18366 -19069 44963 -10143 80758 44927
$$ packed form
5834A38581k01728J10149P7394J95243j5613l44677n9856O2467N1826K25811o0110
5823A79487m0602k2825L1246Q288O5989k53819J48024L0955J76759k15595R8435
5812B06342K19289j35713n455o2186L0718Q994j36379O5207p530j40023P3678
5801A16942j47097J87216j47938K44329j86811J5185R077j26711J77304l8754
5791A02742q8313L2651j94999L19608j76250j11359k5853N7759o6169Q8311Q4698
5780B2826J75967j31326k04631K6279p4582P3360J15490j51743m6027P3274J3412
5769a07701P1360l4655J39499J53242j46857q1889n2126N5347K01113l4574k22918
5758f0159O3855p9310K12982J47889j79783l7333q6507p03O4032n5106R0901l5831
$$ plain form
5746 44927 -132891 30600 -71122 6825 66606 16701 59617 -138254 -103596 -53858 -65253
5735 -65253 -199038 -330656 -245531 -80685 64248 -211720 -28277 21789 25300 32486 149717
5724 149717 -152783 -106451 -210200 -68304 -188291 -354 80704 51367 -124466 -136751
5714 -136751 -103981 -47712 -299372 -270567 12768 -87177 -40342 -38832 58547 152801 -79548
5703 -79548 -7010 62246 -133436 -91043 -150896 -2928 100057 -60544 -135060 -115606 -150122
5692 -150122 -31209 -250344 -95699 45682 -49471 -47845 233961 -83048 -109076 -127885 -104202
5681 -104202 -21889 -184955 -273620 87603 19209 -45917 -52289 7494 65671 -135955 -90315
5670 -90315 115894 112680 254505 158917 280287 153888 -114977 -207622 -56520 -53443 -111380
$$ packed form
5746D4927j77818J63491j01722P7947N9781m9905M2916j97871L4658M9738j1395
5735f5253j33785j31618Q5125J64846J44933k75968J83443N0066L511P186J17231
5724A49717l02500M6332j03749J41896j19987J87937Q1058k9337j75833j2285
5714a36751L2770N6269k51660K8805K83335r9945M6835J510R7379R4254k32349
5703g9548P2538O9256j95682M2393n9853J47968J02985j60601p4516J9454l4516
5692a50122J18913k19135J54645J41381r5153J626K81806l17009k6028j8809K3683
5681a04202Q2313j63066q8665L61223o8394o5126o372N9783N8177k01626M5640
5670i0315K06209l214J41825r5588J21370j26399k68865r2645J51102L077n7937
$$ plain form
5659 -111380 -31148 -87928 88532 -33012 141248 150431 -108836 -71168 -84786 -272744 -47943
5648 -47943 -49284 215793 174945 -181942 -13432 60627 -130583 -141963 -34656 -8072 -11691
5637 -11691 -46398 -46929 88754 13324 79943 188223 -80453 -39026 -30928 -131871 -197751 -171285
5625 -171285 -26806 5011 -65415 -93324 -222883 -27960 45208 33873 41401 120679 136957
5614 136957 -41823 -101322 -331830 -193133 -294743 -265163 -266787 12952 60617 28938 174007
5603 174007 67035 -32515 25947 -74005 -21772 -105785 68102 192889 -23655 -101904 -115380
5592 -115380 -96107 -381767 -393666 -246777 -139642 68919 63194 -20760 -102706 -166930 22283
5581 22283 -54466 -6542 42716 -77767 133772 91399 -54416 -60732 -153378 10291 -7624
$$ packed form
5659a11380Q0232n6780J76460j21544J74260R183k59267L7668j3618j87958K24801
5648d7943j341K65077m0848l56887J68510P4059j91210j1380J07307K6584l619
5637a1691l4707n31J35683p5430O6619J08280k68676M1427Q098j00943o5880K6466
5625a71285J44479L1817p0426k7909j29559J94923P3168j1335P528P9278J6278
5614A36957j78780n9499k30508J38697j01610K9580j624K79739M7665l1679J45069
5603A74007j06972r9550N8462r9952N2233q4013J73887J24787k16544p8249j3476
5592a15380J9273k85660j1899J46889J07135K08561n725q3954q1946o4224J89213
5581B2283p6749M7924M9258j20483K11539m2373j45815o316r2646J63669j7915
$$ plain form
5570 -7624 46692 64937 341404 98056 -159492 -12863 122778 -53291 -24236 -40457 -45345
5559 -45345 -19264 -35446 71274 65520 136055 5036 139440 169418 69100 -271 266440
5548 266440 33835 -162118 11096 234534 344326 291476 214885 91141 -364072 -417378
5538 -417378 -265976 24319 6227 4662 74512 12114 25439 -103113 -23387 -64334 -10141
5527 -10141 63725 13538 42338 194348 92905 203883 195753 147044 152654 141538 85478 144187
5515 144187 127257 244891 273381 233674 133220 -16405 -82284 32335 -28631 -115347 139223
5504 139223 219778 397252 579442 443181 441080 457549 292271 208553 136443 46971 255983
5493 255983 217160 434340 398420 97057 262890 196846 197932 91084 293949 287928 317515
$$ packed form
5570g624N4316J8245K76467k43348k57548J46629J35641j76069K9055j6221m888
5559d5345K6081j6182J06720n754P0535j31019J34404K9978j00318o9371K66711
5548B66440k32605j95953J73214K23438J09792n2850p6591j23744m55213n3306
5538d17378J51402K90295j8092j565O9850o2398J3325j28552P9726m0947N4193
5527a0141P3866n0187K8800J52010j01443J10978q130m8709N610j1116n6060N8709
5515A44187j6930J17634K8490l9707j00454j49625o5879J14619o0966q6716K54570
5504A39223Q0555J77474J82190j36261k101J6469j65278q3718p2110q9472K09012
5493B55983l8823K17180l5920l01363J65833o6044J086j06848K02865o021K9587
$$ plain form
5482 317515 329125 303882 309288 165989 6118 111996 239024 345030 387172 376829 376870
5471 376870 134059 116379 316320 284773 121869 -12367 -90785 253372 322386 297329 356042
5460 356042 364443 390988 395335 418094 193455 176393 209114 250800 230243 157891 174312 449193
5448 449193 232289 288677 372246 250990 333842 156452 182240 268564 251230 281707 183220
5437 183220 75107 216433 147557 157585 160422 87563 515722 465920 307728 411692 234555
5426 234555 239027 108455 60506 -29139 86157 40791 374583 285642 320605 465320 440035
5415 440035 449733 657530 365469 289962 325218 445132 478350 352493 279009 395028 364446
5404 364446 269442 359592 450490 479815 257736 191770 173087 53252 94747 23609 -32659
$$ packed form
5482C17515J1610k5243N406j43299j59871J05878J27028J06006M2142j0343M1
5471C76870k42811j7680J99941l1547j62904j34236p8418L44157O9014k5057N8713
5460C56042Q401K6545M347K2759k24639j7062L2721M1686k0557p2352J6421K74881
5448D49193k16904N6388Q3569j21256Q2852j77390K5788Q6324j7334L0477r8487
5437A83220j08113J41326o8876J0028K837p2859M28159m9802j58192J03964j77137
5426B34555M472j30572m7949q9645J15296m5366L33792q8941L4963J44715k5285
5415D40035R698K07797k92061p5507L5256J19914L3218j25857p3484J16019l0582
5404C64446r5004R0150R0898K9325k22079o5966j8683j19835M1495p1138n6268
$$ plain form
5393 -32659 -30216 -25206 22429 163008 211993 131967 282658 245064 164802 133394 314844 268031
5381 268031 291941 316210 224631 -11944 149873 188380 177333 214700 249849 264900 562537
5370 562537 489873 266838 88555 192266 75966 133558 23223 204867 359741 373261
5360 373261 253132 193404 315554 335497 13925 181031 149982 228728 164144 270236 395639
5349 395639 230202 173439 76647 40006 168014 207418 232980 415188 347478 320185 446653
5338 446653 529267 292347 374844 250877 -6676 -216410 -229642 39701 98181 148223 274622
5327 274622 316646 335020 118069 59818 165761 195482 -53768 47006 187167 273593 132685
5316 132685 129101 266253 151880 133567 221635 66293 201587 266066 167626 64701 91729
$$ packed form
5393c2659K443N010M7635J40579M8985q0026J50691l7594q0262l1408J81450m6813
5381B68031K3910K4269r1579k36575J61817L8507j1047L7367L5149J5051K97637
5370E62537p2664k23035j78283J03711j16300N7592j10335J81644J54874J3520
5360C73261j20129n9728J22150J9943l21572J67106l1049P8746o4584J06092J25403
5349C95639j65437n6763r6792l6641J28008L9404K5562J82208o7710k7293J26468
5338D46653Q2614k36920Q2497j23967k57553k09734j3232K69343N8480N0042J26399
5327B74622M2024J8374k16951n8251J05943K9721k49250J00774J40161Q6426j40908
5316A32685l584J37152j14373j8313Q8068j55342J35294O4479r8440j02925K7028
$$ plain form
5305 91729 51585 46514 17829 64394 207132 480812 600410 479501 271504 204730 217799
5294 217799 88717 136707 46628 37376 58029 -51700 434685 425389 210886 239895 322315
5283 322315 285297 214616 91654 242025 227148 203542 318816 153092 340741 467033
5273 467033 269284 349762 317035 239388 384707 341539 427710 557453 290504 324396 439997
5262 439997 160371 174864 254099 70871 -119303 -137546 242141 178192 104161 334364 269416
5251 269416 138703 278770 1871 8571 66225 121538 261975 153959 150889 104002 288857
5240 288857 277212 273975 203995 460880 628722 523927 183926 62238 116015 238773 369679
5229 369679 296011 339596 377687 352858 433692 563828 409902 582095 618427 656681 710038
$$ packed form
5305I1729m0144n071k8685M6565J42738K73680J19598j20909k07997o6774J3069
5294B17799j29082M7990r0079r252K0653j09729M86385r296k14503K9009Q2420
5283C22315l7018p0681j22962J50371j4877k3606J15274j65724J87649J26292
5273D67033j97749Q0478l2727p7647J45319m3168Q6171J29743k66949L3892J15601
5262D39997k79626J4493P9235j83228j90174j8243L79687o3949p4031K30203o4948
5251B69416j30713J40067k76899O700N7654N5313J40437j08016l070m6887J84855
5240B88857j1645l237o9980K56885J67842j04795l40001j21688N3777J22758J30906
5229C69679p3668M3585L8091k4829Q0834J30136j53926J72193L6332L8254N3357
$$ plain form
5218 710038 736057 721737 789662 779948 409358 482588 557268 600185 303267 331566 309795
5207 309795 388800 199674 206959 319686 287010 285833 221926 168965 -3501 -23848 81955
5196 81955 69897 130835 150618 181179 167656 145878 60788 49498 -152846 -40539 164937
5185 164937 160700 182532 204820 157363 159251 281494 176046 58090 -21795 76591 368429
5174 368429 311237 212069 336674 150285 -173867 -64004 121150 149584 -17830 122820
5164 122820 241175 237250 166955 209957 309187 89982 18849 147439 294364 138900 267312
5153 267312 196090 416629 424624 301157 227283 207455 243228 291787 304814 379788 290688
5142 290688 131261 101715 183325 24482 56052 82755 -36642 160579 63836 118605 90864
$$ packed form
5218G10038K6019j4320O7925r714l70590P3230P4680M2917k96918K8299k1771
5207C09795P9005j89126P285J12727l2676j177o3907n2961j72466k0347J05803
5196H1955j2058O0938J9783L0561j3523k1778q5090j1290k02344J12307K05476
5185A64937m237K1832K2288m7457J888J22243j05448j17956p9885R8386K91838
5174C68429n7192r9168J24605j86389l24152J09863J85154K8434j67414J40650
5164A22820J18355l925p0295M3002R9230k19205p1133J28590J46925j55464J28412
5153B67312p1222K20539P995j23467p3874j9828L5773M8559J3027P4974q9100
5142B90688j59427k9546Q1610j58843L1570K6703j19397J97221r6743N4769k7741
$$ plain form
5131 90864 1555 -71587 -234025 -361762 -117869 -70373 -89327 77815 328191 494076 194694
5120 194694 -20831 -147148 14380 -62086 -263894 -316448 -163035 49417 259614 222988
5110 222988 263790 276310 111083 154616 163656 298249 202215 -49743 39343 167164 289392
5099 289392 132331 31529 87964 -109255 -44844 93899 261767 483973 484701 400038 268694
5088 268694 -56919 -34965 -349102 -124308 -50595 -35922 -39324 121070 58846 -116821 -47635
5077 -47635 -73303 -143007 -307371 -82875 154163 341787 402189 287533 170009 -99038
5067 -99038 -98209 -133349 -42460 37701 -35355 11493 -12164 44556 201553 257419 212914 240377
5055 240377 59859 220489 -53752 133311 -7773 -54352 16502 81316 28392 35862 -62089
$$ packed form
5131I0864q9309p3142j62438j27737K43893M7496j8954J67142K50376J65885k99382
5120A94694k15525j26317J61528p6466k01808n2554J53413K12452K10197l6626
5110B22988M0802J2520j65227M3533R040J34593r6034k51958Q9086J27821J22228
5099B89392j57061j00802N6435j97219O4411J38743J67868K22206P28q4663j31344
5088B68694l25613K1954l14137K24794P3713J4673l402J60394o2224j75667O9186
5077d7635k5668o9704j64364K24496K37038J87624O0402j14656j17524k69047
5067i9038Q29l5140R0889Q0161p3056M6848k3657N6720J56997N5866m4505K7463
5055B40377j80518J60630k74241J87063j41084m6579P0854O4814n2924P470r7951
$$ plain form
5044 -62089 191096 122195 62697 -28510 -122985 -39877 74138 198810 92146 103594 41618
5033 41618 136711 -39339 132316 226140 24557 12635 -85471 -222512 -275347 -183995 -97118
5022 -97118 13771 130959 254237 295167 279299 98155 34 -175924 -380915 -261355
5012 -261355 -130505 157866 208421 306009 238762 70498 -39357 -216502 -135662 91596
5002 91596 277863 245568 273229 215421 262981 228862 -19575 -230442 -170369 -74146 104289
4991 104289 146343 1896 85943 89542 58586 -6326 -54785 66120 430156 168707 201011
4980 201011 178137 168462 1488 -101814 -128572 123938 89841 171403 147986 272027 284018
4969 284018 325575 337054 184222 -52616 -57844 184498 59445 35172 51401 89622 50167
$$ packed form
5044f2089K53185o8901n9498r1207r4475Q3108J14015J24672j06664J1448o1976
5033D1618R5093j76050J71655R3824k01583j1922r8106j37041n2835R1352Q6877
5022i7118J10889J17188J23278M0930j5868j81144r8121j75958k04991J19560
5012b61355J30850K88371N0555R7588o7247j68264j09855j77145Q0840K27258
5002I1596J86267l2295K7661n7808M7560l4119k48437k10867O0073R6223J78435
4991A04289M2054j44447Q4047L599l0956o4912m8459J20905L64036k61449L2304
4980B01011k2874r675j66974j03302k6758K52510l4097Q1562k3417J24041J1991
4969B84018M1557J1479j52832k36838n228K42342j25053k4273J6229L8221l9455
$$ plain form
4958 50167 52807 241187 239509 -34515 60020 34422 -14393 -91541 86220 155528 373427
4947 373427 473690 359818 -33941 -238530 -165439 -139673 -161736 -102173 -120680 246566 380033
4936 380033 133656 75484 105268 -105977 -7813 137886 124788 238439 143440 399552 247632
4925 247632 192336 47309 -130625 -44182 48508 -79325 191089 366215 360293 320494 -35566
4914 -35566 -78407 11360 -43210 198691 189641 224456 118477 185047 195995 98604 241614
4903 241614 134101 63730 157013 -74021 57873 75252 39541 194112 325613 219737
4893 219737 6854 83527 48919 6446 115067 225976 135440 197845 186803 185159 52033
4882 52033 173336 72749 -128919 26609 2218 -87698 81712 -38507 169217 163527 212311
$$ packed form
4958E0167K640J88380j678k74024R4535k5598m8815p7148J77761O9308K17899
4947C73427J00263j13872l93759k04589P3091K5766k2063N9563j8507L67246J33467
4936C80033k46377n8172K9784k11245R8164J45699j3098J13651r4999K56112j51920
4925B47632n5296j45027j77934Q6443R2690j27833K70414J75126n922l9799l56060
4914c5566m2841Q9767n4570K41901r050L4815j05979O6570J0948r7391J43010
4903B41614j07513p0371R3283k31034J31894J7379l5711J54571J31501j05876
4893B19737k12883P6673l4608m2473J08621J10909r0536O2405j1042j644j33126
4882E2033J21303j00587k01668J55528k4391q9916J69410j20219K07724n690M8784
$$ plain form
4871 212311 368465 325023 262533 166549 206699 377350 386599 376560 265021 114863 -15036
4860 -15036 48927 94258 292592 303700 293438 385571 244130 144670 162192 237237 140839
4849 140839 248153 303299 294607 231431 79117 59375 82091 153686 178335 329870 302507
4838 302507 394566 391459 423808 161698 197862 114503 155441 73804 111355 136095 255488
4827 255488 79621 -79015 -51424 180084 502675 274928 307267 281709 634291 457072
4817 457072 273674 351854 287296 366944 336692 354908 556133 154585 473110 553525 567501
4806 567501 470302 428919 564799 485705 254799 376386 290927 423047 273505 314786 493066
4795 493066 438097 393908 469860 470632 550728 602489 414013 662406 386247 666518 836873
$$ packed form
4871B12311J56154m3442o2490r5984M0150J70651R249j0039j11539j50158j29899
4860a5036O3963M5331J98334J1108j0262R2133j41441r9460J7522P5045r6398
4849A40839J07314N5146q692o3176j52314j9742K2716P1595K4649J51535k7363
4838C02507R2059l107L2349k62110L6164q3359M0938q1637L7551K4740J19393
4827B55488j75867j58636K7591K31508L22591k27747L2339k5558L52582j77219
4817D57072j83398P8180o4558P9648l0252J8216K01225m01548L18525Q0415J3976
4806E67501r7199m1383J35880p9094k30906J21587q5459J32120j49542M1281J78280
4795D93066n4969m4189P5952P72Q0096N1761j88476K48393k76159K80271J70355
$$ plain form
4784 836873 633410 704892 833670 722872 762614 865820 880310 711110 691009 986876
4774 986876 1060143 968550 1168421 1158244 1126260 1365895 1651892 1715876 1904590 1690867 1740415
4763 1740415 1448050 1068457 864279 783979 916468 770192 519643 892906 908531 582960
4753 582960 868223 808858 601436 638239 846825 695662 673680 887674 813182 476605
4743 476605 559733 556111 536173 310524 614134 627872 445777 652806 773500 864858 878903
4732 878903 565814 735178 727798 561114 522159 452450 523893 521986 811815 931908 1079694
4721 1079694 984564 1130926 968222 671295 633758 879722 697402 778477 988735 890455
4711 890455 900341 705836 815254 778474 616617 840847 1019488 987371 1194196 1096810 1063022
$$ packed form
4784H36873k03463P1482J28778j10798L9742J03206J4490j69200k0101K95867
4774I86876P3267r1593J99871j0177l1984K39635K85997O3984J88714k13723M9548
4763A740415k92365l79593k04178q0300J32489j46276k50549L73263J5625l25571
4753E82960K85263n9365k07422L6803K08586j51163k1982K13994p4492l36577
4743D76605Q3128l622j9938k25649L03610J3738j82095K07029J20694R1358J4045
4732H78903l13089J69364p380j66684l8955o9709P1443j907K89829J20093J47786
4721A079694r5130J46362j62704k96927l7537K45964j82320Q1075K10258r8280
4711H90455R886j94505J09418l6780j61857K24230J78641l2117K06825r7386l3788
$$ plain form
4700 1063022 883185 868325 884263 1063416 1213780 1213311 1293643 1309277 1192892 1059798 983567
4689 983567 944027 836912 1016185 1109587 1108971 1078601 1067523 785664 924152 890760 1070214
4678 1070214 1008214 836014 1216123 1169274 1124947 1501418 1374634 1290193 1372754 1215985
4668 1215985 1230734 815609 812023 1002950 1120479 1100810 1248917 1189486 1339025 1190012
4658 1190012 1174597 1356233 1163779 1000044 977759 998417 1118054 1052610 1032073 1324161
4648 1324161 1451454 1608466 1704596 1501514 1411747 1439690 1371688 1307457 1257723 1281519 1220334
4637 1220334 1384442 1626559 1695820 1398659 1746105 1846788 1705413 1572615 1588846 1697472
4627 1697472 1513489 1695034 1855695 2131829 2184778 2002877 1879551 2235543 2010018 2071667
$$ packed form
4700A063022j79837j4860J5938J79153J50364m69Q0332J5634j16385j33094p6231
4689I83567l9540j07115J79273R3402o16l0370j1078k81859J38488l3392J79454
4678A070214o2000j72200L80109m6849m4327L76471j26784q4441Q2561j56769
4668A215985J4749m15125l586J90927J17529j9669J48107n9431J49539j49013
4658A190012j5415J81636j92454j63735k2285K0658J19637o5444k0537K92088
4648A324161J27293J57012R6130k03082q9767K7943o8002o4231m9734K3796o1185
4637A220334J64108K42117O9261k97161L47446J00683j41375j32798J6231J08626
4627A697472j83983J81545J60661K76134N2949j81901j23326L55992k25525O1649
$$ plain form
4617 2071667 2166364 2034064 2012753 2318610 2314981 2357405 2300605 2290477 2151987 2069573 2364952
4606 2364952 2292278 2369787 2606564 2777933 2955630 2754789 2880805 2943417 2985036 2769356
4596 2769356 2900978 3045299 3059861 2979284 3098515 3222830 3416332 3525021 3716183 3968719
4586 3968719 3916891 4173816 4367613 4661738 4920876 4847389 4836824 4690597 4387005 4441269
4576 4441269 4328190 4301244 4381691 4481980 4709269 4693272 4757182 4748324 4669070 4867337 4818774
4565 4818774 4986133 5006188 5178316 5162801 5476366 5581658 5717290 5759562 5845716 5904039
4555 5904039 6059874 6337854 6444916 6651690 6802726 6967768 7136170 7403053 7544753 7799637
4545 7799637 8161731 8420320 8577493 8930918 9233080 9328302 9370410 9396870 9373779 9107797
$$ packed form
4617B071667R4697j32300k1311L05857l629M2424n6800j0128j38490q2414K95379
4606B364952p2674P7509K36777J71369J77697k00841J26016O2612M1619k15680
4596B769356J31622J44321J4562q0577J19231J24315J93502J08689J91162K52536
4586C968719n1828K56925J93797K94125K59138p3487j0565j46227l03592N4264
4576D441269j13079k6946Q0447J00289K27289j5997O3910q858p9254J98267m8563
4565D818774J67359K0055J72128j5515L13565J05292J35632M2272Q6154N8323
4555E904039J55835K77980J07062K06774J51036J65042J68402K66883J41700K54884
4545G799637L62094K58589J57173L53425L02162R5222M2108K6460k3091k65982
$$ plain form
4535 9107797 9206566 9263207 9303111 9466368 9900621 10219773 10459357 10502942 10869901 11153024
4525 11153024 11289904 11564001 12013070 12482926 12970785 13507704 13766321 14139633 14869630
4516 14869630 15316980 16001265 16686869 17287573 18001548 18593736 19249332 19785641 20269834
4507 20269834 20743112 21081669 21804534 22468176 23104941 24000994 25008670 26295325 27287568
4498 27287568 28488705 30070947 31615845 33358840 35335622 37732430 40498692 43512087
4490 43512087 46915669 50836041 55238477 60197265 66307257 73277659 81747157 91860569
4482 91860569 104471673 120377261 140695655 166238133 197130834 229998234 255404329
4475 255404329 262630699 247763020 216236678 178472858 143503885 115248892 94545938
$$ packed form
4535I107797R8769N6641L9904J63257M34253L19152K39584M3585L66959K83123
4525A1153024J36880K74097M49069M69856M87859N36919K58617L73312P29997
4516A4869630M47350O84285O85604O00704P13975N92188O55596N36309M84193
4507B0269834M73278L38557P22865O63642O36765Q96053J007676J286655R92243
4498B7287568J201137J582242J544898J742995J976782K396808K766262L013395
4490D3512087L403582L920372M402436M958788O109992O970402Q469498J0113412
4482I1860569J2611104J5905588K0318394K5542478L0892701L2867400K5406095
4475B55404329P226370j4867679l1526342l7763820l4968973k8254993k0702954
$$ plain form
4468 94545938 79935387 69400082 61236932 55306235 50222966 45817546 42034505 38895268
4460 38895268 36121241 33652465 31333620 29189029 27164502 25591586 24211806 22952534
4452 22952534 22099405 21273356 20663187 19768029 19213262 18437641 17962934 17454160 16873664
4443 16873664 16345732 15830791 15066204 14683052 14437445 14072646 13675134 13211289 12767519
4434 12767519 12504644 12167416 11986386 11590442 11317759 11321868 11104934 10648786 10204732 10192380
4424 10192380 9926062 9740622 9686740 9378738 9290758 9104134 8762242 8496852 8436940 8489519
4414 8489519 8565734 8735939 8819264 8465994 8674395 8800374 8613097 8533441 8327415 8312953
4404 8312953 8244776 8261739 8444652 8434826 8300647 8609112 8529223 8370298 8579623 8570635 8378909
$$ packed form
4468I4545938j4610551j0535305q163150n930697n083269m405420l783041l139237
4460C8895268k774027k468776k318845k144591k024527j572916j379780j259272
4452B2952534q53129q26049o10169q95158n54767p75621m74707n08774n80496
4443A6873664n27932n14941p64587l83152k45607l64799l97512m63845m43770
4434A2767519k62875l37228j81030l95944k72683M109k16934m56148m44054j2352
4424A0192380k66318j85440n3882l08002q7980j86624l41892k65390n9912N2579
4414H489519P6215J70205Q3325l53270K08401J25979j87277p9656k06026j4462
4404H312953o8177J6963J82913r826j34179L08465p9889j58925K09325q988j91726
$$ plain form
4393 8378909 8945066 9112193 9144093 9472280 9608019 10103222 10184158 10612487 11107557 11481847
4383 11481847 11264164 10982716 10557915 10192623 9910963 9838801 9681550 9763481 9620564 9640996
4373 9640996 9736333 9816283 9743773 9809054 10078515 10094116 10430443 10565361 10464049 10363340
4363 10363340 10598786 10615111 10611545 10723276 11228121 11571800 11801284 11833749 12022271 11915960
4353 11915960 12297404 12411419 12651875 13071889 13269276 13482528 14142690 14458559 14728143
4344 14728143 14778251 15198161 15457317 15780114 16408970 16864510 17564811 17936503 18631385 19004169
4334 19004169 19474344 20205230 20890375 21645377 22439959 23312783 24008385 24792119 25632963
4325 25632963 26056764 26585467 27565286 28601363 29770465 31038236 32480968 34118721 35473552
$$ packed form
4393H378909N66157J67127L1900L28187J35739M95203Q0936M28329M95070L74290
4383A1481847k17683k81448m24801l65292k81660p2162j57251Q1931j42917K0432
4373I640996R5337P9950p2510O5281K69461J5601L36327J34918j01312j00709
4363A0363340K35446J6325l566J11731N04845L43679K29484L2465J88522j06311
4353A1915960L81444J14015K40456M20014J97387K13252O60162L15869K69584
4344A4728143N0108M19910K59156L22797O28856M55540P00301L71692O94882L72784
4334A9004169M70175P30886O85145P55002P94582Q72824O95602P83734Q40844
4325B5632963M23801N28703R79819J036077J169102J267771J442732J637753J354831
$$ plain form
4316 35473552 37042330 38341740 40089817 41735353 43399119 45187290 47323466 49690350
4308 49690350 52201490 54803365 57667512 61152020 65276356 70019252 75770804 83237580
4300 83237580 92064410 102756226 115476867 131079456 150337668 174310115 203504256
4293 203504256 236330033 265688850 280317908 272072937 245188669 209564653 174493241
4286 174493241 145329688 123376431 107251393 95777885 86990833 80441760 75110497
4279 75110497 71226143 68023614 65440002 63812856 62353479 61350761 60846249 60836665 61135587
4270 61135587 61735994 62662770 64531900 66738701 69910530 72968724 77527443 82567828
4262 82567828 88516574 96002151 105081016 116245160 130471261 148694311 171675205 199889275
$$ packed form
4316C5473552J568778J299410J748077J645536J663766J788171K136176K366884
4308D9690350K511140K601875K864147L484508M124336M742896N751552P466776
4300H3237580Q826830J0691816J2720641J5602589J9258212K3972447K9194141
4293B03504256L2825777K9358817J4629058q244971k6884268l5624016l5071412
4286A74493241k9163553k1953257j6125038j1473508q787052o549073n331263
4279G5110497l884354l202529k583612j627146j459377j002718n04512r584K98922
4270F1135587O00407R26776J869130K206801L171829L058194M558719N040385
4262H2567828N948746P485577R078865J1164144J4226101J8223050K2980894K8214070
$$ plain form
4254 199889275 230279228 256884260 269881433 263757880 240453850 207386832 173204241
4247 173204241 143523353 119936584 101856184 88388708 77936019 69691729 63055766
4240 63055766 57552747 52878507 48767049 44927162 41851991 39085045 36513243 34318807
4232 34318807 32391425 30651282 28921712 27706645 26507696 25315554 24250887 23285132
4224 23285132 22651174 21995158 21297564 20295783 19692795 18870292 18045479 17384929 16932930
4215 16932930 16178499 15666502 15201044 14786048 14445621 13829268 13239825 12656897 12425230
4206 12425230 12206303 12065905 11870822 11478486 11011965 10597674 10239717 9893637 9800877 9542410
4196 9542410 9195537 8873617 8864293 8660833 8319382 8301161 7824046 7769283 7995138 8073736
$$ packed form
4254A99889275L0389953K6605032J2997173o123553k3304030l3067018l4182591
4247A73204241k9680888k3586769j8080400j3467476j0452689q244290o635963
4240F3055766n503019m674240m111458l839887l075171k766946k571802k194436
4232C4318807j927382j740143j729570j215067j198949j192142j064667r65755
4224B3285132o33958o56016o97594j001781o02988q22503q24813o60550m51999
4215A6932930p54431n11997m65458m14996l40427o16353n89443n82928k31667
4206A2425230k18927j40398j95083l92336m66521m14291l57957l46080r2760k58467
4196I542410l46873l21920r324k03460l41451j8221m77115n4763K25855P8598
$$ plain form
4186 8073736 7930168 8117672 8017511 8008472 7620396 7776861 7649003 7457756 6845997 6698055
4176 6698055 6331799 6111620 5998955 5844150 5514067 5405260 5444558 5151878 5269050 5121439
4166 5121439 5139249 4803231 4904761 4907423 4839309 4784337 4932902 4989321 5060309 5105685 5137374
4155 5137374 5277197 5234800 5098315 4697487 4249175 3997171 3689974 3548136 3161752 3194381
4145 3194381 3099013 3362417 3012822 3176473 3390233 3460395 3240810 2809255 2540385 2638497
4135 2638497 2647424 2387941 2394371 2435103 2637473 2461630 2304167 2229762 2347535 2446487 2488076
4124 2488076 2463270 2396276 2584730 2487986 2326481 1908492 1912690 2010519 2093778 2204847 2246706
4113 2246706 2292894 2173925 2094668 1923377 2031734 1952657 2037190 2016629 2202631 2157081 2019306
$$ packed form
4186H073736j43568J87504j00161r039l88076J56465j27858j91247o11759j47942
4176F698055l66256k20179j12665j54805l30083j08807L9298k92680J17172j47611
4166E121439J7810l36018J01530K662o8114n4972J48565N6419P0988M5376L1689
4155E137374J39823m2397j36485m00828m48312k52004l07197j41838l86384L2629
4145C194381r5368K63404l49595J63651K13760P0162k19585m31555k68870R8112
4135B638497Q927k59483O430M0732K02370j75843j57463p4405J17773R8952M1589
4124B488076k4806o6994J88454r6744j61505m17989M198R7829Q3259J11069M1859
4113B246706M6188j18969p9257j71291J08357p9077Q4533k0561J86002m5550j37775
$$ plain form
4102 2019306 2000618 1988943 2070311 2327071 2460268 2482619 2667137 2435185 2480199 2337709
4092 2337709 2356636 2234988 2032484 2065176 1975568 2051279 1770061 1816599 1747813 1763718 1742205
4081 1742205 1832110 1771706 1859686 1781667 1698976 1421857 1402178 1399130 1579960 1711394 1549039
4070 1549039 1364913 1377256 1467249 1668196 1259899 1008247 937415 1064201 1058971 1132514 1133548
4059 1133548 1027269 1093607 1181447 1000995 915807 844992 1021897 1061098 1090699 971932 905647
4048 905647 943055 676838 753193 781185 910912 680289 814671 875114 812368 820030 782328
4037 782328 854393 808683 639400 781303 861354 796076 787685 967456 951848 713318 845880
4026 845880 806843 919807 893233 849880 1021521 706116 904814 828656 679723 769330 790265
$$ packed form
4102B019306j8688j1675Q1368K56760J33197K2351J84518k31952M5014j42490
4092B337709J8927j21648k02504L2692q9608P5711k81218M6538o8786J5905k1513
4081A742205Q9905o0404Q7980p8019q2691k77119j9679l048J80830J31434j62355
4070A549039j84126J2343Q9993K00947m08297k51652p0832J26786n230P3543J034
4059A133548j06279O6338Q7840j80452q5188p0815J76905L9201K9601j18767o6285
4048I05647L7408k66217P6355K7992J29727k30623J34382O0443o2746P662l7702
4037G82328P2065m5710j69283J41903Q0051o5278q391J79771j5608k38530J32562
4026H45880l9037J12964k6574m3353J71641l15405J98698p6158j48933Q9607K0935
$$ plain form
4015 790265 782324 864539 781271 897411 901849 1050623 1170996 1156236 1317515 1306193 1181904
4004 1181904 1158152 1147720 1303816 1547660 1768027 1768116 2172538 2363497 2265013 1982285 1834072
3993 1834072 1537669 1342706 1100912 1297829 1275086 1065694 1101154 833165 752669 605802
3983 605802 491743 681569 550788 992212 1014513 905297 886542 589659 575807 521244
3973 521244 706393 827457 845212 867507 966169 932111 1175812 1301756 1456181 1375746 1460600
3962 1460600 1615748 1722098 1942619 1791484 1664763 1608848 1394107 1196392 1197774 1096541
3952 1096541 954534 935553 809487 625639 635853 534436 446344 510354 445113 530767 684023
3941 684023 569379 614152 596920 425651 607362 536199 466680 413543 328650 457035 315882
$$ packed form
4015G90265p941Q2215q3268J16140M438J48774J20373j4760J61279j1322j24289
4004A181904k3752j0432J56096K43844K20367Q9M04422J90959r8484k82728j48213
3993A834072k96403j94963k41794J96917k2743k09392L5460k67989q0496j46867
3983F05802j14059J89826j30781M41424K2301j09216j8755k96883j3852n4563
3973E21244J85149J21064J7755K2295R8662l4058K43701J25944J54425q0435Q4854
3962A460600J55148J06350K20521j51135j26721n5915k14741j97715J382j01233
3952A096541j42007j8981j26066j83848J0214j01417q8092O4010o5241Q5654J53256
3941F84023j14644M4773j7232j71269J81711p1163o9519n3137q4893J28385j41153
$$ plain form
3930 315882 176700 269343 167218 393346 265153 302098 376515 269790 88634 188376
3920 188376 383737 355616 181721 181795 276957 267384 80335 179001 122827 -6741 280330
3909 280330 278558 436135 432280 382267 460853 187082 -85182 67307 -54405 104026 322933
3898 322933 180389 259355 280887 400061 341096 344349 264874 211822 162347 47278 -36996
3887 -36996 29254 156189 274314 418022 352244 277130 120752 317507 300491 209883 195556
3876 195556 96320 176547 191218 237313 204454 93500 177699 363400 267045 319652 237639
3865 237639 218891 271709 86284 -70310 -13673 -21161 178829 276427 266153 226167 225452 120962
3853 120962 -26684 -80593 -13004 92863 66496 141844 300657 298292 292726 252665 28777
$$ packed form
3930C15882j39182R2643j02125K26128j28193L6945P4417j06725j81156R9742
3920A88376J95361k8121j73895P4R5162r573j87049R8666n6174j29568K87071
3909B80330j772J57577l855n0013P8586k73771k72264J52489j21712J58431K18907
3898C22933j42544P8966K1532J19174n8965L253p9475n3052m9475j15069q4274
3887c6996O6250J26935J18125J43708o5778p5114j56378J96755j7016r0608j4327
3876A95556r9236Q0227J4671M6095l2859j10954Q4199J85701r6355N2607q2013
3865B37639j8748N2818j85425j56594N6637p488J99990R7598j0274l9986p15j04490
3853A20962j47646n3909O7589J05867k6367P5348J58813k365n566m0061k23888
$$ plain form
3842 28777 -165035 -189024 -273138 -214458 11520 275106 589978 520110 554729 283330 94650
3831 94650 -72108 -327009 -223565 -77791 64085 154290 19259 252059 247007 440004
3821 440004 300489 118882 259639 100325 185129 17553 101400 97454 42927 58846 272121
3810 272121 204871 169273 259568 370353 391078 354495 354406 155138 115528 169923 134926 104818
3798 104818 -8130 -28632 188307 220326 365453 271270 322573 92712 -11779 -83864 -53627
3787 -53627 -16190 69609 -29916 61938 -80769 -27386 33908 -16447 37970 90194 124651 411712
3775 411712 322639 289704 126608 -79316 14790 24657 -75598 -63802 19934 275142 300104
3764 300104 309188 365965 280451 336954 157749 124559 -154845 -35723 192649 264873 266017
$$ packed form
3842B8777j93812k3989q4114N8680K25978K63586L14872o9868L4619k71399j88680
3831I4650j66758k54901J03444J45774J41876R0205j35031K32800n052J92997
3821D40004j39515j81607J40757j59314Q4804j67576Q3847l946n4527J5919K13275
3810B72121o7250l5598R0295J10785K0725l6583q9j99268l9610N4395l4997l0108
3798A04818j12948k0502K16939L2019J45127r4183N1303k29861j04491p2085L0237
3787e3627L7437Q5799r9525R1854j42707N3383O1294n0355N4417N2224L4457K87061
3775D11712q9073l2935j63096k05924R4106R867j00255J1796Q3736K55208K4962
3764C00104R084N6777q5514N6503j79205l3190k79404J19122K28372P2224J144
$$ plain form
3753 266017 285198 352146 353028 160731 396154 315415 251776 36913 56720 290726 332589
3742 332589 91599 366969 325987 71188 136396 68697 178668 166675 360904 332759 203399
3731 203399 521296 402649 176015 111849 920 99919 -121262 3264 317708 199602
3721 199602 331596 210399 67242 124117 -8641 194928 276459 209737 142810 194016 266920
3710 266920 315584 339451 300188 320445 337899 387336 426585 364694 149435 181129 142567
3699 142567 12196 -147651 43526 305622 409578 444617 630241 320219 298076 185429
3689 185429 56988 266421 68489 242229 51781 201936 396075 438317 497019 420770
3679 420770 520554 229395 150910 355842 253643 274550 400139 452393 483697 362487 305951
$$ packed form
3753B66017J9181O6948Q82j92297K35423q0739o3639k14863J9807K34006M1863
3742C32589k40990K75370m0982k54799O5208o7699J09971j1993J94229k8145j29360
3731B03399L17897j18647k26634o4166j10929R8999k21181J24526L14444j18106
3721A99602J31994j21197j43157N6875j32758K03569Q1531o6722o6927N1206P2904
3710B66920M8664K3867l9263K0257J7454M9437L9249o1891k15259L1694l8562
3699A42567j30371j59847J91177K62096J03956L5039J85624l10022k2143j12647
3689A85429j28441K09433j97932J73740j90448J50155J94139M2242N8702p6249
3679D20770R9784k91159p8485K04932j02199K0907J25589N2254L1304j21210n6536
$$ plain form
3668 305951 577931 456420 362261 306090 436961 487021 669569 611023 582314 705494 567689
3657 567689 472710 395540 92539 251597 221974 355905 694074 507200 693592 647886
3647 647886 772305 716845 816624 656682 739491 630553 808454 684470 452193 393181
3637 393181 515977 691899 797381 754327 944859 1042874 786616 717571 770268 885775
3627 885775 698353 700606 969976 1297487 1188454 1120944 975621 891239 969769 997532 1143590
3616 1143590 1139422 787631 1007854 1068173 1133687 1343187 1455240 1622083 1634288 1435604
3606 1435604 1719078 1804846 1721771 1674649 1570031 1520991 1679264 1979386 2187070 2278799
3596 2278799 2265111 2281033 2265317 2125373 2423737 2434728 2434432 2765714 3297238 3464157 3429141
$$ packed form
3668C05951K71980j21511r4159n6171J30871N0060J82548n8546k8709J23180j37805
3657E67689r4979p7170l03001J59058k9623J33931L38169j86874J86392m5706
3647F47886J24419n5460R9779j59942Q2809j08938J77901j23984k32277n9012
3637C93181J22796J75922J05482m3054J90532R8015k56258o9045N2697J15507
3627H85775j87422K253K69370L27511j09033o7510j45323q4382P8530K7763J46058
3616A143590m168l51791K20223O0319O5514K09500J12053J66843J2205j98684
3606A435604K83474Q5768q3075m7122j04618m9040J58273L00122K07684R1729
3596B278799j3688J5922j5716j39944K98364J0991k96L31282N31524J66919l5016
$$ plain form
3585 3429141 3418685 3530290 3675227 4065847 4271598 4489215 4916812 5184425 5818085 6296229
3575 6296229 6981064 7779871 8532924 9343922 10359513 11654611 13077616 14617262 16189554
3566 16189554 18143302 19963518 21566474 22361396 21760071 20297402 18103750 15607241
3558 15607241 13610359 11902454 10194470 8949044 7941561 6992771 6316466 5630034 4976314
3549 4976314 4666599 4236791 4164435 3639768 3696527 3454802 3124191 3207762 2814970 2588224
3539 2588224 2515417 2218992 2416145 2321398 2244661 2292589 2120910 1982579 1841861 1693880
3529 1693880 1773276 1610613 1509035 1587979 1424885 1276220 1404733 1006938 772035 965929
3519 965929 948991 1147047 1095818 1081432 1149791 920988 650825 744193 687121 746217 809814
$$ packed form
3585C429141j0456J11605J44937L90620K05751K17617M27597K67613O33660M78144
3575F296229O84835P98807P53053Q10998J015591J295098J423005J539646J572292
3566A6189554J953748J820216J602956P94922o01325j462669k193652k496509
3558A5607241j996882j707905j707984j245426j007483r48790o76305o86432o53720
3549D976314l09715m29808p2356n24667N6759k41725l30611Q3571l92792k26746
3539B588224p2807k96425J97153r4747p6737M7928j71679j38331j40718j47981
3529A693880P9396j62663j01578P8944j63094j48665J28513l97795k34903J93894
3519I65929j6938J98056n1229j4386O8359k28803k70163R3368n7072N9096O3597
$$ plain form
3508 809814 918598 978945 799701 572318 803528 743920 660898 605743 664000 779517 530012
3497 530012 658920 722541 684544 592339 354895 486124 526214 586724 502639 477782 394086
3486 394086 414251 459652 494000 473566 645337 675304 661410 503365 584290 495606 338612
3475 338612 354869 361241 550948 558592 350767 529981 503792 123805 300495 177707 355749
3464 355749 267673 377221 532562 501268 413224 469367 495228 534825 484954 579531 469125
3453 469125 399635 408426 461747 419233 541952 707178 814334 1175598 1078665 937265 754102
3442 754102 633628 389492 185405 234202 251657 341413 28911 365930 380876 267714
3432 267714 406517 393693 315742 188506 163573 166172 273420 371985 459135 562460 613048
$$ packed form
3508H09814J08784O0347j79244k27383K31210n9608q3022n5155N8257J15517k49505
3497E30012J28908O3621l7997r2205k37444J31229M0090O0510q4085k4857q3696
3486C94086K0165M5401L4348k0434J71771K9967j3894j58045Q0925q8684j56994
3475C38612J6257O372J89707P644k07825J79214k6189l79987J76690j22788J78042
3464C55749q8076J09548J55341l1294q8044N6143K5861L9597m9871R4577j10406
3453D69125o9490Q791N3321m2514J22719J65226J07156L61264r6933j41400j83163
3442G54102j20474k44136k04087M8797J7455Q9756l12502L37019J4946j13162
3432B67714J38803j2824p7951j27236k4933K599J07248R8565Q7150J03325N0588
$$ plain form
3421 613048 556937 650238 625860 745957 823371 668773 684382 798202 1047358 1038659 780889
3410 780889 829159 558325 536027 497118 442571 358558 547475 270737 340679 494960 696176
3399 696176 653733 763631 595562 476481 332973 357970 340195 170765 189473 458302
3389 458302 276645 260255 363339 282141 356976 619162 882296 925037 894736 749140 558859
3378 558859 142310 138028 179957 71583 170333 232969 354077 464669 201292 203476 215467
3367 215467 56859 111310 115617 -108290 268715 189093 402908 257761 249126 370982 309501
3356 309501 120644 244188 211057 115916 30215 -67035 44076 37260 106323 369127 363749
3345 363749 230730 108717 -37745 86471 317153 299408 266917 427213 331422 299202
$$ packed form
3421F13048n6111R3301k4378J20097P7414j54598J5609J13820K49156q699k57770
3410G80889M8270k70834k2298l8909n4547q4013J88917k76738O9942J54281K01216
3399F96176m2443J09898j68069j19081j43508K4997j7775j69430J8708K68829
3389D58302j81657j6390J03084q1198P4835K62186K63134M2741l0301j45596j90281
3378E58859m16549m282M1929j08374R8750O2636J21108J10592k63377K184J1991
3367B15467j58608N4451M307k23907L77005p9622K13815j45147q635J21856o1481
3356C09501j88857J23544l3131r5141q5701r7250J11111o816O9063K62804n378
3345C63749j33019j22013j46462J24216K30682j7745l2491J60296r5791l2220
$$ plain form
3335 299202 430188 358523 184216 119044 323450 276415 343839 512841 457315 337293 99091
3324 99091 1397 234564 136903 69802 179449 429400 450586 409089 274408 269960 210086
3313 210086 273078 421447 333956 497902 326312 215520 351280 380587 350739 408767 330455
3302 330455 353905 200032 166015 158389 253270 202910 594769 674375 598423 514761 433085
3291 433085 451666 128725 343871 599204 541189 773523 966483 977984 1019865 1111482 1128338
3280 1128338 1021433 1052698 1233511 1491553 1603409 1895519 2239115 2602229 2876380 2956912
3270 2956912 2933968 2655619 2523797 2291595 1880425 1573989 1390840 1252280 1400232 1387275
3260 1387275 1401080 1639312 1811400 1592492 1536695 1260154 1180554 1348123 1103506 1179479
$$ packed form
3335B99202J30986p1665j74307o5172K04406m7035O7424J69002n5526j20022k38202
3324I9091r7694K33167r7661o7101J09647K49951K1186m1497j34681m448n9874
3313B10086O2992J48369q7491J63946j71590j10792J35760K9307k9848N8028p8312
3302C30455K3450j53873l4017p626R4881n0360L91859P9606p5952q3662q1676
3291D33085J8581l22941K15146K55333n8015K32334J92960J1501M1881R1617J6856
3280A128338j06905L1265J80813K58042J11856K92110L43596L63114K74151Q0532
3270B956912k2944k78349j31822k32202m11170l06436j83149j38560J47952j2957
3260A387275J3805K38232J72088k18908n5797k76541p9600J67569k44617P5973
$$ plain form
3250 1179479 1271722 1313840 1878558 2214026 2435607 2628135 2547705 2820612 3197782 2917490
3240 2917490 2547634 1978341 1799396 1565170 1469522 1435430 1576775 1339015 1199355 1395520
3230 1395520 1039460 1008220 929591 833534 828978 664975 839232 1047824 768062 939487
3220 939487 744883 679099 442756 313212 370288 478843 386907 520083 489863 525565 513194
3209 513194 618549 601092 587834 416856 370679 401872 408092 354588 641666 545262 495504
3198 495504 746187 708298 575125 655281 515254 298337 202692 72158 125428 -93008
3188 -93008 214647 398293 475996 261680 462708 334590 213422 234175 199926 83045
3178 83045 204497 229298 185849 171994 30751 354795 343511 307031 161488 223576 86300
$$ packed form
3250A179479R2243M2118N64718L35468K21581J92528q0430K72907L77170k80292
3240B917490l69856n69293j78945k34226r5648l4092J41345k37760j39660J96165
3230A395520l56060l1240p8629r6057m556j64003J74257K08592k79762J71425
3220I39487j94604o5784k36343j29544N7076J08555r1936J33176l0220L5702j2371
3209E13194J05355j7457j3258j70978m6177L1193O220n3504K87078r6404m9758
3198D95504K50683l7889j33173Q0156j40027k16917r5645j30534N3270k18436
3188i3008L07655J83646P7703k14316K01028j28118j21168K0753l4249j16881
3178H3045J21452K4801m3449j3855j41243L24044j1284l6480j45543O2088j37276
$$ plain form
3167 86300 -140546 -169602 -107859 115369 -130582 2184 44997 138882 201702 76608 -113742
3156 -113742 -18789 8937 164762 19393 17566 303201 264764 232239 264788 183905 215704
3145 215704 68526 -82657 71001 185020 205062 186985 11571 126648 -284857 -58345
3135 -58345 170169 -29967 12488 40900 -69236 20620 162208 3100 42855 47684 358267
3124 358267 296699 376166 238828 290147 124165 -42924 -184817 15522 246363 200634
3114 200634 368484 412927 191929 43220 21023 53652 -149879 -56276 -85931 26131 -33213
3103 -33213 75716 -90836 -77775 30303 -77852 -110538 166413 67569 1494 21580 -205405
3092 -205405 -144916 -135426 -17910 54722 240207 303423 283900 243903 184298 27384 103916
$$ packed form
3167H6300k26846k9056O1743K23228k45951J32766M2813R3885O2820j25094j90350
3156a13742R4953K7726J55825j45369j827K85635l8437l2525L2549q0883L1799
3145B15704j47178j51183J53658J14019K0042j8077j75414J15077m11505K26512
3135e8345K28514k00136M2455K8412j10136Q9856J41588j59108L9755M829L10583
3124C58267o1568P9467j37338N1319j65982j67089j41893K00339K30841m5729
3114B00634J67850M4443k20998j48709k2197L2629k03531R3603k9655J12062n9344
3103c3213J08929j66552J3061J08078j08155l2686K76951r8844o6075K0086k26985
3092b05405O0489R490J17516P2632J85485O3216j9523l9997n9605j56914P6532
$$ plain form
3081 103916 53795 18167 132809 149270 95555 108823 -105131 -211437 -31972 28039 148656
3070 148656 115229 171673 118633 -112368 -139988 -193433 -29320 21221 156949 116945 176707
3059 176707 161747 56795 34411 41503 124521 80357 -69513 90929 191276 112362 174215
3048 174215 48744 -3126 51849 44185 92292 -23745 166609 556 -106672 -287239 -184423
3037 -184423 19599 -63271 146577 165348 220644 203532 72715 27424 -125785 -121360 -126457
3026 -126457 -201128 -4762 81404 79175 -85377 -125308 -50084 -101907 -142638 -16791 -65088
3015 -65088 -165496 -207074 -290730 -426442 -239588 -71929 -50484 -64633 -15502 18510 124157
3004 124157 -187921 -325340 -255571 -335156 -40535 -139354 -162414 199160 75430 -52322
$$ packed form
3081A03916n0121l5628J14642J6461n3715J3268k13954j06306J79465O0011J20617
3070A48656l3427N6444n3040k31001k7620n3445J64113N0541J35728m0004N9762
3059A76707j4960j04952k2384P092Q3018m4164j49870J60442J00347p8914O1853
3048A74215j25471n1870N4975p664M8107j16037J90354j66053j07228j80567J02816
3037a84423K04022q2870K09848J8771N5296j7112j30817m5291j53209M425n097
3026a26457p4671J96366Q6166k229j64552l9931P5224n1823m0731J25847m8297
3015f5088j00408m1578q3656j35712J86854J67659K1445j4149M9131L4012J05647
3004A24157l12078j37419O9769p9585K94621r8819k3060L61574j23730j27752
$$ plain form
2994 -52322 -97692 -182593 -70874 -257672 -64179 294238 236056 233684 -51393 -99771 -73239
2983 -73239 -126678 -31062 -134341 -273791 -103739 -207139 -456185 -251775 -298087 -103546
2973 -103546 -61638 46432 73881 198079 150899 61637 23164 -178471 -206685 -258427 -139725
2962 -139725 207829 -25957 230230 264062 150026 94582 -91457 11086 -121897 -354614
2952 -354614 -311029 -295162 -388117 -150328 -155467 -27907 -44296 -121431 6823 -59185 -151106
2941 -151106 -142905 -237382 -251281 -340723 -307996 -145795 -18324 158563 257403 61398 28388
2930 28388 81047 -87430 -199643 -62667 -110626 279763 381397 225741 62711 -125444
2920 -125444 35715 -62510 -254660 207623 2537 10042 -101025 -276749 14345 -118999
$$ packed form
2994e2322m5370q4901J11719j86798J93493L58417n8182k372k85077m8378K6532
2983g3239n3439R5616j03279j39450J70052j03400k49046K04410m6312J94541
2973a03546M1908J08070K7449J24198m7180q9262l8473k01635k8214n1742J18702
2962a39725L47554k33786K56187L3832j14036n5444j86039J02543j32983k32717
2952c54614M3585J5867r2955K37789n139J27560j6389p7135J28254o6008r1921
2941a51106Q201r4477j3899q9442L2727J62201J27471J76887R8840j96005l3010
2930B8388N2659j68477j12213J36976m7959L90389J01634j55656j63030j88155
2920a25444J61159r8225j92150M62283k05086P505j11067j75724K91094j33344
$$ plain form
2910 -118999 -115182 -35332 -227866 -257657 -155496 -232595 -100612 -308397 -471924 -220321 -89992
2899 -89992 -87284 -62956 35847 42375 -77536 -126049 23208 -61246 -239711 -126669 -242483
2888 -242483 -276503 -265614 -259653 35847 -75099 -352029 -11458 -143575 -21389 47013 -252398
2877 -252398 -184183 -267238 -353537 -148050 -98291 135818 146785 35488 79693 -39504 -156315
2866 -156315 -259643 -414551 -57288 56124 -27696 111623 83283 -32773 12751 -192328
2856 -192328 -134050 -38827 -177860 -73590 21738 -46372 -118061 -277010 -308663 72263 60367
2845 60367 124763 -35112 -422 -1820 -65518 -86717 -155707 -284021 -159081 -94114 18599
2834 18599 96254 53568 -82689 -164036 -195818 -183006 -66327 -48249 -199546 -105880 35723
$$ packed form
2910a18999L817P9850j92534k9791J02161p7099J31983k07785j63527K51603J30329
2899h9992K708K4328R8803O528j19911m8513J49257q4454j78465J13042j15814
2888b42483l4020J0889N961K95500j10946k76930L40571j32117J22186O8402k99411
2877b52398O8215q3055q6299K05487M9759K34109J0967j11297M4205j19197j16811
2866a56315j03328j54908L57263J13412q3820J39319k8340j16056M5524k05079
2856a92328N8278R5223j39033J04270R5328o8110p1689j58949l1653L80926j1896
2845F0367O4396j59875L4690j398o3698k1199o8990j28314J24940O4967J12713
2834A8599P7655m2686j36257q1347l1782J2812J16679J8078j51297R3666J41603
$$ plain form
2823 35723 -99982 -107580 -82035 -203579 -122611 -122003 -110129 -179950 -256220 -71134 71347 156422
2811 156422 -52417 18513 5973 101324 60616 43470 -176924 -370766 -342882 -260940 -96391
2800 -96391 -196624 -192776 -162788 49287 -32260 -120284 -20908 -184720 -298274 -212782 -172520
2789 -172520 -296797 -307208 -264201 -129668 -338320 -97362 146321 129150 194281 81492
2779 81492 -90734 -17891 -136731 -68829 167185 113001 9997 35634 26083 -121699 -113637
2768 -113637 -122883 44235 63283 79409 -117601 -304728 -181339 -60521 22868 -14369 -48325
2757 -48325 -196723 -36318 53131 -14724 -280517 -267749 -237966 -228703 -279017 -312187 -135892
2746 -135892 -133947 -36053 -218620 -269140 -406356 -193269 -174567 -204328 -22826 -136898 -148669
$$ packed form
2823C5723j35705p598K5545j21544Q0968O08J1874o9821p6270J85086J42481Q5075
2811A56422k08839P0930j2540R5351m0708j7146k20394j93842K7884Q1942J64549
2800i6391j00233L848K9988K12075q1547q8024R9376j63812j13554Q5492M0262
2789a72520j24277j0411M3007J34533k08652K40958K43683j7171O5131j12789
2779H1492j72226P2843j18840O7902K36014n4184j03004K5637r551j47782Q062
2768a13637r246J67118J9048J6126j97010j87127J23389J20818Q3389l7237l3956
2757d8325j48398J60405Q9449o7855k65793J2768K9783R263n0314l3170J76295
2746a35892J945R7894j82567n0520j37216K13087J8702k9761J81502j14072j1771
$$ plain form
2735 -148669 -18630 -127955 -268586 -291942 -277898 -333847 -369649 -276980 -108932 87295 -48437
2724 -48437 -219944 -274087 -307987 -262603 -278514 -4956 125560 -72469 -95817 -70049 -321610
2713 -321610 -286865 -116571 95747 26365 -94561 17545 -180465 -90649 -359406 -302955
2703 -302955 -18953 -43198 -64824 -149798 -43018 1102 -104088 -34070 -61523 -153100 -232707
2692 -232707 -469694 -372339 -354887 -294679 -275919 -425355 -212052 -157298 -248019 -79258 -169461
2681 -169461 -186048 -162222 -184012 -328977 -327475 -127983 -51214 78504 -38958 -23415 -22749
2670 -22749 -109390 -107359 -154534 -289522 -181175 -119723 -176382 -97761 -104188 -156041 -333089 -193984
2658 -193984 70225 32663 52928 -46621 -256589 -145334 96218 14519 -34939 -80492 71616
$$ packed form
2735a48669J30039j09325j40631k3356J4044n5949l5802R2669J68048J96227j35732
2724d8437j71507n4143l3900M5384j5911K73558J30516j98029k3348K5768k51561
2713c21610L4745J70294K12318o9382j20926J12106j98010Q9816k68757N6451
2703c02955K84002k4245k1626q4974J06780M4120j05190P0018k7453r1577p9607
2692b32707k36987R7355J7452O0208J8760j49436K13303N4754r0721J68761r0203
2681a69461j6587K3826k1790j44965J502J99492P6769J29718j17462J5543O66
2670b2749q6641K031m7175j34988J08347O1452n6659P8621o427n1853j77048J39105
2658a93984K64209l7562K0265r9549k09968J11255K41552q1699m9458m5553J52108
$$ plain form
2647 71616 91353 39561 -142232 -139509 -51097 -19077 115087 -13283 -88979 -288400 -132959
2636 -132959 -54991 -40854 -172365 20644 108004 14012 -146836 -136814 -178165 -271044 -169800
2625 -169800 -271769 -145616 -91985 33529 -27379 -37332 -136204 -143264 -188975 1081 -127897
2614 -127897 -247836 -92056 -401204 -245350 -199008 -57590 -31396 -119840 -2808 -98178
2604 -98178 -205813 -33203 -275334 -342475 -281867 -351003 -280489 -313096 -42764 -69143 51041
2593 51041 -31484 -94027 -86671 -99504 9065 -78698 -139712 -176350 -199977 -256996 -141144 -194428
2581 -194428 -42575 -197933 -173537 115660 -177 103160 -223865 -342925 -338437 -253737
2571 -253737 -111352 37338 -45044 -112974 -64165 -259954 -123934 -192463 40344 57767 974
$$ packed form
2647G1616J9737n1792j81793K723Q8412L2020J34164j28370p5696j99421J55441
2636a32959P7968J4137j31511J93009Q7360r3992j60848J0022m1351r2879J01244
2625a69800j01969J26153N3631J25514o0908r953r8872p060m5711J90056j28978
2614a27897j19939J55780l09148J55854M6342J41418K6194q8444J17032r5370
2604i8178j07635J72610k42131o7141O0608o9136P0514l2607K70332k6379J20184
2593E1041q2525o2543P356j2833J08569q7763o1014l6638k3627n7019J15852n3284
2581a94428J51853j55358K4396K89197j15837J03337l27025j19060M488Q4700
2571b53737J42385J48690q2382o7930M8809j95789J36020o8529K32807J7423n6793
$$ plain form
2560 974 -112156 -157036 -208346 -14953 -40191 -323867 -192079 -539255 -536745 -330195 -271260
2549 -271260 -178379 12821 -151382 -30577 -156881 125361 -63350 -133497 -78208 -38864
2539 -38864 -23020 13340 149322 -116063 -54544 -17167 283017 40828 70495 -211445 -203895
2528 -203895 -314836 -328785 6356 8830 -181543 -171390 -25421 14731 -35008 -79603 10642
2517 10642 -245625 -277821 -20529 -229019 -397302 -142791 -129036 -118536 -126513 -88570 78715
2506 78715 66782 35058 -15229 -219138 -458784 -299301 -285263 -373063 -187238 -228892 116182
2495 116182 -73799 -168429 -99037 -226496 -110681 -245198 -302201 -271582 -145874 -180713 36476
2484 36476 253004 23536 -117700 -411756 -434356 -44844 -110938 -71891 -59655 -190470 -6337
$$ packed form
2560I74j13130m4880n1310J93393k5238k83676J31788l47176K510K06550N8935
2549b71260R2881J91200j64203J20805j26304K82242j88711p0147N5289L9344
2539c8864J5844L6360J35982k65385O1519L7377L00184k42189K9667k81940P550
2528b03895j10941j3949L35141K474j90373J0153J45969M0152m9739m4595R0245
2517A0642k56267l2196K57292k08490j68283K54511J3755J0500p977L7943J67285
2506G8715j1933l1724n0287k03909k39646J59483J4038q7800J85825m1654L45074
2495A16182j89981r4630O9392j27459J15815j34517n7003L0619J25708l4839K17189
2484C6476K16528k29468j41236k94056k2600L89512o6094L9047J2236j30815J84133
$$ plain form
2473 -6337 -182020 -358907 -238112 -307048 -300025 -159284 -82502 -228508 -79896 -158004 9991
2462 9991 -275439 -279952 -215917 -274851 -266184 -126711 -254424 -341148 -97358 -158367 -50589
2451 -50589 -135083 -69052 -135597 -149340 -281723 -198471 -129634 89389 -94946 44315 13046
2440 13046 -56390 94939 209179 -44466 54790 70195 227752 47988 104962 113462 -96885
2429 -96885 -127141 -188676 132896 74074 198406 230416 251570 276447 81979 80676 28214
2418 28214 25857 5384 -167219 23725 92789 48220 143595 -94849 -146359 -62999 -66589 92200
2406 92200 53872 238184 123287 17345 139599 69056 -140622 31001 166894 173248 123065
2395 123065 140639 -72304 -54809 81942 148039 105985 -21810 -64961 -35187 161534 114334
$$ packed form
2473f337j75683j76887J20795o8936P023J40741P6782j46006J48612p8108J67995
2462I991k85430m513O4035n8934Q667J39473j27713q6724K43790o1009J07778
2451e0589q4494O6031o6545j3743j32383Q3252O8837K19023j84335J39261l1269
2440A3046o9436J51329J14240k53645R9256J5405J57557j79764N6974Q500k10347
2429i6885l0256o1535L21572n8822J24332L2010K1154K4877j94468j303n2462
2418B8214k357k0473j72603J90944O9064m4569R5375k38444n1510Q3360l590J58789
2406I2200l8328J84312j14897j05942J22254p0543k09678J71623J35893O354n0183
2395A23065J7574k12943J7495J36751O6097m2054j27795m3151K9774J96721m7200
$$ plain form
2384 114334 -9600 -41735 3034 -24907 238001 19337 -210405 202648 218053 437191
2374 437191 221217 232094 478474 344306 394732 371144 73337 165432 51819 43665 53820
2363 53820 90905 215064 220127 272558 121361 -80100 96345 -35989 31166 -71610 191561
2352 191561 56732 86069 104045 57239 -187113 -149370 41606 97113 109908 -124854 8602
2341 8602 -390073 -263795 -69206 -39410 217335 374206 412854 546770 360308 483468
2331 483468 89025 71844 388 91049 232232 47910 19783 241869 144909 281356 100042
2320 100042 70980 -49442 35248 103501 -66730 -13509 -73945 -170934 75692 -57192 173338
2309 173338 116258 118793 339173 239028 233133 104693 253214 285426 141622 196220 146944
$$ packed form
2384A14334j23934l2135M4769k7941K62908k18664k29742M13053J5405K19138
2374D37191k15974J0877K46380j34168N0426k3588k97807R2095j13613q154J0155
2363E3820L7085J24159N063N2431j51197k01461J76445j32334O7155j02776K63171
2352A91561j34829K9337J7976m6806k44352L7743J90976N5507J2795k34762J33456
2341H602l98675J26278J94589K9796K56745J56871L8648J33916j86462J23160
2331D83468l94443j7181p1456R0661J41183j84322k8127K22086r6960J36447j81314
2320A00042k9062j20422Q4690O8253j70231N3221o0436r6989K46626j32884K30530
2309A73338n7080K535K20380j00145n895j28440J48521L2212j43804N4598m9276
$$ plain form
2298 146944 -61625 215307 172579 330377 121754 4047 210025 296541 305953 391676 223993
2287 223993 253262 233190 175782 267615 136565 269162 190140 163639 120997 -43804 -74241
2276 -74241 136440 294396 349103 334083 299189 107872 147928 71034 -164339 7972 -140517
2265 -140517 776 406740 490065 482495 302800 423976 310036 261191 240141 14195 128420
2254 128420 59489 104779 40470 326051 259726 394705 427157 371437 344749 513335 254272
2243 254272 285883 310544 150145 203975 249945 449659 459017 276542 370941 346458 176617
2232 176617 460208 423269 449390 449553 644893 653999 583186 577605 603770 559693 661412 667950
2220 667950 768040 785361 697452 578811 409852 439823 515147 479732 673407 722911 695375
$$ packed form
2298A46944k08569K76932m2728J57798k08623j17707K05978Q6516R412Q5723j67683
2287B23993K9269k0072n7408R1833j31050J32597p9022k6501m2642j64801l0437
2276g4241K10681J57956N4707j5020l4894j91317M0056p6894k35373J72311j48489
2265a40517J41293M05964Q3325p570j79695J21176j13940m8845k1050k25946J14225
2254A28420o8931M5290o4309K85581o6325J34979L2452n5720k6688J68586k59063
2243B54272L1611K4661j60399N3830M5970J99714R358j82475R4399k4483j69841
2232A76617K83591l6939K6121J63J95340R106p0813n581K6165m4077J01719O538
2220F67950J00090J7321q7909j18641j68959K9971P5324l5415J93675M9504k7536
$$ plain form
2209 695375 592989 628879 736394 921868 1028356 1096409 1019136 796598 813382 981024
2199 981024 1200884 1176159 1093552 1023234 1112579 1129761 1125028 1097476 1118758 1236969 1334579
2188 1334579 1337430 1477847 1346530 1241536 1499877 1647111 1455996 1423721 1477618 1593154
2178 1593154 1516565 1610995 1840423 1829190 1810645 1905950 1856561 1848016 1747014 1853354 2027130
2167 2027130 1845886 1947260 2078493 2033178 2200517 2399661 2316344 2586316 2700040 2879770
2157 2879770 2744333 2692561 2851723 2858522 2971966 3249622 3393889 3639564 3916822 4040846
2147 4040846 4097920 4336157 4418250 4747407 5078189 5028790 5359069 5381494 5637098 5507541
2137 5507541 5592569 5924711 6137052 6279916 6789956 7258490 7710824 8135275 8786528 9219016
$$ packed form
2209F95375j02386L5890J07515J85474J06488O8053p7273k22538J6784J67642
2199I81024K19860k4725q2607p0318Q9345J7182m733k7552K1282J18211R7610
2188A334579K851J40417j31317j04994K58341J47234j91115l2275N3897J15536
2178A593154p6589R4430K29428j1233j8545R5305m9389q545j01002J06340J73776
2167B027130j81244J01374J31233m5315J67339J99144q3317K69972J13724J79730
2157B879770j35437n1772J59162O799J13444K77656J44267K45675K77258J24024
2147D040846N7074K38237Q2093L29157L30782m9399L30279K2425K55604j29557
2137E507541Q5028L32142K12341J42864N10040M68534M52334M24451O51253M32488
$$ plain form
2127 9219016 9608808 10103942 10570579 11371276 12675046 13727274 15100527 15804549 16865472
2118 16865472 17960649 19594054 21638452 24076662 27040343 30806699 35501202 41962795
2110 41962795 49261451 58906384 71674777 88259038 97569583 86534083 70420861 53407398
2102 53407398 41071910 33438930 27974077 23942971 20790904 18514401 16719633 15212568
2094 15212568 14177760 13367883 12697297 12157884 11031978 10312188 9482576 8962990 8345162
2085 8345162 7647055 6973666 6679653 6070035 5909172 5598255 5445701 5238098 5114386 4762553
2075 4762553 4542165 4491294 4654100 4379639 4254083 3970635 3755569 3666943 3608690 3692472
2065 3692472 3151060 2915450 2657766 2480832 2483497 2580082 2679973 2575747 2552761 2577420 2369652
$$ packed form
2127I219016L89792M95134M66637Q00697J303770J052228J373253P04022J060923
2118A6865472J095177J633405K044398K438210K963681L766356M694503O461593
2110D1962795P298656R644933J2768393J6584261R310545j1035500j6113222j7013463
2102E3407398j2335488p632980n464853m031106l152067k276503j794768j507065
2094A5212568j034808q09877o70586n39413j125906p19790q29612n19586o17828
2085H345162o98107o73389k94013o09618j60863l10917j52554k07603j23712l51833
2075D762553k20388n0871J62806k74461j25556k83448k15066q8626n8253Q3782
2065C692472n41412k35610k57684j76934K665R6585R9891j04226k2986K4659k07768
$$ plain form
2054 2369652 2266762 2208333 1957433 1926369 1972992 2099994 1968161 1952775 1895594 1574511
2044 1574511 1689720 1564570 1509968 1613892 1416927 1422409 1288907 1369592 1402620 975444
2034 975444 936451 1147699 1012109 1003829 1144792 1218519 1187341 1174232 1210866 1125235 905860
2023 905860 952676 807743 804721 843839 519241 523958 916295 1081275 1068725 1004876 773297
2012 773297 790763 787529 859599 788823 700242 758334 805933 534813 633031 407232 250925
2001 250925 641164 522082 341232 600001 589760 628226 385310 590912 550892 95290
1991 95290 -11184 390596 270714 530085 606571 448917 494755 393135 348217 38878
1981 38878 -13342 152520 268088 203239 537031 247302 433642 490068 239969 316539 346679
$$ packed form
2054B369652j02890n8429k50900l1064M6623J27002j31833j5386n7181l21083
2044A574511J15209j25150n4602J03924j96965N482j33502Q0685L3028m27176
2034I75444l8993K11248j35590q280J40963P3727l1178j3109L6634q5631k19375
2023I05860M6816j44933l022L9118l24598M717L92337J64980j2550o3849k31579
2012G73297J7466l234P2070p0776q8581N8092M7599k71120R8218k25799j56307
2001B50925L90239j19082j80850K58769j0241L8466k42916K05602m0020m55602
1991I5290j06474M01780j19882K59371P6486j57654M5838j01620m4918l09339
1981C8878n2220J65862J15568o4849L33792k89729J86340N6426k50099P6570L0140
$$ plain form
1970 346679 118339 441564 413240 295725 214409 196257 243081 -47663 -91460 235811 134204
1959 134204 118971 368119 376051 299968 229343 295417 433260 274121 403050 260173 -74551
1948 -74551 50561 161414 270262 499437 299798 359279 351492 176708 323187 190081
1938 190081 191001 273822 122724 237866 382149 39183 188530 127714 -93233 -71417 27584
1927 27584 294507 102857 276055 124994 235435 258752 147127 -61378 -140453 -25994
1917 -25994 -66375 32140 118249 155822 194593 266250 107754 133963 162146 390538 124982
1906 124982 -13340 199079 -104483 -246052 -127015 -301082 -90700 -89940 137461 281779
1896 281779 171472 316231 336472 -2484 131366 -106680 -51280 8926 134332 16245
$$ packed form
1970C46679k28340L23225k8324j17515q1316j8152M6824k90744m3797L27271j01607
1959A34204j5233K49148P932p6083p0625O6074J37843j59139J28929j42877l34724
1948g4551J25112J10853J08848K29175j99639N9481p787j74784J46479j33106
1938A90081R20Q2821j51098J15142J44283l42966J49347o0816k20947K1816R9001
1927B7584K66923j91650J73198j51061J10441K3317j11625k08505p9075J14459
1917b5994m0381R8515Q6109L7573L8771P1657j58496K6209K8183K28392k65556
1906A24982j38322K12419l03562j41569J19037j74067K10382P60K27401J44318
1896B81779j10307J44759K0241l38956J33850k38046N5400O0206J25406j18087
$$ plain form
1886 16245 217097 95029 34851 -55468 -11455 315859 230918 406903 309275 346818 220343
1875 220343 248199 18162 140522 -15207 17050 84731 -121148 134564 -15054 -70542
1865 -70542 192738 153938 -65678 212883 185470 -81376 -66489 43652 -62730 -116899 16110
1854 16110 -49247 127327 -119116 -22459 118647 56354 156442 -60287 103012 227038
1844 227038 86850 201316 309919 -7564 157780 355429 530833 633763 640554 761195
1834 761195 503350 220478 85056 -147480 -436399 -302436 -317106 -166128 30734 137764
1824 137764 206840 217153 52976 -46633 -177019 -130081 -86791 20282 182052 111766 179967
1813 179967 315201 12397 -153766 -70370 -131496 -76220 178240 28842 26033 -91864 -9919
$$ packed form
1886A6245K00852j22068o0178r0319M4013L27314q4941J75985r7628L7543j26475
1875B20343K7856k30037J22360j55729L2257O7681k05879K55712j49618n5488
1865g0542K63280l8800k19616K78561k7413k66846J4887J10141j06382n4169J33009
1854A6110o5357J76574k46443R6657J41106o2293J00088k16729J63299J24026
1844B27038j40188J14466J08603l17483J65344J97649J75404J02930O791J20641
1834G61195k57845k82872j35422k32536k88919J33963j4670J50978J96862J07030
1824A37764O9076J0313j64177r9609j30386M6938M3290J07073J61770p0286O8201
1813A79967J35234l02804j66163Q3396o1126N5276K54460j49398k809j17897Q1945
$$ plain form
1802 -9919 104141 -176157 -134372 -21967 107144 119549 203689 311363 245659 33008 -50456
1791 -50456 -18474 -81915 -181453 -62949 -183053 178142 68258 62452 -43699 -87059 67237
1780 67237 46006 190759 269986 3512 -139880 -212921 -286708 45736 -36094 41477 63889
1769 63889 -188939 -267292 -238620 -318685 -154121 -70742 52093 349333 323412 190403 -40271
1758 -40271 -145422 -58652 -369760 -295662 90252 53141 -186051 -30581 -35556 28903 -320212
1747 -320212 -385597 -203363 -204651 50051 148028 117389 113067 32101 -48264 -27639 -208480
1736 -208480 -51033 123257 143612 71348 -18567 -256503 -225540 -336104 -377661 -65709 145515
1725 145515 201669 145666 -58372 -181800 -378540 -551723 -215227 -149037 109527 36857
$$ packed form
1802i919J14060k80298M1785J12405J29111J2405Q4140J07674o5704k12651q3464
1791e0456L1982o3441r9538J18504j20104L61195j09884n806j06151m3360J54296
1780F7237k1231J44753P9227k66474j43392p3041p3787L32444q1830P7571K2412
1769F3889k52828p8353K8672q0065J64564Q3379J22835K97240k5921j33009k30674
1758d0271j05151Q6770l11108P4098L85914l7111k39192J55470m975O4459l49115
1747c20212o5385J82234j288K54702R7977l0639m322q0966q0365K0625j80841
1736b08480J57447J74290K0355p2264q9915k37936L0963j10564m1557L11952K11224
1725A45515N6154n6003k04038j23428j96740j73183L36496O6190K58564p2670
$$ plain form
1715 36857 -63486 52852 -75663 -26845 111430 194248 180548 33056 -84332 -237761
1705 -237761 -207969 -210250 -348283 -45260 262 58531 39434 -167276 -72987 -247418 -294117
1694 -294117 -185797 -140249 -153442 -75328 86230 37754 -129660 -315146 -303748 -362571 -285480
1683 -285480 -375003 71205 239479 120850 172271 -67150 -191693 -62423 -11426 46054
1673 46054 61562 187188 244049 -70745 -77048 -211018 -151969 -288408 -275415 42482 164009
1662 164009 61865 63299 188755 174215 67390 -46185 -17665 -50720 -261626 -243685 -157810
1651 -157810 -219701 -255345 -221150 -351663 -28559 -219895 -123709 -123549 -307347 -252464 -51527
1640 -51527 2001 217074 178462 -73132 -26840 34500 40812 -168294 -44537 -126064 146402
$$ packed form
1715C6857j00343J16338j28515M8818J38275Q2818j3700j47492j17388j53429
1705b37761K9792k281j38033L03023M5522N8269j9097k06710R4289j74431m6699
1694b94117J08320M5548j3193P8114J61558m8476j67414j85486J1398n8823P7091
1683b85480q9523M46208J68274j18629N1421k39421j24543J29270N0997N7480
1673D6054J5508J25626N6861l14794o303j33970N9049j36439J2993L17897J21527
1662A64009j02144J434J25456j4540j06825j13575K8520l3055k10906J7941Q5875
1651a57810o1891l5644L4195j30513L23104j91336R6186J60j83798N4883K00937
1640e1527N3528K15073l8612k51594M6292O1340O312k09106J23757q1527K72466
$$ plain form
1629 146402 34689 72877 218745 27469 -156216 -266680 -310338 -86623 -215316 -23972
1619 -23972 73247 -57508 -153614 33581 -166943 -172244 -99779 105571 12139 -93359 12427
1608 12427 52074 -179553 -148266 -60565 -169446 -208105 -171971 133342 65092 197609 202323
1597 202323 108601 -61105 -31984 -115683 -284619 -397518 -455436 -253221 35423 22903 71427
1586 71427 -140328 -301098 -180006 -134650 113889 205150 146177 207681 66576 -39914 -55769
1575 -55769 -30897 87900 10461 7807 -53605 -282137 -283656 -171915 -154430 -112966 -153758 52417
1563 52417 -157031 -161525 -115017 -119272 -244842 -187669 -36981 -124949 -32585 155973 137161
1552 137161 -68854 -168147 -79126 -179265 -323691 -86999 -110082 -109677 -212623 -169868 -267591
$$ packed form
1629A46402j11713L8188J45868j91276j83685j10464m3658K23715j28693J91344
1619b3972R7219j30755r6106J87195k00524n301P2465K05350r3432j05498J05786
1608A2427L9647k31627L1287Q7701j08881l8659L6134L05313o8250J32517M714
1597B02323r3722j69706K9121q3699j68936j12899n7918K02215K88644j2520M8524
1586G1427k11755j60770J21092M5356K48539R1261n8973O1504j41105j06490j5855
1575e5769K4872J18797p7439k654o1412k28532j519J11741J7485M1464m0792K06175
1563E2417k09448m494M6508m255j25570N7173J50688q7968R2364J88558j8812
1552A37161k06015r9293Q9021j00139j44426K36692k3083M05j02946M2755r7723
$$ plain form
1541 -267591 -338491 -305479 -53401 -81246 -17064 -25961 15812 -23394 80055 -42527 -115325
1530 -115325 -219986 -249235 -207241 -246652 -257416 -243804 -46411 -43039 -179573 -25338 59382
1519 59382 -206226 -156897 -187454 -113082 -199390 -167407 -71456 -84377 -388426 -310833 -364559
1508 -364559 -139470 134355 -78573 1609 -199940 -21415 -80709 -100361 -110315 128182 18610
1497 18610 36088 79493 79694 -28769 69654 -227020 -133248 -12278 -55093 94474 -32890
1486 -32890 -128349 -97486 -35106 109433 -133541 -237988 -37867 -115054 436 55053 154326
1475 154326 128124 36461 29568 -27895 -134484 -159830 -328908 -44273 -69297 -155172 -181373
1464 -181373 -137526 -65455 -81332 -9839 160719 -146896 -150706 -451437 -308169 -155826 22937
$$ packed form
1541b67591p0900L3012K52078k7845O4182q897M1773l9206J03449j22582p2798
1530a15325j04661k9249M1994l9411j0764J3612J97393L372j36534J54235Q4720
1519E9382k65608M9329l0557P4372q6308L1983R5951j2921l04049P7593n3726
1508c64559K25089K73825k12928Q0182k01549J78525n9294j9652r954K38497j09572
1497A8610J7478M3405K01j08463R8423k96674R3772J20970m2815J49567j27364
1486c2890r5459L0863O2380J44539k42974j04447K00121p7187J15490N4617R9273
1475A54326k6202r1663o893n7463j06589k5346j69078K84635k5024q5875k6201
1464a81373M3847P2071j5877P1493J70558l07615l810l00731J43268J52343J78763
$$ plain form
1453 22937 108893 120697 94797 44636 88034 122106 61720 3598 -97570 -203715 -88348
1442 -88348 -109528 48804 -17364 -137182 74800 229218 184732 37459 -68905 56064
1432 56064 -128946 -84013 152132 136145 127235 -33767 -129049 -156519 -171012 -62755 63668
1421 63668 75311 125302 -186939 -138813 -63840 159981 173154 128021 313423 260509 33458
1410 33458 -191371 -184039 75598 -92979 -179588 19011 66433 164078 65988 -48578 -94620
1399 -94620 -72422 -66323 -67872 -183453 -332503 -91815 251619 122422 76347 -65528 174784
1388 174784 101704 5310 217315 222330 -89339 27494 -292251 -173075 -24987 -98804 54695
$$ packed form
1453B2937Q5956J1804k5900n0161M3398L4072o0386n8122j01168j06145J15367
1442h8348k1180J58332o6168j19818K11982J54418m4486j47273j06364J24969
1432E6064j85010M4933K36145j5987q910j61002r5282k7470j4493J08257J26423
1421F3668J1643M9991l12241M8126P4973K23821J3173m5133J85402n2914k27051
1410C3458k24829P332K59637j68577q6609J98599M7422R7645r8090j14566m6042
1399i4620K2198O099j549j15581j49050K40688L43434j29197m6075j41875K40312
1388A74784p3080r6394K12005N015l11669J16833l19745J19176J48088p3817J53499
$$ [...]
##END NTUPLES=NMR SPECTRUM
##END=
