##TITLE=1H_CG-1160
 CDCl3
 8 sc, 
 31.05.2022
##JCAMPDX= 6.0         $$ Bruker NMR JCAMP-DX V2.0
##DATA TYPE= NMR SPECTRUM
##DATA CLASS= NTUPLES
##ORIGIN= UXNMR, Bruker Analytische Messtechnik GmbH
##OWNER= root
$$ XWIN-NMR		Version 3.5
$$ Wed Jun  1 14:53:11 2022 Russian Standard Time (UT+4h)  she@DPX200
##.OBSERVE FREQUENCY= 200.13135
##.OBSERVE NUCLEUS= ^1H
##.ACQUISITION MODE= SIMULTANEOUS
##.ACQUISITION SCHEME= undefined
##.AVERAGES= 8
##.DIGITISER RES= 18
##SPECTROMETER/DATA SYSTEM= spect
##.PULSE SEQUENCE= zg30
##.SOLVENT NAME= CDCl3
##.SHIFT REFERENCE= (INTERNAL, CDCl3, 0, 15.7315)
##AUDIT TRAIL= $$ (NUMBER, WHEN, WHO, WHERE, WHAT)
$$ ##TITLE= Audit trail, XWIN-NMR		Version 3.5
$$ ##JCAMPDX= 5.01
$$ ##ORIGIN= Bruker BioSpin GmbH
$$ ##OWNER= she
$$ F:/spectra/data/she/nmr/H-F/1/pdata/1/auditp.txt
$$ ##AUDIT TRAIL=  $$ (NUMBER, WHEN, WHO, WHERE, WHAT)
(   1,<2022-06-01 14:51:49.90 +0400>,<she>,<DPX200>,
      <created by zg, POWCHK disabled, PULCHK disabled
       configuration hash MD5:
       00 E9 B6 7A A2 85 ED C7 34 08 36 98 17 FE 4E 26
       data hash MD5: 16K
       51 FF 10 DC 79 F3 36 5F 12 51 BE D9 66 5B 74 D1>)
(   2,<2022-06-01 14:51:52.51 +0400>,<she>,<DPX200>,
      <Start of raw data processing
       efp BC_mod = 2 LB = 0.24 FT_mod = 6 PKNL = 1 PHC0 = -18033.1 PHC1 = 5.60074 SI = 16K 
       data hash MD5: 16K
       01 E3 7B FC 2E B2 FB 65 EF 9C 0D 0D B4 F6 96 29>)
(   3,<2022-06-01 14:52:11.59 +0400>,<she>,<DPX200>,
      <pk PHC0 = -6.481373 PHC1 = 10.6 
       data hash MD5: 16K
       F1 89 87 65 66 EC FD 1E BB 55 6E 2B 4B 98 E9 28>)
(   4,<2022-06-01 14:52:15.15 +0400>,<she>,<DPX200>,
      <abs ABSG = 5 
       data hash MD5: 16K
       53 8F 23 0B 2D 33 9E 81 34 25 11 40 C1 9A C6 A9>)
$$ ##END=
$$ 
$$ hash MD5
$$ 17 8F C5 30 30 CD B5 FD C0 47 4C 44 C5 40 CF 25
##$RELAX= 
##$RELAX= 
##$RELAX= 
##$RELAX= 
##$RELAX= 
##$RELAX= 
$$ Bruker specific parameters
$$ --------------------------
##$DU= <F:/spectra>
##$EXPNO= 1
##$NAME= <H-F>
##$PROCNO= 1
##$TYPE= <nmr>
##$USER= <she>
##$AMP= (0..31)
100 100 100 100 100 100 100 100 100 100 100 100 100 100 100 100 100 100 
100 100 100 100 100 100 100 100 100 100 100 100 100 100 
##$AQSEQ= 0
##$AQ_mod= 1
##$AUNM= <au_zg>
##$AUTOPOS= <>
##$BF1= 200.13
##$BF2= 200.13
##$BF3= 200.13
##$BF4= 200.13
##$BF5= 200.13
##$BF6= 200.13
##$BF7= 200.13
##$BF8= 200.13
##$BYTORDA= 1
##$CFDGTYP= 0
##$CFRGTYP= 5
##$CHEMSTR= <none>
##$CNST= (0..31)
1 1 145 1 1 1 1 1 1 1 1 1 1 1 1 1 1 1 1 1 1 1 1 1 1 1 1 1 1 1 1 1 
##$CPDPRG= <>
##$CPDPRG1= <>
##$CPDPRG2= <>
##$CPDPRG3= <>
##$CPDPRG4= <mlev>
##$CPDPRG5= <mlev>
##$CPDPRG6= <mlev>
##$CPDPRG7= <mlev>
##$CPDPRG8= <mlev>
##$CPDPRGB= <>
##$CPDPRGT= <>
##$D= (0..31)
0 1.2 0 0 0 0 0 0 0 0.06 0 0.03 0 0 0 0 0.0002 0 0 0 0 0 0 0 0 0 0 0 0 
0 0 0 
##$DATE= 1654080709
##$DBL= (0..7)
120 120 120 120 120 120 120 120 
##$DBP= (0..7)
150 150 150 150 150 150 150 150 
##$DBP07= 0
##$DBPNAM0= <>
##$DBPNAM1= <>
##$DBPNAM2= <>
##$DBPNAM3= <>
##$DBPNAM4= <>
$$ [...]
##$SUBNAM2= <"">
##$SUBNAM3= <"">
##$SUBNAM4= <"">
##$SUBNAM5= <"">
##$SUBNAM6= <"">
##$SUBNAM7= <"">
##$SUBNAM8= <"">
##$SUBNAM9= <"">
##$SW= 18.05172834244
##$SWIBOX= (0..15)
0 0 2 0 0 0 0 0 0 0 0 0 0 0 0 0 
##$SW_h= 3612.71676300578
##$TD= 16384
##$TD0= 1
##$TE= 0
##$TE2= 300
##$TE3= 300
##$TEG= 300
##$TL= (0..7)
0 120 120 120 120 120 120 120 
##$TP= (0..7)
150 150 150 150 150 150 150 150 
##$TP07= 0
##$TPNAME0= <>
##$TPNAME1= <>
##$TPNAME2= <>
##$TPNAME3= <>
##$TPNAME4= <>
##$TPNAME5= <>
##$TPNAME6= <>
##$TPNAME7= <>
##$TPOAL= (0..7)
0.5 0.5 0.5 0.5 0.5 0.5 0.5 0.5 
##$TPOFFS= (0..7)
0 0 0 0 0 0 0 0 
##$TUNHIN= 0
##$TUNHOUT= 0
##$TUNXOUT= 0
##$USERA1= <user>
##$USERA2= <user>
##$USERA3= <user>
##$USERA4= <user>
##$USERA5= <user>
##$V9= 5
##$VALIST= <valist>
##$VCLIST= <CCCCCCCCCCCCCCC>
##$VD= 0
##$VDLIST= <DDDDDDDDDDDDDDD>
##$VPLIST= <PPPPPPPPPPPPPPP>
##$VTLIST= <TTTTTTTTTTTTTTT>
##$WBST= 1024
##$WBSW= 4
##$XGAIN= (0..3)
0 0 0 0 
##$XL= 0
##$YL= 0
##$YMAX_a= 69286
##$YMIN_a= -108975
##$ZGOPTNS= <>
##$ZL1= 120
##$ZL2= 120
##$ZL3= 120
##$ZL4= 120
##$ABSF1= 15.74248
##$ABSF2= -2.309369
##$ABSG= 5
##$ABSL= 3
##$ALPHA= 0
##$AQORDER= 0
##$ASSFAC= 0
##$ASSFACI= 0
##$ASSFACX= 0
##$ASSWID= 0
##$AUNMP= <proc_1d>
##$AZFE= 0.1
##$AZFW= 0.1
##$BCFW= 0
##$BC_mod= 2
##$BYTORDP= 0
##$COROFFS= 0
##$CY= -3
##$DATMOD= 1
##$DC= 0
##$DFILT= <>
##$DTYPP= 0
##$F1P= 0
##$F2P= 0
##$FCOR= 1
##$FTSIZE= 16384
##$FT_mod= 6
##$GAMMA= 0
##$GB= 0
##$INTBC= 1
##$INTSCL= 0
##$ISEN= 128
##$LB= 0.24
##$LEV0= 0
##$LPBIN= 0
##$MAXI= 10000
##$MC2= 0
##$MEAN= 0
##$ME_mod= 0
##$MI= 1.114404
##$NCOEF= 0
##$NC_proc= -8
##$NLEV= 6
##$NOISF1= 3.799351
##$NOISF2= 2.8
##$NSP= 0
##$NTH_PI= 0
##$NZP= 0
##$OFFSET= 15.73146
##$PC= 1
##$PHC0= -18039.58
##$PHC1= 16.20074
##$PH_mod= 1
##$PKNL= yes
##$PPARMOD= 0
##$PSCAL= 0
##$PSIGN= 0
##$REVERSE= no
##$SF= 200.130008020517
##$SI= 16384
##$SIGF1= 3
##$SIGF2= 2
##$SINO= 5.538805
##$SIOLD= 16384
##$SREGLST= <1H.CDCl3>
##$SSB= 0
##$STSI= 16384
##$STSR= 0
##$SW_p= 3612.71676300578
##$SYMM= 0
##$S_DEV= 0
##$TDeff= 16384
##$TDoff= 0
##$TI= <>
##$TILT= no
##$TM1= 0
##$TM2= 0
##$TOPLEV= 0
##$USERP1= <user>
##$USERP2= <user>
##$USERP3= <user>
##$USERP4= <user>
##$USERP5= <user>
##$WDW= 1
##$XDIM= 16384
##$YMAX_p= 373580914
##$YMIN_p= -3477827
$$ End of Bruker specific parameters
$$ ---------------------------------
##NTUPLES= NMR SPECTRUM
##VAR_NAME=  FREQUENCY,     SPECTRUM/REAL,   SPECTRUM/IMAG
##SYMBOL=    X,             R,               I
##VAR_TYPE=  INDEPENDENT,   DEPENDENT,       DEPENDENT
##VAR_FORM=  AFFN,          ASDF,            ASDF
##VAR_DIM=   16384,         16384,           16384
##UNITS=     HZ,            ARBITRARY UNITS, ARBITRARY UNITS
##FACTOR=    0.220516191357247, 1,           1
##FIRST=     3148.33713944768, 0,            0
##LAST=      -464.379623558102, 0,           0
##MIN=       -464.379623558102, -3477827,    0
##MAX=       3148.33713944768, 373580914,    0
$$ Real data points
##PAGE= N=1
##DATA TABLE= (X++(R..R)), XYDATA
$$ [...]
6993b20584J49522o40332M36031L40977R9352j52186J07702r9677K03236k55255
$$ -220584 -71062 -711394 -275363 65614 164966 12780 120482 20805 224041 -31214
6983c1214k78670l2289M06027L5708m56580L92808N03373l41625l91944K32876
$$ -31214 -309884 -342173 63854 99562 -357018 35790 539163 197538 -194406 38470
6973C8470j75898l04142k15979J30875l10051M59668O27229l92302j69851J61802
$$ 38470 -137428 -441570 -657549 -526674 -836725 -377057 250172 -142130 -311981 -150179
6963a50179K41722j60430J30887J56438j89538O65386o33252l92557O95401J09542
$$ -150179 91543 -68887 62000 218438 28900 694286 61034 -331523 363878 473420
6953D73420j021031k21103L66477K21186l26526O4167K15600J75247P9909M69177
$$ 473420 -547611 -768714 -402237 -181051 -507577 -443410 -227810 -52563 27346 496523
6943D96523n27940m18784J035097L62005k12595n15163k67630L78026J22933j044637
$$ 496523 -31417 -450201 584896 946901 734306 219143 -48487 329539 452472 -592165
6933e92165l18654L61437P5685l20883J03230p2120l13579J097467l37808k24074
$$ -592165 -910819 -549382 -473697 -794580 -691350 -763470 -1077049 20418 -317390 -541464
6923e41464L38405k72342q87168N83249M50285L0202l8638q8698M26212R2187
$$ -541464 -203059 -475401 -1362569 -779320 -329035 -298833 -337471 -426169 43 92230
6913I2230K03892o83504J42154k57348k0377M58250l90511J61702K49161L74544
$$ 92230 296122 -387382 -245228 -502576 -522953 -64703 -455214 -293512 -44351 330193
6903C30193p5661k21809P6488l6067m1358J6331J73616n473r9253m35499K53576
$$ 330193 254532 32723 109211 73144 31786 48117 221733 216260 117007 -318492 -64916
6892f4916L8671L8245l01041L5217O82904l54262q6626r7718j12312J30129o42428
$$ -64916 -26245 12000 -289041 -253824 429080 74818 -11808 -109526 -221838 -91709 -734137
6881g34137M47896K43226L56855L14925n58812k43756L9261J80187o4582j38915
$$ -734137 -286241 -43015 313840 628765 69953 -173803 -134542 45645 -18937 -157852
6871a57852K90012o30704J33807k93562o09487P99570M34947M2127k00343j65480
$$ -157852 132160 -498544 -364737 -658299 -1267786 -468216 -33269 8858 -191485 -356965
6861c56965j97212N9389l16794m25614M40873L05610P04634K37758k92253m02371
$$ -356965 -554177 -494788 -811582 -1237196 -796323 -490713 213921 451679 159426 -242945
6851b42945L81314M50807m35480J48348J3155m45932R3469K69731M28260n4283
$$ -242945 138369 589176 153696 302044 315199 -130733 -37264 232467 660727 606444
6841F06444n39529n7544j34810K15322n19963l47653J10904O85220J64243k63025
$$ 606444 66915 9371 -125439 89883 -430080 -777733 -666829 18391 182634 -80391
6831h0391L3602j67068l87451J4224L26739j14277k36394p2445J1801O25535L83895
$$ -80391 -46789 -213857 -601308 -587084 -260345 -374622 -611016 -683461 -671660 -46125 337770
6820C37770n03048q06312Q0939j36606L7822J66157Q7300K1685M64132p755j04921
$$ 337770 -165278 -971590 -890651 -1027257 -989435 -823278 -735978 -714293 -250161 -257916 -362837
6809c62837Q2304K80415K71399n73588p4468L33710J02930K55619l1051o6438
$$ -362837 -280533 -118 271281 -302307 -376775 -43065 59865 315484 284433 217995
6799B17995l55145l80630L81115N84394l82161l32768L93034j58205l08581Q8350
$$ 217995 -137150 -517780 -136665 447729 65568 -267200 125834 -32371 -340952 -252602
6789b52602N08751n02620l9875j74083O75723k22920k27189R5302J31345m34924
$$ -252602 256149 -246471 -286346 -460429 215294 -7626 -234815 -139513 -8168 -443092
6779d43092l29280K36300N50774M71778l21266p4991P5643o7823R9279j98792
$$ -443092 -772372 -536072 14702 486480 165214 90223 165866 98043 197322 -1470
6769a470J49388j47789l98285L82446R5417k68375K63865j46587N42588o5408
$$ -1470 147918 129 -398156 -15710 79707 -188668 75197 -71390 471198 405790
6759D05790o85663K11011L45476n34290K40865J92275L1130J45141j67261M74332
$$ 405790 -279873 -68862 276614 -257676 -16811 175464 206594 351735 184474 658806
6749F58806o43091j74199O2095m9518K06321N15087r40461n32224l7652M32113
$$ 658806 15715 -158484 -96389 -145907 60414 575501 -364960 -897184 -934836 -502723
6739e02723K3787M55380J0563j61109M8793O08546J50548O2764k62731n06041
$$ -502723 -478936 -23556 -12993 -174102 -125309 483237 633785 696549 433818 -72223
6729g2223j97163K8876K83L43506J50825J16617J15900N356p52605k97750K55155
$$ -72223 -269386 -240510 -240227 103279 254104 370721 486621 491977 -260628 -558378 -303223
6718c03223n05518k16063J84462K98796P23857k73143k23841J00590K76325r680
$$ -303223 -808741 -1024804 -840342 -541546 182311 -90832 -314673 -214083 62242 52562
6708E2562R6125k82084n78734L85709K37049R8575l10901L56878l45425K12392
$$ 52562 148687 -133397 -712131 -326422 -89373 9202 -301699 55179 -290246 -77854
6698g7854J70895J34643n36839n18975J01349L49151L52473J65258j25750j59946
$$ -77854 93041 227684 -309155 -828130 -726781 -377630 -25157 140101 14351 -145595
6688a45595K70918M2198o01162k69692N26462o4254l29361J94987j73929M13816
$$ -145595 125323 167521 -433641 -703333 -176871 -241125 -570486 -375499 -549428 -135612
6678a35612L66430k6449q8410L67900J97513m73220n77924J73109M43631J56809
$$ -135612 230818 204369 115959 483859 681372 208152 -369772 -196663 246968 403777
6668D03777J84989o4146n51388P4543L10657M31882r2648k71856m03757p9479
$$ 403777 588766 524620 -26768 47775 358432 790314 697666 425810 22053 -57426
6658e7426k72607l31770k10424O59247J95511m76599j25511O60745K48131L55546
$$ -57426 -330033 -661803 -872227 -212980 -17469 -494068 -619579 41166 289297 644843
6648F44843o5932p81930o9715L95021j30457l86148m05708J56782j08023Q27558
$$ 644843 578911 -203019 -272734 122287 -8170 -394318 -800026 -643244 -751267 76291
6638G6291K17129J25888k80864k18999M01676J17366k86855o76107K62501O93138
$$ 76291 293420 419308 138444 -80555 321121 438487 151632 -524475 -261974 431164
6628D31164j22239j060563N33592J34734n6101r0624L31348k88907k14911l02509
$$ 431164 308925 -751638 -218046 -83312 -139413 -230037 101311 -187596 -402507 -705016
6618g05016P8415K09749L21492l20304K52608K1995o3219k2629R164M32015N21775
$$ -705016 -626601 -416852 -95360 -415664 -163056 -141061 -204280 -226909 -217745 214270 736045
6607G36045o20786m33350j01079l7964K83811r0978l7920J02875q1923j6330j21361
$$ 736045 115259 -318091 -419170 -457134 -173323 -264301 -302221 -199346 -281269 -297599 -418960
6596d18960Q14028n45256q95400M68114Q9857L94779K8199r1003m2065j4590J14304
$$ -418960 395068 -150188 -1045588 -577474 -487617 -92838 -64639 -155642 -197707 -212297 -97993
6585i7993J88087j40145j56287M38358M29180n36568m55236N1285M39553m11070
$$ -97993 90094 -50051 -206338 232020 661200 124632 -330604 -279319 160234 -250836
6575b50836J41675p1818k81667K23892k47472Q3759m46919O60042n0855K50768
$$ -250836 -109161 -180979 -462646 -238754 -486226 -402467 -849386 -189344 -240199 10569
6565A0569n12409N02045L21408o37370n32987J09382L7861M22354N24855l38022
$$ 10569 -501840 205 321613 -315757 -848744 -739362 -701501 -279147 245708 -92314
6555i2314p80751q8635N62524K07528l37819m04569J065165M71421j032257p25463
$$ -92314 -873065 -961700 -399176 -191648 -529467 -934036 131129 602550 -429707 -1155170
6545a155170P86697n9513j85900N82853j0310l84244R4915K44688K06347q36781
$$ -1155170 -368473 -427986 -613886 -31033 -41343 -425587 -330672 -85984 120363 -716418
6535g16418N85544K8938l14479N77903O6123j36972j15578K3785K49275l59693
$$ -716418 -130874 -101936 -416415 161488 227611 90639 -24939 -1154 248121 -111572
6525a11572O48680j04630p15772L3502m00056Q87641j7096j91528M08160m87184
$$ -111572 537108 432478 -283294 -249792 -649848 237793 220697 29169 437329 -49855
6515d9855k58352L2266O53382j54222p63403n46074O13762P37247k17910o7637
$$ -49855 -308207 -275941 377441 223219 -540184 -1086258 -472496 264751 46841 -20796
6505b0796Q7123o191J24709n77746l66665K43956L02654Q2658m44033n64224L18278
$$ -20796 66327 60136 184845 -392901 -759566 -515610 -212956 -130298 -574331 -1138555 -820277
6494h20277M21342K94287l13320P13475K47401n17728J63054k41636m11413j53437
$$ -820277 -398935 -104648 -417968 295507 542908 25180 188234 -53402 -464815 -618252
6484f18252K55823J8351L66995J17109Q9959m62125m58167M70372J5004K01572
$$ -618252 -362429 -344078 22917 140026 229985 -232140 -690307 -219935 -204931 -3359
6474c359j8501k83887l4758j25394R45690L8823l21865J01528j57247M82707n29401
$$ -3359 -21860 -305747 -340505 -465899 479791 518614 196749 298277 141030 623737 94336
6463I4336j31983q5868N92823q88103J74467K39679o87122L02730K41664j53291
$$ 94336 -37647 -123515 469308 -418795 -244328 -4649 -691771 -389041 -147377 -300668
6453c00668P76151l74546m22705j4236M89055j39348q6861p5084k52437K91027
$$ -300668 475483 100937 -321768 -336004 153051 13703 -73158 -148242 -400679 -109652
6443a09652m06704P85666l38934L67921j28143j28826r2447L1652p56068n33402
$$ -109652 -516356 269310 -69624 298297 170154 41328 -51119 -19467 -775535 -1308937
6433a308937J033056K15608O4267L90090j08154J04970k62362j86302n8434K09720
$$ -1308937 -275881 -60273 3994 394084 285930 390900 128538 -57764 -116198 93522
6423I3522K24607k01695O8350J73754j91145N29700r2528l49657m76689L1149
$$ 93522 318129 116434 184784 358538 167393 697093 604565 254908 -221781 -190632
6413a90632o6579m47333m63446L2092K25262R97364J55227L01600K19266n65868
$$ -190632 -257211 -704544 -1167990 -1135898 -910636 86728 241955 543555 762821 196953
6403A96953p26741O10666J47890j98150P09067R6711n1355n47822n23792J58327
$$ 196953 -529788 80878 228768 30618 739685 836396 785041 237219 -286573 -128246
6393a28246K23746j28939K91599J40292k34678j38902n37853K70660J45095j49411
$$ -128246 95500 -33439 258160 398452 163774 24872 -512981 -242321 -97226 -246637
6383b46637K49262k16999o58505O75859K33173l3546m15370j09528M24798j75986
$$ -246637 2625 -214374 -872879 -197020 36153 2607 -412763 -522291 -97493 -273479
6373b73479q6809m60255k42526L48030O66844n2297k8672j99832l79798J08368
$$ -273479 -360288 -820543 -1063069 -715039 -48195 -100492 -129164 -328996 -708794 -600426
6363f00426K7041N26740K60510l46394L284P0410J28200k2242k77722O05554L26801
$$ -600426 -573385 -46645 213865 -132529 -129245 -58835 69365 47123 -230599 374955 701756
6352G01756o41558j2093k87746N04547M55860k88363p28173q3542M40510K58397
$$ 701756 60198 48105 -239641 264906 720766 432403 -295770 -379312 61198 319595
6342C19595L78667J71507n92149J25874l5078L01329K39105k98444l20194j32691
$$ 319595 698262 869769 277620 403494 368416 669745 908850 610406 290212 157521
6332A57521J49744q8592K00164m77853j31034L6232k12023l36627P58382N97781
$$ 157521 307265 218673 418837 -59016 -190050 -153818 -365841 -702468 55914 653695
6322F53695k90631k44038K2676M60529n15046n9958k40349N28023k7967K87038
$$ 653695 363064 119026 141702 602231 87185 27227 -213122 314901 286934 573972
6312E73972o6789k66196o574J3977M12556K05024l42814J11304N99984k35853
$$ 573972 507183 240987 234413 248390 660946 865970 523156 634460 1234444 998591
6302I98591J25096J45942k47730O5283m32298j02626j79048M46119k04877L93567
$$ 998591 1123687 1269629 1021899 1087182 654884 552258 373210 819329 614452 1008019
6292A008019q60941o22079N99379k77813J73736J39214M3317J016K71352j69858
$$ 1008019 147078 -475001 124378 -153435 20301 159515 202832 203848 475200 305342
6282C05342r177o3481p97594k198K28553K03936J84541J72693K60746l0757k0048
$$ 305342 296165 232684 -564910 -567108 -338555 -134619 49922 222615 483361 452604 432556
6271D32556l55812k56631k71951M2679Q04884m4650l70763L19539M15560r5355
$$ 432556 76744 -179887 -451838 -409159 395725 351075 -19688 299851 715411 620056
6261F20056m89269K62743K97442j36042M15199P1465q15024j59435L28771K98461
$$ 620056 130787 393530 690972 554930 970129 1041594 226570 67135 395906 694367
6251F94367j6300r8292K07734M51520K6044j90179m20976o37810J08282O3516
$$ 694367 678067 579775 787509 1239029 1265073 1074894 653918 16108 124390 187906
6241A87906j68847j45120o10111P79351J09911Q89708J29408N0652m75397q7666
$$ 187906 19059 -126061 -736172 43179 153090 1042798 1172206 1222858 747461 659795
6231F59795j01522J53825L39110l35651K65489m3066k83465m13714m41841M11243
$$ 659795 558273 712098 1051208 715557 981046 937980 654515 240801 -201040 210203
6221B10203j66266k504M53939j67391o7379K47048L05677K74868n48068n78518
$$ 210203 43937 41433 495372 327981 260602 507650 813327 1088195 540127 -38391
6211c8391L62139p39223L24983P41443J67668l65618o34233Q21680K8079m55530
$$ -38391 323748 -415475 -90492 650951 818619 453001 -181232 640448 668527 212997
6201B12997r4536K82342J62024k33647j37679l26688l2956N72580k52380L05770
$$ 212997 118461 400803 562827 329180 191501 -135187 -168143 404437 152057 457827
6191D57827M20313O6495P2491n03084J86965j62023p03656p6009M55113J43838
$$ 457827 878140 944635 1017126 514042 701007 538984 -164672 -240681 214432 358270
6181C58270k43276O4641J69294m68116M46133j32476J45166k62951k30250q8154
$$ 358270 114994 179635 348929 -119187 326946 194470 339636 76685 -153565 -241719
6171b41719L88534J97952m04480P5932J95731K11372q59884M28828L70508J97095
$$ -241719 146815 344767 -59713 16219 211950 423322 -436562 -7734 362774 559869
6161E59869K28440n31259L35130M06338o64436o73581Q94869J13990J77017p2425
$$ 559869 788309 257050 592180 998518 334082 -339499 555370 669360 846377 773952
6151G73952l29539l81747l02383J25479L20691N83216p52731K13252l95691J8578
$$ 773952 444413 62666 -239717 -114238 206453 789669 36938 250190 -145501 -126923
6141a26923N09621J09630l43685m25036N75308j57717k7789K41192j55185o3771
$$ -126923 382698 492328 148643 -276393 298915 141198 113409 354601 199416 135645
6131A35645N03631K06234q0969q56725K94464P84089k08483k71305j29729L85636
$$ 135645 639276 845510 764541 -92184 202280 986369 777886 506581 376852 762488
6121G62488l56144N49853l20859l25960J00561J10957J70493o75790J83237K09975
$$ 762488 406344 956197 635338 309378 409939 520896 691389 15599 198836 408811
6111D08811K96995k6947j09885K15873J69749K25724k54372k32567L28000K05623
$$ 408811 705806 678859 568974 784847 954596 1180320 925948 693381 1021381 1227004
6101A227004o23599l36500Q04625j67977r4067P00073J17077l51549m7962l32958
$$ 1227004 603405 266905 1071530 903553 809486 1509559 1626636 1275087 1227125 894167
6091H94167N83106r63367K94013q1369m64819K02767r4357j09543n7723K43077
$$ 894167 1477273 513906 807919 726550 261731 464498 370141 260598 202875 445952
6081D45952l16591O89526K34958J14860n9204J22222J30495j28208l45704j07043
$$ 445952 129361 818887 1053845 1168705 1109501 1231723 1362218 1234010 888306 781263
6071G81263J19399L29104m42055K03353J45929l11542N58828l57504k30920R7534
$$ 781263 900662 1229766 787711 991064 1136993 825451 1384279 1026775 795855 893389
6061H93389j48413r913O5263M34234K8579J37155Q75484m01253j15107j17616
$$ 893389 744976 735063 800326 1234560 1263139 1400294 2275778 1874525 1759418 1641802
6051A641802L67497m9717l33659m4689J04252J1356J64255N6501n10443M6173
$$ 1641802 2009299 1959582 1625923 1581234 1685486 1696842 1861097 1917598 1407155 1453328
6041A453328l77070K45489K58670Q65613J484n82496M18666Q2492m58917l26653
$$ 1453328 1076258 1321747 1580417 2446030 2447514 1865018 2283684 2366176 1907259 1580606
6031A580606N67415J57213m64626K55612R58480o76542o7619M40039n57533k11645
$$ 1580606 2148021 2305234 1840608 2096220 3054700 2378158 2310539 2750578 2193045 1981400
6021A981400J82720N33569k79972L0025L03168j30097o94878p3184M92838j35870
$$ 1981400 2164120 2697689 2417717 2447742 2750910 2620813 1925935 1852751 2345589 2209719
6011B209719o2366M6321J46513L40508M92947J113410O5780p21089K9650O76213
$$ 2209719 2147353 2193674 2340187 2680695 3173642 4287052 4352832 3631743 3661393 4337606
6001D337606L05014R1986L3566k12869L84122L16079j44724P6137j3311L98097
$$ 4337606 4642620 4734606 4768172 4555303 4939425 5255504 5110780 5186917 5173606 5571703
5991E571703k44453k24235L12190M95548j64099l5708J90375M5618n88302J037496
$$ 5571703 5327250 5103015 5415205 5910753 5746654 5710946 5901321 5946939 5358637 6396133
5981F396133N22587O21370N47725N31219J63750O61013M51619k54485j6851O97644
$$ 6396133 6918720 7540090 8087815 8619034 8782784 9443797 9895416 9640931 9624080 10321724
5971A0321724J324670Q95937Q53029P41944J831380J136295J287472J402178K82577
$$ 10321724 11646394 12542331 13395360 14137304 15968684 17104979 18392451 19794629 20077206
5962B0077206N55532L99655R699J358328J259843L88846J930007K160032K203049
$$ 20077206 20632738 21032393 21042092 22400420 23660263 24049109 25979116 28139148 30342197
5953C0342197L378116K507989Q8475k183474k389217l382173k047445j056343
$$ 30342197 33720313 36228302 36316777 34133303 31744086 28361913 26314468 25258125
5945B5258125o66849j135214O19619L32143P15854J425989Q94371J285782J687113
$$ 25258125 24591276 23456062 24075681 24407824 25123678 26549667 27444038 28729820 30416933
5936C0416933K418641K499015K740492L542023M293365K723169J770956K53846
$$ 30416933 32835574 35334589 38075081 41617104 45910469 48633638 50404594 50658440
5928E0658440o11441O90969K314394L058749L839480N242811P287673Q632113
$$ 50658440 50046999 50737968 53052362 56111111 59950591 65193402 72481075 81113188
5920H1113188Q477768K249211m898366r878267j0225663q555272p059656m534034
$$ 81113188 89590956 91840167 86941801 77063534 66837871 58282599 51222943 46688909
5912D6688909l899992k828357j272328j058096r29560o35480K72734Q12692O69402
$$ 46688909 42788917 39960560 38688232 37630136 36700576 36065096 36337830 37150522 37819924
5903C7819924K140909K137044K738161L332135L540436K364330J35535j308720
$$ 37819924 39960833 42097877 44836038 48168173 51708609 54072939 54208474 52899754
5895E2899754j031952j61351K551492L403936M671031N023272P240782Q028603
$$ 52899754 51867802 51706451 54257943 57661879 62332910 67356182 74596964 82625567
5887H2625567M163679k812194q884178j1120090j0701779p261963n992738m568560
$$ 82625567 86789246 83977052 75092874 63972784 53271005 46009042 40016304 35447744
5879C5447744l360595k291358j806212j976439j272646j396762L84931L35517
$$ 35447744 32087149 29795791 27989579 26013140 24740494 23343732 23728663 24064180
5871B4064180j1061k22283l57324J33906J390578L18054O20O4610n88388o81480
$$ 24064180 24053119 23830836 23473512 23607418 24997996 25316050 25316670 25381280 24792892 24111412
5861B4111412J88668L48290N29316K094180K550274K899124O25224p24110k106740
$$ 24111412 24300080 24648370 25177686 27271866 29822140 32721264 33346488 32622378 30515638
5852C0515638l224165m049660l360516k255407k001496j003808j010300k009799
$$ 30515638 27291473 23241813 19881297 17625890 15624394 14620586 13610286 11600487
5844A1600487o73931o19548j295573m08406j77057l29250n14152m17940P7958
$$ 11600487 10926556 10307008 9011435 8603029 8425972 8096722 7582570 7164630 7242588
5835G242588m57161k97239n85837N38707M8763l01310j84207k28041M55648K71798
$$ 7242588 6785427 6488188 5902351 6441058 6489821 6188511 6004304 5776263 6231911 6503709
5825F503709n13344j154037j97030K04908J03420q00061n09121M87415l58955
$$ 6503709 5990365 4836328 4639298 4844206 4947626 4147565 3638444 4125859 3766904
5816C766904m32832P22759l12310J22431M00536m7786p8581m36935J97808k08621
$$ 3766904 3334072 4056831 3744521 3866952 4267488 4219702 4141121 3704186 3901994 3693373
5806C693373n18220K5619j27353K70389j06623n77480k9862m83174J98309M84579
$$ 3693373 3175153 3200772 3073419 3343808 3237185 2659705 2629843 2146669 2344978 2829557
5796B829557K69566p01475j37087M91519p7433k42J50142o85985p6817k63854
$$ 2829557 3099123 2397648 2260561 2752080 2674647 2674405 2824547 2138562 2061745 1797891
5786A797891K22262k2678J14214n53591k93017j58895N18336M58203O9470K86943
$$ 1797891 2020153 1997475 2111689 1558098 1265081 1106186 1624522 2082725 2152195 2439138
5776B439138k33664q23677J20195k6884J7110M00467N01594L61121q85779q08927
$$ 2439138 2205474 1381797 1501992 1475108 1492218 1892685 2394279 2755400 1869621 1060694
5766A060694j96484j43091j12127N31366M24124l9494n79925L48151R2054k0471
$$ 1060694 864210 721119 608992 1140358 1564482 1524988 945063 1293214 1385268 1364797
5756A364797j08096K18732k86689o4436k37133m1845M51720m07268l60180K31853
$$ 1364797 1256701 1475433 1188744 1124308 887175 845330 1297050 889782 529602 761455
5746G61455k56421k07311M85886J85688m26216Q6488L85881k53196K47196K69553
$$ 761455 505034 297723 783609 969297 543081 629569 1015450 762254 1009450 1279003
5736A279003o34298J8656K8795N53302l282j05782r5731j0575L67400k5763n70612
$$ 1279003 644705 663361 692156 1245458 1242176 1136394 1040663 1030088 1397488 1371725 801113
5725H01113l07603L76671r0260r53362L93716M48169k52805M82642m01709J7206
$$ 801113 493510 870181 779921 -173441 220275 668444 415639 898281 496572 513778
5715E13778j5292k04879M72335K7888K27241o55985q00113R9055M71433p6702
$$ 513778 498486 293607 765942 793830 1021071 365086 -435027 -335972 135461 58759
5705E8759K98446j56099M2741O53471J90142o99452l11157J79497O31600J19170
$$ 58759 357205 201106 243847 897318 1087460 388008 76851 256348 887948 1007118
5695A007118n88275J49790O7262J48955Q7558k17659k2304j32366k30506N95609
$$ 1007118 418843 568633 635895 784850 872408 654749 632445 500079 269573 865182
5685H65182k9240l74919n4724n62226O53025j057K15370L00850j82302o5075K93318
$$ 865182 835942 461023 406299 -155927 497098 496041 711411 1012261 829959 764884 1058202
5674A058202n2735L3116m95862n76201K75907M84974K1827k72462k72947J79705
$$ 1058202 1005467 1038583 542721 -33480 242427 727401 749228 476766 203819 383524
5664C83524j03353P8435R1806J23923j70089n98954K93767L92193L78928j90499
$$ 383524 280171 358606 450412 574335 404246 -194708 99059 491252 870180 679681
5654F79681K38850N30795l3095o57819K39023m50778L61709l40321j21135L20179
$$ 679681 918531 1449326 1416231 758412 997435 546657 908366 568045 446910 767089
5644G67089n7264j47228k62127j32609N80006m42970o42635K58477K20696P2803
$$ 767089 709825 562597 300470 167861 747867 304897 -337738 -79261 141435 214238
5634B14238q3069n06774o4303m33725K86387L32668J036160L03000j011408J69700
$$ 214238 131169 -375605 -439908 -873633 -587246 -254578 781582 1084582 73174 242874
5624B42874L95532m7762Q86746L23203l82346n07428l69718K82729M32173j3281
$$ 242874 638406 590644 1477390 1800593 1418247 910819 541101 823830 1256003 1242722
5614A242722l70068m22440P21339L32191q81788j00957k95597J0793L49680J05161
$$ 1242722 872654 450214 1171553 1503744 621956 520999 225402 236195 585875 691036
5604F91036j61263k11408j83219J80675K91135l12301K14685J15303r8187q3341
$$ 691036 529773 318365 135146 315821 606956 294655 509340 624643 526456 443115
5594D43115K11099l4823l4581j55503m75681K72515M79911M42532o37587j52875
$$ 443115 654214 619391 584810 429307 -46374 226141 706052 1148584 510997 358122
5584C58122K03181k34178O6568j29521K809L81873m67256K75275J23744M43907
$$ 358122 561303 327125 393693 264172 266981 648854 181598 456873 580617 1024524
5574A024524K05581k02739o16301K41980O15223q18249K66825L41574j79365n53310
$$ 1024524 1230105 1027366 411065 653045 1268268 450019 716844 1058418 879053 325743
5564C25743M41625J10019K52606o5592P5220L35339p57876q3298M32522M42213
$$ 325743 767368 877387 1129993 1064401 1139621 1474960 717084 633786 1066308 1508521
5554A508521j60324J39199j32905K88527J53507J1938j603o22031j397205Q44032
$$ 1508521 1348197 1487396 1354491 1643018 1796525 1808463 1806860 1184829 -212376 631656
5544F31656M34072j10912M47355j01843q27105N77797L87176M78756l45265K26042
$$ 631656 1065728 954816 1402171 1300328 473223 1051020 1438196 1916952 1571687 1797729
5534A797729j97538J8048N56827P01498o0431r07488L78332k78684K23N4668L38326
$$ 1797729 1600191 1618239 2175066 2876564 2816133 1908645 2286977 2008293 2008516 2063184 2401510
5523B401510k01595M6064k96640J45361l46865K09247m72569L38260n32830j90184
$$ 2401510 2199915 2245979 1949339 2094700 1747835 1957082 1484513 1822773 1289943 1099759
5513A099759K77696p6150K30911l02152N91258L70668L72110m54842k0987j32348
$$ 1099759 1377455 1301305 1532216 1230064 1821322 2191990 2564100 2109258 2088271 1955923
5503A955923K59168Q89830N37906M67192l99909j003535m78053q08572m0425M94878
$$ 1955923 2215091 3104921 3642827 4110019 3710110 2706575 2228522 1419950 1379525 1874403
5493A874403K24708J4721R8155J38284m32999n51865J90287J22788n72673K59017
$$ 1874403 2099111 2113832 2211987 2350271 1917272 1365407 1555694 1678482 1105809 1364826
5483A364826o10885M06363R22207l52766n89958M42429K01186j81175P05680r6641
$$ 1364826 753941 1160304 2082511 1729745 1139787 1582216 1783402 1602227 2307907 2211266
5473B211266L72180N52221J58404M72576L06136r497q5104n80168P5670k72039
$$ 2211266 2583446 3135667 3294071 3766647 4072783 4063286 3978182 3398014 3473684 3201645
5463C201645n92475j17700l12722Q0894M35513l94240l56347M50391K829K58057
$$ 3201645 2609170 2491470 2178748 2259642 2695155 2300915 1944568 2394959 2397788 2655845
5453B655845j63670O05646J53985J06395M6702j03779r19466k46309J115079K42515
$$ 2655845 2492175 3097821 3251806 3358201 3404903 3301124 2381658 2135349 3250428 3492943
5443C492943j90500N0364L21524j14065m78453N16678L1737j289386k22598j51028
$$ 3492943 3302443 3352807 3674331 3560266 3081813 3598491 3630228 2340842 2118244 1967216
5433A967216j96726L87004j40671J03223k53101J01242j85496p20984j0959L07098
$$ 1967216 1770490 2157494 2016823 2120046 1866945 1968187 1782691 1061707 1050748 1357846
5423A357846K01983l5248K68532M83746j28534k19134L5489l11326m84855L07328
$$ 1357846 1559829 1524581 1793113 2276859 2148325 1929191 1964680 1653354 1168499 1475827
5413A475827M32521n19733M11495N5989k97050m29158L73367N36881L73995k78905
$$ 1475827 1908348 1388615 1800110 1856099 1559049 1129891 1503258 2040139 2414134 2135229
5403B135229p10551m69953j62362J014125m6899J46353J42880j28944K47854m9451
$$ 2135229 1424678 954725 792363 1806488 1759589 1905942 2048822 1919878 2167732 2118281
5393B118281J54645P83993k82719n45605J35793l75976n85779Q1427K45020J69433
$$ 2118281 2272926 3056919 2774200 2228595 2364388 1988412 1402633 1484060 1729080 1898513
5383A898513q1715k61863q9915L72811J08434j16224J22541L7838N65346n26529
$$ 1898513 1816798 1554935 1465020 1837831 1946265 1830041 1952582 1990420 2555766 2029237
5373B029237n11361M67824L92727m73719m94834M37934M26239J79661m4976l85489
$$ 2029237 1517876 1985700 2378427 1904708 1409874 1847808 2274047 2453708 2408732 2023243
5363B023243L25808Q0873j90762O1098k21491K48020J72350l05825k8782k86694
$$ 2023243 2349051 2429924 2239162 2300260 2078769 2326789 2499139 2193314 2164532 1877838
5353A877838L55376K11229M69842p6911j80624Q21260l46423o63011j44549R3538
$$ 1877838 2233214 2444443 2914285 2837374 2656750 3478010 3131587 2468576 2324027 2417565
5343B417565N42337n10978M54383P22130r2032q69858O91751p12695J32503P31173
$$ 2417565 2959902 2448924 2903307 3625437 3533405 2663547 3355298 2642603 2775106 3506279
5333C506279N35266N17330J2015p96931m12480L46421o61199Q57879j46258M4350
$$ 3506279 4041545 4558875 4570890 3773959 3361479 3707900 3046701 3904580 3758322 3802672
5323C802672M88376m21969j8767M17904k90892K13535M00524Q32186n63749M71234
$$ 3802672 4291048 3869079 3850312 4268216 3977324 4190859 4591383 5423569 4859820 5331054
5313E331054M07683N87634m86346l76187R21714J24752m23607M53429K97768j01071
$$ 5331054 5738737 6326371 5840025 5463838 6385552 6510304 6086697 6540126 6837894 6736823
5303F736823k15718M24531k46037K76468L09908R3269P66828m60302L75300p7450
$$ 6736823 6521105 6945636 6699599 6976067 7285975 7379244 8146072 7685770 8061070 7983620
5293G983620L71676L69912M46925N43653n59753L7165Q64316M65901j18093N8496
$$ 7983620 8355296 8725208 9172133 9715786 9156033 9193198 10057514 10523415 10405322 10463818
5283A0463818j04111J51099O25764M56358J78864l83162J5327L64966L0284P1829
$$ 10463818 10359707 10510806 11136570 11592928 11771792 11388630 11403957 11768923 11799207 11871036
5273A1871036k44642O95724O00418O6663P77608P29982P78455Q47465Q09960o6078
$$ 11871036 11626394 12322118 12922536 12989199 13766807 14496789 15275244 16122709 16932669 16866591
5263A6866591L71072P66074O36973L69360L57644J182629J088252O96277J068753
$$ 16866591 17237663 18003737 18640710 19010070 19367714 20550343 21638595 22334872 23403625
5254B3403625J556736J543474J422607R59608P43218K197274K133489J686796
$$ 23403625 24960361 26503835 27926442 28886050 29629268 31826542 33960031 35646827
5246C5646827K015983K184028K335823K896704L107402L930233M612152N156439
$$ 35646827 37662810 39846838 42182661 45079365 48186767 52117000 56729152 61885591
5238F1885591N033830O506025P229889Q185560J0386634J0778512J3386482J6255202
$$ 61885591 66919421 73425446 80655335 88840895 99227529 110006041 123392523 139647725
5230A39647725J8071331J8456344J9199969J9084381J5272582O563458m9973n301187
$$ 139647725 157719056 176175400 195375369 214459750 229732332 236295790 236245817 230944630
5222B30944630j2795996j9365024k2861659k2693684k1248675j8849276j5728479
$$ 230944630 218148634 198783610 175921951 153228267 131979592 113130316 97401837
5215I7401837j2413636r414086p648773n824646m473006l364000m146542k749092
$$ 97401837 84988201 75574115 67925342 62100696 57627690 54263690 50117148 47368056
5207D7368056j979254k310165k418493j925306p15602j456071j248552r07441
$$ 47368056 45388802 43078637 40660144 38734838 38019236 36563165 35314613 34407172
5199C4407172q10209k98388m71865j040355m58482n52608P3665n12970L18833
$$ 34407172 33596963 33298575 32826710 31786355 31327873 30775265 30848930 30335960 30654793
5190C0654793j33150M79564k66938O22776K07805M56432M24102Q45164J330771
$$ 30654793 30521643 31001207 30734269 31357045 31564850 32021282 32445384 33290548 34621319
5181C4621319L27931J279181R33504J625143J590027J856172J438728K187290
$$ 34621319 34949250 36228431 37161935 38787078 40377105 42233277 43672005 45859295
5173D5859295K705187K357583K675204L774724M461820M838904N334745O981641
$$ 45859295 48564482 50922065 53597269 57371993 61833813 66672717 72007462 78989103
5165G8989103P300022R454799J0704400J1760386J4040989J6931301K1315000
$$ 78989103 86289125 95743924 106448324 118208710 132249699 149181000 170496000
5158A70496000K5819864K7111311J9427721K704775j7062618l0711710l4055135
$$ 170496000 196315864 223427175 242854896 245559671 228497053 197785343 163730208
5151A63730208k9124788k1972580j7170067j2534193j0048128q998180o582923
$$ 163730208 134605420 112632840 95462773 82928580 72880452 63882272 57299349
5144E7299349n125053l956576l046311l057153l141529k079170k054425j817230
$$ 57299349 52174296 48217720 45171409 42114256 38972727 36893557 34839132 33021902
5136C3021902j630717j782645j215230j857044j634663j068611o88383j222467
$$ 33021902 31391185 29608540 28393310 26536266 24901603 23832992 23144609 21922142
5128B1922142j151896j024158j124411m24220r52041j210045p22636m28041l77705
$$ 21922142 20770246 19746088 18621677 18197457 17245416 16035371 15312735 14884694 14506989
5119A4506989r16363j80006j50438o44732l98408k99492l50119o57558O70741
$$ 14506989 13590626 13410620 13260182 12615450 12217042 11917550 11567431 10909873 11580614
5110A1580614o21607l53062p47628k10179J94521o38956J01177p7652k63026n32103
$$ 11580614 10959007 10605945 9858317 9648138 9842659 9203703 9304880 9227228 8964202 8432099
5100H432099Q7619p09055j072137L58993Q5035K47961n70005l43399K5284K40896
$$ 8432099 8519718 7810663 6738526 7097519 7182554 7430515 6860510 6517111 6542395 6783291
5090F783291l14321l42299N34898N293j84956o53812n80174l08392j24992M9759
$$ 6783291 6468970 6126671 6661569 6666862 6481906 5828094 5247920 4939528 4814536 4864295
5080D864295L08531k98714K42210n09531q2670j268l03753o04776K25878J442511
$$ 4864295 5172826 4874112 5116322 4606791 4524121 4522853 4219100 3614324 3840202 5282713
5070E282713l45763j178001L41210m83337k75758K35149J70121m9222L39455k96161
$$ 5282713 4936950 3758949 4100159 3616822 3341064 3576213 3746334 3697112 4036567 3740406
5060C740406J2631L5167l80926J05282j30136J50201m63131M30398j2986m86350
$$ 3740406 3753037 3788204 3407278 3512560 3382424 3532625 3069494 3499892 3486906 3000556
5050C000556j37762k22907l40897K68144K42638o56131K29322k84074P9913L89793
$$ 3000556 2862794 2639887 2298990 2567134 2809772 2153641 2382963 2098889 2178802 2568595
5040B568595k59013m0486q3311O70566R0110l08098r8454R8471n31163p3268N6238
$$ 2568595 2309582 2269096 2185785 2856351 2946461 2638363 2539909 2638380 2107217 2033949 2090187
5029B090187j00708o58169J12471Q76525k7394l37969p1155k46609j44396M95630
$$ 2090187 1989479 1331310 1443781 2320306 2292912 1954943 1883788 1637179 1492783 1988413
5019A988413o87684J50698n5319N01078M82893j77303k551o62826m16183J32659
$$ 1988413 1300729 1451427 1396108 1897186 2380079 2202776 2200225 1537399 1121216 1253875
5009A253875M57286k76910j49270j22288K02805l36668K66981J26880k01164m74795
$$ 1253875 1711161 1434251 1284981 1162693 1365498 1028830 1295811 1422691 1221527 746732
4999G46732J36543J58362k56922N46217j92044k66662J39482J70953K15830P2474
$$ 746732 883275 1041637 784715 1330932 1138888 872226 1011708 1182661 1398491 1470965
4989A470965m46081j03434O0752N21041P5155l95682M37950n7676j84543k29599
$$ 1470965 1024884 921450 982202 1503243 1578398 1182716 1620666 1562990 1378447 1148848
4979A148848J96352p8559j44374k95860L22168n18141J90646Q13342q8086l11959
$$ 1148848 1345200 1266641 1122267 826407 1148575 630434 821080 1634422 1546336 1234377
4969A234377l59182m70554p1719J39435N75285o8492k43877j5706j97434J86181
$$ 1234377 875195 404641 332922 472357 1047642 979150 735273 719567 522133 708314
4959G08314m53577R47224j85427l44135j05961L04154j37379K83405k23485j70995
$$ 708314 254737 1201961 1016534 672399 566438 870592 733213 1016618 793133 622138
4949F22138o82920j73226N78934J00579N37840K66883j11078p92897L49326M42582
$$ 622138 -60782 -234008 344926 445505 983345 1250228 1139150 346253 695579 1138161
4939A138161m95818L50696M68368l32931m86577j72472K14494K16405j84014P26697
$$ 1138161 642343 993039 1461407 1128476 641899 469427 683921 900326 716312 1443009
4929A443009l8341n46644p2585L45646M02266R0178K56140M3238N89164J01511
$$ 1443009 1404668 858024 785439 1131085 1533351 1623529 1879669 1922907 2512071 2613582
4919B613582j007865k25773M33880m45094N0682j75338k39346m85488K116J52480
$$ 2613582 1605717 1379944 1813824 1368730 1419412 1244074 1004728 519240 521356 673836
4909F73836J32552l49659J6089L4278o43046r8935L84244J53819k7559J22658
$$ 673836 806388 456729 472818 507096 -135950 -234885 149359 303178 275619 398277
4899C98277o7701K22083l52696M9389M10581j80279M41489m12921o23247m8403
$$ 398277 330576 552659 199963 249352 659933 479654 921143 508222 -115025 -163428
4889a63428k18721k68396N77931N48473J18738K61977j19128J09912m595o77570
$$ -163428 -382149 -650545 -72614 475859 594597 856574 737446 847358 842763 165193
4879A65193n5308K53685M3312p2070L12024N75060n75191k89541R03962J12912
$$ 165193 109885 363570 406882 334812 646836 1221896 646705 357164 1261126 1374038
4869A374038m15873j29173k95999m23246J67079Q88326K0833O63811m896n09899
$$ 1374038 958165 828992 532993 109747 276826 1165152 1185985 1849796 1844900 1335001
4859A335001m1652O79668l61291k16835p31112p05345M57361j15055K11152j44543
$$ 1335001 1293349 1973017 1611726 1394891 663779 -41566 415795 300740 511892 367349
4849C67349K58205R1854j7059o4381n03176M98573O48356j32720j89920k0155
$$ 367349 625554 717408 700349 635968 132792 631365 1279721 1147001 957081 936926
4839I36926n42096n20341M43383L49648p3927k46915K61846k13276L07265M27808
$$ 936926 394830 -125511 317872 667520 593593 346678 608524 395248 702513 1130321
4829A130321o49374p0345K08822m44311L34810L77248k64430l53744J22576l84185
$$ 1130321 480947 410602 619424 175113 509923 887171 622741 268997 391573 7388
4819G388j12898N73889l39322K96194j13514j96422L97458p66832j90245J02402
$$ 7388 -105510 468379 129057 425251 311737 115315 512773 -254059 -444304 -341902
4809c41902N55125L92352n9696m29646M95688L63245k41395P32522m60045q06919
$$ -341902 213223 605575 545879 116233 611921 975166 733771 1466293 1006248 199329
4799A99329L15208M6251k61663l04017l13461M10328L51710L09667o85715k04980
$$ 199329 514537 560788 299125 -4892 -318353 91975 443685 753352 67637 -137343
4789a37343O81528J91480m52434j45620J7891L16889n49865J94901n04125N49446
$$ -137343 544185 735665 283231 137611 155502 472391 -77474 117427 -386698 162748
4779A62748Q05116q6725n52539k64865m0643L35308J07894p99581N804j25869
$$ 162748 967864 881139 328600 63735 23092 358400 466294 -333287 -327483 -453352
4769d53352j91076p9339P0570J59056j12189J258711M31315k80542p18865m48570
$$ -453352 -644428 -723767 -653197 -494141 -606330 652381 1083696 803154 84289 -364281
4759c64281O74513J29081j82465M26341L45043l69931n3439k50452k59598P3398
$$ -364281 310232 439313 256848 683189 1028232 658301 604862 354410 94812 168210
4749A68210m8646k36633P35574n15106l83859M89776O28321n52542j35318M95306
$$ 168210 119564 -117069 618505 103399 -280460 209316 837637 285095 149777 645083
4739F45083l9076o18285K61061k75699k8830J54393M14874o80683k24148j95203
$$ 645083 606007 -12278 248783 -26916 -55746 98647 513521 -167162 -391310 -586513
4729e86513J80136O8504j98246l04759J092368J77753k78732l57927k0729P97451
$$ -586513 -406377 -337873 -536119 -840878 251490 429243 150511 -207416 -228145 569306
4719E69306L08000k15110k36817J00114M302q15535j59161N23127M23002j2750
$$ 569306 877306 662196 425379 525493 529795 -285740 -444901 78226 501228 488478
4709D88478k36312L98433j042802L2873J80924k33593k31897M55965j1621k33370
$$ 488478 252166 650599 -392203 -359330 -178406 -411999 -643896 -187931 -199552 -432922
4699d32922K03203j94302J18655J11492k9886p5338N13686m5066m14502m20429
$$ -432922 -229719 -424021 -305366 -193874 -223760 -299098 214588 169522 -244980 -665409
4689f65409L97762K7558l2658O37527q63811L98716M88826k60529p85267L04110
$$ -665409 -267647 -240089 -272747 364780 -499031 -100315 388511 127982 -657285 -353175
4679c53175L17979M81986l70393K7278o17440k8842L30761K76753N4617o33814
$$ -353175 -35196 446790 76397 103675 -513765 -542607 -211846 64907 119524 -514290
4669e14290K22196J70471K48868M42313l54319K09369l33649L86381J35229q18419
$$ -514290 -292094 -121623 127245 569558 215239 424608 90959 477340 612569 -205850
4659b05850o1794P59958m89762N8900l63391k05081N10206l54100l25368J81059
$$ -205850 -267644 492314 2552 61452 -301939 -507020 3186 -350914 -676282 -495223
4649d95223M10216M71714p94008l87479P88833N88184j11410p71258K86576K54644
$$ -495223 -85007 386707 -407301 -794780 -5947 582237 470827 -300431 -13855 240789
4639B40789n01445n19200J094835p0986n73355M04039j7590j23494O94302O32372
$$ 240789 -260656 -779856 314979 243993 -329362 74677 57087 -66407 627895 1260267
4629A260267p31994r66339M01187J6014n96645o29993N85327L49968l13371K83427
$$ 1260267 528273 -438066 -36879 -20865 -617510 -1247503 -662176 -312208 -625579 -342152
4619c42152J16148P2259J96703q60739R39105R1545p94561p161L18996R10413
$$ -342152 -226004 -153745 42958 -817781 121324 212869 -581692 -588853 -269857 640556
4609F40556l58533Q268k20538M56746J64300j018953K5536p73409K09460P23295
$$ 640556 282023 290291 69753 526499 690799 -328154 -302618 -1076027 -866567 -143272
4599a43272M0176l82266n7899M64619L95988K23763n99626O47204j26103p68457
$$ -143272 -103096 -485362 -543261 -78642 317346 541109 -58517 588687 462584 -305873
4589c05873k72897N1333J025895j84235m7837o05689J74396k34546K84161M78369
$$ -305873 -578770 -527437 498458 314223 266386 -339303 -164907 -399453 -115292 363077
4579C63077j0551K17220j53350N66276k17488J13808l42770m96296p75185N894
$$ 363077 352526 569746 416396 982672 765184 878992 536222 39926 -735259 -729365
4569g29365L32284J3912q496k76753K31342o3294r8265L92709K59027k20972j94523
$$ -729365 -397081 -383169 -391665 -668418 -437076 -500370 -598635 -205926 53101 -167871 -362394
4558c62394K69298N48783j27935l4197j95711n2867N01648k10984J53917Q3484
$$ -362394 -93096 455687 327752 293555 97844 44977 546625 335641 489558 573042
4548E73042l13969k77167m98001O6735K97585L31116l0394l70636O95332L47534
$$ 573042 259073 -18094 -516095 -449360 -151775 179341 148947 -221689 473643 821177
4538H21177m45785M20486j21633j72615m38559k3587l25882Q38599K81804o62423
$$ 821177 375392 795878 674245 501630 63071 39484 -286398 552201 834005 171582
4528A71582K93479J95392M07601n0235K12377J97475J38923L96233l22649n6632
$$ 171582 465061 660453 1068054 1017819 1230196 1427671 1566594 1962827 1640178 1583546
4518A583546l51885m21879J53003J56042l59058L87187n44010k70284K17496j31757
$$ 1583546 1231661 809782 962785 1118827 759769 1146956 602946 332662 550158 418401
4508D18401L00718J99445J31006J54898n81175p18589L70065o39194J27909j0767
$$ 418401 719119 918564 1049570 1204468 623293 -95296 274769 -364425 -236516 -247283
4498b47283M44334j00021L40424k40757M3729P63660K16411k91558J03364J8480
$$ -247283 197051 97030 437454 196697 240426 1004086 1220497 928939 1032303 1050783
4488A050783m55379l17951l63885R0952L80653O13815k38865m66303J7384P016
$$ 1050783 595404 277453 -86432 4520 385173 998988 760123 293820 311204 318220
4478C18220j29286P4959K93675m16647j69459L64203l801p622p37332K74299O74453
$$ 318220 188934 263893 557568 140921 -28538 335665 331864 324242 -413090 -138791 535662
4467E35662P3593R821J37877k77375J8907P14371o3264p51778L3541R0704k41631
$$ 535662 609255 619076 756953 479578 498485 1212856 1149592 397814 431355 522059 280428
4456B80428J04751j72224M8060J35086L80483p5428j03869k43475j89694J99908
$$ 280428 385179 212955 261015 396101 776584 701156 597287 353812 164118 364026
4446C64026j41571m67504N80045K51174M17373n90218q7670N80302j8537m38019
$$ 364026 222455 -245049 334996 586170 1003543 413325 325655 905957 887420 449401
4436D49401l70961J06243M56030l07611J38330j10159K25161L59682m19338j09895
$$ 449401 78440 184683 640713 333102 471432 361273 586434 946116 526778 416883
4426D16883N82221n15044n05029N65778j56649L76312n15405k97643N16676J38936
$$ 416883 999104 484060 -20969 544809 388160 764472 249067 -48576 468100 607036
4416F07036M0550P15394j66219L083l36010Q5183N14777q09674j83132M62470
$$ 607036 647586 1362980 1196761 1199844 863834 949017 1463794 654120 470988 933458
4406I33458N70434l65311J24953M7363J06987M87981m8869L29513J65229M60260
$$ 933458 1503892 1138581 1263534 1310897 1417884 1905865 1856996 2186509 2351738 2811998
4396B811998J31925M1463L65790p98486k33553j54889L00558L1768n99274J30784
$$ 2811998 2943923 2985386 3351176 2552690 2319137 2164248 2464806 2496574 1897300 2028084
4386B028084l89468o87305J83406p3993j30603O81335R7477m16326q62339N84563
$$ 2028084 1638616 951311 1134717 1060724 930121 1611456 1708933 1292607 430268 1014831
4376A014831N91057k16460r56127M01447L68257L00911k78491J10423m45340L77036
$$ 1014831 1605888 1389428 433301 834748 1203005 1503916 1225425 1335848 890508 1267544
4366A267544m00357K59433N13228K71488l26553j28416j92472M20431O11568k88148
$$ 1267544 867187 1126620 1639848 1911336 1584783 1456367 1263895 1684326 2295894 2007746
4356B007746J18232P7678R6641l73727j80343K6772K44316k32Q19127n17851o395
$$ 2007746 2125978 2203656 2300297 1926570 1746227 1772999 2017315 2017083 2836210 2318359 2311964
4345B311964L23249L14417k10252l71875M35327J2492L54626n0032J96433Q39735
$$ 2311964 2635213 2949630 2739378 2367503 2802830 2815322 3169948 3119916 3316349 4156084
4335D156084J56963k18901O10655O41050P44679L51904O35031P51979M26933R04640
$$ 4156084 4313047 4094146 4704801 5345851 6090530 6442434 7077465 7829444 8256377 9161017
4325I161017J122562L12070J12012j354303j610683m30506p42585l30122o58768
$$ 9161017 10283579 10595649 10707661 9353358 7742675 7312169 6569584 6239462 5580694
4316E580694K22722o35837j014475N35873J03630P5327J10817j14591J27052J0272
$$ 5580694 5803416 5167579 4153104 4688977 4792607 4867934 4978751 4864160 4991212 5001484
4306E001484P8939p3175P32735P288j17457L283R07348q7480M71296N97727O69513
$$ 5001484 5080423 5007248 5739983 5747271 5629814 5633097 6540445 6452965 6924261 7521988 8191501
4295H191501M45184J238936P63796p28464j031585j919011j081091j92176o225
$$ 8191501 8636685 9875621 10639417 9910953 8879368 6960357 5879266 5687090 5680865
4286E680865n79079n63266r37283j95031m95692j36460N83208j81543K45583l64692
$$ 5680865 5101786 4538520 3601237 3406206 2910514 2774054 3357262 3175719 3421302 3056610
4276C056610J00353L40060O0554k13606o06273L2543M23830l04359l41575O76102
$$ 3056610 3156963 3497023 3557577 3343971 2737698 2770241 3194071 2889712 2548137 3224239
4266C224239k51145M11853M77391k73689J93870m29561n28674J43245K7120J06422
$$ 3224239 2973094 3384947 3862338 3588649 3782519 3352958 2824284 2967529 2994649 3101071
4256C101071Q33553m02992r18299J79602M92852n13275L029K58713k81338L8936
$$ 3101071 3934624 3531632 2613333 2792935 3285787 2772512 2775541 3034254 2752916 2791852
4246B791852Q160M10689L24245K42401m77363r6679r203k88606L3690j90038L79686
$$ 2791852 2800012 3210701 3534946 3777347 3299984 3203305 3194102 2905496 2939186 2749148 3128834
4235C128834J50573J64379n63907K55251M57960m8249L30931n63990R7852L77767
$$ 3128834 3279407 3443786 2879879 3135130 3593090 3544841 3875772 3311782 3409634 3787401
4225C787401k29008R1917p36711J81639M72828p2034L65105k41193o02704J39491
$$ 3787401 3558393 3650310 2913599 3095238 3568066 3496032 3861137 3619944 3017240 3156731
4215C156731L36199O93043K01007n68420J41149P872j7227k46873M37256m183
$$ 3156731 3492930 4185973 4386980 3818560 3959709 3967581 3950354 3703481 4140737 4136554
4205D136554R0776N69464j51383n72475P06203j08951Q93994J15007j82021L12406
$$ 4136554 4227330 4796794 4645411 4072936 4779139 4670188 5564182 5679189 5497168 5809574
4195E809574k74356k38585N8320P01766L36265L49713P456N20015K93071N07932
$$ 5809574 5535218 5296633 5354953 6056719 6392984 6742697 6750153 7270168 7563239 8071171
4185H071171N62089L21153L6462J2574K75608N69247m89373M30988J48793M63726
$$ 8071171 8633260 8954413 8990875 9003449 9279057 9848304 9358931 9789919 9938712 10402438
4175A0402438N88520N18680J39553O42223P15806J18058R99989N82054J66278
$$ 10402438 10990958 11509638 11649191 12291414 13007220 13125278 14125267 14707321 14873599
4166A4873599K28854J126005R00975O41386k17113q83883q92552R44850m70000
$$ 14873599 15102453 16228458 17129433 17770819 17553706 16669823 15777271 16722121 16252121
4157A6252121r8285j92146L98376K24083K12357J34059M67225Q14561J05829P51892
$$ 16252121 16153836 15961690 16360066 16584149 16796506 16930565 17397790 18212351 18318180 19070072
4147A9070072N31533R95775Q89058R32759J337851L00746N95800J273922N23905
$$ 19070072 19601605 20597380 21486438 22419197 23757048 24057794 24653594 25927516 26451421
4138B6451421P05923J332081J194704K93052J589304J060584J186187J578830
$$ 26451421 27157344 28489425 29684129 29977181 31566485 32627069 33813256 35392086
4130C5392086J659230K453313K953700J675482K994810L290063K346104L829275
$$ 35392086 37051316 39504629 42458329 44133811 47128621 50418684 52764788 56594063
4122E6594063M089344L978420M398327N843567N722947O916926Q540585R480283
$$ 56594063 60683407 64661827 69060154 74903721 80626668 87543594 96084179 105564462
4114A05564462J0892289J3291670J4854801J8012688K0864728K4626750L0867187
$$ 105564462 116456751 129748421 144603222 162615910 183480638 208107388 238974575
4107B38974575L5469119L2526943K7762664K5125710J3721903p033958k2465411
$$ 238974575 274443694 306970637 334733301 359859011 373580914 366546956 344081545
4100C44081545l3415215l8789717l8362537l7894833l2011964k5404077j9362294
$$ 344081545 310666330 271876613 233514076 195619243 163607279 138203202 118840908
4093A18840908j4120948j1377965r870105o766563o175974m684168m574403m234055
$$ 118840908 104719960 93341995 83471890 76705327 70529353 65845185 61270782 57036727
4085E7036727l346962k348266k228615k489874k844950j619984k113559k194699
$$ 57036727 53689765 51341499 49112884 46623010 43778060 42158076 40044517 37849818
4077C7849818j463314j539367p89994j951565k114793j354457n53841n20194j165439
$$ 37849818 36386504 34847137 34057143 32105578 29990785 28636328 28082487 27562293 26396854
4068B6396854j384084j010828m45475m92754p56002o73930n38669J61734l22183
$$ 26396854 25012770 24001942 23556467 23063713 22307711 21633781 21095112 21256846 20934663
4059B0934663j08102Q2950J4731j62631p36412l17319l13092q91102J72484P94197
$$ 20934663 20826561 20909511 20924242 20761611 20025199 19707880 19394788 18503686 18676170 19470367
4049A9470367L44160q1818P2452l23645J61316k78039M05712O73982N38949N83351
$$ 19470367 19814527 19732709 19805161 19481516 19642832 19364793 19770505 20444487 20983436 21566787
4039B1566787R57976N44012J030347J242503O75036J589779J707776J722001K205861
$$ 21566787 22524763 23068775 24099122 25341625 26016661 27606440 29314216 31036217 33242078
4030C3242078K696358K857027L317401L463159N148770O003609P878042R889254
$$ 33242078 35938436 38795463 42112864 45576023 50724793 56728402 64606444 74495698
4022G4495698J0149232N028706l795043j0730084j2896066j0679168q106909n813708
$$ 74495698 84644930 89673636 85878593 75148509 62252443 51573275 43466366 37652658
4014C7652658m381593l904608k590218k876274k540170p06632p92144j694871
$$ 37652658 33271065 29366457 26776239 23899965 21359795 20653163 19861019 18166148
4006A8166148o64631L4122l45144r52941r82076l64815m52324k59763m94311n50484
$$ 18166148 17501517 17535639 17190495 16237554 15255478 14890663 14438339 14178576 13684265 13133781
3996A3133781n25207q37607q0533m92595J50752K82648n26206o41957o5425o20791
$$ 13133781 12608574 11770967 11690434 11197839 11348591 11631239 11105033 10463076 10397651 9776860
3986I776860O6174M14709n46430l90595p34730K67178j7100J75693k50399J08580
$$ 9776860 9843034 10257743 9711313 9320718 8585988 8853166 8836066 9011759 8761360 8869940
3976H869940q3483J36227K02425n9569K08506J16851m2580M60328l91134l63902
$$ 8869940 8786457 8922684 9125109 9065540 9274046 9390897 9348317 9808645 9417511 9053609
3966I053609L79504K38168j23030n17874N4790l38593Q6716J98846O7450n7885
$$ 9053609 9433113 9671281 9548251 9030377 9085167 8746574 8833290 9032136 9099586 9041701
3956I041701R12763J73752n43446q6920m5915j20141K56981J25947q5614M89030
$$ 9041701 9954464 10128216 9584770 9497850 9451935 9331794 9588775 9714722 9629108 10118138
3946A0118138j2892M94287j61638K63524N45957m08108l12575K94833J74225R07586
$$ 10118138 10105246 10599533 10437895 10701419 11247376 10839268 10526693 10821526 10995751 11903337
3936A1903337J82012K33396J00617o24318k11472P15065P10625o84527j86077
$$ 11903337 12085349 12318745 12419362 11795044 11583572 12298637 13009262 12324735 12138658
3927A2138658N86079K96939K48681L5934N91883M61257K19563L76022Q40363K12760
$$ 12138658 12724737 13021676 13270357 13306291 13898174 14359431 14578994 14955016 15795379 16008139
3917A6008139J88134N60790Q89104J224570L8001J295062M34712J56042Q47172
$$ 16008139 16196273 16757063 17646167 18870737 18908738 20203800 20638512 20794554 21641726
3908B1641726R82198L08594J302147J947529R40835R22439J137267J730506J564030
$$ 21641726 22623924 22932518 24234665 26182194 27123029 28045468 29182735 30913241 32477271
3899C2477271Q86876J844065K280431K650768K409637L415653L488595M458185
$$ 32477271 33364147 35208212 37488643 40139411 42549048 45964701 49453296 53911481
3891E3911481M481684N054798O078981O856593Q548082R612894J0854965J1997714
$$ 53911481 58393165 63447963 69526944 76383537 84931619 94544513 105399478 117397192
3883A17397192J4837241J7280111K1134206K5537965L2880008L9209972L2369481
$$ 117397192 132234433 149514544 170648750 196186715 229066723 268276695 300646176
3876C00646176N324385k5406531m3862211m5722890l7510460k7104879j9129486
$$ 300646176 305970561 280564030 236701819 190978929 153468469 126363590 107234104
3869A07234104j4553978j1530649r119667p493979o162562n247197l902401l059457
$$ 107234104 92680126 81149477 72029810 64535831 58373269 53126072 49223671 46164214
3861D6164214l655916k565323k784796k131462j884526j540560j600306j793096
$$ 46164214 42508298 39942975 37158179 35026717 33142191 31601631 30001325 28208229
3853B8208229j207067j217247j141319r00729j145716j479928j120217o19269
$$ 28208229 27001162 25783915 24642596 23741867 22596151 21116223 19996006 19376737
3845A9376737n85577j332960p52863o52056j44643p62789r10423m94695n09542
$$ 19376737 18791160 17458200 16705337 16053281 15908638 15145849 14235426 13740731 13231189
3836A3231189j69820o79597J76789j22210q08816l45044K72727o05939k89099
$$ 13231189 13061369 12381772 12558561 12436351 11627535 11282491 11555218 10949279 10660180
3827A0660180M07787k10259l32322l58168k61355j60112R9456M5167o69488Q324
$$ 10660180 11067967 10857708 10525386 10167218 9905863 9745751 9845207 9890374 9220886 9229210
3817I229210L53697m52394J67524J2881k86711j18645K75113P0737o11164l28085
$$ 9229210 9582907 9130513 9298037 9310918 9024207 8905562 9180675 9251412 8640248 8312163
3807H312163K37530J64299K48867q29013q04749p28810o9489n8455o2475o56251
$$ 8312163 8549693 8713992 8962859 8133846 7329097 6600287 6530798 6472343 6409868 5753617
3797E753617m688N153n49928M91538n85517n2518J57517j1444k85407j13219N71254
$$ 5753617 5748929 5754082 5204154 5695692 5110175 5057657 5215174 5203730 4918323 4805104 5376358
3786E376358k21439o79024o50117J40712r5420P74287N30538r17647K90943k82090
$$ 5376358 5154919 4475895 3825778 3966490 3871070 4645357 5175895 4258248 4549191 4267101
3776D267101K87081l00547M21688J46353q00189J40830j62062l1626l28313n3279
$$ 4267101 4554182 4253635 4675323 4821676 4021487 4162317 4000255 3968629 3640316 3587037
3766C587037O27138K34992l55231k49646J26596N5364j36019o224j79029o16662
$$ 3587037 4214175 4449167 4093936 3844290 3970886 4026250 3890231 3884007 3704978 3088316
3756C088316J74308J97564K0269K68875j79285l11823K0980o02697J82409L35905
$$ 3088316 3262624 3460188 3480457 3749332 3570047 3258224 3279204 2676507 2858916 3194821
3746C194821N69806l10801n4389L73084j82625L4368l63976n08311K7338j12309
$$ 3194821 3764627 3453826 3399437 3772521 3589896 3624264 3260288 2751977 2779315 2667006
3736B667006K36585O8809L48585r1114M08386L37335l94300q1932k09863k82055
$$ 2667006 2903591 2972400 3320985 3229871 3638257 3975592 3581292 3499360 3289497 3007442
3726C007442K33153L23312l29281O6792l29273m10014L77809K18504k7799K2883
$$ 3007442 3240595 3563907 3234626 3301418 2972145 2562131 2939940 3158444 3130645 3153528
3716C153528J16843M454J068J37627m61738K42487Q4010n34118K22699K2449j81623
$$ 3153528 3270371 3274825 3275893 3413520 2951782 3194269 3278279 2744161 2966860 2989309 2807686
3705B807686K93299O70019J69913m26667L18289l68258l92122L91896n57101k89091
$$ 2807686 3100985 3771004 3940917 3514250 3832539 3464281 3072159 3464055 2906954 2617863
3695B617863R31093l77829l88928o3979Q0646l72509K9677M06953P70276k17211
$$ 2617863 3548956 3171127 2782199 2718220 2798866 2426357 2456034 2862987 3633263 3416052
3685C416052j158J65626l34915J66498Q62063k94078m28265J61213K38781M98482
$$ 3416052 3414894 3580520 3245605 3412103 4274166 3980088 3551823 3713036 3951817 4450299
3675D450299k28395j61461j04100j80770P04273P6415M84441k67737k0372L91931
$$ 4450299 4221904 4060443 3956343 3775573 4479846 4556261 5040702 4772965 4752593 5144524
3665E144524k12430n22839j87647j40190O91516L5735m03700O33558M52213J72445
$$ 5144524 4932094 4409255 4221608 4081418 4772934 4808669 4404969 5038527 5490740 5663185
3655E663185j45643K38568k87318m23755k06201q8309L31329J40997K93442M09803
$$ 5663185 5517542 5756110 5468792 5045037 4838836 4750527 5081856 5222853 5516295 5926098
3645E926098K39118j01398l62332M0794N62565K39223j32737k0940K37471L24971
$$ 5926098 6165216 6063818 5701486 5742280 6304845 6544068 6411331 6390391 6627862 6952833
3635F952833l7362l77137L39936K13223j02054L42673J44810J9634J83929Q35380
$$ 6952833 6915471 6538334 6878270 7091493 6989439 7332112 7476922 7496556 7680485 8515865
3625H515865L54723l56280j7488O98291k08464R47811M00776p24007r1921J011874
$$ 8515865 8870588 8514308 8496820 9195111 8986647 9934458 10335234 9611227 9519306 10531180
3615A0531180O83566q12744p3271M09047J02045M13537P92176M38175k84071Q86349
$$ 10531180 11214746 10402002 10328731 10737778 10839823 11253360 12045536 12483711 12199640 13085989
3605A3085989J51954L76040J95214K25255K22945q7770L51455J56136R27656K73489
$$ 13085989 13237943 13613983 13809197 14034452 14257397 14169627 14521082 14677218 15604874 15878363
3595A5878363j10689O24484J53245M38389N51552j64035K10101P22530M1756J39539
$$ 15878363 15767674 16392158 16545403 16983792 17535344 17371309 17581410 18303940 18345696 18485235
3585A8485235k14846k06344k74466k83816n53839O8752L25717M34293n7285j87866
$$ 18485235 18270389 18064045 17789579 17505763 16951924 17020676 17346393 17780686 17723401 17535535
3575A7535535r42665k12520k65626m44192j64688K43467j02520L31055l5053r02455
$$ 17535535 16592870 16380350 16114724 15670532 15505844 15749311 15646791 15977846 15942793 15040338
3565A5040338j62271k56882m77216m06420L99419j65984m41557M42800m29789
$$ 15040338 14878067 14621185 14143969 13737549 14136968 13970984 13529427 13972227 13542438
3556A3542438j89417L88016j311096l60993m93877o97461m91658N50606K40026
$$ 13542438 13353021 13741037 12429941 12068948 11575071 10877610 10385952 10936558 11176584
3547A1176584J86428p33492p30431L28856K11040J77652n36223n45891p17873
$$ 11176584 11363012 10629520 9899089 10227945 10438985 10616637 10080414 9534523 8816650
3538H816650J16637N01022l30674o90979J47428o56690j51855K30709j34762j62571
$$ 8816650 8933287 9434309 9103635 8412656 8560084 7903394 7751539 7982248 7847486 7684915
3528G684915j78118N44895j18230k31442l11538m27007K6337q4606n27916O2218
$$ 7684915 7506797 8051692 7933462 7702020 7390482 6963475 6989812 6905206 6377290 6439508
3518F439508m02589O0804m44280K96999K5344j99659N2514o08373M41374K13090
$$ 6439508 6036919 6097723 5653443 5950442 5975786 5776127 5828641 5220268 5661642 5874732
3508E874732p27872k96917l53974K62114p4429L4423K0746j93715L65102K98556
$$ 5874732 5146860 4849943 4495969 4758083 4683654 4718077 4738823 4545108 4910210 5208766
3498E208766m69564n32175J49922q0197L37086L99620n40878m70133l29818N12145
$$ 5208766 4739202 4207027 4356949 4276752 4613838 5013458 4472580 4002447 3672629 4184774
3488D184774J84856m51599K90248N29616R5422l40378m46733k34137o26202P77900
$$ 4184774 4369630 3918031 4208279 4737895 4833317 4492939 4046206 3812069 3185867 3963767
3478C963767Q5056k40839R7007m89872K39438J03104p5373J957K09477M33116
$$ 3963767 4048823 3807984 3904991 3415119 3654557 3757661 3682288 3684245 3893722 4326838
3468D326838j07079n47606l26261J13006J61845K1364R44938j44259K8023j13232
$$ 4326838 4219759 3672153 3345892 3458898 3620743 3642107 4587045 4442786 4470809 4357577
3458D357577m87774k52184J03652J65554K72557K21348p77986O59728n4592m77999
$$ 4357577 3869803 3617619 3721271 3886825 4159382 4380730 3602744 4262472 4207880 3729881
3448C729881M21232m76540J9131P3043q51340m7387j75221J16850P67743k27480
$$ 3729881 4151113 3674573 3693704 3766747 2915407 2868020 2692799 2809649 3577392 3349912
3438C349912k5724q9833J28110K79662N58820n97091r15700k20404L40738r3090
$$ 3349912 3324188 3234355 3362465 3642127 4200947 3603856 2688156 2467752 2808490 2715400
3428B715400P41732P03460R5763k21936k40248P8624j11316l8463J92241O37657
$$ 2715400 3457132 4160592 4256355 4034419 3794171 3872795 3761479 3723016 3915257 4552914
3418D552914m11394k34463l91735l46068J31455L69977n32969P0125M29480n551
$$ 4552914 4141520 3907057 3515322 3169254 3300709 3670686 3137717 3207842 3637322 3631771
3408C631771O2752k64528n33660L10043P91334r996K2342J80713r9427L1090l71784
$$ 3631771 3694523 3429995 2896335 3206378 3997712 3987716 4010058 4190771 4091344 4122434 3750650
3397C750650o40255K58512J68412M90400Q4723M6465O9990k93735N4404j52541
$$ 3750650 3110395 3368907 3537319 4027719 4112442 4158907 4228897 3935162 3989566 3837025
3387C837025J87709M09761Q16590K95710l80874O0594l6355k67454Q8633r2259
$$ 3837025 4024734 4434495 5251085 5546795 5165921 5226515 5190160 4922706 5011339 4919080
3377D919080k01082N42668J98946p292J7956K30667j12982L75208k12753L92739
$$ 4919080 4717998 5260666 5459612 5452320 5470276 5700943 5587961 5963169 5750416 6143155
3367F143155L35171J25578k13001L87619M89490l24261J01673j72439j70887P44264
$$ 6143155 6478326 6603904 6390903 6778522 7268012 6943751 7045424 6872985 6702098 7446362
3357G446362K39862L85955J75477M97254j90113k73233M57626k70896J05162J83632
$$ 7446362 7686224 8072179 8247656 8744910 8554797 8281564 8739190 8468294 8573456 8757088
3347H757088K37197M94245L69268Q27032K72224J97080M58027j70696N13876K36139
$$ 8757088 8994285 9488530 9857798 10684830 10957054 11154134 11612161 11441465 11955341 12191480
3337A2191480K94488O80745R68462N76976K01549O08889N33653N32410J071607
$$ 12191480 12485968 13166713 14135175 14712151 14913700 15522589 16056242 16588652 17660259
3328A7660259N66136Q87464P87683J286806J435275J581058J172833J076197K432954
$$ 17660259 18226395 19113859 19901542 21188348 22623623 24204681 25377514 26453711 28886665
3319B8886665K334675K435899K803216L846105M252857N742040N745041K625565
$$ 28886665 31221340 33657239 36460455 40306560 44559417 50301457 56046498 58672063
3311E8672063J876424K38649J199956K259800L850498N532881P775448J0159446
$$ 58672063 60548487 60787136 61987092 64246892 68097390 73630271 81405719 91565165
3303I1565165R067827K024008o570570j1413405j2163772q743603n906399l806027
$$ 91565165 100632992 102657000 96086430 84673025 72509253 63765650 57859251 54053224
3295E4053224k594592j061065m20025O28736M0749J55433J441922K123526L423258
$$ 54053224 51458632 50397567 49977542 50606278 50647027 50802460 52244382 54367908 57791166
3286E7791166L274572M116546N239672P375961Q710876R954640P885401K942209
$$ 57791166 61065738 65182284 70421956 77797917 86508793 96463433 104348834 107291043
3278A07291043q1484K03699K746771N669521Q102912J2663816J7889336K0384784
$$ 107291043 107209559 107413258 110160029 115829550 123932462 136596278 154485614 174870398
3270A74870398R164448j0662012k2464500k6287356k0826216j4464003j0719345
$$ 174870398 184034846 173372834 150908334 124620978 103794762 89330759 78611414
3263G8611414p964300o521693m055135l094965k935949k016608j163666q83284
$$ 78611414 70647114 64125421 60070286 56975321 54039372 52022764 50859098 49975814
3255D9975814k03837K63121P64867Q03719K012418K814478L373929L609458J891776
$$ 49975814 49771977 50035098 50799965 51603684 53616102 56430580 59804509 63413967 65305743
3246F5305743O34802m70435N56590J416529K970072M096530P170691R634114O199915
$$ 65305743 65940545 65470110 66026700 67443229 70413301 74509831 81680522 91314636 97514551
3237I7514551j757299q741124j1988935j1754806r827012p312260n161113m395042
$$ 97514551 95757252 87016128 75027193 63272387 53445375 46133115 40972002 36576960
3229C6576960l527760l364495k545645j972902j532915j039108j732348o75605
$$ 36576960 33049200 29684705 27139060 25166158 23633243 22594135 20861787 20186182
3221B0186182j180196j266010l33340K70641k74424j397375m72045l49195p96114
$$ 20186182 19005986 17739976 17406636 17677277 17402853 16005478 15533433 15184238 14388124
3212A4388124P5113o57116p2829n1347p19180j73232r75414L02852K46596k39118
$$ 14388124 14463237 13806121 13733292 13681945 12962765 12789533 11814119 12116971 12363567 12124449
3202A2124449P4852q23286n80915o98820n97537l79644j65358M33688k70500l79906
$$ 12124449 12199301 11376015 10795100 10096280 9498743 9119099 8953741 9387429 9116929 8737023
3192H737023m25845q14104l91607M50001j78754k82324j89590M99781n5470l13731
$$ 8737023 8311178 7497074 7105467 7555468 7376714 7094390 6904800 7404581 7349111 7035380
3182G035380m64541m83240n620J43728m89376l09330m91422L04748L0788o49442
$$ 7035380 6570839 6087599 6081979 6225707 5736331 5427001 4935579 5240327 5271115 4621673
3172D621673q4385p23829K36994L42155M16338j04456L06523m36357o35156J81880
$$ 4621673 4537288 3813459 4050453 4392608 4808946 4704490 5011013 4574656 3939500 4121380
3162D121380n17426L90926K05424m08543k27140j70268J80282k20418J70205K17075
$$ 4121380 3603954 3994880 4200304 3791761 3564621 3394353 3574635 3354217 3524422 3741497
3152C741497j84907j11733j05647m33137O11751K50035J30753k44443n99672m27353
$$ 3741497 3556590 3444857 3339210 2906073 3517824 3767859 3898612 3654169 3054497 2627144
3142B627144K26448m40038k75324Q08800l32937j19825P1128J67231n63157j688
$$ 2627144 2853592 2413554 2138230 2947030 2614093 2494268 2565396 2732627 2169470 2167782
3132B167782J85205n66377q8990L63183L31315J0578k48944K20248j42498n38832
$$ 2167782 2352987 1786610 1697620 2060803 2392118 2402696 2153752 2374000 2231502 1692670
3122A692670J73646l72926q33986M27939P82577K82330q17214J4764k79953k38373
$$ 1692670 1866316 1493390 659404 1087343 1869920 2152250 1335036 1349800 1069847 831474
3112H31474R26376j6328K13347j5535j60602L6112j58592L53804l69757l49994
$$ 831474 1757850 1741522 1954869 1939334 1778732 1814844 1656252 2010056 1640299 1290305
3102A290305p9456P8374K49500o31596n20396M38384R59771l46886q65350m50132
$$ 1290305 1210849 1289223 1538723 907127 386731 825115 1784886 1438000 572650 122518
3092A22518J170223k53884m03924L21644P66161J0386n06929r5647O4746m19755
$$ 122518 1292741 1038857 634933 956577 1722738 1733124 1226195 1130548 1195294 775539
3082G75539K12357L02073J30274M03354j129546L13524M791P2374M7386l27950
$$ 775539 987896 1289969 1420243 1823597 694051 1007575 1012366 1084740 1132126 804176
3072H04176m80088p4482J71313Q9659L37192N32561k70993p02177l31565m37206
$$ 804176 324088 249606 420919 510578 847770 1380331 1109338 407161 75596 -361610
3062c61610M36593Q98172j77346l60191l5367k83Q08799L1478N7936j29138l45098
$$ -361610 74983 973155 795809 435618 400251 399968 1208767 1240245 1298181 1169043 823945
3051H23945L29218K20516k3219m04697n5184o02768m59453L09883Q52711j63727
$$ 823945 1153163 1373679 1350460 945763 890579 287811 -171642 138241 990952 827225
3041H27225M5089p7599m22853L89631n1532j17635L99519j80462o51279Q9096
$$ 827225 872314 794715 371862 761493 709961 592326 991845 811383 160104 249200
3031B49200J65225K80407K39067m23747K37860K65162k5602j65828J97477l59831
$$ 249200 414425 694832 933899 510152 748012 1013174 987572 821744 1019221 659390
3021F59390j86231N44925j33078l45675l06640L30471P43517P5655o99646K05551
$$ 659390 473159 1018084 885006 539331 232691 563162 1306679 1382334 682688 888239
3011H88239j59532k01343m692Q8275l90327M54116M1328k13594L93292K0809J31939
$$ 888239 728707 527364 522672 610947 220620 674736 716064 502470 895762 916571 1048510
3000A048510J10297m62422L97650l68443k16649J59234k14803J129727o4247n13437
$$ 1048510 1158807 696385 1094035 725592 508943 668177 453374 1583101 1518854 1005417
2990A005417K49035L0746p2670j8142K15407m07995J23607j7180n32923M12799
$$ 1005417 1254452 1285198 1212528 1194386 1409793 1001798 1125405 1108225 575302 988101
2980I88101m9907P45290j83740m08737p14828R7555j85302l4125K47682j61405
$$ 988101 938194 1683484 1499744 1091007 376179 473734 288432 254307 501989 340584
2970C40584J98492L1424n8103L3491p60837J92605m61562M24291L30060M40792
$$ 340584 539076 570500 512397 545888 -214949 -22344 -483906 -59615 270445 711237
2960G11237o2485m78719M76880M31600l99797k30500n1128j21193L66268J30978
$$ 711237 648752 170033 646913 1078513 678716 448216 397088 275895 642163 773141
2950G73141r8934j65705L9257K17603L65152m16368K14539m23283j12435l00697
$$ 773141 674207 508502 547759 765362 1130514 714146 928685 505402 392967 92270
2940I2270P18923R4558j8626o0277K81k29300p5398p35407K02056J51402K60321
$$ 92270 811193 905751 887125 826848 827129 597829 522431 -212976 -10920 140482 400803
2929D00803l0076M5602K07708J94370k63428k69838n48678j09486M05863K1344
$$ 400803 370727 416329 624037 818407 554979 285141 -263537 -373023 32840 54184
2919E4184L0744j45333P6483K99768l2300r2889k45432L42310N0015M50698K20796
$$ 54184 84928 -60405 16078 315846 283546 190657 -54775 287535 337550 788248 1009044
2908A009044k31968n56538l7835L38946j32562l92970o20444N32386o5318L04399
$$ 1009044 777076 220538 182703 521649 389087 -3883 -624327 -91941 -157259 147140
2898A47140k60519M40793Q2088M8281J22407k35863J99201m14982m34730n7975
$$ 147140 -113379 327414 409502 457783 580190 344327 543528 128546 -306184 -364159
2888c64159L45227K66576q15405O62264m653J58686k24344j24563n33055k5653
$$ -364159 -18932 247644 -567761 94503 89850 248536 24192 -100371 -633426 -659079
2878f59079O04137l8649N82342M79814o17102j19642k02085J89246M3976j68834
$$ -659079 -54942 -93591 488751 968565 351463 231821 29736 218982 262958 94124
2868I4124L06771j01697m35095K3455P8123M89452O9918k21786K71699J24582
$$ 94124 400895 299198 -135897 -112442 -34319 455133 525051 303265 574964 699546
2858F99546m18766p57125L79349R72106K68126q84862l13108K41250l34793n40049
$$ 699546 280780 -476345 -96996 875110 1143236 258374 -54734 186516 -148277 -688326
2848f88326M24564N16841J70231m63264M35541k27443m49780M31q5827j45998
$$ -688326 -263762 253079 423310 -39954 395587 168144 -281636 -281205 -367032 -513030
2838e13030P28260j74879n05084J10527l4635L11637K65587Q0342L80187m70457
$$ -513030 215230 40351 -464733 -354206 -388841 -77204 188383 268725 648912 178455
2828A78455p5455j96206q4932M24945N63950p27258o30870K11493M75397j28864
$$ 178455 103000 -93206 -178138 246807 810757 83499 -547371 -335878 139519 10655
2818A0655J56098N3504P5482l983l65900J71955o50163q3744M06773R9733l44057
$$ 10655 166753 220257 295739 291756 -74144 97811 -552352 -636096 -229323 -129590 -473647
2807d73647N8210J57835L81329n94619m24559J45834M06417P8784j41425L8948
$$ -473647 -415437 -257602 123727 -470892 -895451 -749617 -343200 -264416 -405841 -366893
2797c66893K49249L03692l94610m02188k06407L14099Q21775m0203m54144m58340
$$ -366893 -117644 186048 -208562 -610750 -817157 -503058 318717 278514 -175630 -633970
2787f33970J03770j77935n61069M60834M39337j42125l93399j8778M10998J6747
$$ -633970 -530200 -708135 -1269204 -808370 -369033 -511158 -904557 -923335 -512337 -495590
2777d95590M49624p3027l60726K62773k5495R7864L45476L37843J97570p99762
$$ -495590 -45966 -118993 -479719 -216946 -242441 -144577 200899 538742 736312 -63450
2767f3450L79692l04726j75211n6525k73191l0207K54852L67797k75540L47470
$$ -63450 316242 11516 -163695 -220220 -493411 -523618 -268766 99031 -176509 170961
2757A70961l95810m22296Q92103K3743M95648l0369p41855m41413L25867L88114
$$ 170961 -224849 -647145 244958 268701 764349 733980 -7875 -449288 -123421 264693
2747B64693l90740J94806Q017n34537J81459k14471p6459m8549J65550l3692J42977
$$ 264693 -126047 68759 76776 -457761 -276302 -490773 -567232 -615781 -450231 -483923 -340946
2736c40946N45276l26299J18889O8401l06648K50709l63739j96125M62766J91535
$$ -340946 204330 -121969 -3080 65321 -241327 9382 -354357 -550482 -87716 103819
2726A03819r4241j154962k80089K98609J147723J36558k60250k881N7969J25942
$$ 103819 9578 -1145384 -1425473 -1126864 20859 157417 -102833 -105714 -47745 78197
2716G8197N07301n00383O8894l62554M75700M69081m31800O44805l22383n68137
$$ 78197 585498 85115 154009 -208545 267155 736236 304436 949241 626858 58721
2706E8721o4267J10069q8827o33726N06517m5232j0700Q0515k13388k80398J39878
$$ 58721 -5546 104523 15696 -618030 -111513 -156745 -167445 -86930 -300318 -580716 -440838
2695d40838l4501p66274L11742M26318m52642Q7391N53715K05208l45353L73137
$$ -440838 -475339 -1241613 -929871 -503553 -956195 -868804 -315089 -109881 -455234 -82097
2685h2097J88385n11909O26164n3852k3151Q7759L5804o96514k97041J11555j70782
$$ -82097 106288 -405621 220543 166691 143540 231299 267103 -429411 -726452 -614897 -785679
2674g85679M91007k73807o7687j63948m69333J86417J09242M77209L13782k7926
$$ -785679 -294672 -568479 -636166 -800114 -1269447 -1083030 -973788 -496579 -182797 -210723
2664b10723j63813J69365K75746J78428l79943n2308N00962q27980L69072M8620
$$ -210723 -374536 -205171 70575 249003 -130940 -183248 317714 -510266 -141194 -92574
2654i2574l60594Q7548j49481j5673m9407o56393l60219L93016L95034L70413
$$ -92574 -453168 -365620 -515101 -530774 -580181 -1236574 -1596793 -1203777 -808743 -438330
2644d38330j83696q355l29767j1979P78407M49711l21548k81124k81306O28592
$$ -438330 -622026 -630381 -960148 -972127 -193720 255991 -65557 -346681 -627987 605
2634F05j28559l31182q3720Q7701P6442M01966k46154l47465M24821r6673j16321
$$ 605 -127954 -459136 -542856 -455155 -378713 23253 -222901 -570366 -145545 -242218 -358539
2623c58539j19186l02738L63551m19937M18297m3380j4965K69527l4770l32079
$$ -358539 -477725 -780463 -416912 -836849 -418552 -461932 -476897 -207370 -242140 -574219
2613e74219L45094M0703j98918P38587l2050M30326p09875J90995p9963J14349
$$ -574219 -229125 -188422 -387340 351247 319197 749523 39648 230643 150680 265029
2603B65029J24883R7197p60692K91714l69973j45431O83430j6476m5269n71941
$$ 265029 389912 487109 -273583 18131 -351842 -497273 186157 169681 124412 -447529
2593d47529n6299q9k1185n31115j5067J55649M83363M30581j07010k60777J80480
$$ -447529 -503828 -503917 -525102 -1056217 -1071284 -915635 -432272 -1691 -108701 -369478 -188998
2582a88998L30491j60191o45065N777l69103K32512M56932j06689O53446P9603
$$ -188998 141493 -18698 -663763 -657986 -1027089 -794577 -337645 -444334 209112 288715
2572B88715n57857L2795m30429P8555P9000M33492M27463j09225o99851O7268
$$ 288715 -269142 -236347 -666776 -588221 -509221 -75729 351734 242509 -457342 -390074
2562c90074p7202K17491Q1584r46403P73360k64616J67819N2259m96847O14157
$$ -390074 -467276 -249785 -168201 -1114604 -341244 -605860 -438041 -385782 -882629 -268472
2552b68472n182O96672o25770p36517N91727J30014M32942j59138O98700k40582
$$ -268472 -273654 423018 -202752 -939269 -347542 -217528 215414 56276 754976 514394
2542E14394q23438N9114q6925k16017J03639q345M96976j95004k64917j764q51764
$$ 514394 -309044 -249930 -336855 -552872 -449233 -457578 39398 -155606 -420523 -422287 -1274051
2531a274051M59005Q86496j93790k6659M39236l61124m44341m41411O23161N56558
$$ -1274051 -815046 71450 -122340 -148999 290237 -70887 -515228 -956639 -333478 223080
2521B23080k88257l10333k18959L15165J47208l09574J16174N25846j32100L43934
$$ 223080 -65177 -375510 -594469 -279304 -132096 -441670 -325496 200350 68250 412184
2511D12184j97174J71414n20278l05266L39961j09190J49750K70590j01038o80449
$$ 412184 215010 386424 -133854 -439120 -99159 -208349 -58599 211991 110953 -569496
2501e69496m33771j39418N58129K38096L07983k57736k81669j48725k57844M07627
$$ -569496 -1003267 -1142685 -584556 -346460 -38477 -296213 -577882 -726607 -984451 -576824
2491e76824M04786O7602L02189O3829j01732J40893n07798k56761J3138J017234
$$ -576824 -172038 -104436 197753 261582 159850 300743 -207055 -463816 -450678 566556
2481E66556l64500l28484J43085n56218j23413J98821K22402j50352L75160K84939
$$ 566556 202056 -126428 16657 -539561 -662974 -464153 -241751 -392103 -16943 267996
2471B67996L16792o46626k57484m7671J60959M20241q0823n66492N0990k7669
$$ 267996 584788 -61838 -319322 -366993 -206034 214207 133384 -433108 -382118 -409787
2461d09787j20545K58998K04874J56626r22649J75620N01156J32071p9172n22380
$$ -409787 -530332 -271334 -66460 90166 -832483 -656863 -155707 -23636 -102808 -625188
2451f25188N9615N71906P38634m96856l35573J47101n7138R9090n57902k40766
$$ -625188 -565573 6333 744967 248111 -87462 59639 2501 101591 -456311 -697077
2441f97077M58792J70090K56045n43636k26392L80468O45240p17532J03819N6056
$$ -697077 -238285 -68195 187850 -355786 -582178 -201710 443530 -274002 -170183 -114127
2431a14127k79662j96418j03757M94510M15012J78983l91644k21836m09491M55144
$$ -114127 -393789 -590207 -693964 -199454 215558 394541 2897 -218939 -628430 -173286
2421a73286m7435N13033m0671l19469m03019k21494O28483J05376o01876N413
$$ -173286 -220721 292312 251641 -67828 -470847 -692341 -63858 41518 -560358 -554945
2411e54945M21986m48759J01552R36675j5721j24472k39892n12348j21861k17583
$$ -554945 -132959 -581718 -480166 456509 440788 316316 76424 -435924 -557785 -775368
2401g75368O0058K7874L68449Q16885n09904n66633O71644L76496o4298n8796
$$ -775368 -715310 -687436 -318987 497898 -12006 -578639 93005 469501 405203 346407
2391C46407N3136o11245K20135J415273r4674l01901l50731L25938m60444j14318
$$ 346407 399543 -211702 8433 1423706 1329032 1027131 676400 1002338 541894 427576
2381D27576j28510p9631J98626M01115L85381R8979M26136R8587J29640m74916
$$ 427576 299066 219435 418061 819176 1204557 1303536 1729672 1828259 1957899 1482983
2371A482983l03625n03927l01104P01432m26040l89510l1162O09534j26822n7733
$$ 1482983 1179358 675431 374327 1075759 649719 260209 229047 838581 711759 654026
2361F54026L8531P7024l7450k96469K58691l30164m18646J53918n57947k9169
$$ 654026 692557 769581 732131 435662 694353 364189 -54457 99461 -458486 -487655
2351d87655O98507k55110j35786M62672P20643o74949o64582L6469n2249j80687
$$ -487655 210852 -44258 -180044 282628 1003271 328322 -336260 -299791 -352040 -532727
2341e32727L58426j19998L95355J81147j66723r0447K58296l98684K7118p15491
$$ -532727 -174301 -294299 101056 282203 115480 25033 283329 -115355 -88237 -803728
2331h03728J40313M48421L55918K62120K12032j74594l34646m5576L43429K52969
$$ -803728 -663415 -214994 140924 403044 615076 440482 105836 60260 403689 656658
2321F56658j84604n10584O17077K1185n19734P6176k37333N8487K15178m08422
$$ 656658 472054 -38530 578547 599732 79998 156174 -81159 -22672 192506 -215916
2311b15916K73686M31792K47322K40662k98621P4221o81569N86442J98766k16012
$$ -215916 57770 489562 736884 977546 678925 753146 71577 658019 856785 640773
2301F40773n31825p3705N14691k70677O7970J81602K48264q5499n96336J28337
$$ 640773 108948 35243 549934 279257 347227 528829 777093 691594 95258 223595
2291B23595K90425q0460O32155R8609l52331l15908l28215J17591N4954j82913
$$ 223595 514020 433560 1065715 1164324 811993 496085 167870 285461 340415 157502
2281A57502k2741L85483K18179k41040m37378N34490L72717m02519j79061k92666
$$ 157502 134761 520244 738423 497383 60005 594495 967212 564693 385632 92966
2271I2966L57719J11572p3839K24724j03784N49757j11832J07643p31613n80393
$$ 92966 450685 562257 488418 713142 609358 1159115 1047283 1154926 423313 -157080
2261a57080K16557K96175N92813J61875m20811L01989j18498n82906L21651M51147
$$ -157080 59477 355652 948465 1110340 689529 991518 873020 290114 611765 1062912
2251A062912K29055l96618o33392l19544M58007j19156K98524O65555j98635L61906
$$ 1062912 1291967 895349 261957 -57587 400420 281264 579788 1245343 1046708 1408614
2241A408614J23386p28193j9525J21665J09695k67888k93226O14317L4279j65808
$$ 1408614 1532000 803807 784282 905947 1015642 747754 454528 1068845 1103124 937316
2231I37316N23348o94676l42360M73970K52405J21310K87015L83160j0539o6732
$$ 937316 1460664 765988 423628 897598 1150003 1271313 1558328 1941488 1930949 1864217
2221A864217l08179p8636P3685M13260n94054K77922K57152N18205l46800n10325
$$ 1864217 1556038 1477402 1551087 1964347 1370293 1648215 1905367 2423572 2076772 1566447
2211A566447J4648N80930J7230o39547K98695O13526L22217j62387K03858j72673
$$ 1566447 1581095 2162025 2179255 1539708 1838403 2451929 2774146 2611759 2815617 2642944
2201B642944L73515j54408R0005r9117O24749J26104l01733N8852O92453M61553
$$ 2642944 3016459 2862051 2952056 2852939 3477688 3603792 3302059 3360911 4053364 4514917
2191D514917p21896L55025k85859J18045N73491M34487k73929n99842M68584R33564
$$ 4514917 3793021 4148046 3862187 3980232 4553723 4988210 4714281 4114439 4583023 5516587
2181E516587N11798J55972o40640j19282K66849M03567k93069M86117K2016M29742
$$ 5516587 6028385 6184357 5543717 5424435 5691284 6094851 5801782 6287899 6309915 6739657
2171F739657O01436k94962J43535N32852M8871k97363J33254j68172L86700K21172
$$ 6739657 7341093 7046131 7189666 7722518 7771389 7474026 7607280 7439108 7825808 8046980
2161H046980K53017N74866N59374l16852L50104L10581k24766J44596L46933J360660
$$ 8046980 8299997 8874863 9434237 9117385 9467489 9778070 9553304 9697900 10044833 11405493
2151A1405493L69536M76938Q78271L53052Q50610R36973M91955L0995N82731J195977
$$ 11405493 11775029 12251967 13130238 13483290 14333900 15270873 15762828 15793823 16376554 17572531
2141A7572531P60413l7956L57964P81611J162539J474246P08366J171520J741492
$$ 17572531 18332944 18294988 18652952 19434563 20597102 22071348 22779714 23951234 25692726
2132B5692726J331647J973670K036423J899371J930260J869202K726845L537129
$$ 25692726 27024373 28998043 31034466 32933837 34864097 36733299 39460144 42997273
2124D2997273M047857M548039M740990L678928M395593N102541O162570P605891
$$ 42997273 47045130 51593169 56334159 60013087 64408680 69511221 75673791 83279682
2116H3279682Q631852J0722012J2756844J4836865J8816464K1693033K5102772
$$ 83279682 91911534 102633546 115390390 130227255 149043719 170736752 195839524
2109A95839524L7326956N2862940M5083313n544520m1234600n9797250n2055791
$$ 195839524 233166480 286029420 331112733 325568213 284333613 224536363 172480572
2102A72480572l2324092k2146591j6263858j3667803j0412353q646622o723848
$$ 172480572 140156480 118009889 101746031 88078228 77665875 69019253 62295405
2095F2295405n319055l397723j909379j440621l731581m148995l473058k399351
$$ 62295405 56976350 53578627 51669248 50228627 46497046 42348051 38874993 36475642
2087C6475642k641977j839051j596804j396899k013568j067246k029902j070714
$$ 36475642 33833665 31994614 30397810 29000911 26987343 25920097 23890195 22819481
2079B2819481j539604o25022p62910q85043r93553q61368k10073n14362j222746
$$ 22819481 21279877 20654855 19891945 19006902 18013349 17151981 16941908 16427546 15204800
2070A5204800j018553m61999j1853n72499p1313m87395o71318l19810j88260j83783
$$ 15204800 14186247 13724248 13712395 13139896 13068583 12581188 11909870 11590060 11401800 11218017
2060A1218017n98809k95136j12120q00256p20392k64385j16019l09197n31426
$$ 11218017 10619208 10324072 10211952 9411696 8691304 8426919 8310900 8001703 7470277
2051G470277J56256k9789k08124j0980l48020r2562j51184K92604r82775j55242
$$ 7470277 7626533 7596744 7388620 7377640 7029620 6937058 6785874 7078478 6095703 5940461
2041E940461N94953j24918j5557o40488K06672L45531j86746o9185k61083p44119
$$ 5940461 6535414 6410496 6394939 5754451 5961123 6306654 6119908 6050723 5789640 5045521
2031E045521k56915J77273M9346l79267K74907k32636o41418J09706K3279k86057
$$ 5045521 4788606 4965879 5015225 4635958 4910865 4678229 4036811 4146517 4169796 3883739
2021C883739l43568M13743J48550j86473l51013m17094j18741m6964n58158K50928
$$ 3883739 3540171 3953914 4102464 3915991 3564978 3147884 3029143 2982179 2424021 2674949
2011B674949N979L70626M55439p92665k57109P0466n8979k05244q33875Q08964
$$ 2674949 2680928 3051554 3506993 2714328 2457219 2527685 2468706 2263462 1429587 2238551
2001B238551N67779L92602r15216l09968J2469O45686j94685p30167P46522k58201
$$ 2238551 2806330 3198932 2283716 1973748 1986217 2631903 2437218 1707051 2453573 2195372
1991B195372m10748N07358L82989m68494l11524R27020K6762o32881P68866n65653
$$ 2195372 1784624 2291982 2674971 2206477 1894953 2821973 2848735 2215854 2984720 2419067
1981B419067L3646k02573N9971j41478p6375K5834o81868k3957O27880j039828
$$ 2419067 2452713 2250140 2310111 2168633 2092258 2118092 1436224 1412267 2040147 1000319
1971A000319k63829M65399N26167n46747M9430K54299N14602j50941k33827m74024
$$ 1000319 736490 1201889 1728056 1181309 1230739 1485038 1999640 1848699 1614872 1140848
1961A140848K81252m4518m87725L58680K16962k26583m67356K69006q2629m42942
$$ 1140848 1422100 1377582 889857 1248537 1465499 1238916 771560 1040566 957937 514995
1951E14995K04335K62017l38289O40286J08925p4806k58722p58031J57066l87837
$$ 514995 719330 981347 643058 1283344 1392269 1317463 1058741 300710 457776 69939
1941F9939K5536O60026j21007N23963j12258n04616j85139L17727Q9605l0625
$$ 69939 95475 755501 634494 1158457 1046199 541583 356444 674171 763776 733151
1931G33151j57491j6714P5073N50042k1596o37041P3468L4192L01003j41348l66062
$$ 733151 575660 558946 634019 1184061 1162465 525424 598892 633084 934087 792739 426677
1920D26677O25343N5476l29849l2248n44062L64000J31072J27822L57493n24151
$$ 426677 1052020 1107496 777647 745399 201337 565337 696409 824231 1181724 657573
1910F57573k81032K80724L91073L62116q75479M77886k28018m28521m61369K30540
$$ 657573 376541 657265 1048338 1410454 534975 1012861 784843 356322 -105047 125493
1900A25493J51929m8248l1750J84735J58209l02789O72663j89471K24613J96390
$$ 125493 277422 229174 197424 382159 540368 237579 910242 720771 945384 1141774
1890A141774r81476m52767K24300K28401J04186j41330K0350J83561k78441R3446
$$ 1141774 160298 -292469 -68169 160232 264418 123088 143438 326999 48558 142004
1880A42004M68306j90855K93619l52959P348k7645l71720L7347K52249j76673
$$ 142004 610310 419455 713074 360115 367463 339818 -31902 5445 257694 81021
1870H1021l21092k6581N70480l06646j13892K22498p2159j36481K13057k07458
$$ 81021 -240071 -266652 303828 -2818 -116710 105788 33629 -102852 110205 -97253
1860i7253N25728L89533k15732P79413R131l46066J43949k10227j34849K38242
$$ -97253 428475 818008 602276 1381689 1390820 1044754 1188703 978476 843627 1081869
1850A081869k34387J55259N22465r8026M79624m77760q0185J18061p6417q2907
$$ 1081869 847482 1002741 1525206 1427180 1906804 1429044 1348859 1466920 1390503 1307596
1840A307596k40941P8365P25086K11751l55212j38401K53880l36119n59201n63955
$$ 1307596 1066655 1145020 1870106 2081857 1726645 1588244 1842124 1506005 946804 382849
1830C82849m00314L78152M065k36238l5228k62145M43110M45119q12838j76738
$$ 382849 -17465 360687 364752 128514 93286 -168859 274251 719370 -93468 -270206
1820b70206N95358L12401o83128K08741n18167p338M74353M6850o8667K50398
$$ -270206 325152 637553 -45575 163166 -355001 -362339 112014 158864 90197 340595
1810C40595R5806k85318k73963o2742J65428N79267K49810o50780J10976r9683
$$ 340595 436401 151083 -122880 -185622 -20194 559073 808883 158103 269079 169396
1800A69396p8955j27264J43233n2098J42275N4607M06793L758k49499M650n63905
$$ 169396 90441 -36823 106410 54312 196587 251194 657987 661745 412246 416896 -147009
1789a47009k25099N43008L217J7519k69742j44596k26545m23654O48992J174446
$$ -147009 -372108 170900 174117 191636 -78106 -222702 -449247 -872901 -223909 950537
1779I50537m45135l34162j40654Q3950Q79703r22920j05081N9772L83575j96098
$$ 950537 505402 171240 30586 114536 994239 71319 -33762 26010 409585 213487
1769B13487l56521k88459l98352K74061Q32521j20443q09728M7836L65648k13133
$$ 213487 -143034 -431493 -829845 -555784 276737 156294 -653434 -605598 -239950 -453083
1759d53083j38908P99751L24809m21731m23052J75651M08813J95135j28904j01679
$$ -453083 -591991 207760 532569 110838 -312214 -136563 272250 467385 338481 236802
1749B36802L05778j63603j11177j5897m5627k43713R7249j65710O22177r542L2207
$$ 236802 542580 378977 267800 251903 206276 -37437 59812 -105898 516279 506737 538944
1738E38944N2254K85846R1153p8538q82663m36132k17890L65143N9356m2733K90757
$$ 538944 591198 877044 968197 889659 6996 -429136 -647026 -281883 -222527 -265260 25497
1727B5497P6303M74632n81986L99256K0249K14871r7015m98215r7789M87255o8665
$$ 25497 101800 576432 -5554 393702 413951 628822 531807 33592 -64197 423058 354393
1716C54393N8968l14497k489l01955j83264L44572q68400L09136L14699J56637
$$ 354393 413361 98864 96375 -205580 -388844 -44272 -912672 -603536 -288837 -132200
1706a32200J59471k41857j82182j63748J11634N51953M58092o1697k48893J94334
$$ -132200 27271 -214586 -396768 -560516 -448882 103071 561163 499466 250573 444907
1696D44907l10218n83181m1867L06238K85015J68873J41502K24013L92006k11062
$$ 444907 134689 -448492 -490359 -184121 100894 269767 411269 635282 1027288 816226
1686H16226p69161k57130J41490K06362K18541j05064L29807O31115j36756q75250
$$ 816226 47065 -210065 -68575 137787 356328 251264 581071 1212186 1075430 200180
1676B00180q4582j05455L49326n72966M10216j81185l22864M50391j37381r3733
$$ 200180 115598 10143 359469 -213497 196719 15534 -307330 143061 5680 -88053
1666h8053j1831k78902L61454L38730m74823l20795l41528O06373N91045k71968
$$ -88053 -99884 -378786 -17332 321398 -153425 -474220 -815748 -209375 381670 109702
1656A09702J29033n77933j12438Q58188j16698K6356j64012K57355L05533r62461
$$ 109702 238735 -339198 -451636 406552 289854 316210 152198 409553 715086 -247375
1646b47375L14181J02440l54709J23456q8378J37479l7317m19310Q8273K32042
$$ -247375 66806 169246 -185463 -62007 -150385 -12906 -50223 -469533 -381260 -149218
1636a49218k28368m6132P82294r741r38510K11980L42474K68500j21604K21992
$$ -149218 -377586 -423718 358576 348835 -589675 -377695 -35221 233279 111675 333667
1626C33667j37152j38897J2186K75766J00009o72164n59572O16997j44449m64927
$$ 333667 196515 57618 69804 345570 445579 -226585 -786157 -169160 -313609 -778536
1616g78536j13040L42001J49493j12807M54954K32309l45442l61935O59145L6202
$$ -778536 -891576 -549575 -400082 -512889 -57935 174374 -171068 -533003 126142 162344
1606A62344J19016m36772k34226K60514o11105k62484L65626j2574L8160r2989
$$ 162344 281360 -155412 -389638 -129124 -740229 -1002713 -637087 -649661 -611501 -704490
1596g04490P61439R7421l28366L63996o34468j73514O98912l19160J53197J056873
$$ -704490 56949 154370 -173996 190000 -444468 -617982 80930 -238230 -85033 971840
1586I71840n46688k63714q3397J44731k20962l62433q8187k402j89299L8923Q3616
$$ 971840 425152 161438 78041 222772 1810 -360623 -448810 -451212 -640511 -601588 -517972
1575e17972k09079M76499Q5769j63913N29327M99583n45933J07366m8473n79945
$$ -517972 -727051 -250552 -164783 -328696 200631 700214 154281 261647 213174 -366771
1565c66771j4012M91607o36914L10045N76901n07014L69439j101648j6545K83264
$$ -366771 -380783 110824 -526090 -216045 360856 -146158 223281 -878367 -894912 -611648
1555f11648L81298k2652L04517J67515o42995R18378p1932r50531k67171Q27381
$$ -611648 -230350 -253002 51515 219030 -423965 494413 422481 -528050 -795221 32160
1545C2160K39609L9700n48841l71306O12874N51234M48051k52874J55148m07098
$$ 32160 271769 311469 -237372 -608678 4196 555430 1003481 750607 905755 498657
1535D98657l23510k42300k18962K12575J61490L7486m79178K20809J49918k97338
$$ 498657 175147 -67153 -286115 -73540 87950 125436 -353742 -132933 16985 -280353
1525b80353K29894k00885r550n58618J82751O11628j13610k97952p0547J2055
$$ -280353 -50459 -251344 -260894 -819512 -636761 -25133 -138743 -436695 -507242 -495187
1515d95187P55371m104o19390P9596R61375L39823p37505J56894k33530j48283
$$ -495187 260184 256080 -363310 -283714 677661 1017484 279979 436873 203343 55060
1505E5060K13903j86865j22324R31569l92110p57789J54634L16244k08015n78867
$$ 55060 268963 82098 -40226 891343 499233 -258556 -103922 212322 4307 -574560
1495e74560K91797L99738J22066j05520p7567J35239q44306K39988L98286k12587
$$ -574560 -282763 116975 239041 133521 55954 191193 -653113 -413125 -14839 -227426
1485b27426N78030L30208r1746l13258j2317j30285J25179L21399l82441m90519
$$ -227426 350604 680812 589066 275808 263491 133206 258385 579784 197343 -293176
1475b93176P7946L1237K73962M7986n43845J93154j28462L32461L49903N38172
$$ -293176 -215230 -183993 89969 137955 -405890 -212736 -341198 -8737 341166 879338
1465H79338p50387J5863M93718p33866l4884m3835N53444J40294n5440o34772
$$ 879338 128951 144814 638532 -95334 -130218 -174053 379391 519685 464245 -170527
1455a70527j07479K70415k57822L78601m98344q1822K26341P0166k1754K60932
$$ -170527 -278006 -7591 -265413 113188 -385156 -466978 -240637 -170471 -192225 68707
1445F8707O8099j4358k29199K78196l01115p19096Q49576l52745o8701K26989
$$ 68707 136806 122448 -106751 171445 -129670 -848766 810 -351935 -420636 -193647
1435a93647K31203N76747k10297m82699k2595L41800n72889j42782L03277J10815
$$ -193647 37556 614303 404006 -78693 -101288 240512 -332377 -475159 -171882 -61067
1425f1067L93988m2401n33185M54049M5104m72452m38673L24787j06059n8306
$$ -61067 332921 290520 -242665 211384 256488 -215964 -654637 -329850 -435909 -494215
1415d94215N82422o10997P9306J51555M24142o70081l36954N61502N020l28401
$$ -494215 88207 -522790 -443484 -291929 132213 -537868 -874822 -313320 -308300 -636701
1405f36701n34893Q67364L47574K9715n9912l3285j6333M77046q81n05067l1383
$$ -636701 -1171594 -304230 43344 73059 13147 -20138 -36471 440575 439694 -65373 -96756
1394i6756j3894m42214K70073J35280m66527j46957L26012R45048N10889k82177
$$ -96756 -110650 -552864 -282791 -147511 -614038 -760995 -434983 510065 1020954 738777
1384G38777q33600J65151J37422n6509K27419R91226p52283n94963j28793J87844
$$ 738777 -94823 70328 207750 151241 378660 1369886 617603 22640 -106153 81691
1374H1691L20621N4494o87381K21061m7265L29233J65263p20187r3694l7909J25704
$$ 81691 402312 456806 -230575 -9514 -56779 272454 437717 -282470 -376164 -414073 -288369
1363b88369J24903M7920j99450j94377J33938J88810L65456l08997O9336K93872
$$ -288369 -163466 -115546 -314996 -509373 -375435 -186625 178831 -130166 -60830 233042
1353B33042q1228K77903k87164J3027m46762L93362j7713r9907M61193j89039
$$ 233042 151814 429717 142553 155580 -291182 102180 84467 -15440 445753 256714
1343B56714R5830k05727N9967l7464J10491K32430j17939o6967k66326M30383
$$ 256714 352544 146817 206784 169320 279811 512241 394302 327335 61009 491392
1333D91392q03132j235302K14917M70530P12087K1004j31036O89370k70166j88710
$$ 491392 -311740 -1547042 -1332125 -861595 -149508 -128504 -259540 429830 159664 -29046
1323b9046k4408L7341m17602l89711M82155O885O9870j10887n3987J54691J18150
$$ -29046 -53454 -16113 -433715 -823426 -341271 -334386 -264516 -375403 -429390 -274699 -156549
1312a56549J00538j66458k23673J59227J98806k46227j18264L08066j30652L21945
$$ -156549 -56011 -222469 -446142 -286915 -88109 -334336 -452600 -144534 -275186 46759
1302D6759j36036o61700L96235N86581n20940K72386J61488K0730K09015J71755
$$ 46759 -89277 -750977 -354742 231839 -289101 -16715 144773 165503 374518 546273
1292E46273m77503k20415m17660K33466l96592k32292L26432p45532L65778O4794
$$ 546273 68770 -151645 -569305 -335839 -732431 -964723 -638291 -1383823 -1018045 -953251
1282i53251R71709K12456J10017j70573k55240L3403r3729K0283N40834l48665
$$ -953251 18458 230914 340931 170358 -84882 -51479 -145208 -124925 415909 67244
1272F7244J14155l90427m12168k18001O59293P95751L19677j06590k77373o82532
$$ 67244 181399 -209028 -621196 -839197 -179904 615847 935524 828934 551561 -130971
1262a30971k65848J70247r5767K84422p336p01499K50200R00395j70717M51424
$$ -130971 -396819 -226572 -322339 -37917 -45253 -746752 -496552 403843 233126 684550
1252F84550n50263r6372L33150n95064K98679M46992l41854l2477k12007j59419
$$ 684550 134287 37915 371065 -223999 74680 521672 179818 147341 -64666 -224085
1242b24085Q3155m57024J15545N37569k98948j85623M64943k59087k25755o4074
$$ -224085 -140930 -597954 -482409 55160 -243788 -429411 35532 -223555 -449310 -513384
1232e13384j50709L59502O36128m15762m6920m2894r2035l82698L41117M25937
$$ -513384 -664093 -304591 331537 -84225 -131145 -174039 -266074 -648772 -307655 118282
1222A18282l10142m73632L6897J98517L34204L43762J71459l72489k61287J61183
$$ 118282 -191860 -665492 -628595 -430078 -95874 247888 419347 46858 -214429 -53246
1212e3246K69475R8737l17877L3599n15837K17085J33628J39409n95179M24263
$$ -53246 216229 314966 -2911 30688 -485149 -268064 -134436 4973 -590206 -165943
1202a65943R4875r0731l82532N14161M33185p60717L91084j90059N64660m84102
$$ -165943 -71068 -161799 -544331 -30170 403015 -357702 33382 -156677 407983 -76119
$$ [...]
##END NTUPLES=NMR SPECTRUM
##END=
