##TITLE=1H_CG-1160-2
 CDCl3
 8 sc, 
 3.06.2022
##JCAMPDX= 6.0         $$ Bruker NMR JCAMP-DX V2.0
##DATA TYPE= NMR SPECTRUM
##DATA CLASS= NTUPLES
##ORIGIN= UXNMR, Bruker Analytische Messtechnik GmbH
##OWNER= root
$$ XWIN-NMR		Version 3.5
$$ Fri Jun  3 13:59:48 2022 Russian Standard Time (UT+4h)  she@DPX200
##.OBSERVE FREQUENCY= 200.13135
##.OBSERVE NUCLEUS= ^1H
##.ACQUISITION MODE= SIMULTANEOUS
##.ACQUISITION SCHEME= undefined
##.AVERAGES= 8
##.DIGITISER RES= 18
##SPECTROMETER/DATA SYSTEM= spect
##.PULSE SEQUENCE= zg30
##.SOLVENT NAME= CDCl3
##.SHIFT REFERENCE= (INTERNAL, CDCl3, 0, 15.7282)
##AUDIT TRAIL= $$ (NUMBER, WHEN, WHO, WHERE, WHAT)
$$ ##TITLE= Audit trail, XWIN-NMR		Version 3.5
$$ ##JCAMPDX= 5.01
$$ ##ORIGIN= Bruker BioSpin GmbH
$$ ##OWNER= she
$$ F:/spectra/data/she/nmr/H-F/1/pdata/1/auditp.txt
$$ ##AUDIT TRAIL=  $$ (NUMBER, WHEN, WHO, WHERE, WHAT)
(   1,<2022-06-03 13:58:38.84 +0400>,<she>,<DPX200>,
      <created by zg, POWCHK disabled, PULCHK disabled
       configuration hash MD5:
       00 E9 B6 7A A2 85 ED C7 34 08 36 98 17 FE 4E 26
       data hash MD5: 16K
       0B 9D 4E CD 41 90 1C 84 E9 53 81 DE BF 34 50 45>)
(   2,<2022-06-03 13:58:41.48 +0400>,<she>,<DPX200>,
      <Start of raw data processing
       efp BC_mod = 2 LB = 0.24 FT_mod = 6 PKNL = 1 PHC0 = -18048.39 PHC1 = 7.800743 SI = 16K 
       data hash MD5: 16K
       39 0E 9D 4E 9F A6 07 6E 00 62 E6 D2 0D 8D 40 D6>)
(   3,<2022-06-03 13:58:58.25 +0400>,<she>,<DPX200>,
      <pk PHC0 = -5.028428 PHC1 = 7 
       data hash MD5: 16K
       9C 3A D4 05 14 5C 64 03 70 DE A2 C1 57 5F 29 68>)
(   4,<2022-06-03 13:59:01.54 +0400>,<she>,<DPX200>,
      <abs ABSG = 5 
       data hash MD5: 16K
       DE 00 7A 96 32 A4 BA D0 22 18 B3 C0 4A 7A 3D A0>)
$$ ##END=
$$ 
$$ hash MD5
$$ 48 7C EC 2A 20 06 18 68 5A FB C2 6E 0E D2 03 62
##$RELAX= 
##$RELAX= 
##$RELAX= 
##$RELAX= 
##$RELAX= 
##$RELAX= 
$$ Bruker specific parameters
$$ --------------------------
##$DU= <F:/spectra>
##$EXPNO= 1
##$NAME= <H-F>
##$PROCNO= 1
##$TYPE= <nmr>
##$USER= <she>
##$AMP= (0..31)
100 100 100 100 100 100 100 100 100 100 100 100 100 100 100 100 100 100 
100 100 100 100 100 100 100 100 100 100 100 100 100 100 
##$AQSEQ= 0
##$AQ_mod= 1
##$AUNM= <au_zg>
##$AUTOPOS= <>
##$BF1= 200.13
##$BF2= 200.13
##$BF3= 200.13
##$BF4= 200.13
##$BF5= 200.13
##$BF6= 200.13
##$BF7= 200.13
##$BF8= 200.13
##$BYTORDA= 1
##$CFDGTYP= 0
##$CFRGTYP= 5
##$CHEMSTR= <none>
##$CNST= (0..31)
1 1 145 1 1 1 1 1 1 1 1 1 1 1 1 1 1 1 1 1 1 1 1 1 1 1 1 1 1 1 1 1 
##$CPDPRG= <>
##$CPDPRG1= <>
##$CPDPRG2= <>
##$CPDPRG3= <>
##$CPDPRG4= <mlev>
##$CPDPRG5= <mlev>
##$CPDPRG6= <mlev>
##$CPDPRG7= <mlev>
##$CPDPRG8= <mlev>
##$CPDPRGB= <>
##$CPDPRGT= <>
##$D= (0..31)
0 1.2 0 0 0 0 0 0 0 0.06 0 0.03 0 0 0 0 0.0002 0 0 0 0 0 0 0 0 0 0 0 0 
0 0 0 
##$DATE= 1654250318
##$DBL= (0..7)
120 120 120 120 120 120 120 120 
##$DBP= (0..7)
150 150 150 150 150 150 150 150 
##$DBP07= 0
##$DBPNAM0= <>
##$DBPNAM1= <>
##$DBPNAM2= <>
##$DBPNAM3= <>
##$DBPNAM4= <>
$$ [...]
##$SUBNAM2= <"">
##$SUBNAM3= <"">
##$SUBNAM4= <"">
##$SUBNAM5= <"">
##$SUBNAM6= <"">
##$SUBNAM7= <"">
##$SUBNAM8= <"">
##$SUBNAM9= <"">
##$SW= 18.05172834244
##$SWIBOX= (0..15)
0 0 2 0 0 0 0 0 0 0 0 0 0 0 0 0 
##$SW_h= 3612.71676300578
##$TD= 16384
##$TD0= 1
##$TE= 0
##$TE2= 300
##$TE3= 300
##$TEG= 300
##$TL= (0..7)
0 120 120 120 120 120 120 120 
##$TP= (0..7)
150 150 150 150 150 150 150 150 
##$TP07= 0
##$TPNAME0= <>
##$TPNAME1= <>
##$TPNAME2= <>
##$TPNAME3= <>
##$TPNAME4= <>
##$TPNAME5= <>
##$TPNAME6= <>
##$TPNAME7= <>
##$TPOAL= (0..7)
0.5 0.5 0.5 0.5 0.5 0.5 0.5 0.5 
##$TPOFFS= (0..7)
0 0 0 0 0 0 0 0 
##$TUNHIN= 0
##$TUNHOUT= 0
##$TUNXOUT= 0
##$USERA1= <user>
##$USERA2= <user>
##$USERA3= <user>
##$USERA4= <user>
##$USERA5= <user>
##$V9= 5
##$VALIST= <valist>
##$VCLIST= <CCCCCCCCCCCCCCC>
##$VD= 0
##$VDLIST= <DDDDDDDDDDDDDDD>
##$VPLIST= <PPPPPPPPPPPPPPP>
##$VTLIST= <TTTTTTTTTTTTTTT>
##$WBST= 1024
##$WBSW= 4
##$XGAIN= (0..3)
0 0 0 0 
##$XL= 0
##$YL= 0
##$YMAX_a= 52590
##$YMIN_a= -77142
##$ZGOPTNS= <>
##$ZL1= 120
##$ZL2= 120
##$ZL3= 120
##$ZL4= 120
##$ABSF1= 15.73146
##$ABSF2= -2.32039
##$ABSG= 5
##$ABSL= 3
##$ALPHA= 0
##$AQORDER= 0
##$ASSFAC= 0
##$ASSFACI= 0
##$ASSFACX= 0
##$ASSWID= 0
##$AUNMP= <proc_1d>
##$AZFE= 0.1
##$AZFW= 0.1
##$BCFW= 0
##$BC_mod= 2
##$BYTORDP= 0
##$COROFFS= 0
##$CY= -3
##$DATMOD= 1
##$DC= 0
##$DFILT= <>
##$DTYPP= 0
##$F1P= 0
##$F2P= 0
##$FCOR= 1
##$FTSIZE= 16384
##$FT_mod= 6
##$GAMMA= 0
##$GB= 0
##$INTBC= 1
##$INTSCL= 0
##$ISEN= 128
##$LB= 0.24
##$LEV0= 0
##$LPBIN= 0
##$MAXI= 10000
##$MC2= 0
##$MEAN= 0
##$ME_mod= 0
##$MI= 1.114404
##$NCOEF= 0
##$NC_proc= -9
##$NLEV= 6
##$NOISF1= 3.799351
##$NOISF2= 2.8
##$NSP= 0
##$NTH_PI= 0
##$NZP= 0
##$OFFSET= 15.72816
##$PC= 1
##$PHC0= -18053.42
##$PHC1= 14.80074
##$PH_mod= 1
##$PKNL= yes
##$PPARMOD= 0
##$PSCAL= 0
##$PSIGN= 0
##$REVERSE= no
##$SF= 200.130008681906
##$SI= 16384
##$SIGF1= 3
##$SIGF2= 2
##$SINO= 5.538805
##$SIOLD= 16384
##$SREGLST= <1H.CDCl3>
##$SSB= 0
##$STSI= 16384
##$STSR= 0
##$SW_p= 3612.71676300578
##$SYMM= 0
##$S_DEV= 0
##$TDeff= 16384
##$TDoff= 0
##$TI= <>
##$TILT= no
##$TM1= 0
##$TM2= 0
##$TOPLEV= 0
##$USERP1= <user>
##$USERP2= <user>
##$USERP3= <user>
##$USERP4= <user>
##$USERP5= <user>
##$WDW= 1
##$XDIM= 16384
##$YMAX_p= 429151917
##$YMIN_p= -7427233
$$ End of Bruker specific parameters
$$ ---------------------------------
##NTUPLES= NMR SPECTRUM
##VAR_NAME=  FREQUENCY,     SPECTRUM/REAL,   SPECTRUM/IMAG
##SYMBOL=    X,             R,               I
##VAR_TYPE=  INDEPENDENT,   DEPENDENT,       DEPENDENT
##VAR_FORM=  AFFN,          ASDF,            ASDF
##VAR_DIM=   16384,         16384,           16384
##UNITS=     HZ,            ARBITRARY UNITS, ARBITRARY UNITS
##FACTOR=    0.220516191357247, 1,           1
##FIRST=     3147.67677823398, 0,            0
##LAST=      -465.039984771796, 0,           0
##MIN=       -465.039984771796, -7427233,    0
##MAX=       3147.67677823398, 429151917,    0
$$ Real data points
##PAGE= N=1
##DATA TABLE= (X++(R..R)), XYDATA
$$ [...]
6961a564854J68941M53118L77441N21255j34768r73812r7118N71526O86192L7871
6951D5792K11446P3694k83653J27332m99190j21714J78884J47178p73138M5344
6941h48025M70144P805j75098l15486j70988L8034J109078j63071n62713J6712
6931e93608j2569N67005n16059k91574j80590O79820O28493r21728n36370O82411
6921d94769n928j06869J82576k34607o7522J41178m19030L5766M32252j10187
6911f47140j22891J2044M10034o23361Q88964J51725m95258n4217M63316k68731
6901b85515k28668N63241p13814J04201l72039n09752J77409O55214o03560L63646
6891h49637L95668n70273K6566L07765P75484k65400p72300m7376j88860K20583
$$ plain form
6961 -1564854 -1395913 -942795 -565354 -44099 -178867 -1152679 -1249797 -678271 7921 45792
6951 45792 257238 330932 47279 174611 -324579 -446293 -267409 -120231 -893369 -848025
6941 -848025 -377881 -370076 -545174 -860660 -1031648 -993614 115464 -47607 -610320 -593608
6931 -593608 -606177 -39172 -555231 -846805 -1027395 -347575 280918 -640810 -1177180 -494769
6921 -494769 -500697 -607566 -424990 -659597 -727119 -585941 -1004971 -969205 -536953 -647140
6911 -647140 -770031 -757987 -347953 -971314 -82350 69375 -425883 -480100 -16784 -285515
6901 -285515 -514183 49058 -664756 -560555 -932594 -1442346 -1264937 -609723 -1213283 -849637
6891 -849637 -453969 -1024242 -997676 -689911 85573 -179827 -952127 -999503 -1188363 -967780
6881i67780K52482L33795J55815r85941J72562N11054P4670O5541K33316l87567
6871e42053n24676j50436M36857O04094n44084J62837k05148P89754L18515j98269
6861A47391P4538k43010Q57962q59160m5736J23142o23893l06021P05745j00636
6851b69678l48378k50242k54995N3996J39852Q61013m44300J16342J79616k30526
6841d47300M33773k92088m44088K88694o61165J43179l46122M67505Q5236J20486
6831f51890J50752J75401l9929j22622N35410J92858N40811j16792m67870j03603
6821I2526Q8981N3044o40190o19344O86248m0470l6689J29678l04033K84142m78304
6810g84411p58233O27841L48760N45257L41482m34721n9431q03132n8039N56884
$$ plain form
6881 -967780 -715298 -381503 -225688 -1211629 -1039067 -528013 -453343 -387802 -154486 -542053
6871 -542053 -1066729 -1217165 -780308 -176214 -720298 -557461 -762609 27145 345660 147391
6861 147391 221929 -21081 836881 -22279 -68015 55127 -568766 -874787 -169042 -269678
6851 -269678 -618056 -868298 -1123293 -1069297 -929445 -68432 -512732 -396390 -216774 -447300
6841 -447300 -13527 -305615 -749703 -461009 -1122174 -978995 -1325117 -857612 -772376 -651890
6831 -651890 -501138 -325737 -365666 -488288 47122 239980 780791 663999 196129 92526
6821 92526 181507 234551 -405639 -1024983 -338735 -379205 -415894 -286216 -590249 -306107 -784411
6810 -784411 -1542644 -914803 -566043 -20786 320696 -114025 -173456 -976588 -1034627 -477743
6800d77743j55205N02045p9664j60175L62867k12128k48478j67004l46756l0545
6790a012786N46262M10130q2890n11789J98981R3055j87500L3763l51970J87264
6780f77480j78078O78510K35647o6939L57009K62729n40965q92204O25940N50061
6770C54230j48894n93480J29700R87262j12070p10203l49723O65766k15667J58722
6760A65643k12367m49916P4027L39287J80831M21855J93762k88895l48785K45900
6750C21342k98105l95246J73200J74708Q66179l59555n26016K13529J09608k45359
6740C4285l05133o3073M59109k36539J0420M0641n80205j76765M61430M25395
6730F9565l99221n84815Q73886L43288j65588k05927j12525K94278O37523J78902
$$ plain form
6800 -477743 -632948 -130903 -210567 -370742 -7875 -220003 -468481 -635485 -982241 -1012786
6790 -1012786 -466524 -56394 -139284 -651073 -452092 -359037 -546537 -512774 -864744 -677480
6780 -677480 -855558 -177048 58599 -8340 348669 611398 70433 -821771 -195831 354230
6770 354230 205336 -388144 -258444 728818 616748 -93455 -443178 222588 6921 165643
6760 165643 -46724 -496640 -422613 -83326 97505 519360 713122 424227 75442 321342
6750 321342 23237 -372009 -198809 -24101 842078 482523 -43493 170036 279644 34285
6740 34285 -270848 -333921 125188 -111351 -100931 -60290 -640495 -817260 -355830 69565
6730 69565 -329656 -914471 -40585 302703 137115 -68812 -181337 112941 750464 929366
6720I29366l09545m61466Q22977n4396k26462N8609j13121M01248p79976L13823
6710E81057l1474l65511l17217R36838P0184o39498l83386R45308J60777q32161
6700A24917M05334J92300m139K72072K69037l4477n28710M72501M93962n73997
6690A088800M31820J01542j193223R416o52851J54069L13374K65492J28833m08353
6680B38919L87476n11407k44460k57153L08355j86396M34044Q23111P7168q42120
6670B27537M31253M33874K5124J44876j5527N43947K87014o35305m25552j35915
6660H81326L89933K7269j23035j229584J52514J15493M48503O53710j014184j47642
6650A54303n7726k0946N35674J43995r5605J68893L47786q40187l82120J39780
$$ plain form
6720 929366 619821 158355 981332 926936 700474 759083 645962 1047210 267234 581057
6710 581057 549583 184072 -133145 803693 873877 234379 -149007 796301 957078 124917
6700 124917 530251 722551 718412 990484 1259521 1225044 696334 1168835 1662797 1088800
6690 1088800 1520620 1622162 428939 438355 -214496 -60427 252947 518439 647272 238919
6680 238919 626395 114988 -129472 -386625 -78270 -264666 169378 992489 1069657 227537
6670 227537 658790 1092664 1117788 1262664 1247137 1791084 2078098 1442793 1017241 881326
6660 881326 1271259 1298528 1175493 -54091 98423 213916 662419 1316129 301945 154303
6650 154303 96577 75631 611305 755300 659695 828588 1176374 336187 -45933 93847
6640I3847J84446k87093j319260O89539Q43681r73k7227n40480N0950O71098J9876
6629C78404q64616M78405N02813K34896l84454l15720R67m83576N21788m9118
6619A9789K27200J20599K31408k16569k73762J99841L74113k38400m47410n42927
6609e46118J66260N02416N721K87526M6554K61700K37796o69024n96690J24864
6599a78995j82057j39144J51465k29970n02341R59391K02805n71517P678J01121
6589c81564j96214j22413M98151K08555r11893K92832o2175K54192Q06684j86530
6579A99625M10074j161372N14694K17045j61572J61643j18569l65793o7639l57054
6569g28918J40874J13383M10871K27653p01881M82773j78924L14332K13726p28390
$$ plain form
6640 93847 278293 -8800 -1328060 -638521 205160 204187 176960 -363520 -312570 358528 378404
6629 378404 -486212 -7807 495006 729902 345448 29728 30695 -452881 68907 19789
6619 19789 246989 367588 598996 382427 108665 308506 682619 444219 -3191 -546118
6609 -546118 -379858 122558 128279 415805 462359 724059 961855 292831 -303859 -178995
6599 -178995 -361052 -500196 -348731 -578701 -1081042 -121651 81154 -490363 -482685 -381564
6589 -381564 -577778 -700191 -202040 6515 -905378 -612546 -674721 -420529 386155 199625
6579 199625 609699 -551673 -36979 180066 18494 180137 61568 -304225 -371864 -728918
6569 -728918 -588044 -474661 -63790 163863 -538018 -55245 -234169 80163 293889 -434501
6559d34501J76947l38466J01856J44970j19657M57567l23376o63346Q72807J62518
6549C7319n30658j8875j37423k22292J38083J380607O3586q52823J14800j80737
6539b08413P7792k16689L50293r8824l87634N27833p42370K8018L50189k27350
6529e47155K18706l58286j71665J41927O97532p37825k13342N32746R1941O22520
6519B77099Q6357k89698p42891j31082J27905L26122L36898n82058j99508K13824
6509e77032k76703J93169K69820M71980m42965j4755K07459l75632r9406J33068
6499e10997l38407k44862Q76344O85874p67000O39702l21771K6744K63329l63074
6489e4118M06469N8943n4599J80757m23690p34285J17443O29746q95167L99473
$$ plain form
6559 -434501 -257554 -596020 -494164 -349194 -468851 -11284 -334660 -998006 -125199 37319
6549 37319 -493339 -512214 -649637 -871929 -733846 646761 710347 -142476 -27676 -208413
6539 -208413 -130621 -347310 2983 -95841 -483475 44358 -698012 -669994 -319805 -547155
6529 -547155 -328449 -686735 -858400 -716473 -18941 -756766 -970108 -437362 -345421 277099
6519 277099 363456 73758 -669133 -800215 -672310 -346188 -9290 -591348 -790856 -577032
6509 -577032 -853735 -660566 -390746 81234 -361731 -376486 -169027 -544659 -644065 -510997
6499 -510997 -849404 -1094266 -217922 467952 -299048 340654 18883 45627 308956 -54118
6489 -54118 352351 411294 356695 537452 113762 -620523 -503080 126666 -768501 -369028
6479c69028M02533l77037K88202L32404K23561n57241p46524K71541P62078O94012
6469I24501j3775o75593K35859p52077J275364o13500j64955j29879m94736j02000
6459e10791o1576M48853j92885O77945o0189j021048L5630M43971j30761K94151
6449g6700K43913J12304k86128m9857R3975j57883k53255K87168p4286k55142
6439d15891k99492O08083J14204j052656N65838K97451L73899l5769n94986K80886
6429a58433n2011o82094M1710J93831j85305K77281K90103p1173M9537J97811
6419i8743j26642K12303O11030K1843q27252j50497j3231n41303M60986P53911
6409C02405N4135k19436n40625r6572m7595M56329n71265L00307L27645N28622
$$ plain form
6479 -369028 33505 -343532 -55330 277074 500635 -56606 -803130 -531589 230489 924501
6469 924501 910726 235133 470992 -281085 994279 380779 215824 85945 -408791 -510791
6459 -510791 -572367 -123514 -316399 361546 301357 -719691 -684061 -240090 -370851 -76700
6449 -76700 167213 279517 -6611 -56468 37507 -120376 -373631 -86463 -160749 -415891
6439 -415891 -715383 -107300 6904 -1045752 -479914 -182463 191436 155667 -439319 -158433
6429 -158433 -210444 -892538 -850828 -656997 -842302 -565021 -274918 -346091 -296554 -98743
6419 -98743 -225385 -13082 597948 619791 -207461 -357958 -371189 -912492 -451506 302405
6409 302405 356540 137104 -403521 -500093 -547688 -91359 -662624 -362317 -34672 493950
6399D93950k63322j81006K45232J97477n22483n52103K21197l16958K27273J46072
6389c04671O76990R5547o25227l27712O32413k71921K98531j81130m09759M48539
6379C1600k19742n35051K99370l82577P0083M96710m37835M34352q5612O1032
6369b67670R99101r0162o73663p34838K59938j43391l37968K7875J10738J31180
6359g18860K17980L56289l82851p5675P30128L70535n59424K87563l68890J45460
6349B255J2421j37484K68663k49210n57511L9364k73302k30704J44857M03573
6339e77078k83881m52353J093323M41700p35234J28293J96095M68834M29101m38253
6329B70547k7416m67470O01302M98595q29434j67966p04693L27023Q48317J05469
$$ plain form
6399 493950 230628 49622 294854 492331 -30152 -582255 -361058 -678016 -450743 -304671
6389 -304671 372319 467866 -157361 -485073 147340 -124581 173950 -7180 -416939 31600
6379 31600 -188142 -723193 -423823 -806400 -736317 -239607 -677442 -243090 -328702 -267670
6369 -267670 731431 641269 -32394 -767232 -507294 -650685 -988653 -960778 -850040 -718860
6359 -718860 -500880 -144591 -527442 -603117 127011 497546 -61878 225685 -143205 2255
6349 2255 14676 -122808 145855 -103355 -660866 -621502 -894804 -1125508 -980651 -577078
6339 -577078 -860959 -1313312 -219989 221711 -513523 -385230 -189135 279699 708800 270547
6329 270547 243131 -224339 376963 875558 46124 -121842 -826535 -499512 348805 454274
6319D54274n29151l17596M1386K26209L23166l13117N73465o3613L42768p17400
6309B0391R4271K37352l72890O2672M06677q1852M9987K5459K81854L99690q9009
6298A034602Q4138j9411l46784L84604j15709o22662o05628J89527J38063j09616
6288A1124M84938M83110j94018J7669j37559J7097p640k39180L61118k44272l10015
6277B42372q4268j70521o05777L1142L67059N37221P3575m78078n50791J36062
6267e02004P80732M05876k55132L95976K2292Q7697j64953p9317l8292l23532
6257C29343L76759J86246l80635r9J84850J66206m46695o92300K9639P44048M31816
6246I29178o09098N68961O47215k39901j042601m05228L84819K89776l39241M9273
$$ plain form
6319 454274 -74877 -392473 -351087 -124878 198288 -114829 458636 395023 737791 20391
6309 20391 114662 352014 -20876 41796 448473 366621 416608 442067 723921 1123611 1034602
6298 1034602 1118740 1099329 752545 1137149 1021440 398778 -206850 -17323 120740 11124
6288 11124 496062 979172 785154 802823 665264 682361 674721 435541 796659 552387 242372
6277 242372 158104 -12417 -618194 -587052 -219993 317228 390803 -87275 -638066 -502004
6267 -502004 278728 684604 429472 825448 847740 935437 770484 691167 652875 329343
6257 329343 706102 892348 511713 511614 696464 862670 415975 -276325 -246686 497362 929178
6246 929178 320080 889041 1536256 1296355 253754 -151474 233345 523121 183880 233153
6236B33153O47745l11794N79432l58663N8374M19071n08687o81380M53051O85962
6226A216264n12233p40305P8885N82204M33748j1466q2071k73397l93770N56670
6216H54529L79711m58967q69823L55840P52536m04143l28203q1832J6827J2780
6206B29255J70807M81437K65952J50364M5012r3758p14185k12916N5106L7404
6196D14478m78749m58309m3953q0675R63036M12553n1555q41L95599L8353p83241
6185C26696J78473L22076k0032k05934l16252N12324n28574K88836K48361k25340
6175E80634K58963m52602L11364k0263l02599P23731k3899k77414L0924R1381
6165I20220j34107k53396M22668p13722P17895O21774o04492l57505J76108j60764
$$ plain form
6236 233153 880898 569104 1148536 789873 848247 1267318 758631 77251 530302 1216264
6226 1216264 704031 -36274 42611 624815 1058563 1047097 965026 691629 297859 854529
6216 854529 1234240 775273 -94550 261290 1013826 609683 281480 199648 216475 229255
6206 229255 400062 881499 1147451 1297815 1342827 1249069 534884 321968 377074 414478
6196 414478 -64271 -522580 -566533 -647208 315828 728381 676826 675985 1071584 1109937 326696
6185 326696 505169 827245 807213 601279 285027 797351 268777 557613 805974 580634
6175 580634 839597 386995 698359 678096 375497 1099228 1075329 797915 828839 920220
6165 920220 786113 532717 955385 241663 959558 1581332 976840 619335 795443 634679
6155F34679R1651K71239r53904L15946J315657K28200o12348n58942K26352q28683
6145A29847n85614L84203N81178N85628k61111J6755m73983M53548n03001M8971
6135C76421j0436N76562O7555p55483L2952l51151k71625P64298M70961M56060
6125A356114L03294l62565m28215N41608Q000m01517j17783j41146K06066N58872
6115A522728K53527j101668K73391M57204j86215L63321K73451m19547J6960p61796
6105F91356m68620J76867N40288Q34037m59630m07847N74349k30356J1379j79751
6095A082072o59838m77124J92729J78297O94650P47761J58673j46738o65333J11970
6085A217119J90709l79982K68457j02981r8993R20602J13806k88531K64381j4720
$$ plain form
6155 634679 726330 997569 43665 359611 1675268 1903468 1291120 732178 958530 129847
6145 129847 -455767 -71564 509614 1095242 834131 850886 376903 830451 327450 376421
6135 376421 365985 942547 1010102 254619 287571 -63580 -335205 429093 900054 1356114
6125 1356114 1659408 1296843 868628 1410236 1418236 1016719 898936 757790 963856 1522728
6115 1522728 1776255 674587 947978 1405182 1218967 1582288 1855739 1436192 1453152 691356
6105 691356 222736 399603 939891 1773928 1314298 906451 1480800 1250444 1261823 1082072
6095 1082072 422234 -54890 137839 316136 1010786 1758547 1917220 1770482 1105149 1217119
6085 1217119 1407828 1027846 1296303 1193322 1094329 2014931 2128737 1840206 2104587 2089867
6075B089867M10871n99535j89771l16512l9332K37949J13940k57690L94393k69526
6065A574654k05757J2972N30181O8430j0182J73028M94703j58812o25296K60472
6055B114393j50292Q9390K89442l77002k9369L48762Q0346K15782K72146j90174
6045B663424j298097k4539O06438O70767M95278o12288L09486R7872p8607N29965
6035C359699j62706k72599j31479J50925j05772L2770o35483M6488R20128L61801
6025C563772m40716J31364o52939j71903M56659k0495L49431J67032M06830J81873
6015C970908m01048L05983l22636J28319j29869M88439p92249Q38216R60602J27726
6005E174391n21528Q4572L35682o72446N42002L02138J54668K32160R272l6666
$$ plain form
6075 2089867 2500738 1901203 1711432 1394920 1355588 1593537 1707477 1449787 1844180 1574654
6065 1574654 1368897 1381869 1912050 1980480 1970298 2143326 2638029 2479217 1853921 2114393
6055 2114393 1964101 2053491 2342933 1965931 1936562 2285324 2365670 2581452 2853598 2663424
6045 2663424 1365327 1340788 1947226 2617993 3113271 2500983 2810469 2908341 2829734 3359699
6035 3359699 3196993 2924394 2792915 2943840 2838068 2870838 2235355 2281843 3201971 3563772
6025 3563772 3123056 3254420 2601481 2429578 2886237 2865742 3215173 3382205 3789035 3970908
6015 3970908 3569860 3875843 3553207 3681526 3551657 4040096 3247847 4086063 5046665 5174391
6005 5174391 4652863 4737435 5073117 4400671 4942673 5244811 5399479 5631639 5640911 5604245
5995E604245q8127K76203J91375k08950L93672M87667R52843J71872k14979M61859
5985H027680O02564m57193l21377P94249R4065k45062N16142P94706Q4336L99895
5975A0290005L57667L95866K17755M94586L84300P61775O97913P49446Q01250
5966A5150563L28315J611057J82394O53328N10544J510587J169374J459248K081757
5957B4657167J319281K566937L493832M137017L434588J799162L99610p2891j292185
5948D0442518j230348k049552k266613j269618j599845n37991o63743q72614k30231
5939B9721963J3674j0597N65380M07784J720922J080989J823738K205047K953786
5930D0482686K754948K391388K012290L069169N200414N365505O888391Q973446
$$ plain form
5995 5604245 5516118 5792321 5983696 5774746 6168418 6656085 7608928 7780800 7565821 8027680
5985 8027680 8630244 8173051 7851674 8645923 8739988 8494926 9011068 9805774 9890110 10290005
5975 10290005 10647672 11043538 11261293 11755879 12140179 12901954 13599867 14349313 15150563
5966 15150563 15478878 17089935 17272329 17925657 18436201 19946788 21116162 22575410 24657167
5957 24657167 25976448 28543385 32037217 36174234 39608822 41407984 41807594 41734703 40442518
5948 40442518 39212170 37162618 34896005 33626387 32026542 31488551 30824808 29952194 29721963
5939 29721963 29735637 29725040 30290420 30698204 32419126 33500115 35323853 37528900 40482686
5930 40482686 43237634 45629022 47641312 50710481 55910895 61276400 68164791 77138237
5922G7138237R515878Q957636Q224448M381339l55961m074443o768575q246037
5914H8772522p735874p789681o338141n138847n841622m301576k258426k657237
5906D6711118j711221j927673l59962P65148K10910j2210J233925Q91274J310974
5897D7112283K003439K415318L042519L734728M359300O379231Q170832Q788225
5889H6005875Q268258Q300088N139153J023325m016184o538641p933016r037761
5881H1211097q855955q706705o695535n612912m606797l817848l446645k455490
5873C7013210j781111k095114j229665j068433j028960j179637J64789L23582
5865B9118661N03184m48986O58463J054586P97183M84221K178580L163496K965428
$$ plain form
5922 77138237 86654115 95611751 103836199 108217538 107861577 103787134 97018559 88772522
5914 88772522 81036648 73246967 66908826 61769979 55928357 51626781 49368355 46711118
5906 46711118 44999897 43072224 42712262 43477410 43688320 43676110 44910035 45801309 47112283
5897 47112283 49115722 51531040 54573559 58308287 62667587 69046818 77217650 86005875
5889 86005875 94274133 102574221 107713374 108736699 104720515 98181874 90248858 81211097
5881 81211097 72355142 63648437 56952902 51339990 46733193 42915345 39468700 37013210
5873 37013210 35232099 33136985 31907320 30838887 29809927 28630290 28795079 29118661
5865 29118661 29621845 29172859 29831322 30885908 31683091 32167312 34345892 37509388 40474816
5856D0474816J552137J450951Q58227j615750j978953k560500l292360l508320
5848C1380248k772650l243663k517391j657564j768544q65468q24538j110763
5840A6619667j001812o27284r30377n71657n94561j25945p22042j60954l92626
5831A1492409r88539o28285k70253r52330N20635n89943m99983M09011p83530
5822G709192l4705p87771M45065M5060k80728N84244j062698o58247n32528O61353
5812F088237P63376M08436m32655j051033K3281j97297m95472m53443O4174P84870
5802E502474O33863j56949o14458p05340j245056K44338L47564P6427j84313L80699
5792D279249R3488l67286K52059o26339M25858K04058j41957J41740j14372p73516
$$ plain form
5856 40474816 42026953 43477904 44336131 42720381 40741428 38180928 34888568 31380248
5848 31380248 28607598 25363935 22846544 21188980 19420436 18554968 17730430 16619667
5840 16619667 15617855 14990571 14060194 13488537 12893976 12768031 12045989 11885035 11492409
5831 11492409 10503870 9875585 9605332 8653002 9173637 8583694 8083711 8492722 7709192
5822 7709192 7674487 6886716 7331781 7376841 7096113 7680357 6617659 5959412 5426884 6088237
5812 6088237 6851613 7260049 6827394 5776361 5799642 5602345 5106873 4653430 4717604 5502474
5802 5502474 6136337 5979388 5364930 4659590 3414534 3658872 4006436 4082863 3898550 4279249
5792 4279249 4372737 4005451 4257510 3631171 4057029 4261087 4119130 4260870 4146498 3372982
5782C372982k18547L33495N11335r09299P92071n09977r19682k62275r3752N15855
5772B612206j51676L12434l43823r9604J61723l10274J075136j203711P1822j29283
5762A994950K15544K35859j68734k02305m89207M75133k9744J50734N78612o93119
5752B067723r0353N15165p97653k45065J81991J53152J98407J12387K21632k17651
5742B099735L46726m95051n54344l6450O79272K51747m30534p41994O48599L94858
5732B162564n55948l63258J10702J37871L97017M20565n74231r63063l14699p998
5722D49522O39073j74820K77683R02712k43035N35255o57033m17781m79102J44691
5712I77165K63685K43021j50861j47984J70349N67976n0426n3592q69015p96839
$$ plain form
5782 3372982 3154435 3487930 3999265 3089966 3882037 3372060 2452378 2190103 2096351 2612206
5772 2612206 2460530 2772964 2429141 2329537 2491260 2180986 3256122 2052411 2124233 1994950
5762 1994950 2210494 2446353 2277619 2075314 1586107 2061240 2031496 2182230 2760842 2067723
5752 2067723 1977370 2492535 1694882 1449817 1631808 1784960 1983367 2095754 2317386 2099735
5742 2099735 2446461 1951410 1397066 1360616 2039888 2291635 1861101 1119107 1767706 2162564
5732 2162564 1606616 1243358 1354060 1491931 1888948 2309513 1735282 772219 457520 449522
5722 449522 1088595 913775 1191458 2094170 1851135 2386390 1729357 1311576 832474 977165
5712 977165 1240850 1483871 1333010 1185026 1355375 1923351 1872925 1819333 950318 153479
5702A53479P32769J092341n66427l5980j09541M46014j5792K25083m07428q28911
5692F85607N06811M50489r57530R8014m5510m70920M99154P24308o03548j11554
5682G75321J42699p6551L63051k20682P6757l72075K08623l42608N56381N40542
5672A651458J23173j9043j91765n85377l73694O44443K47188l58448k91636O44547
5662A490846n0668j41380r9378K83771k62763j06156M5972k53714L84894k15637
5652A075787j1414j05477P11936n6972r84224N6442L79887k17636Q7839k34476
5642G01692l44875M16157K45795J56664l35440L34333m88524m59222K91554P21829
5632A239963P8009n62651J77916j77450m12744M58002M34598L83605j20897n06063
$$ plain form
5702 153479 886248 1978589 1412162 1376182 1266641 1712655 1696863 1921946 1514518 685607
5692 685607 1192418 1642907 685377 783391 737881 266961 766115 1490423 886875 775321
5682 775321 918020 841469 1204520 983838 1060595 688520 897143 554535 1110916 1651458
5672 1651458 1774631 1755588 1563823 978446 604752 1249195 1496383 1137935 846299 1490846
5662 1490846 1440178 1298798 1199420 1483191 1220428 1114272 1160244 906530 1291424 1075787
5652 1075787 1064373 958896 1670832 1613860 629636 686078 1065965 848329 936168 701692
5642 701692 356817 772974 1018769 1175433 839993 1174326 685802 226580 518134 1239963
5632 1239963 1317972 755321 933237 755787 343043 801045 1235643 1619248 1498351 992288
5622I92288K51652l26238K6487j74791K10238j65396j16224j54217j89545j33421
5612B20833P8043M41455L6862j66292K27027L16274l93286j03691Q29042l57157
5602A129110o64363K31394L29774n18380P59922K18149l22880J6889K1654n2266
5592A149003M9705L73486l88513l68170l35433M53274k17615K5895j22213J50018
5582G69437P95374K03748M3811j58078K8726O28627o2681j84892k49480m27897
5572A386695n78033L86205Q3789l9669R693M8851p38443o72963J145747Q21888
5562A853760l52340N44906n43673k82711o08978P65025J0857n86886L56593J219219
5552B375772L78089l49686k51904m18795k59863L41718N20318n5796j81132p05064
$$ plain form
5622 992288 1243940 917702 944189 769398 979636 814240 698016 543799 354254 220833
5612 220833 298876 740331 777193 610901 837928 1154202 760916 657225 1486267 1129110
5602 1129110 464747 696141 1025915 507535 1267457 1485606 1162726 1179615 1201269 1149003
5592 1149003 1198708 1572194 1183681 815511 480078 933352 715737 741632 619419 769437
5582 769437 1564811 1768559 1812370 1654292 1683018 2311645 2248964 2064072 1814592 1386695
5572 1386695 808662 1194867 1278656 1238987 1248680 1297531 559088 -113875 1031872 1853760
5562 1853760 1501420 2046326 1502653 1219942 610964 1375989 1386846 799960 1156553 2375772
5552 2375772 2753861 2404175 2152271 1733476 1473613 1815331 2335649 2279853 2098721 1393657
5542A393657N25706k98401n85358J93361O62005k81322R4258k22878O03270l95546
5532A688752K61531k60584P49902j47171r6631l98383K48235N20989k34459r6978
5522B235203P38640K74067M43467j38123o15245N85469L35698m86231J43167m10326
5512C105786p51146K45260L15807L72090p30541m10283J9715k48046P38118J65448
5502B822208k64535r989o0899J83664J59704k84944O9969J74890R23297o12119
5492C101246p04199j27006o74158N03894N3041j06984K76477N24532o89279O01804
5482B759368m54765k68347j47887O67092k42927k15122O65576l75232j02961L35892
5472B620687J38740N46480N4277k92764r1321P41709K42957p82101K83474K15670
$$ plain form
5542 1393657 1919363 1620962 1035604 1228965 1890970 1609648 1703906 1481028 2084298 1688752
5532 1688752 1950283 1689699 2439601 2292430 2195799 1797416 2045651 2566640 2332181 2235203
5522 2235203 2973843 3247910 3691377 3553254 2938009 3523478 3859176 3372945 3516112 3105786
5512 3105786 2354640 2599900 2915707 3287797 2557256 2146973 2166688 1918642 2656760 2822208
5502 2822208 2557673 2547684 2486785 2670449 2830153 2545209 2615178 2790068 3713365 3101246
5492 3101246 2397047 2270041 1595883 2099777 2152818 2045834 2322311 2846843 2157564 2759368
5482 2759368 2304603 2036256 1888369 2555461 2312534 2097412 2762988 2387756 2284795 2620687
5472 2620687 2759427 3305907 3360184 3067420 2976099 3717808 3960765 3178664 3462138 3677808
5462C677808m03309J09495J212313r01535l35649l31931k11463P19425j573K57680
5452C791261n3398K1137J87489K05003n8555K92566k68862n42803j45029K78632
5442C707441k64180n15951O93314k01464l35712J064909k53373o2044P7570K1973
5432C932483m24813O91586J46389p77989o02677j10513M57579K1828k6180L97619
5422C705312l93982j74557l29110o2888N72461O48990n59089P953K02141j56779
5412C460452K17984j18997k33135L2862k35527R14896j81374p28494L95590l06300
5402C217957j058447l8545R78134L80758R42049m22321k58517j64651L12717q6308
5392C802826p1160o28331o23171Q93763j6211L49129J043541q5706L63060r66347
$$ plain form
5462 3677808 3274499 3383994 4596307 3694772 3359123 3027192 2815729 3535154 3533581 3791261
5452 3791261 3737863 3759000 3946489 4151492 4092937 4385503 4116641 3573838 3428809 3707441
5442 3707441 3443261 2927310 3620624 3419160 3083448 4148357 3894984 3832940 3910510 3932483
5432 3932483 3507670 4199256 4345645 3567656 2964979 2854466 3312045 3333873 3307693 3705312
5422 3705312 3311330 3136773 2807663 2744775 3317236 3966226 3407137 3415090 3617231 3460452
5412 3460452 3678436 3559439 3326304 3359166 3123639 4038535 3857161 3128667 3524257 3217957
5402 3217957 2159510 2120965 3099099 3479857 4421906 3999585 3741068 3576417 3889134 3802826
5392 3802826 3731666 3103335 2480164 3373927 3357716 3706845 4750386 4664680 5027740 4061393
5382D061393M4590K65233j60237k4213q29114O64719L19951l98984l0596Q37155
5372D749897l93129l87562P353L26223M29178N5203m43974K5305L12757l88150
5362D293101j0987O91191m91810j26666K98379l90498P01011j02595k05804m01655
5352D253667J03119k70515k04697R8021N09315m86993J73515r3128j37520K89510
5342D234294J062814M97488J34419K48819p07199m16475j86210l312M51202P48832
5332F064672n4887l16859J96027K40809Q73597m29942J25077N6240m79677P29281
5322G004338k39988n11449J14942M77952j1372j40712j5516K01070m87998J02737
5312F494004M41787J00137m40687j25689N98563K26064J152135m36551K37179
$$ plain form
5382 4061393 4105983 4371216 4210979 4186766 3357652 4022371 4342322 3943338 3912742 4749897
5372 4749897 4356768 3969206 3976559 4302782 4731960 4787163 4343189 4368494 4681251 4293101
5362 4293101 4282114 4973305 4481495 4354829 4653208 4262710 4963721 4861126 4655322 4253667
5352 4253667 4356786 4086271 3881574 3979595 4488910 4001917 4175432 4082304 3944784 4234294
5342 4234294 5297108 5794596 5929015 6177834 5470635 5054160 4867950 4864638 5315840 6064672
5332 6064672 6009785 5692926 5888953 6129762 7003359 6573417 6698494 6754734 6275057 7004338
5322 7004338 6764350 6252901 6367843 6845795 6834423 6693711 6678195 6879265 6391267 6494004
5312 6494004 6935791 7035928 6595241 6469552 7068115 7294179 8446314 8009763 8246942
5303H246942J71603K18984J13614k11074P58592j54063M99711K01311O66134N61675
5293A1073429l2663j19512L12968L96550l53248K84547Q13439q7218R26275Q26880
5283A4041447N0435l10584l36802R57122L92429j33768P27954N49809j14328R42918
5273A6766632J201525m53150K61069j35519l36889N15553M11663O95937O45715
5264A9572536J337890P39862N9067l71897L76239P62681J383933R00455L65046
5255B5125812M11321Q29023J576152J220560O20349R06067J077939J708097K157378
5246C5632698J369540J371636J635226K451773K316786K129816K315661K697501
5238E1920637K754845L543505L405642L611369N364744N536842N140179O265678
$$ plain form
5303 8246942 8418545 8637529 8751143 8540069 9298661 9144598 9644309 9845620 10511754 11073429
5293 11073429 11040766 10921254 11234222 11630772 11277524 11562071 12375510 12288292 13214567 14041447
5283 14041447 14091882 13781298 13444496 14401618 14794047 14660279 15388233 15938042 15823714 16766632
5273 16766632 17968157 17515007 17776076 17640557 17303668 17819221 18230884 18926821 19572536
5264 19572536 20910426 21650288 21709355 21337458 21713697 22476378 23860311 24760766 25125812
5255 25125812 25537133 26366156 27942308 29162868 29783217 30689284 31767223 33475320 35632698
5246 35632698 37002238 38373874 40009100 42460873 44777659 46907475 49223136 51920637
5238 51920637 54675482 58218987 61624629 65235998 70600742 76137584 81277763 87543441
5230H7543441O859508Q255859R979930J2119059J3857457J6509085J9386724K1263861
5222A95774924K1015188K0418628J8676542J5013769Q001319K013360l701661
5215B77212069j0051618j6454139j9965787k0671752k1251243k0236885j8150068
5208A50430577j5408000j3596037j1127747j0050519q355831o931184n800176
5201G9161083m437290m126891l875936l022106k772351k508758j804609k106198
5193E4506944j262349j202131j350361r30016p33044j031473l4866R53302j44609
5184D8771397R9431M56786J30310P20937O85098J24408R00275J188965J086091
5175E4163698J629468J568571J693644J853333L419279J827741K807908L652439
$$ plain form
5230 87543441 94402949 102658808 112638738 124757797 138615254 155124339 174511063 195774924
5222 195774924 216790112 237208740 255885282 270899051 278900370 280913730 277212069
5215 277212069 267160451 250706312 230740525 210068773 188817530 168580645 150430577
5208 150430577 135022577 121426540 110298793 100248274 91892443 84961259 79161083
5201 79161083 74723793 70596902 66720966 63698860 60926509 58417751 56613142 54506944
5193 54506944 53244595 52042464 50692103 49762087 49029043 47997570 47962704 48916006 48771397
5184 48771397 48870828 49327614 49457924 50178861 50863959 50988367 51888642 53077607 54163698
5175 54163698 55793166 57361737 59055381 60908714 64327993 66155734 68963642 72616081
5167G2616081M019950M860705M528246N443147O684634Q047582J0206329J2049654
5159A28456328J5383968K0767202K3653755K5178617K3154957J7669915R746260
5152B64011002j051017j0045192j8011237k2474396k2335989k3179320k0386151
5145A46527700j7688623j4474235j1085281r568840r334544o782827n933698m567659
5137F7091993l791911l056349l157372k684750j523717k237198j245050j458296
5129D7937350j034044p90340k408598j987517j566031k068733k826289j743638
5121C3512160j514286j527149j165242j342679j631562q42956o69214n28520j098847
5112B3191705o02328k12106j313523j185803n67780l67969j254174k57729r68069
$$ plain form
5167 72616081 76636031 81496736 86024982 91468129 98152763 106200345 116406674 128456328
5159 128456328 143840296 164607498 188261253 213439870 236594827 254264742 264011002
5152 264011002 262959985 252914793 234903556 212429160 190093171 166913851 146527700
5145 146527700 128839077 114364842 103279561 93710721 84376177 77593350 71659652 67091993
5137 67091993 63300082 60243733 57086361 54401611 52877894 50640696 49395646 47937350
5129 47937350 46903306 46112966 43704368 41716851 40150820 38082087 35255798 33512160
5121 33512160 31997874 30470725 29305483 27962804 26331242 25488286 24819072 24290552 23191705
5112 23191705 22589377 22377271 21063748 19877945 19310165 18942196 17688022 17430293 16462224
5103A6462224l01696j53697n28661l79525l38887j08482m75680n92936j316040
5094A2266620L78702O4828L8324k96990M0924j357857p86732O6638J04178K42057
5084A0760692J35530Q730p0435m97463j401879Q87352k36509J29495K70250m46464
5074I539299j162858l80160J077067p05661r45361k88246L68839R95834k30460
5065H268293r19056m41452L49000M67055L85697m95711r48790l89534m92288k34333
5055E548881J50531K5628m33393L67393j47251K24608l99582l6590q2926l93473
5045D823826K63658l55108M01669n14936l1835l80466o60K88710K36995m55511
5035D276342l91274q93312O36582N90447r7339m7754k1746j55280n45501L11930
$$ plain form
5103 16462224 16160528 16006831 15478170 15098645 14759758 14651276 14175596 13582660 12266620
5094 12266620 12645322 12710150 12748474 12451484 12492408 11134551 10347819 10414457 10518635 10760692
5084 10760692 10896222 10904952 10834517 10337054 8935175 9822527 9586018 9715513 9985763 9539299
5074 9539299 8376441 7996281 9073348 8367687 7422326 7134080 7502919 8498753 8268293
5065 8268293 7349237 6907785 7256785 7723840 8109537 7613826 6665036 6275502 5783214 5548881
5055 5548881 5699412 5725040 5291647 5659040 5511789 5736397 5336815 5300225 5217299 4823826
5045 4823826 5087484 4732376 5134045 4619109 4587274 4206808 4206148 4494858 4731853 4276342
5035 4276342 3885068 2991756 3628338 4218785 4121446 4073692 4051946 3896666 3351165 3663095
5025C663095L93353m50850K83075n51725n20861j29744Q5840J69326M22645l08622
5015C055532m87712R8687J27044L70797M24015o45591n71662o059q21899l5M63324
5004B006441j39973Q48621o756r60380o50193k8770J257923O6071p26131L51542
4994B018395j33914r0306O25154L29870M4714k28114N38517n90270K3358M2294
4984B579698k08280m11995J41643j10953o4357P21221J30696j86396m64711O48680
4974B775246k48509Q6628j33962k20659K44223L79802p7254r65353R5303j67898
4964A767567r2973l25616K29204K54121k64698M39905M04781o02956L401J868
4954A814604k54613m38547M04697l61543M3206J69556l88580N79740K86552O1242
$$ plain form
5025 3663095 4056448 3605598 3888673 3336948 2816087 2686343 2772183 2941509 3364154 3055532
5015 3055532 2567820 2666507 2793551 3164348 3588363 2942772 2371110 2365051 1543152 1543117 2006441
5004 2006441 1866468 2715089 2708333 1747953 1097760 1068990 2326913 2392984 1666853 2018395
4994 2018395 1884481 1794175 2419329 2749199 2793913 2565799 3104316 2514046 2537404 2579698
4984 2579698 2371418 1959423 2101066 1990113 1925756 2646977 2777673 2591277 2126566 2775246
4974 2775246 2526737 2613365 2479403 2258744 2502967 2882769 2805515 1840162 1935465 1767567
4964 1767567 1674594 1348978 1578182 1832303 1567605 2007510 2412291 1809335 1812736 1814604
4954 1814604 1559991 1121444 1526141 1164598 1207804 1377360 988780 1568520 1855072 1916314
4944A916314R513o7926J18901o85616J62384K56196M61171m81716l44988q2135
4934A262098j27968j89914L48697M3661q66985M76028L86759Q3685R04203q14151
4924A506113J00246n63876k91365R29464J062433j30921o24887k23210P15968
4915B479965O68875k71279J51850p6293K36040m52313q03472J77882N5889j77664
4905A989480J55120q8004o4958m93125m52584q4917J122575l11065o62708m32625
4895F77189N13633k07376M15487k5802n24903L15803N14444j99155m63202k66416
4885G49702j51742J44142Q35321L52943j78032j390404q3548Q7040j72769J77455
4875C70108P81414j41560n22529M70053K29490J78821o91123L1649N00039k33430
$$ plain form
4944 1916314 1925827 1857901 1976802 1291186 1453570 1709766 2170937 1689221 1344233 1262098
4934 1262098 1134130 944216 1292913 1336574 469589 945617 1332376 1416061 2320264 1506113
4924 1506113 1606359 1042483 751118 1680582 2743015 2612094 1987207 1763997 2479965
4915 2479965 3148840 2877561 3029411 2953118 3189158 2736845 1933373 2111255 2167144 1989480
4905 1989480 2144600 2056596 1991638 1498513 1045929 961012 2083587 1772522 1109814 677189
4895 677189 1190822 983446 1398933 1373131 848228 1164031 1678475 1479320 1016118 749702
4885 749702 597960 742102 1577423 1930366 1752334 361930 278382 365422 192653 370108
4875 370108 1151522 1009962 487433 957486 1186976 1365797 674674 706323 1206362 972932
4865I72932L66548j79744q2892K89227K58648J50348O5413O90099N18315k36740
4855B812154r22658p46639O31592K38183n52564j63744N78110n77748j47612m25543
4845G23531K27149j13110n88109L60327L51599O99062j090582M69649J62299k21463
4835I80352k84732j73404J81699j0440l4388K63321R1491K61697j14203m45709
4825G15684N5411l100M94892M70852r98460r11787K64439k27928J76469L77716
4815D14188p6249J85029j145035M13038Q20372k07431o75275K47991L26517j00
4805C03045O19164R5512j65174j4618O9304k91745q67358l73880L82710l44115
4795e87155q4930N52286M46363L33217J75693j1554J21256j47899L67535l05427
$$ plain form
4865 972932 1339480 1159736 1076844 1366071 1624719 1775067 1840480 2530579 3048894 2812154
4855 2812154 1889496 1142857 1774449 2012632 1460068 1296324 1874434 1296686 1149074 723531
4845 723531 950680 837570 249461 609788 961387 1660449 569867 1039516 1201815 980352
4835 980352 695620 522216 703915 693475 659087 922408 1013899 1275596 1161393 715684
4825 715684 771095 767995 1262887 1733739 735279 -176508 87931 -139997 36472 414188
4815 414188 337939 522968 -622067 -209029 611343 403912 -271363 -23372 303145 303045
4805 303045 922209 1017721 852547 837929 907233 615488 -251870 -625750 -243040 -587155
4795 -587155 -672085 -119799 326564 659781 835474 823920 945176 797277 1164812 859385
4785H59385p79437R42583l53230n32177o97698P75404J4029o24567K15713M43762
4775B63767P36370M61m97256r59412L710K79299N43528K59605j34009n67649r9535
4764a71121m90260L2368Q47540k49480M10230M58620l13562n84210k73594L12857
4754b0612J49626J77294l3116M16167p31853r494O1999k09268O78021m26190L1414
4743H3988J58816p255k16094r0600M73525L2542n58460l85486n0317J30932K46006
4732a82403M3987q34056l62181O9524Q31957O00381J23702m00675k27806J075830
4722G38260k7286j81103p21157p07776o3062K83604K64940K44802O03097n8243
4712C76076O14305K7786q24130r3200K54393J1286j0193j97049l17402N1737n49405
$$ plain form
4785 859385 79948 1022531 669301 137124 -560574 214830 228859 -395708 -179995 263767
4775 263767 1000137 1000598 503342 -456070 -452360 -173061 370467 630072 496063 -71586 -171121
4764 -171121 -661381 -629013 218527 -30953 379277 837897 524335 -59875 -333469 -20612
4754 -20612 129014 306308 273192 689359 -42494 -51988 10011 -199257 478764 52574 83988
4743 83988 242804 235549 19455 -71145 402380 434922 -123538 -509024 -559341 -428409 -182403
4732 -182403 -138416 -972472 -1334653 -1265129 -433172 167209 290911 -109764 -337570 738260
4722 738260 710974 529871 -191286 -899062 -962124 -678520 -413580 -168778 434319 376076
4712 376076 990381 1018167 194037 100837 355230 366516 356323 159274 -158128 -106391 -655796
4701f55796N52629O45259k54510O2119n7371J30914N71860l86901n69678Q32906
4691H71431J54913k04534o7498J20782k95395J0607L43642o68103k9054o7804
4681A68987N11020j233239l87567P40917Q16325m66364k07469M08787n20988N61598
4671C92007R59711p27393M4833m2634n51038j89345l87983N19875M68625l66472
4661A20186j12520K77566M3418m31635o4596Q57013K8254k25152k77125j9010
4651A96399n53202k24981L52901N42432k12491o42415J462K37472N15960K87934
4641E01471J82338m94418n04839O3588L57270j46216q1560j89989P48855L88514
4631H25014J6708k42213o78983J29251J76057k52563o94019P05834j3097K63389
$$ plain form
4701 -655796 -103167 542092 287582 349701 292330 423244 995104 608203 38525 871431
4691 871431 1026344 821810 754312 875094 579699 590306 933948 265845 236791 168987
4681 168987 680007 -553232 -940799 -199882 616443 150079 -57390 351397 -169591 392007
4671 392007 1351718 624325 669158 626524 75486 -113859 -501842 18033 486658 120186
4661 120186 7666 285232 328650 -102985 -167581 689432 717686 492534 215409 196399
4651 196399 -356803 -581784 -228883 313549 101058 -541357 -539895 -302423 213537 501471
4641 501471 683809 189391 -315448 -251860 105410 -40806 -122366 -312355 436500 825014
4631 825014 841722 599509 -79474 49777 225834 -26729 -720748 -14914 -28011 235378
4621B35378r000j53422L7881K48812l68284o0249j28183l06237N15108Q2337j05081
4610a0940K27563L091J36500l82293L59072O5012r10852J61919J30574P733n6026
4599b68647N59774Q9004r09765N74211L07424l66187k26665l39403J024136M21701
4589H65583o04749j33822K19603k36713j00153k48175R24149R708p37458L55870
4579C13843J86797j17517j12356J52873J11850N6362P9981J59921q49999M41282
4569D23037l12984p85500J256043M37681l92735n80234o45333N17385j33278j3842
4559b29760O85868L07165j102843L79112M07192n79228O90977K61091j1498K92783
4549A100859K5616l89938N102Q53770l36941l48251J29790n76480m78369N39163
$$ plain form
4621 235378 226378 72956 110837 359649 -8635 -68884 -197067 -503304 11804 94141 -10940
4610 -10940 216623 219714 356214 -26079 332993 398005 -512847 -350928 -220354 -212621 -268647
4599 -268647 291127 380131 -529634 44577 352001 -14186 -240851 -580254 443882 865583
4589 865583 260834 127012 346615 109902 9749 -238426 685723 695431 -42027 313843
4579 313843 500640 383123 270767 423640 535490 591852 671833 831754 -18245 423037
4569 423037 110053 -675447 580596 1018277 625542 45308 -600025 -82640 -215918 -229760
4559 -229760 456108 763273 -339570 39542 446734 -132494 558483 819574 808076 1100859
4549 1100859 1126475 736537 741639 1595409 1258468 910217 1040007 463527 -14842 524321
4539E24321q04325J21893J58946K74963K17998q0225L96998j78979j21112n04479
4529E999P57764p86981j72534J217404j74149j18151l27528N14905L92565p9891
4519A229403l1186q10797R48183J85440J87700l93575J7860j78989k7540m54819
4509F71680l31804N59682L88940J0200l8912j54352n2896Q1604k69859o16279
4499B48004n17125N03498M46458J07043L0445j67312j09972l0871O15484K71991
4489A397643q79214O03563l19762M30152l47267M68434j38006o11696k48536m93876
4479a38565N25925j65669N96656J74887j1434j60975k34479m93702J32402R83337
4469A208383K89772p54278K01403o35465L24817M38932j566l79808j83846l19951
$$ plain form
4539 524321 -280004 -158111 835 275798 493796 413571 810569 631590 510478 5999
4529 5999 763763 -23218 -195752 1021652 847503 729352 401824 916729 1309294 1229403
4519 1229403 1198217 387420 1335603 1521043 1708743 1315168 1333028 1154039 1126499 671680
4509 671680 339876 899558 1288498 1298698 1259786 1105434 1052538 1134142 864283 248004
4499 248004 -269121 234377 680835 787878 818323 651011 541039 510168 1125652 1397643
4489 1397643 518429 1121992 802230 1232382 885115 1353549 1215543 603847 355311 -138565
4479 -138565 387360 221691 818347 993234 981800 820825 586346 92644 225046 1208383
4469 1208383 1498155 743877 945280 309815 634632 1073564 1071998 692190 508344 188393
4459A88393J36970J97975Q6886j47777K85499l37554L56496j13786n57281N88849
4449F84670J79131k5120l21764L6546L5279j02322m36357L79705N08372k06053
4439G32087M54970p68773p45725K66200J034267j9030n79146M01720J82868M08526
4429A367964k48667l1847K02370j37228M74640K90687m94266m88267q47981J62975
4419B50380J08662K02368K01443K13536L88516l27688J46215o37127l32032J304676
4409A518949N31399J04717o00639q16152J95979K54589M03969J52281p7048M30482
4399B098526J40468N67596o59033n00007M99469J189667m05173l03213k86542
4390B341758L60416R69688k1875r4862m53015n45341J73229k93738n37996J06383
$$ plain form
4459 188393 325363 523338 610224 462447 747946 410392 766888 653102 95821 684670
4449 684670 863801 838681 516917 553463 588742 486420 50063 429768 938140 732087
4439 732087 1187057 418284 -327441 -61241 973026 953996 374850 776570 959438 1367964
4429 1367964 1119297 1087450 1289820 1152592 1627232 1917919 1423653 935386 87405 250380
4419 250380 359042 561410 762853 976389 1364905 1037217 1183432 546305 214273 1518949
4409 1518949 2050348 2155065 1554426 738274 934253 1188842 1592811 1745092 1668044 2098526
4399 2098526 2238994 2806590 2147557 1647550 2147019 3336686 2931513 2628300 2341758
4390 2341758 2702174 3671862 3649987 3555125 3102110 2556769 2729998 2436260 1898264 2004647
4380B004647M76886l19176j8314J39344k97756p6121Q01331m91249j66124N61699
4370B615167o96901j76045j38615M46284N35773l64254q01022j44927O44135J20880
4360B040475n24095K19306L77596K59327J86501m18824P08214n70812q70341J37667
4350A545014N53309j0304M06640n32845L09922J92931o93787L19678N71558k68625
4340B393491j64866N28923J13387n23987L10505J460347J77695k63750J0671J46063
4330D188479q87674P16779l0656l00468K17300L21289Q00289L7001K23903J091811
4320F378053M13758J238445K69436j343989o7636P2865j1029j85974n66338l87465
4310E810126j40220j31041K60385j002226m35m21404o53263J055241P61509L9774
$$ plain form
4380 2004647 2481533 2162357 2144043 2283387 1985631 1909510 2710841 2219592 2053468 2615167
4370 2615167 1918266 1742221 1603606 2049890 2585663 2221409 1420387 1275460 1919595 2040475
4360 2040475 1516380 1735686 2113282 2372609 2559110 2140286 2848500 2277688 1407347 1545014
4350 1545014 2098323 2088019 2494659 1961814 2271736 2464667 1770880 2090558 2662116 2393491
4340 2393491 2228625 2757548 2870935 2346948 2657453 4117800 4295495 4031745 4042416 4188479
4330 4188479 3300805 4017584 3986928 3686460 3903760 4225049 5025338 5062339 5286242 6378053
4320 6378053 6791811 8030256 8299692 6955703 6888067 6960932 6949903 6763929 6197591 5810126
4310 5810126 5669906 5538865 5799250 4797024 4796589 4375185 3721922 4777163 5538672 5578446
4300E578446m34893K54486k26495m86110k29228O22987J400210J36240j79221
4291F436422K92535P16732O75348k25067k02451r76131o0704j031806l7156l18175
4281E269547P3953N6641l54698l30220P4385m20429n09358k45483L01413j76338
4271C739413M26548m23161l43021k37181J41925O21524p14940K27533K60632N0226
4261C749498K5148K27884j26103N47302P26100q13736K2048Q12551k97601l34900
4251D538191l33309N36246Q35821j7144j36939j22322l9496p59918k00448O63797
4241D964479K7565l73161R7489j30311q3525Q9004O56454q7035j06917K94344
4231E348386O92855l31384n87111L49062L57281l716n99102O69971N54800l54495
$$ plain form
4300 5578446 5143553 5398039 5171544 4685434 4456206 5079193 6479403 6615643 6436422
4291 6436422 6728957 7445689 8121037 7895970 7693519 6717388 6656684 5624878 5587722 5269547
4281 5269547 5343500 5400141 5045443 4715223 4789608 4369179 3859821 3614338 3915751 3739413
4271 3739413 4165961 3742800 3399779 3162598 3304523 3926047 3211107 3438640 3699272 3749498
4261 3749498 3774646 4002530 3876427 4423729 5149829 4336093 4358141 5170692 4873091 4538191
4251 4538191 4204882 4741128 5576949 5559805 5422866 5300544 5261048 4501130 4300682 4964479
4241 4964479 4992044 4618883 4716372 4586061 4502536 4591540 5247994 5160959 5054042 5348386
4231 5348386 6041241 5709857 5122746 5471808 5829089 5825373 5226271 5896242 6451042 6096547
4221F096547k36454L82548j79967J12265O693J06707R6204N00104P8133j35126
4211F827654l70743L23700M41790l23325k25513L68741n37618j46186P11170K2686
4201G092356j71400M50202j40113J7858n36408L08586M82481K77184Q90507m23137
4191H248116J91054M96269j52624j58934k36408O18084o5930L68469P08856J66219
4181A0183171n87298L23941L95546J629155L24190K72355O82209o12207o25418
4172A1985644Q47017J128046K02256M28740K83727M22245R44473j1085l5339O26381
4162A6822105K48280R67304J106729O23829j43204L0596J260864J42513k27122
4153B0831894J496148L91164n5026N13247O45190L27091k23668Q55168L03042
$$ plain form
4221 6096547 5860093 6242641 6062674 6174939 6181632 6288339 6384543 6884647 6962780 6827654
4211 6827654 6456911 6780611 7222401 6899076 6673563 7042304 6504686 6358500 7069670 7092356
4201 7092356 6920956 7371158 7231045 7248903 6712495 7021081 7503562 7780746 8671253 8248116
4191 8248116 8439170 8935439 8782815 8623881 8387473 9005557 8939627 9308096 10016952 10183171
4181 10183171 9595873 9919814 10315360 11944515 12268705 12541060 13223269 12611062 11985644
4172 11985644 12832661 13960707 14162963 14591703 14875430 15297675 16242148 16231063 16195724 16822105
4162 16822105 17070385 18037689 19144418 19768247 19625043 19655639 20916503 21059016 20831894
4153 20831894 22328042 22719206 22664180 23177427 23822617 24149708 23926040 24781208 25084250
4144B5084250L8439J078203N48947O24608J118697J211352j59087P81999J175350
4135C1502758Q93828J274108K233251J859964J357632K059756K374500J346660
4127D4902457J491045J755435K435945K244305K228700L034428L130599L053984
4119F4276898M244458M625596M553669N211913N052184N785062O841775Q457120
4111A09048675Q578111R103909J1121325J2835020J6070175K0099730K3721570
4104B10578515K8090485L1905262L5376649L7137542L4223485K6645864J8351184
4097D22308986O842931q394313k0716587k6421586l2307304l6437610l5146112
4090B69728405l1576688k8195750k5723688k1209771j7212025j3927049j2735507
$$ plain form
4144 25084250 25122689 26200892 26749839 27374447 28493144 29704496 29545409 30327408 31502758
4135 31502758 32396586 33670694 35903945 37763909 39121541 41181297 43555797 44902457
4127 44902457 46393502 48148937 50584882 52829187 55057887 58092315 61222914 64276898
4119 64276898 68521356 73146952 77700621 82912534 87964718 93749780 100591555 109048675
4111 109048675 117626786 126730695 137852020 150687040 166757215 186856945 210578515
4104 210578515 238669000 270574262 305950911 343088453 377311938 403957802 422308986
4097 422308986 429151917 420757604 400041017 373619431 341312127 304874517 269728405
4090 269728405 238151717 209955967 184232279 163022508 145810483 131883434 119147927
4083A19147927j0776796p922598p286576o941895n739594n488017l915064l468494
4075F7608893l768759k924821l076930l559297k236415k192802j817961k914600
4067D5117308j507426j668676k067445j232556j605900l91096m22490o72878j665802
4058C3883039j055399p19733r75612l67291j111236j342246q58650o79602p53913
4049B6019357l12998p97719n97535m05869n77667k05165p48205r57767p7067o25827
4039B0713538m14749L0221j6945o62680j58977k72368L32507p2993l22848L50987
4029A9505693N86791N07549r87118J91779M09515J280125j9811n00891K01842
4020B1175474m748n1251m14227m91401j153111k17805j93854j295151q80661o82444
$$ plain form
4083 119147927 108371131 100448533 93161957 86220062 80480468 74992451 71077387 67608893
4075 67608893 63840134 60915313 57838383 54279086 52042671 49849869 48031908 45117308
4067 45117308 43609882 41941206 39873761 38641205 37035305 36644209 36221719 35548841 33883039
4058 33883039 32827640 32107907 31132295 30765004 29653768 28311522 27452872 26773270 26019357
4049 26019357 25706359 24908640 24311105 23905236 23327569 23122404 22374199 21416432 21339365 20713538
4039 20713538 20298789 20329010 20312065 19649385 19490408 19218040 19550547 19477554 19154706 19505693
4029 19505693 20092484 20600033 19612915 19804694 20214209 21494334 21474523 20973632 21175474
4020 21175474 21170726 21119475 20705248 20213847 19060736 18842931 18649077 17353926 16473265 15790821
4010A5790821q8661n28423k13100j21013r9581n62337j17463Q0280l29898j012506
4000A2798119p13915Q34090R6570j71039l87978k26823K59258q7549L98644K20007
3990A3019384q91731m91244M80479R6852k5689j35037j56112k51899j55365o99881
3980A0789757M739j2658K3826o4402p39196k25042R238l52663L43543K82583M66848
3969A0526573j65694J82040N86088L84694M88250M45526j033918N57368P06564
3960A2677491J17362r81513p46706O19833K51416L24251o17932P00510p0703O37867
3950A2911876N64085M2535P5858l6114N14336M60973j61147N20358L12309j20632
3940A5084437K67543j55370K21641M89676k5790R36131R80929J09956l86566k19603
$$ plain form
4010 15790821 15702160 15173737 14960637 14839624 14740043 14177706 14060243 14140523 13810625 12798119
4000 12798119 12084204 12918294 13014864 12843825 12455847 12229024 12488282 12400733 12799377 13019384
3990 13019384 12127653 11636409 12116888 12213740 12188051 12053014 11896902 11645003 11489638 10789757
3980 10789757 10794496 10781838 10805664 10741262 10002066 9777024 9786262 9433599 9777142 10059725 10526573
3969 10526573 10360879 10542919 11129007 11513701 12001951 12447477 11413559 11970927 12677491
3960 12677491 12794853 11813340 11066634 11686467 11937883 12262134 11644202 12344712 12274009 12911876
3950 12911876 13475961 13518496 13594354 13558240 14072576 14533549 14372402 14892760 15205069 15084437
3940 15084437 15351980 15196610 15418251 15907927 15882137 16818268 17799197 17909153 17522587 17302984
3930A7302984M45194M80163Q89338J142554j28798k64951J323565O14780O02740
3921B2407569n1831Q69307n47754J82832R61195L26374N60687M87982J193357
3912B6389718L41478Q53706M41295J796446J277108J080868P44679J994498K119199
3903C7038995J903491J855617J261888K105710J751235J155276K054741K877153
3895E2004106K701331K371051K529219L903450M071473M872883N828972N817031
3887H4099516O543273P588465P343242Q364472R943527J2688419J5154221J7889626
3879A69614761K2435382K9688117L7440287M1545314M0583534L2609965K0441961
3872C94359321L022628j5387630k6894833l1683115l4617864l5932164l3035454
$$ plain form
3930 17302984 17748178 18228341 19117679 20260233 20131435 19866484 21190049 21804829 22407569
3921 22407569 22355738 23225045 22677291 22860123 23821318 24147692 24708379 25196361 26389718
3912 26389718 26731196 27584902 28026197 29822643 31099751 32180619 32925298 34919796 37038995
3903 37038995 38942486 40798103 42059991 44165701 45916936 47072212 49126953 52004106
3895 52004106 54705437 57076488 59605707 63509157 67580630 72453513 78282485 84099516
3887 84099516 90642789 98231254 105574496 113938968 123882495 136570914 151725135 169614761
3879 169614761 192050143 221738260 259178547 300723861 341307395 373917360 394359321
3872 394359321 397381949 381994319 355099486 323416371 288798507 252866343 219830889
3865B19830889k7976062k2792658j9061642j6060852j2989736j0898108j0001930
3858A00049901r073332p248110o365230n129701n077220l728675l417220l052637
3850E6957776l444218k677253k609127k326115k625506k035024j348538k298590
3842C7593405j199584k089468j559779q38436p22113l91178r54864n77017n85243
3833B8675723j052022q67673n09094j211191j431188j27580j37192k52839L2148
3824B3119092p29865j655751j087329j402050l995O01416j17738o09283r04893
3815A7209604L0735L70476p61703o71856m63576J05040M5951J67464M79607m96869
3805A6014873j61757K25218K75897K9636j432252o76213L32943O7074k21826q26497
$$ plain form
3865 219830889 191854827 169062169 150000527 133939675 120949939 110051831 100049901
3858 100049901 90976569 83728459 77363229 72233528 67156308 63427633 60010413 56957776
3850 56957776 53513558 50836305 48227178 45901063 43275557 41240533 39891995 37593405
3842 37593405 36393821 34304353 32744574 31906138 31184025 30792847 29837983 29260966 28675723
3833 28675723 27623701 26756028 26246934 25035743 23604555 23476975 23339783 23086944 23119092
3824 23119092 22389227 20733476 19646147 18244097 18240102 18841518 18723780 18114497 17209604
3815 17209604 17240339 17610815 16849112 16177256 15713680 15818720 15864671 16032135 16511742 16014873
3805 16014873 15853116 16078334 16354231 16383867 14951615 14275402 14608345 14675419 14453593 13627096
3795A3627096o90300r56356M10912p14857m11606q93436j73462j26601k42316
3786I829074L00551n82066M49077k41521k71432o99441m35451M24028o8446l29453
3776H374920k07103m45445n7580n1895j08596O4260L84148k14192q29057M5151
3766F954611j43461p37160P5527j38919j34341K44988n47010J28732l01541N40825
3756E942251L71353o83634l8501o00153Q12934m63387j81110L21996p07069p38967
3746D035713j66883O12776Q66751j69647M54207o35651l6547J17348J04603n20844
3736D661826l80254L09185K97873l81616j99937Q35178o07418L8417M06345P01644
3726E681243m82096m7538K15615l56942m45057p3183k57988P4867Q5500j8811
$$ plain form
3795 13627096 12936796 11980440 12391352 11676495 11264889 10371453 10197991 10071390 9829074
3786 9829074 10129625 9547559 9996636 9755115 9483683 8784242 8348791 8772819 8704373 8374920
3776 8374920 8167817 7722372 7664792 7612897 7504301 7568561 7952709 7738517 6909460 6954611
3766 6954611 6811150 6073990 6149517 6010598 5876257 6121245 5574235 5702967 5401426 5942251
3756 5942251 6313604 5629970 5591469 4991316 5804250 5340863 5159753 5481749 4774680 4035713
3746 4035713 3868830 4481606 5348357 5178710 5632917 4997266 4960719 5078067 5182670 4661826
3736 4661826 4281572 4590757 4888630 4507014 4307077 5142255 4534837 4573254 4979599 5681243
3726 5681243 5199147 5151609 5367224 5010282 4565225 4492042 4234054 4308921 4394421 4375610
3716D375610K94023K08283K62402n02488r268p31861j33424O3348j54386N52778
3706D225017k12167o910J10582M58731J76425n21056l67692K55586K11874Q57407
3696E187797q4510j66136m904K61477k17249j45017k78904m84069O9227k53324
3686C884388N2968J41972K27193o5076j94345r8990M50014K51427J09443k12065
3676D546929r6738l6228Q8614l72832M89327L16759q13820q8194P03674N56933
3666E294424l5528O74110K81525m56697k98768J82199Q50569K15178o56353l87699
3656E662960N7196M14068j48488K6272K60151L11673l34118K14371P94670j49917
3646G108838N14555r62249K89588M17496L48629K06863R9090L19084O41434Q57410
$$ plain form
3716 4375610 4669633 4877916 5140318 4637830 4628562 3896701 3763277 3826625 3672239 4225017
3706 4225017 4012850 4005940 4116522 4575253 4751678 4230622 3862930 4118516 4330390 5187797
3696 5187797 5103287 4937151 4932247 5193724 4976475 4831458 4552554 4068485 4137712 3884388
3686 3884388 3937356 4079328 4306521 4241445 4047100 3948110 4398124 4649551 4758994 4546929
3676 4546929 4450191 4413963 4502577 4129745 4619072 4935831 4122011 4033817 4737491 5294424
3666 5294424 5258896 5933006 6214531 5757834 5459066 5641265 6491834 6707012 6050659 5662960
3656 5662960 5720156 6134224 5985736 6012008 6272159 6583832 6249714 6464085 7258755 7108838
3646 7108838 7623393 6661144 6950732 7368228 7716857 7923720 8022810 8341894 8983328 9840738
3636I840738K95837Q9943o54714O2903O40502O60639N88201J107315R83976r5757
3626A3519583Q8676J104807N67405N61620J071637M86997O69932J024861K89363
3617A9384881K099911J254444J344777R93958J001532J264091Q55185K027800
3609C0226579J121039O76921O13342N6709N54153n59352l70783j054280j078802
3600C0185526q47438r43879k378625j587478r28668q26222j255505j202697m65025
3591A9749989m69272p88061j122133m55866j45557j276160J17487j7861p07009
3582A4885557p62981n74843j81878j045571p69205o12145n19836j00895r60855
3573I357348l74146Q01322J35562q40147p82181M6875p90404l53798Q75746j20277
$$ plain form
3636 9840738 10136575 10226518 9571804 9634707 10275209 10935848 11524049 12631364 13615340 13519583
3626 13519583 13608259 14713066 15280471 15842091 16913728 17400725 18070657 19095518 19384881
3617 19384881 21484792 22739236 24084013 25077971 26079503 27343594 28198779 30226579
3609 30226579 31347618 32024539 32637881 32694590 33248743 32689391 32318608 31264328 30185526
3600 30185526 29338088 28394209 26015584 24428106 23499438 22673216 21417711 20215014 19749989
3591 19749989 19280717 18492656 17370523 16914657 16769100 15492940 15610427 15592566 14885557
3582 14885557 14122576 13547733 13365855 12320284 11551079 10938934 10419098 10318203 9357348
3573 9357348 8983202 9784524 9920086 9079939 8297758 8344633 7554229 7200431 8076177 7955900
3563G955900r16846J79873l16830J92202j96467r6915o82123j14060M57600l20570
3553F141764L72213P21j267029M00490M58045p58373j053457Q6499N04254J69251
3543E054378j49617O18727k51244l77913m40553L45631j04556K31240q69395P0155
3533D126853M60684o29272J2802L19289R7503n23380l99404O51925L16403L50732
3523D784135J12099p19857o1440J82481L1068M29931n91189p67923l98942l26269
3513B674094O61418P50511M14448k11803k60838J3617k26925j73753k72840M57672
3503C825601K59184m01729J70963J95946p06926n0785L17910n74988J44705m24127
3493B755754N98971O40752n54436k30661m49522J53640q5843l35088j23437J87678
$$ plain form
3563 7955900 7039054 7218927 6902097 7094299 6897832 6800917 6118794 6004734 6462334 6141764
3553 6141764 6513977 6514698 5247669 5648159 6106204 5347831 4294374 4380873 4885127 5054378
3543 5054378 4904761 5523488 5272244 4894331 4453778 4799409 4694853 4926093 4056698 4126853
3533 4126853 4587537 3958265 3971067 4290356 4387859 3864479 3465075 4117000 4433403 4784135
3523 4784135 4896234 4176377 4114937 4297418 4328486 4758417 4167228 3399305 3000363 2674094
3513 2674094 3335512 4086023 4500471 4288668 4027830 4041447 3814522 3640769 3367929 3825601
3503 3825601 4084785 3683056 3854019 4049965 3343039 3292254 3610164 3035176 3179881 2755754
3493 2755754 3354725 3995477 3441041 3210380 2760858 2914498 2828655 2493567 2370130 2557808
3483B557808l33567n4602J061470L83327M4404l97356j35042k1688J45331n42
3473C249543j16686l87288L46782P586K32680j02555l27430j755L49305P448j01115
3462C156515N60589k24142N1037q4736k81352k76884M42888k17439j47572l1036
3452B947868m16927L76368o83940Q11389P72282j39546j70887J48803R575L44399
3442C999384k14750n16438K3209N86616J81124n1494p44276J43783o5488Q53696
3432D195366J89395L73118L79248q16958r13975R4308l6858M93330M03205L594
3422D363773l68325L52661L989m9467k97869J82441r7397L66045l65188l63332
3412C727331L78512m74598P12605l22216o61723L25661R60301q2133Q6528l31679
$$ plain form
3483 2557808 2224241 2169639 3231109 3614436 3658840 3261484 3126442 3104754 3250085 3249543
3473 3249543 3132857 2745569 3092351 3099937 3332617 3230062 2902632 2900877 3250182 3257630 3156515
3462 3156515 3717104 3492962 3543999 3459263 3177911 2901027 3343915 3126476 2978904 2947868
3452 2947868 2530941 2907309 2223369 3034758 3807040 3667494 3496607 3645410 3654985 3999384
3442 3999384 3784634 3268196 3291405 3878021 4059145 4007651 3263375 3407158 3341670 4195366
3432 4195366 4384761 4757879 5137127 4320169 3406194 3500502 3463644 3956974 4360179 4363773
3422 4363773 3995448 4348109 4352098 4302631 4004762 4187203 4089806 4455851 4090663 3727331
3412 3727331 4105843 3631245 4343850 4021634 3359911 3685572 4645873 4563740 4650268 4318589
3402D318589K44776R36542j93438J50542j84071p85963L59671O14165l01470k47712
3392D911631L65005k19087K73474N85361N45489q09487L97550L27048O6429m38318
3382F005095J4725l43835L90635N36965P8743J60090o5847j83240J83405j06385
3372F670351J02861O7325O2171m13496L33527j34105Q01915N33043L21905r169
3362H336328P02368k22655M35407M07173l99171O12075M33390J80471M89717m74921
3352A0500182J39298N64930O1025K44547K11477O4310k86097J283644o5908O37726
3342A3355134L42500L9097J031782J260913N2833J00084L2484L30240P08227J5558
3332A7268852N39179J215496J105016J086930Q60522M58043J395345J052589J66975
$$ plain form
3402 4318589 4563365 5499907 5306469 5457011 5272940 4486977 4846648 5460813 5159343 4911631
3392 4911631 5276636 5057549 5331023 5916384 6461873 5652386 6049936 6376984 6443413 6005095
3382 6005095 6019820 5675985 6066620 6603585 6682328 6842418 6776571 6593331 6776736 6670351
3372 6670351 6773212 6840537 6902708 6489212 6822739 6688634 7490549 8023592 8345497 8336328
3362 8336328 9038696 8816041 9251448 9658621 9259450 9871525 10304915 10485386 10975103 10500182
3352 10500182 10639480 11204410 11265435 11509982 11721459 11785769 11499672 12783316 12717408 13355134
3342 13355134 13697634 13736731 14768513 16029426 16082259 16182343 16214827 16545067 17253294 17268852
3332 17268852 17808031 19023527 20128543 21215473 22075995 22534038 23929383 24981972 25148947
3323B5148947M52448J235321K289308J970818J926255J384772J396020J099643
3315C6903532K399404L271010L270067L020533L026637M141264N307044O019302
3307F7358793Q596668J0324201J0696735J1202603Q579396M853287K12159m408457
3299A17415385o285833p352937q845202q599166o883858m935783l741818l125250
3291F7645538j429434j012603o62501l36188P03682J312252J520850K153446L536151
3282G3431193M168284L851786N484488N856416O981481P581589R834621J3410037
3274A30599895J8239020K1387595K0666871J7621716J2146611L275964o986613
3267B16951059j2772745j4933537j6603580j7492472j5516772j4122666j1858992
$$ plain form
3323 25148947 25601395 26836716 29126024 31096842 33023097 34407869 35803889 36903532
3315 36903532 39302936 42573946 45844013 48864546 51891183 56032447 61339491 67358793
3307 67358793 75955461 86279662 96976397 108179000 116758396 121611683 121823842 117415385
3299 117415385 111129552 103776615 94931413 86332247 79448389 74512606 70770788 67645538
3291 67645538 66216104 65203501 64541000 64204812 64908494 66220746 67741596 69895042 73431193
3282 73431193 77599477 81451263 86935751 92792167 99773648 107355237 117189858 130599895
3274 130599895 148838915 170226510 190893381 208515097 220661708 223937672 216951059
3267 216951059 204178314 189244777 172641197 155148725 139631953 125509287 113650295
3260A13650295q996090p596965p104948o260786m602991l876071l356378j440589
3252G0415477k130565l53554k91865K21739J352868P62761K608233K836241M562092
3243G9983427N403508O060834Q469301J0347435R719161O684034L947949j614409
3235A29001240n636025q046294j0063586j0101793r999161q766436p726376o270256
3227F2391313n322348m539533m272082l616659k520675j924835k314983j994916
3219C5885282j245427j278217j119479j621764r52936j312353j085660k52000
3211B7017446j478085j688434m15582q22012l82267p56256j343697J52662j76208
3202B0107567l49030M36572m53578j188677l04743k9472o48312k86143j43360
$$ plain form
3260 113650295 104654205 97057240 89952292 83691506 79088515 75212444 71856066 70415477
3252 70415477 68284912 67931358 67639493 67861232 69214100 69976861 72585094 75421335 79983427
3243 79983427 85386935 91447769 99917070 110264505 119983666 126667700 130615649 129001240
3235 129001240 123365215 115318921 105255335 95153542 85154381 76387945 68661569 62391313
3227 62391313 57068965 52529432 48257350 44640691 42120016 40195181 37880198 35885282
3219 35885282 34639855 33361638 32242159 30620395 29667459 28355106 27269446 27017446
3211 27017446 25539361 23850927 23435345 22613333 22231066 21474810 20131113 20283775 20107567
3202 20107567 19758537 20195109 19741531 18552854 18248111 18218639 17570327 17284184 17140824
3193A7140824k02663O2711j123503K2045K73828k9174q38612j408592n95213p8685
3183A3222966k50123p46422k94335n3413j291849J18522l71037K71546n28281
3174A0077574j001967n4763q1766K99474j42662o9972j198259J31089K74517R3936
3164H327201n59019p485k15142k58132m04283L92868l19319j252139q4787M11862
3154F031625N28234m04838j78895n57065p57249J9P77052L51561K07189l07270
3144E690363p25596l7095R2791m40871M50301J78257m79777j85906k8977l7369
3134D476121j15253K46906L70652j37429l66488o129q02772k31614j60700M94546
3124C767840M06160l31385M32348m90928p46552J27970J54879n44261M58954r76325
$$ plain form
3193 17140824 16938161 17000872 15877369 15899414 16173242 16144068 15305456 13896864 13301651 13222966
3183 13222966 12972843 12226421 11932086 11878673 10586824 10705346 10334309 10605855 10077574
3174 10077574 9075607 9020844 8939078 9238552 9095890 9025918 7827659 7958748 8233265 8327201
3164 8327201 7768182 7760697 7545555 7287423 6883140 7276008 6956689 5704550 5619763 6031625
3154 6031625 6559859 6155021 5976126 5419061 4661812 4661831 5438883 5790444 5997633 5690363
3144 5690363 4964767 4927672 5020463 4579592 5029893 5208150 4728373 4542467 4513490 4476121
3134 4476121 4360868 4607774 4978426 4840997 4474509 4468380 3665608 3433994 3273294 3767840
3124 3767840 4174000 3842615 4274963 3784035 3037483 3165453 3320332 2776071 3235025 2258700
3114B258700L01021J188380L45229j32756o93453R25253k3889l3482j56032m39504
3104C539467m90681p54672L10786J48756k74481l41788L57208l25290p21358K76333
3094A724280j67927K13781P70845N44717n03913q21333o9503j69430M70647k66189
3084A725975n52286M39833K21146R5540K29937r3903L05000L35962l39246m24158
3074A943800O33000l24596l86745M99K30843L5666q58471Q70683M69673l71902
3064B242450n42899q3690r2087L77816l22918L39672J41544L0015L10674k68451
3054B132126l21945R36718K6691p59422J07028n16820r88442J06885N60118J74168
3044A457105M60462l73315m85902O64597k42216m83097M60104p4539K9419m85187
$$ plain form
3114 2258700 2559721 3748101 4093330 3960574 3267121 4192374 4168485 4135003 3978971 3539467
3104 3539467 3048786 2294114 2604900 2753656 2479175 2137387 2494595 2169305 1447947 1724280
3094 1724280 1556353 1770134 2540979 3085696 2581783 1760450 1690947 1521517 1992164 1725975
3084 1725975 1173689 1613522 1834668 1930208 2160145 2066242 2371242 2707204 2367958 1943800
3074 1943800 2576800 2252204 1865459 1865958 2096801 2132467 1273996 2144679 2614352 2242450
3064 2242450 1699551 1615861 1523774 1901590 1578672 1918344 2059888 2089903 2400577 2132126
3054 2132126 1810181 2746899 2773590 2014168 2121196 1604376 615934 722819 1282937 1457105
3044 1457105 1917567 1544252 1058350 1722947 1480731 997634 1457738 1383199 1412618 927431
3034I27431J75304k32979M97452m51836o4172K14225m6781K48869n89064J83224
3024H61673L16303J098753k74231n76990q46412n36070P52759Q84317q9774p60566
3014H29762l4411N51162N19186o10899n54844p8041J53975K45550k04384M67673
3004A284729k47423J60772l3192J02196J90690j11363l25365L535L42187k83480
2994A083286J3918j10508J28423J37209L63280m6053j050L25935L79677n54635
2984A719482J79698L06623o18097J3837M88569K11937l7098l00662l96756P2795
2974A640328L1797o7405J72944k42155J43502J64578o02980l41037N97736l57609
2964A139699l93223J07778o59909k13847N25071J31783L01066L01654l14147N4967
$$ plain form
3034 927431 1102735 869756 1367208 915372 851200 1065425 1018644 1267513 678449 861673
3024 861673 1177976 2276729 2002498 1425508 579096 43026 795785 1680102 1590328 829762
3014 829762 795351 1346513 1865699 1254800 699956 621915 775890 1021440 817056 1284729
3004 1284729 1037306 1198078 1164886 1267082 1457772 1346409 1021044 1024579 1366766 1083286
2994 1083286 1097204 986696 1115119 1252328 1615608 1569555 1568505 1894440 2274117 1719482
2984 1719482 1899180 2205803 1587706 1601543 2090112 2302049 2264951 1964289 1567533 1640328
2974 1640328 1672125 1604720 1777664 1535509 1679011 1843589 1240609 899572 1497308 1139699
2964 1139699 746476 854254 194345 -19502 505569 637352 938418 1240072 925925 980892
2954I80892m82213m3165P81567M31359l14559r6703P20068l18428q13107q6385
2944G59326O13902k0935r68381l65551M91726L17973m34799K37628l10878n77460
2934b57449L05182M11044L22306l25918j17867L65392k51334N27304Q5119k54157
2924H09622k47230J01342m40916o8662N80226K59018k15343R7884M24277o15955
2914F84263k52594m04349j66751k92988K34292L37292J45952j22103m60861K2434
2904b75413J57482L79612K54500K73186n36196l53951J168662p64632r8714M89322
2894F93858L38535J21552K68568j008011n6616L4624j44934L07353O2503k04734
2884D12698O61k95165K91827j2322l17510N4883o75981Q0482J068678J30507q00778
$$ plain form
2954 980892 498679 455514 1237081 1668440 1353881 1257178 1977246 1658818 845711 759326
2944 759326 1373228 1352293 383912 18361 510087 828060 393261 630889 320011 -257449
2934 -257449 47733 458777 781083 455165 337298 702690 451356 978660 1063779 809622
2924 809622 562392 663734 222818 154156 734382 993400 778057 875941 1300218 684263
2914 684263 431669 27320 -139431 -432419 -198127 139165 285117 163014 -297847 -275413
2904 -275413 -117931 261681 516181 789367 253171 -100780 1067882 303250 204536 693858
2894 693858 1032393 1153945 1422513 414502 357886 392510 247576 554929 617432 412698
2884 412698 413359 118194 410021 397699 80189 135072 -540909 -460427 608251 738758 -62020
2873f2020q2593j27755J07506J50097O44915m03820J73223o1883p9060J3908K60203
2862E32721k89153k71888j28919N71012K24539j07677j97905r1445n99282q4562
2852d42559o5509l13525L31135J040512L58911j050065M98355l64510o28501J49908
2842d85848M57641k43023j2593N89075J95235k10770n81553P78363J39657j97323
2832D28861m26144P19412J81572l33886o74623q60264M42002L79169L30225k64557
2822g8233n1987N78634J10692m77977j15321N5529m04515r1631J09428K26106
2812a39275j83895K14999R13821k38089l94807O3599L0843K7733j78350k75631
2802a59052O9086O9417l1324j68120P2809O0820N57925L85387m31137J06503K46505
$$ plain form
2873 -62020 -144613 -272368 -164862 -14765 630150 226330 399553 337670 258610 272518 532721
2862 532721 243568 -28320 -157239 413773 638312 530635 332730 241285 -357997 -442559
2852 -442559 -508068 -821593 -490458 550054 908965 -141100 357255 -7255 -635756 -485848
2842 -485848 -28207 -271230 -283823 305252 500487 289717 -291836 486527 626184 428861
2832 428861 2717 722129 903701 569815 -104808 -965072 -523070 -143901 186324 -78233
2822 -78233 -130220 448414 559106 81129 -34192 21337 -383178 -474809 -365381 -139275
2812 -139275 -323170 -108171 805650 567561 172754 236353 267196 294929 116579 -159052
2802 -159052 -89966 -20549 -51873 -219993 -147184 -86364 471561 856948 425811 532314 778819
2791G78819q88661k12807J37379m2624L59355j2081o53916K57246M23193l11171
2781a65268n16626K33274l2527m61955n6321O69956J61238k15065L8970M15812
2771G1488r3732J8110M5641o83964l38143J00047J132830M87613p77176p2666
2761a09952n22889l59936M31994N53356M66708j02665o51946J649K07826J05266
2751A9411k48774k54532M40930J55292j78056L25053J83837k78676k10781k80098
2741c26394k08979p4765P87227k43092j8770k98136J476452l67453p73667M5112
2731b465j28082J27884l10612l90466j46804N32277N54727n52306k66319P62468
2721A80302Q36749n14378p36013P4603m72130L23803k64895n5481M62458L04389
$$ plain form
2791 778819 -109842 -322649 -185270 -227894 131461 119380 -534536 -277290 145903 -165268
2781 -165268 -681894 -448620 -481147 -943102 -999423 -329467 -168229 -383294 -344324 71488
2771 71488 -22244 -4134 41507 -642457 -980600 -880553 252277 739890 -37286 -109952
2761 -109952 -632841 -992777 -560783 -7427 459281 356616 -295330 -293681 -85855 19411
2751 19411 -229363 -483895 -42965 112327 -65729 259324 443161 164485 -46296 -326394
2741 -326394 -535373 -610138 177089 -66003 -84773 -382909 1093543 726090 -47577 -2465
2731 -2465 -130547 -2663 -313275 -703741 -850545 -318268 236459 -315847 -582166 180302
2721 180302 1017051 502673 -233340 -158737 -630867 -307064 -571959 -627440 -164982 139407
2711A39407k69772j95734O84725p2277j2047M63927r91810r61435N74428J23100
2701e17488l51894k47623M24383P46520m25615M40495M64557M3602j54637K16691
2691F38991M21317j61323q06330m04974J20418j42293n35639n3945Q42229l13454
2681c95003o83299M7729L02966M93130J77650l72615m7452R89251j89194o05742
2671b82579P3779O32537m30497L51435k59499j75505j19390J05184l44971k80321
2661g29827R4081p3240p2069M88580M24393o12190N62648J04174q9070M5938k66951
2650a23533Q64856L44977r32843r24424l06904M09644j36011L34938l13193M68969
2640c13524N09372j4098l61194m14868Q094K31919J8435q2413l40207q9974M2453
$$ plain form
2711 139407 -130365 -326099 358626 286349 274302 738229 -253581 -1215016 -640588 -517488
2701 -517488 -869382 -1117005 -692622 53898 -371717 68778 533335 576937 422300 638991
2691 638991 1060308 898985 92655 -312319 -191901 -334194 -869833 -923778 -81549 -395003
2681 -395003 -1078302 -1030573 -727607 -234477 -56827 -429442 -476894 512357 323163 -282579
2671 -282579 -208800 423737 -6760 344675 85176 -90329 -209719 -104535 -449506 -729827
2661 -729827 -635746 -708986 -781055 -292475 131918 -480272 82376 186550 97480 143418 -123533
2650 -123533 741323 1086300 153457 -770967 -1077871 -668227 -804238 -469300 -782493 -313524
2640 -313524 195848 181750 -179444 -594312 -586218 -354299 -335864 -418277 -758484 -848458 -806005
2629h06005N51166L78212j88832l44159m57371L87058K93916J04189K64596J59409
2619C42179j10097q99312j20725J074580m32757l62826k68746j74883L24981J028867
2609D01261j82410l2868K46035m91774L41905L16304l19208K86599j119340k6052
2599e79548P72958j96766K34400j8922L29532l54011p45626J76775m17913N49932
2589b49189P22297p83855J18175J87875n63914l32009O28451K2775L80394K10793
2579C41793P65149k75023j338967k96955J48372M1261R6523n35093R95446J98908
2569A41414M3247j047692K07889K75314m8419J3243J173192j71587n47483Q3524
2559A22642m57307J78832k75713M14797l19318l04124O895N41609L84494j9461
$$ plain form
2629 -806005 -254839 123373 -65459 -409618 -866989 -479931 -186015 -81826 182770 342179
2619 342179 232082 -667230 -787955 286625 -146132 -508958 -777704 -952587 -627606 401261
2609 401261 218851 185983 432018 -59756 282149 598453 279245 565844 -553496 -579548
2599 -579548 193410 -3356 231044 212122 541654 187643 -557983 -381208 -799121 -249189
2589 -249189 473108 -310747 -192572 -4697 -568611 -900620 -272169 -249394 131000 341793
2579 341793 1106942 831919 -507048 -804003 -655631 -614370 -517847 -1052940 -57494 141414
2569 141414 184661 -863031 -655142 -379828 -428247 -415004 758188 586601 39118 122642
2559 122642 -334665 -155833 -431546 -16749 -336067 -640191 -633296 -91687 292807 273346
2549B73346j92103j62344Q58874l0097n0578k55005k44139o80662k21559J00675
2539f03592R3646m0980j43656O11108M80454o5047n91608p7152J23248J97015
2529a6564k13452j12345K06740R3873q74811K49976J98942K81374j99299O10086
2519B24520l7781r62614N48704P75490L36976o62856l10675O22256N99639k10614
2509I23045q45902O76855q18073j72454J49961j93592L90932p0997o67492Q5830
2499e41887J84500m70435j3504O02247m5379P80047m61164o50138N18321M25841
2489C28449k97178k63872k2467j80044j87487L68364r4918J81071l98178l29887
2479h96147K2688J158715l76975l18671K35069k78277M21059J34951M29253p71464
$$ plain form
2549 273346 81243 -81101 777773 747676 697098 442093 197954 -482708 -704267 -603592
2539 -603592 -509946 -550926 -694582 -83474 396980 331933 -259675 -336827 -213579 -16564
2529 -16564 -230016 -342361 -135621 -41748 -916559 -666583 -467641 -186267 -385566 224520
2519 224520 186739 -775875 -227171 548319 885295 222439 -88236 534020 1133659 923045
2509 923045 77143 753998 -64075 -236529 -86568 -280160 110772 39775 -627717 -541887
2499 -541887 -357387 -827822 -841326 -239079 -284458 495589 34425 -615713 -97392 328449
2489 328449 31271 -232601 -255068 -435112 -622599 -254235 -349153 -168082 -566260 -896147
2479 -896147 -873459 285256 -91719 -410390 -175321 -453598 -32539 102412 531665 -239799
2469b39799J3437L96967m71916J0776K45157J58013K42506Q2196q60448m32599
2459h55710M70810k28245M49746m7249L04778m81574J96648L23069N1820L31378
2449E15471q1559l02788o29996R3732J39831l43896O0271O99821L86774l09310
2439B28351l30471q7047n34368M444N19975n06978K58045l62765k46184M92327
2429e64671O23118j57320j2820K54740L74941L10900n8806m49853q52323j74115
2419g06209M16941P32391M97015l85889l76926j07620O0979n12433j37325n10459
2409a029535j0689L40713L05487m32636n4360P55658L66570M05627l72358l30941
2399e6464j35327L12819O33639l4399k55771J88420n17750l34212O71801l68271
$$ plain form
2469 -239799 -226362 170605 -301311 -290535 -45378 112635 355141 437337 -423111 -855710
2459 -855710 -384900 -613145 -163399 -210648 94130 -387444 -190796 132273 184093 515471
2449 515471 433912 131124 -498872 -405140 -265309 -609205 -548934 150887 537661 228351
2439 228351 -102120 -189167 -723535 -719091 -199116 -706094 -448049 -810814 -1056998 -564671
2429 -564671 58447 -98873 -111693 143047 517988 828888 770082 320229 -532094 -706209
2419 -706209 -289268 443123 940138 554249 177323 69703 130682 -381751 -519076 -1029535
2409 -1029535 -1040224 -699511 -394024 -826660 -881020 -125362 241208 646835 274477 -56464
2399 -56464 -191791 121028 754667 720268 464497 652917 135167 -199045 472756 104485
2389A04485k5106n63324K37151L39847k43866L98167M3398M18136q72519j75819
2379c39450J074142J96887L43151l23447l87293N10613r5643l16083L1263j76993
2369E17147l07014j07194M17245K9095J94561m91858l39639J44253L6550O7586
2359A60732L01355r0309k57350M91820J13996k20650n23562M87320J07403l00673
2349B70082L49635K55170j10546o00883j77835J78072o13508J42308R41742m21611
2339B12626p81671Q26431k192l06116J01806k46713K01285M26489k85266r04940
2329g58261K42722R06398l82755p003k73868N89741K64191j54389m36184j14701
2319a24109L73743K16486L25048j71507n77077L99526N1341m25617j55847j57413
$$ plain form
2389 104485 79379 -483945 -246794 93053 -150813 247354 290752 708888 -163631 -339450
2379 -339450 734692 931579 1274730 951283 563990 1074603 978960 662877 694140 517147
2369 517147 210133 102939 520184 549279 743840 251982 -87657 56596 93146 160732
2359 160732 462087 371778 114428 606248 720244 499594 -23968 463352 570755 270082
2349 270082 619717 874887 764341 163458 -14377 163695 -449813 -307505 634237 212626
2339 212626 -569045 257386 255194 -50922 50884 -195829 5456 431945 146679 -758261
2329 -758261 -515539 390859 8104 1101 -272767 316974 581165 426776 -9408 -124109
2319 -124109 249634 466120 791168 619661 42584 442110 493451 67834 -88013 -245426
2309b45426L34531l11143K91001Q14616l11995k62276o8926L67759l92613J11372
2299C26900M14050J67061j291958K86779L54637o00460L76741N21696l6703m54531
2289F4212J53778j78722Q5294J06174l38295j39243K51804O31200L64384n25787
2279D74799J59295k3045K22704l71008J63588k02422k07897K13955m1038r8208
2269B90723L17851k35914j79835k13539K63720l94812Q15616M36116l92075L55341
2259A063192j82609R4000k01136l04122N6151J66465N82342n79435j25524m56510
2249A12814K86323K48245K27534L34975l06818q644m06310K37599O45915N0644
2239A422277M9425L64296k98746p9638j03282Q80886l43009m04087J95861m89245
$$ plain form
2309 -245426 89105 -222038 68963 883579 571584 309308 240382 608141 215528 326900
2299 326900 740950 908011 -383947 -97168 257469 -342991 33750 555446 518743 64212
2289 64212 217990 39268 124562 230736 -107559 -246802 5002 636202 1000586 474799
2279 474799 634094 611049 833753 462745 626333 423911 216014 429969 388931 290723
2269 290723 608574 372660 192825 -20714 243006 -151806 663810 1099926 707851 1063192
2259 1063192 880583 974583 773447 469325 525476 691941 1274283 694848 569324 112814
2249 112814 399137 647382 874916 1209891 903073 894429 488119 725718 1371633 1422277
2239 1422277 1471702 1835998 1537252 1457614 1354332 2235218 1892209 1488122 1683983 1194738
2229A194738M92044M05020p85046O07424J59373q9023r34680L13521O63341p0012
2219A956700K67582M3127j3173l57322Q3617l37224k96396J43840k06132R19191
2209B203810P09412q04656j29710l33688N5266J80922J233215j50688q72317N95262
2199B686828k82100m42435o6554R29882J60903m73863J07533p764J76786M54046
2189C243262J59110q16l6296L76203j12496K49607K1098M92206j97752P344p71745
2178C429725m43417L14692O09845L76909L32606M25421l3766O68474m66501j94625
2168E019363M49125N61903Q34269j54587m52679m75790o5332O81740l23304P93293
2158F868001P4532n9945O90648R60223L91888j63415Q8880N10534m19540M5889
$$ plain form
2229 1194738 1686782 2091802 1306756 1914180 2073553 1984530 1049850 1363371 2026712 1956700
2219 1956700 2224282 2267409 2254236 1896914 1980531 1643307 1346911 1490751 1284619 2203810
2209 2203810 2913222 2108566 1978856 1645168 1700434 1881356 3114571 2963883 2091566 2686828
2199 2686828 2404728 1962293 1895739 2825621 2986524 2512661 2620194 2612430 2789216 3243262
2189 3243262 3402372 3401556 3365260 3741463 3628967 3878574 3899672 4391878 4194126 4201470 3429725
2178 3429725 2986308 3301000 3910845 4287754 4620360 5045781 5012015 5680489 5213988 5019363
2168 5019363 5468488 6030391 6864660 6710073 6257394 5781604 5716272 6398012 6074708 6868001
2158 6868001 6942533 6882588 7573236 8533459 8925347 8761932 8850812 9361346 8941806 8987695
2148H987695J77974L93054O32930M44893M8762O96411Q81963J120678N63945M22802
2138A4371107O38311O5990L56583J729739Q56183R02505J310155J191177J647649
2129B3069399P85237J747393J761498K781838L234520K063002J767012K552753
2121C9762652J862097L474189L916336M456298M820013O501754R861147J1949583
2113H6604069J5955648J8972645J8954471J5056757J0792703K221789p076714
2106A61481368j3724444j4262359j6355933j6119925j4192249j2476050r175793
2099F5174615p142526n395862m826191m362628k407372l335055k990099j813949
2091C2900933k758467j812860j666084j273946j993510j288692j451192n68974
$$ plain form
2148 8987695 9165669 9558723 10191653 10636546 10685308 11381719 12263682 13384360 13948305 14371107
2138 14371107 15009418 15075408 15431991 17161730 18017913 18920418 20230573 21421750 23069399
2129 23069399 23854636 25602029 27363527 30145365 33379885 35442887 37209899 39762652
2121 39762652 41624749 45098938 49015274 53471572 58291585 64793339 74654486 86604069
2113 86604069 102559717 121532362 140486833 155543590 166336293 168558082 161481368
2106 161481368 147756924 133494565 117138632 101018707 86826458 74350408 65174615
2099 65174615 58032089 52636227 47810036 43447408 41040036 37704981 34714882 32900933
2091 32900933 30142466 28329606 26663522 25389576 23396066 22107374 20656182 20087208
2083B0087208k29275j905799p88921j305932q25787n75438q36899m05797j242660
2074A1970700k81770p40551r6088K98233M029j88782n72907m00378o60475j129238
2064H202773O93735j80967l11335m81344m33115L39378N82287j289956p11011
2055F410445n03120J093961m90086o98837P5712P1228J87063j159263K32621M68466
2045E688190L39057n23801m49438J58306n75619k69416r1397j85727j96871O7934
2035C961218L8936k03179N10554M76612j60198p98924o03394O92464k66693n06754
2025C140642J44280N6325Q5386j89481j39296L33557N03706j023171j9799m18055
2015B474094R1896J004504r53208n39627L05697P46746n8707j078678j39053K9659
$$ plain form
2083 20087208 19857933 17952134 17163213 15857281 15031494 14456056 13619157 13213360 11970700
2074 11970700 11688930 10948379 10852291 11150524 11154553 10965771 10392864 9992486 9332011 8202773
2064 8202773 8896508 8715541 8404206 7922862 7489747 7829125 8411412 7121456 6410445
2055 6410445 5907325 7001286 6511200 5812363 5888075 5959303 6146366 4987103 5219724 5688190
2045 5688190 6027247 5503446 5054008 5212314 4636695 4367279 4275882 4090155 3893284 3961218
2035 3961218 4000154 3796975 4307529 4784141 4623943 3825019 3221625 3914089 3647396 3140642
2025 3140642 3284922 3341247 3426633 3237152 3097856 3431413 3935119 2911948 2892149 2474094
2015 2474094 2565990 3570494 2617286 2077659 2383356 3130102 3071395 1992717 1853664 1883323
2005A883323N01721L80833m33513j39328L76239J7707J00049o13246k85867j38836
1995A649082r22898N98848M72944q21153L17033J26735N86771O0860m42865o11377
1985A013980K65146k03047n51796l33964Q10233K05827o00574j21854R08720M88555
1975A881226J65651r42278m27669P61078k13445j36190j4927o83091N40961o00260
1965C31056l06231N48837J36238M9816j423042j1591J052555N2507N75604K3113
1955A028862l17496N98800l68168L68063m94311o64086j62422O37259N33588k8200
1945A131889m0200j05503j62944M90194n39034K05445k09196n7537n4541j90184
1935D68389j7438N45657o251m19262k9288N38594J64251n57709N4889K82522l1650
$$ plain form
2005 1883323 2385044 2765877 2332364 2193036 2569275 2586982 2687031 2073785 1787918 1649082
1995 1649082 726184 1325032 1797976 976823 1293856 1420591 2007362 2068222 1625357 1013980
1985 1013980 1279126 1076079 524283 190319 1000552 1206379 605805 483951 1392671 1881226
1975 1881226 2046877 1104599 676930 1438008 1224563 1088373 1073446 390355 931316 331056
1965 331056 24825 573662 709900 759716 -663326 -674917 377638 430145 1005749 1028862
1955 1028862 711366 1310166 941998 1310061 815750 151664 -10758 626501 1160089 1131889
1945 1131889 1091689 986186 823242 1313436 774402 979847 770651 713114 658573 468389
1935 468389 450951 996608 990357 571095 541807 1080401 1244652 686943 741832 1024354 992704
1924I92704o33485m61259q5591M33062K81498O8180q09291J34059P33080j2061
1914F40896N52295j04763m35808k50362k14357r4827K63885m34963O15703j72774
1904C64925k80688L09866m92661M14458J18384J121326n30611o66633l54758L55411
1894C59019J57575J86386K57435o67517p83650J90814L57189q6546j02870M92497
1884C60332L86314p19569M57559N6639J24499J42401m17189O57101n65534m5311
1874D37242n442k63838K7976m01942N74847K1272k50892m76212L51756J05006
1864A19773l14727M23801M0649l17695j82578N42076L04782r6775o41940k63295
1854c85929L18781P60082k29432L2514r6503m58483O2892N46762q26346N41101
$$ plain form
1924 992704 359219 -102040 -187631 245431 526929 595109 -214182 -80123 652957 640896
1914 640896 1193191 1088428 652620 402258 187901 93074 356959 -78004 537699 364925
1904 364925 84237 394103 -98558 315900 434284 1555610 1024999 358366 3608 359019
1894 359019 516594 702980 960415 292898 -490752 -299938 57251 -29295 -132165 360332
1884 360332 746646 27077 484636 541275 665774 808175 390986 1048087 482553 437242
1874 437242 431800 167962 195938 -206004 368843 390115 139223 -336989 14767 119773
1864 119773 -194954 228847 269496 -48199 -230777 311299 616081 519306 -122634 -385929
1854 -385929 -67148 692934 463502 496016 399513 -58970 3922 550684 -275662 265439
1844B65439l80473l66467R35470l76798K14599R228J17161j8343O50051J9160
1834A069027o9854j132549L28125P38866r9706n85417p16733m1896P98977O53140
1824I41980l80499l08033K77690J78688n55888O3957P34536p10494l71211J39729
1814A0455q35724M29402N16084M79615j98128l64035q80972J95975Q33617K76368
1804D62657m2078j573779O85231p4565l93059K97356P49919M25258o11681J65574
1794I0833M83287o57713m2686K05675k5471L30508o68708n2252N22104k67220
1784h1643L19848j59349n94558j50076L54150J52950k22645N8229J32568k43551
1774d34077N9859m9862O49329M67637k88254q19332m29867P89402N54270M7949
$$ plain form
1844 265439 -115034 -481501 453969 77171 291770 300998 418159 399816 1049867 1069027
1834 1069027 999173 -133376 194749 933615 833909 248492 -468241 -510137 288840 941980
1824 941980 561481 253448 531138 709826 153938 217895 952431 241937 -129274 10455
1814 10455 -825269 -395867 120217 599832 401704 37669 -843303 -647328 186289 462657
1804 462657 420579 -1153200 -467969 -542534 -935593 -638237 111682 536940 -74741 90833
1794 90833 574120 -83593 -126279 79396 53925 384433 -284275 -336527 185577 -81643
1784 -81643 238205 78856 -515702 -665778 -311628 -158678 -381323 -323094 -190526 -434077
1774 -434077 -374218 -424080 225249 692886 404632 -414700 -844567 -55165 499105 547054
1764E47054j93304L8750J16918k91567P5676k06161m88201J23751J87265n80713
1754f70532K0576k89862N03229J93632J69184N38199l25708k58645m64571N15282
1744f9216J09588j73116r4345M57599L77954j25718m01743J85730o17207o7121
1734d17595K77918Q4219l05485j89087K58435R09290l09237o92001M80262L47754
1724D44473r57213K61794Q38613l66648M98019l80911r91402O17573R17m8453
1714h3238n3424K52291J25208n68283N114L25877j79309j00014j27011Q4753l2489
1703c50525n13677P30176K65395j72746K17629l997o60393l58044p7478J10911
1693h12749R24594o98717m4702O3598L25446j63871K89924K01092m70098j19683
$$ plain form
1764 547054 353750 392500 509418 217851 293527 87366 -400835 -277084 -89819 -670532
1754 -670532 -649956 -939818 -436589 -242957 -73773 464426 138718 -119927 -584498 -69216
1744 -69216 40372 -132744 -227089 230510 608464 482746 81003 266733 -350474 -417595
1734 -417595 -139677 -55458 -360943 -550030 -291595 617695 308458 -383543 96719 444473
1724 444473 -512740 -250946 587667 221019 719038 338127 -653275 -35702 -34785 -83238
1714 -83238 -136662 115629 240837 -327446 -322332 3545 -175764 -275778 -402789 -318036 -350525
1703 -350525 -864202 -134026 131369 -41377 176252 172255 -488138 -846182 -923660 -812749
1693 -812749 111845 -586872 -631574 -567976 -242530 -406401 -116477 84615 -385483 -505166
1683e05166j44124K70739n17434O53246k30258o69348K55123K50598M28826J025045
1673H17247J86420j036005N40371p13736j101518q37089O78221Q93199M48094
1664a24796M78615l38639L29820K5169j42880m93387j73999j33886K92228K07128
1654g4627J97323l91487l79468J60617N23251M84587k13904j033336k33133O30396
1644c29781J45519l83413m01738P38725K79209j88039k11407j29135M3324K95115
1634a41621L75444Q57740n95140o53807N32489n4445L68156j70408J4903m21676
1624A11635l72000j80850O0709N28862L68766q46424q3294L32562K54008j48704
1614B5270R2971K05307j75980m01936k82981n5069M15058j39003k96888O00409
$$ plain form
1683 -505166 -649290 -378551 -895985 -242739 -472997 -1142345 -887222 -636624 -207798 817247
1673 817247 1003667 -32338 508033 -205703 -1307221 -2144310 -1466089 -572890 -124796
1664 -124796 353819 15180 345000 370169 227289 -266098 -440097 -573983 -281755 -74627
1654 -74627 122696 -268791 -648259 -487642 35609 520196 306292 -727044 -960177 -329781
1644 -329781 -184262 -567675 -969413 -230688 48521 -139518 -350925 -480060 -436736 -141621
1634 -141621 233823 1091563 496423 -157384 375105 320660 688816 518408 533311 111635
1624 111635 -260365 -441215 -380506 148356 517122 -329302 -412596 -80034 173974 25270
1614 25270 118241 323548 147568 -254368 -537349 -592418 -177360 -316363 -613251 -12842
1604a2842M19992q04398n55662N9809O04509K89329K49928N90044l95628o46644
1594b01563P1148j58463j64607Q76391K89444j127552k42248L34908L51523k59799
1584b30818J26684K38157M73648n48046m67731J1839K55003k40241j37828j59763
1574f79096K17399Q03445j98270N35953m84599k88370P29511k09701m81734j64184
1564b19646N51886L02040n92640k6956O42182k86076o10008P6759J51431R3870
1554H2842k88018j63151N01854k20543O4918J65536l49432K71194n96613N2342
1544d79071L77265n67723M93256L14015m22160j29327J10952Q14318j172899K44912
1534d16462J66397j35112L43966M76384j113790r7528Q3691O04859J85202m66315
$$ plain form
1604 -12842 407150 -397248 -952910 -893101 -288592 737 250665 840709 445081 -201563
1594 -201563 -130415 -288878 -453485 422906 712350 -415202 -657450 -322542 28981 -230818
1584 -230818 -104134 134023 607671 59625 -408106 -396267 -141264 -381505 -519333 -679096
1574 -679096 -461697 341748 143478 679431 194832 -93538 635973 426272 -55462 -219646
1564 -219646 332240 634280 41640 14684 656866 370790 -239218 -162459 -11028 82842
1554 82842 -205176 -368327 133527 -87016 -22098 143438 -205994 65200 -531413 -479071
1544 -479071 -101806 -669529 -176273 137742 -284418 -413745 -302793 511525 -661374 -416462
1534 -416462 -250065 -385177 -41211 435173 -678617 -776145 -692454 -87595 97607 -368708
1524c68708j84860K83451R8261L25790N4943n11489m77119J08718L27338j6330
1514c60005o3188m80865K17109L56725J49108P3579L97697l12380n70446m75760
1504a068426P56838O59884k55034L2970k16214K76177l64533L06603L76050K0837
1494E25152J40405J60075q29309P1701J03081k41640l50411L82465o442k53242
1484b98165R6214l09668N94256m98656J72914n5466P12168M7445r3419n98833
1474b31210k70911R5157O64765m4292O61277j64806k91140n15174n88904K27996
1464d57242O64259J10211n23318n07583O7623N00509Q09166k48606j45937k33484
1454C5598j8862M332l30178m477n65695j27594M45019N38268m7417N4412L843
$$ plain form
1524 -368708 -553568 -270117 -171856 153934 208877 -302612 -779731 -671013 -343675 -360005
1514 -360005 -423193 -904058 -686949 -330224 -181116 -107537 290160 -22220 -592666 -1068426
1504 -1068426 -311588 348296 93262 126232 -89982 186195 -178338 128265 504315 525152
1494 525152 665557 825632 -3677 68024 171105 -70535 -420946 -38481 -44923 -298165
1484 -298165 -201951 -511619 82637 -416019 -243105 -298571 413597 461042 367623 -231210
1474 -231210 -502121 -406964 257801 213509 874786 709980 418840 -96334 -685238 -457242
1464 -457242 207017 317228 -206090 -713673 -646050 -145541 663625 415019 269082 35598
1454 35598 16736 21068 -309110 -313587 -879282 -1006876 -561857 -23589 -71006 -16594 -12751
1443a2751K63835n93539k48719p27875j80313R55739Q3272o42982N20526L2357
1433e50450l99166N74239m17205m80927K20546J9852P51021K96281K2639k03900
1423a67070K50694n88609l21247P88457n67918L804N49844p2174k62178j05922
1413d92319k58844n85117M86977M65852N3621q58728K40833P3637J07787O82811
1403h3490J67869r6922j44416N94389O37125k57190J78415k3836p26365j20885
1393A24694n97956N22493J44330r43923K38749N97337n0910k50058n96404J29462
1383f82186r5592N74111Q95051k18948r21061q8293K97021l44174m33207j64070
1373a181348O86042L8896M65368P08166n43780o27326L7485m57529j33042L30234
$$ plain form
1443 -12751 251084 -342455 -591174 -1319049 -1499362 -543623 -460351 -1103333 -582807 -550450
1433 -550450 -949616 -375377 -792582 -1273509 -1052963 -1033111 -282090 14191 36830 -167070
1423 -167070 83624 -504985 -826232 -37775 -605693 -601889 -52045 -124219 -386397 -492319
1413 -492319 -751163 -1336280 -849303 -383451 -329830 -1188558 -947725 -874088 -766301 -83490
1403 -83490 84379 -12543 -156959 437430 1074555 817365 995780 971944 245579 124694
1393 124694 -473262 49231 193561 -750362 -511613 85724 34814 -215244 -811648 -682186
1383 -682186 -777778 -203667 691384 472436 -448625 -536918 -239897 -584071 -1017278 -1181348
1373 -1181348 -495306 -456410 8958 717124 173344 -453982 -416497 -874026 -1007068 -676834
1363f76834O25554q9948M040l84041J1177J86584p33796K99067M50819J39720
1353a67658P2M12365r64145n3722N81766K33268K81513j95960j71594M63617j03796
1342C15726n25498k70287q0990J68550K57734J9823J26922m09122M4869j31294
1332d83567r9086M7423k46628L67726k23945N2588n01790j5427L19825j72922
1322i55803P31355q9839N69006m93092r5556l86966N722j4700J35887m12755J41774
1311h64967Q69648k30354N24478N25121j23276o53455l6206l34511Q6679k86153
1301e22996n2477K31560l11447J61188m2820J8712O68763O61738k53967J04296
1291F62550M2175n71715j67999J94531k30783K49686m9264k52515N0727j50652
$$ plain form
1363 -676834 -51280 -141228 -137188 -521229 -510052 -323468 -1057264 -758197 -307378 -167658
1353 -167658 -167586 244779 -719366 -773088 -191322 41946 323459 127499 -44095 419522 315726
1342 315726 -209772 -480059 -561049 -392499 -134765 -114942 11980 -397142 -352273 -483567
1332 -483567 -582653 -535230 -781858 -414132 -638077 -585489 -1087279 -1102706 -782881 -955803
1322 -955803 -224448 -314287 254719 -238373 -333929 -720895 -715173 -729873 -593986 -1006741 -864967
1311 -864967 4681 -225673 298805 823926 700650 47195 10989 -323522 -236843 -522996
1301 -522996 -575473 -343913 -655360 -494172 -536992 -518280 150483 812221 558254 662550
1291 662550 704725 133010 -34989 159542 -71241 178445 129181 -123334 -72607 -223259
1281b23259N5174m96022j53033J54325J010549L30069k21010l94223j98456j68714
1271c04600L9405N72691M507K77035O56239k61803q98680p52264R1965K42622
1261c32883L00917Q9781r2891N93793l15280p67267p06764P23441J510551p66760
1251B36638l3648o98248P0496P69401L56761j387832J49543K10172j80162j24737
1241f31616Q66891k97594L50858L90021j053330N2072K27595M97910j9985m05913
1231b3091M96733l51069n07483K38528K7825k45148K73967K06338o05916L39885
$$ plain form
1281 -223259 -168085 -664107 -817140 -662815 347734 677803 456793 62570 -135886 -304600
1271 -304600 -265195 307496 312003 589038 1245277 983474 84794 -667470 -575505 -332883
1261 -332883 -31966 57815 -35076 558717 243437 -523830 -1230594 -507153 1003398 236638
1251 236638 202990 -495258 -424762 344639 701400 -686432 -536889 -326717 -506879 -631616
1241 -631616 235275 -62319 288539 678560 -374770 -322698 -95103 402807 382822 -23091
1231 -23091 473642 122573 -384910 -146382 -118557 -363705 -89738 116600 -489316 -149431
$$ [...]
##END NTUPLES=NMR SPECTRUM
##END=
