##TITLE=1H_CG-1160-1
 CDCl3
 8 sc, 
 3.06.2022
##JCAMPDX= 6.0         $$ Bruker NMR JCAMP-DX V2.0
##DATA TYPE= NMR SPECTRUM
##DATA CLASS= NTUPLES
##ORIGIN= UXNMR, Bruker Analytische Messtechnik GmbH
##OWNER= root
$$ XWIN-NMR		Version 3.5
$$ Fri Jun  3 13:54:28 2022 Russian Standard Time (UT+4h)  she@DPX200
##.OBSERVE FREQUENCY= 200.13135
##.OBSERVE NUCLEUS= ^1H
##.ACQUISITION MODE= SIMULTANEOUS
##.ACQUISITION SCHEME= undefined
##.AVERAGES= 8
##.DIGITISER RES= 18
##SPECTROMETER/DATA SYSTEM= spect
##.PULSE SEQUENCE= zg30
##.SOLVENT NAME= CDCl3
##.SHIFT REFERENCE= (INTERNAL, CDCl3, 0, 15.7315)
##AUDIT TRAIL= $$ (NUMBER, WHEN, WHO, WHERE, WHAT)
$$ ##TITLE= Audit trail, XWIN-NMR		Version 3.5
$$ ##JCAMPDX= 5.01
$$ ##ORIGIN= Bruker BioSpin GmbH
$$ ##OWNER= she
$$ F:/spectra/data/she/nmr/H-F/1/pdata/1/auditp.txt
$$ ##AUDIT TRAIL=  $$ (NUMBER, WHEN, WHO, WHERE, WHAT)
(   1,<2022-06-03 13:53:15.65 +0400>,<she>,<DPX200>,
      <created by zg, POWCHK disabled, PULCHK disabled
       configuration hash MD5:
       00 E9 B6 7A A2 85 ED C7 34 08 36 98 17 FE 4E 26
       data hash MD5: 16K
       43 A4 BF 2B E7 2A 45 99 C6 2E 72 1C 57 36 29 DC>)
(   2,<2022-06-03 13:53:18.00 +0400>,<she>,<DPX200>,
      <Start of raw data processing
       efp BC_mod = 2 LB = 0.24 FT_mod = 6 PKNL = 1 PHC0 = -18047.59 PHC1 = 17.00074 SI = 16K 
       data hash MD5: 16K
       B6 01 8B B0 7B 94 48 86 99 CB 09 D8 52 7A 48 FB>)
(   3,<2022-06-03 13:53:38.64 +0400>,<she>,<DPX200>,
      <pk PHC0 = -0.800743 PHC1 = -9.199997 
       data hash MD5: 16K
       9A 45 9C B3 2B 60 1E AF B9 47 23 10 0E D2 F9 B5>)
(   4,<2022-06-03 13:54:02.73 +0400>,<she>,<DPX200>,
      <abs ABSG = 5 
       data hash MD5: 16K
       E1 F7 93 74 E0 9E 09 7A 72 32 2F 95 34 93 4A 81>)
$$ ##END=
$$ 
$$ hash MD5
$$ 05 B9 0D 3F D7 9D 97 4F 2C 19 A3 44 ED 4A CE 71
##$RELAX= 
##$RELAX= 
##$RELAX= 
##$RELAX= 
##$RELAX= 
##$RELAX= 
$$ Bruker specific parameters
$$ --------------------------
##$DU= <F:/spectra>
##$EXPNO= 1
##$NAME= <H-F>
##$PROCNO= 1
##$TYPE= <nmr>
##$USER= <she>
##$AMP= (0..31)
100 100 100 100 100 100 100 100 100 100 100 100 100 100 100 100 100 100 
100 100 100 100 100 100 100 100 100 100 100 100 100 100 
##$AQSEQ= 0
##$AQ_mod= 1
##$AUNM= <au_zg>
##$AUTOPOS= <>
##$BF1= 200.13
##$BF2= 200.13
##$BF3= 200.13
##$BF4= 200.13
##$BF5= 200.13
##$BF6= 200.13
##$BF7= 200.13
##$BF8= 200.13
##$BYTORDA= 1
##$CFDGTYP= 0
##$CFRGTYP= 5
##$CHEMSTR= <none>
##$CNST= (0..31)
1 1 145 1 1 1 1 1 1 1 1 1 1 1 1 1 1 1 1 1 1 1 1 1 1 1 1 1 1 1 1 1 
##$CPDPRG= <>
##$CPDPRG1= <>
##$CPDPRG2= <>
##$CPDPRG3= <>
##$CPDPRG4= <mlev>
##$CPDPRG5= <mlev>
##$CPDPRG6= <mlev>
##$CPDPRG7= <mlev>
##$CPDPRG8= <mlev>
##$CPDPRGB= <>
##$CPDPRGT= <>
##$D= (0..31)
0 1.2 0 0 0 0 0 0 0 0.06 0 0.03 0 0 0 0 0.0002 0 0 0 0 0 0 0 0 0 0 0 0 
0 0 0 
##$DATE= 1654249995
##$DBL= (0..7)
120 120 120 120 120 120 120 120 
##$DBP= (0..7)
150 150 150 150 150 150 150 150 
##$DBP07= 0
##$DBPNAM0= <>
##$DBPNAM1= <>
##$DBPNAM2= <>
##$DBPNAM3= <>
##$DBPNAM4= <>
$$ [...]
##$SUBNAM2= <"">
##$SUBNAM3= <"">
##$SUBNAM4= <"">
##$SUBNAM5= <"">
##$SUBNAM6= <"">
##$SUBNAM7= <"">
##$SUBNAM8= <"">
##$SUBNAM9= <"">
##$SW= 18.05172834244
##$SWIBOX= (0..15)
0 0 2 0 0 0 0 0 0 0 0 0 0 0 0 0 
##$SW_h= 3612.71676300578
##$TD= 16384
##$TD0= 1
##$TE= 0
##$TE2= 300
##$TE3= 300
##$TEG= 300
##$TL= (0..7)
0 120 120 120 120 120 120 120 
##$TP= (0..7)
150 150 150 150 150 150 150 150 
##$TP07= 0
##$TPNAME0= <>
##$TPNAME1= <>
##$TPNAME2= <>
##$TPNAME3= <>
##$TPNAME4= <>
##$TPNAME5= <>
##$TPNAME6= <>
##$TPNAME7= <>
##$TPOAL= (0..7)
0.5 0.5 0.5 0.5 0.5 0.5 0.5 0.5 
##$TPOFFS= (0..7)
0 0 0 0 0 0 0 0 
##$TUNHIN= 0
##$TUNHOUT= 0
##$TUNXOUT= 0
##$USERA1= <user>
##$USERA2= <user>
##$USERA3= <user>
##$USERA4= <user>
##$USERA5= <user>
##$V9= 5
##$VALIST= <valist>
##$VCLIST= <CCCCCCCCCCCCCCC>
##$VD= 0
##$VDLIST= <DDDDDDDDDDDDDDD>
##$VPLIST= <PPPPPPPPPPPPPPP>
##$VTLIST= <TTTTTTTTTTTTTTT>
##$WBST= 1024
##$WBSW= 4
##$XGAIN= (0..3)
0 0 0 0 
##$XL= 0
##$YL= 0
##$YMAX_a= 74934
##$YMIN_a= -86675
##$ZGOPTNS= <>
##$ZL1= 120
##$ZL2= 120
##$ZL3= 120
##$ZL4= 120
##$ABSF1= 15.73146
##$ABSF2= -2.32039
##$ABSG= 5
##$ABSL= 3
##$ALPHA= 0
##$AQORDER= 0
##$ASSFAC= 0
##$ASSFACI= 0
##$ASSFACX= 0
##$ASSWID= 0
##$AUNMP= <proc_1d>
##$AZFE= 0.1
##$AZFW= 0.1
##$BCFW= 0
##$BC_mod= 2
##$BYTORDP= 0
##$COROFFS= 0
##$CY= -3
##$DATMOD= 1
##$DC= 0
##$DFILT= <>
##$DTYPP= 0
##$F1P= 0
##$F2P= 0
##$FCOR= 1
##$FTSIZE= 16384
##$FT_mod= 6
##$GAMMA= 0
##$GB= 0
##$INTBC= 1
##$INTSCL= 0
##$ISEN= 128
##$LB= 0.24
##$LEV0= 0
##$LPBIN= 0
##$MAXI= 10000
##$MC2= 0
##$MEAN= 0
##$ME_mod= 0
##$MI= 1.114404
##$NCOEF= 0
##$NC_proc= -8
##$NLEV= 6
##$NOISF1= 3.799351
##$NOISF2= 2.8
##$NSP= 0
##$NTH_PI= 0
##$NZP= 0
##$OFFSET= 15.73146
##$PC= 1
##$PHC0= -18048.39
##$PHC1= 7.800743
##$PH_mod= 1
##$PKNL= yes
##$PPARMOD= 0
##$PSCAL= 0
##$PSIGN= 0
##$REVERSE= no
##$SF= 200.130008021268
##$SI= 16384
##$SIGF1= 3
##$SIGF2= 2
##$SINO= 5.538805
##$SIOLD= 16384
##$SREGLST= <1H.CDCl3>
##$SSB= 0
##$STSI= 16384
##$STSR= 0
##$SW_p= 3612.71676300578
##$SYMM= 0
##$S_DEV= 0
##$TDeff= 16384
##$TDoff= 0
##$TI= <>
##$TILT= no
##$TM1= 0
##$TM2= 0
##$TOPLEV= 0
##$USERP1= <user>
##$USERP2= <user>
##$USERP3= <user>
##$USERP4= <user>
##$USERP5= <user>
##$WDW= 1
##$XDIM= 16384
##$YMAX_p= 401258147
##$YMIN_p= -3208940
$$ End of Bruker specific parameters
$$ ---------------------------------
##NTUPLES= NMR SPECTRUM
##VAR_NAME=  FREQUENCY,     SPECTRUM/REAL,   SPECTRUM/IMAG
##SYMBOL=    X,             R,               I
##VAR_TYPE=  INDEPENDENT,   DEPENDENT,       DEPENDENT
##VAR_FORM=  AFFN,          ASDF,            ASDF
##VAR_DIM=   16384,         16384,           16384
##UNITS=     HZ,            ARBITRARY UNITS, ARBITRARY UNITS
##FACTOR=    0.220516191357247, 1,           1
##FIRST=     3148.33713945949, 0,            0
##LAST=      -464.379623546287, 0,           0
##MIN=       -464.379623546287, -3208940,    0
##MAX=       3148.33713945949, 401258147,    0
$$ Real data points
##PAGE= N=1
##DATA TABLE= (X++(R..R)), XYDATA
$$ [...]
9370 3312407 3144817 3302252 3352776 3730247 3679205 3411821 3441674 3316520 3556671 3877033
9360 3877033 3776647 3766036 4012107 3950474 4123935 4451880 4717510 4402135 4444804 4705949
9350 4705949 4319384 4616199 4439013 4517859 4567968 4475824 4593782 4747485 4964138 4671720
9340 4671720 4858054 5392498 5372660 5749571 5726729 5590996 5847746 5891384 5679768 5522538
9330 5522538 5644460 5584975 5792919 6170420 6258802 6192228 6509946 6730498 6923331 6731098
9320 6731098 6795121 7139272 8015004 8287061 7881579 8045206 8382077 8431330 9099740 9374985
9310 9374985 9764070 10243060 10350617 10386939 10817047 11292697 11718802 12212765 12816072 13391177
9300 13391177 14050778 14286958 14682286 15438948 15742486 16166344 16775630 17187023 17444348
9291 17444348 17716583 18855087 19687133 20470721 21323614 21817793 22562301 23250000 24549251
9282 24549251 25234108 26017679 27071852 28071930 28671691 29752469 30868529 32218598 33155160
9273 33155160 34418713 35851862 37264690 38729884 40407331 42306991 44162222 46344777
9265 46344777 48750496 51725677 54272182 57069797 60064298 62522854 65419094 67886154
9257 67886154 69628579 71101416 73357398 76394442 80038102 84329787 89011684 94307831
9249 94307831 100434930 107830446 116016096 124816004 133088882 136259866 133021004 126301016
9241 126301016 119485220 113861638 109673449 107017346 105576340 104965186 104605000 103059833
9233 103059833 99592914 95927867 92839099 90632604 89214533 88622020 88174162 87576196
9225 87576196 87430858 87722290 88491779 90274947 92463035 94414184 96041521 97901938 99754085
9216 99754085 101795068 105038322 108903230 111943891 113608962 114489131 115953429 119441966
9208 119441966 123967459 129723620 137520019 144859771 149319366 148321976 139744689 126560341
9200 126560341 114568696 105573278 97925441 91948600 87133544 82974760 79394088 76055696
9192 76055696 73598504 71749938 69386010 66440470 63356710 60102350 57089310 54535121
9184 54535121 51952287 49384288 47028658 45045001 43378913 41794848 40295008 38648404
9176 38648404 36789867 35142777 33622400 32006432 31015208 30147206 29387566 28446471 27269037
9167 27269037 26153851 25310737 24217870 23312366 22739305 22365355 21787912 21342136 20814222
9158 20814222 20517358 20035103 19534828 18894005 18092121 17406156 17373741 17329354 16545864 16075381
9148 16075381 15902766 15770037 15372738 14907390 14608272 14106857 13605145 12974651 12640988
9139 12640988 12618475 12292014 12291351 12045262 11850293 11555552 11206245 10998547 10890671 10421163
9129 10421163 10235393 10112778 9777706 9219617 9164144 9391937 8959941 8718855 8862387 8704185
9119 8704185 8312161 8198689 8005068 7620349 7476258 7578577 7547641 7409522 7101455 7059562
9109 7059562 7131513 6786620 6555227 6291394 6178916 6337191 6402712 6251421 5917785 5611834
9099 5611834 5637165 5376089 5366731 5137163 5146926 5516868 5451509 5428786 5268975 5588000 5545291
9088 5545291 5230306 5170229 4879691 4676507 5000222 5206067 4807679 4584812 4450118 4589813
9078 4589813 4510276 4283043 3854964 3906865 3930590 4012630 4296511 3764500 3992834 4016902
9068 4016902 4281907 4284740 3746652 3729914 3831178 3938753 4057834 3844401 4088506 4173534
9058 4173534 3634533 3805972 3602782 3743596 4103933 3958996 4047688 4072562 3937379 3937422 3998382
9047 3998382 3657410 3581910 3263890 3347252 3635142 3791384 3677019 3482108 3324269 3147300
9037 3147300 3327241 3381523 3274391 3326047 3477826 3264654 3073007 3103358 3402759 3417577
9027 3417577 3375689 3479589 3398834 3508155 3553167 3490170 3347791 3744681 3599570 3571077
9017 3571077 3671592 3717712 3655974 3467668 3432292 3537646 3606760 3157334 3092511 2806125
9007 2806125 2875630 2975839 3320144 3256062 3300441 3317536 3034492 3001592 3199295 3164739 3166490
8996 3166490 2938957 2938784 3122052 2985394 3020159 3048209 3029645 3104631 3051759 3344094 3216154
8985 3216154 3214559 3473563 3213593 2822874 2563728 2704408 2831389 2613913 2721035 2558799
8975 2558799 2900645 3114621 2962931 3131787 2579566 2482861 2645081 2269721 2604221 2815972
8965 2815972 2928582 3352103 3585560 3591308 3374604 3516895 3305635 3226305 3464076 3208297
8955 3208297 3074171 3032668 3314194 3292158 3166524 3369780 3490026 3552085 3477177 3677148
8945 3677148 3438768 3202620 3457841 3475064 3620403 3911098 3500322 3681928 3710329 3611727
8935 3611727 3718687 3932173 4077636 4116469 3967296 4376611 4182558 4111453 4242157 4217268
8925 4217268 4293219 4265527 4644708 4764167 4566262 4608845 4511567 4742303 4557029 4508505
8915 4508505 4675390 4339620 4785376 4892215 4962138 5009349 4712774 4996860 5291772 5211121
8905 5211121 4960556 5195146 4882247 5012249 5217119 5115032 5528316 5719561 5989743 6276664
8895 6276664 6094295 5978233 5735575 5957651 6192669 6054403 6216278 6454182 6426931 6717940
8885 6717940 6743531 7023655 7403586 7438498 7448118 7338971 7227220 6884448 7098294 7448018
8875 7448018 7878351 7763365 7511180 7881817 8442248 8675281 8852240 8864054 9189298 9155715
8865 9155715 9577566 9807707 9894798 10179797 10395999 10606802 10580271 10818749 10899722 11592804
8855 11592804 12171247 12517295 12871828 13244296 13565387 14001049 14770444 14889185 15375639
8846 15375639 16137219 16702180 17133149 17989237 18290729 18771376 19482095 19965820 20758172
8837 20758172 21886089 22674668 23174411 23829896 24592605 24799205 26023521 27231005 27919395
8828 27919395 29231092 30228653 31232154 32040907 33571576 34543780 35492555 36911477 38003973
8819 38003973 39347547 40808638 42287669 43958501 45559147 47002281 48939774 51334425
8811 51334425 53934274 56794309 59706507 63034965 66661384 70113684 73474761 76803283
8803 76803283 79571590 81513859 83251510 84835235 88300766 92424792 97685472 103683799
8795 103683799 109689848 116973630 125085767 134723502 145258871 154877793 157868408 152809744
8787 152809744 144290569 135320069 127600452 121971285 118388190 116581768 115344954 114285177
8779 114285177 112444906 108140700 103739706 100251239 97591037 95115030 93358269 92397890
8771 92397890 91020335 90206094 90004608 90097564 90964316 91758704 92799169 94385939 95788230
8762 95788230 96995534 98688870 101035699 103972407 106982847 108294001 108642344 109588610
8754 109588610 111654798 114906309 119534802 125499202 131475011 134364758 133463204 126160366
8746 126160366 115122153 104896573 96820367 90484693 85551741 81821022 78185251 74573321
8738 74573321 71907645 69644404 67663310 65576996 63313135 61251128 58513879 55847756
8730 55847756 53789700 52001991 49919650 48417406 47019247 45561449 44169448 42755018
8722 42755018 41542990 40826258 40097763 39155678 38305098 37636862 36945781 36229173 35375637
8713 35375637 35004175 34363756 34231248 34328906 34907280 35742487 36549971 37476183 38786661
8704 38786661 40187268 41721750 43445053 42092690 38652996 35314380 32812308 30478007
8696 30478007 29087161 27365821 26345325 25503159 24222472 23265644 22883966 22012291 21377575
8687 21377575 20995815 19928882 19339080 18882191 18387578 17972942 17519814 16805141 16266303
8678 16266303 15876303 15364567 15001750 14612519 14505348 13963162 13695154 13200917 12724693
8669 12724693 12880387 12489508 11947351 11649760 11409751 11193418 11042725 10836777 11027867
8660 11027867 10819388 10681689 10597559 10316687 10133404 10022222 10164623 10051859 9959116 9804771
8650 9804771 9805318 9713712 9582879 9981512 10083752 10236067 10615341 10696512 10584060 10366914
8640 10366914 9751486 9636407 9453271 9065177 8953117 8854693 8784280 8757597 8718503 8687748
8630 8687748 8257807 8068261 7945207 7899761 7718655 7709781 7718792 7869939 7563184 7745085
8620 7745085 7908411 7370688 7727858 7641341 7565070 7764264 7883896 7781089 7812202 8044476
8610 8044476 7835055 7883694 7998083 8361523 8684880 8557538 8868651 8921562 8620817 8412204
8600 8412204 8188247 7608633 7247767 7401394 7130497 6621973 6643388 6339745 5788249 5456323
8590 5456323 5262852 5525597 5253003 4880960 4827098 4846689 4678936 4565973 4758151 4848876
8580 4848876 4190866 4150871 4178317 4399129 4121210 4110248 3923636 3932035 3987782 3887671 3906423
8569 3906423 4104140 4007443 3947010 4067359 3683306 3516545 3320204 3463439 3842884 3787384
8559 3787384 3191488 2935544 3229647 2940151 2877942 3270383 3458015 3686242 3431952 3115433
8549 3115433 3245488 3409733 3192369 3055257 3349605 3379075 3172884 3172664 3210272 3273424 3549490
8538 3549490 3434771 3305707 3487944 3383609 3469587 3491247 3593477 3231346 3375568 3380750
8528 3380750 3342284 3777752 3791777 3702974 3677955 3784677 3711811 3415011 3874840 3487269
8518 3487269 3514310 3714608 3918407 4055745 4148348 4009356 4216165 4291831 4709748 4574549
8508 4574549 4515117 4442007 4366416 4752522 4901726 4804053 4600154 4793817 4609737 4300640
8498 4300640 4400744 4363471 4819647 4475336 4337008 4317721 4228230 4324552 4490186 4478882
8488 4478882 4093167 3970804 4077463 3787089 3635084 3658828 3487839 3444706 3552412 3721477
8478 3721477 3537287 3756204 3788391 4027696 3670412 3700883 3677401 3951027 4116635 4218459
8468 4218459 4641632 4658965 4339020 4776348 4973447 4535490 4432119 4792291 5208375 5425008
8458 5425008 5587482 6114310 6389380 6588724 6850377 6823376 6659328 6682163 6299130 5513830
8448 5513830 5130092 5266921 5201905 5327573 5234124 5109249 4906669 5064733 4974898 4619744
8438 4619744 4716994 4440521 4203387 4282314 3931033 3870456 4227726 4270050 4429430 4245265
8428 4245265 4477186 4469061 4849396 4977156 4786463 4538494 4567309 4683363 4583540 4441450
8418 4441450 4421990 4690472 4878008 5500874 5593136 5498544 5384029 5084532 4608572 4954818
8408 4954818 4681994 4221640 4072686 4105813 4329558 3949837 3606728 3216447 3357409 3101528
8398 3101528 2863938 2956616 2666653 3025054 3140997 2919414 2769412 2733663 2668708 2438372
8388 2438372 2403136 2258570 2510590 2473029 2483025 2593643 2538082 2708661 2909737 2999189 2633549
8377 2633549 2311385 2028850 2427356 2157383 1691355 1792277 1876017 2000117 1967689 1986369
8367 1986369 2043782 1808622 1679851 1529869 1535138 1604972 1605547 1894898 1875186 1339255 927830
8356 927830 1280889 1180885 1306597 1250999 1073908 1478917 1490529 1412838 1116233 1261482
8346 1261482 1194945 1115023 1059476 1064858 919774 890112 1248239 1284187 1224557 1383307 1459659
8335 1459659 1257363 1533210 1174520 1018130 915137 1008862 1080375 1024692 685105 643863
8325 643863 880564 839913 863241 985416 951481 463256 254565 407170 634872 1170112
8315 1170112 907795 403463 459160 1274546 1246409 633057 832492 954862 722098 460707
8305 460707 638826 876928 1187856 1224865 955487 470629 681193 1055368 948721 1011997
8295 1011997 692248 953656 670957 237022 501967 640426 743041 608000 640877 747101
8285 747101 726569 780069 642417 1013663 883573 543927 592266 669440 843345 948419
8275 948419 991965 943437 994051 822360 669116 716429 686161 403283 400878 439322 608534
8264 608534 867012 370733 729977 1070689 1093301 1220237 878493 721717 309992 600112
8254 600112 758446 1051700 760798 696949 783699 818334 628830 772410 756404 652589
8244 652589 919556 648560 659633 687361 519704 688808 602582 329581 496117 638344
8234 638344 693564 582657 620763 426991 424955 694028 795118 787130 771695 867234 665406
8223 665406 579050 794301 548191 351850 523425 333808 444281 170427 -92015 277063
8213 277063 660103 698374 201835 329901 205379 329707 488311 531086 423493 374763
8203 374763 406858 306587 -229142 -26309 -190526 -90785 -385825 -146391 -579797 -775999
8193 -775999 -3208940 -1891343 2251989 1033099 1362825 1137551 1015669 1001154 1346644
8184 1346644 904670 481832 228160 -151983 44856 66650 -304280 176711 419992 352585
8174 352585 458850 704123 348819 311485 381587 552105 297764 357803 647534 489216
8164 489216 461865 601157 713857 304636 52252 165472 483863 591756 749530 620468
8154 620468 528831 447287 688089 238928 271411 331778 444523 347472 511280 286991 210228
8143 210228 206534 310868 473384 648396 387691 487407 620227 570538 263682 165306 90854
8132 90854 303154 492828 388070 665321 439962 646203 601196 478278 395266 472114
8122 472114 243101 552847 538395 809802 677300 604620 403560 157439 287728 739151
8112 739151 876319 700491 653884 338178 30806 316161 383608 341430 336648 282572 278624
8101 278624 673796 615060 80971 500229 543120 398245 629357 525693 735683 736228 568210
8090 568210 487069 214441 359197 444926 660444 453743 746171 406769 200025 112699
8080 112699 -18179 155122 482041 430365 330209 260534 63969 101196 462679 493405
8070 493405 360061 405003 466636 338087 165858 188734 40692 -66416 176374 237314
8060 237314 -102105 60632 -113025 17993 -237791 -288158 -41927 34348 131566 373659
8050 373659 53089 -146607 -90578 -71608 58346 246535 468886 323958 206505 47906
8040 47906 77172 127719 160286 103932 427413 184116 162373 76493 368628 628508 384575
8029 384575 363879 526455 432457 -60026 41000 534823 728753 754358 527855 362235
8019 362235 39550 74938 131613 186484 192919 606808 474740 270193 233080 -65109 -144090
8008 -144090 178 349053 486881 87854 75954 408767 506146 526882 108140 32896
7998 32896 44272 346800 380903 330909 363177 519761 341573 -131357 276027 402208 171237
7987 171237 -312542 117875 239721 -64586 219316 368723 440571 337849 485050 222114
7977 222114 249322 460163 523761 190972 -28013 -315790 -118989 -145686 136987 338386
7967 338386 69575 -130087 -331803 59385 239992 -117588 -217929 141115 120403 226678
7957 226678 186867 -245929 -96962 -317887 425677 229796 210239 294875 83568 -190522
7947 -190522 40724 412120 1852 -2535 43329 -120788 362605 644277 211239 290972
7937 290972 447620 284700 -31400 197719 436365 283142 122274 -25718 -122577 -10568
7927 -10568 -106600 -66560 93478 254742 344076 224100 239736 256183 49586 167107 330779
7916 330779 343632 491931 638723 422858 637010 632549 423330 -6102 -116878 167913
7906 167913 248610 282303 62077 104451 -66902 -200395 497026 422713 51936 34521 45946
7895 45946 -89752 -93506 -39338 205915 387574 485495 104924 -256436 -76271 101442 429764
7884 429764 159965 120038 148081 -132796 -91448 9504 80491 117550 195977 269085 203756
7873 203756 459537 476578 526584 549833 223411 187538 273211 205818 146385 343363 -14555
7862 -14555 -75869 392892 176385 259977 314447 300839 430073 263615 246074 232591 297231
7851 297231 241523 107871 -48394 -302610 -316821 -200084 12871 58324 -374884 -310260
7841 -310260 19761 267563 -53431 -243695 -18977 43966 -131997 -303329 -44350 -64827
7831 -64827 -324219 -348241 -281782 -70652 191331 87479 90066 459092 591859 242199 119578
7820 119578 57308 123210 113018 43856 348779 236113 364148 279474 322099 208010 492037
7809 492037 200605 190832 159938 283005 178513 -161737 -86394 -737431 -298277 -242490 -244397
7798 -244397 -75134 866 80458 257960 39180 -38902 -55568 -248754 -98561 123203
7788 123203 421863 490831 340072 138011 56813 218219 201577 291212 94184 -356896
7778 -356896 -290635 -12212 400311 208826 78177 227693 -11190 8189 -170720 -39921
7768 -39921 19193 -147025 -236396 -137799 -132064 -254971 -13660 -63939 -310938 -272812 -35106
7757 -35106 13851 -67921 14062 382034 222573 271636 -33678 -113151 -80410 -188861 1337
7746 1337 85648 33406 -252928 -49065 114195 307569 67725 -135406 91109 81187 203893
7735 203893 449304 398021 206622 313969 214347 106813 -342786 -679057 -464713 -416952
7725 -416952 -79842 30970 186900 305545 266416 182103 191051 -27871 -51378 25519 459105
7714 459105 465607 478950 163172 182891 41001 120648 26445 -57340 240660 -53378 -424531
7703 -424531 -285041 102142 -243877 -232917 345457 362510 234914 492826 291249 292448
7693 292448 87940 162821 256252 -63890 1211 31230 -134723 -6870 275996 588181
7683 588181 490877 317883 446023 415704 -92340 -164188 -108510 173137 253251 225677 260701
7672 260701 314723 339498 391378 151191 -74421 -138670 -474945 -402007 -2999 51650 -142594
7661 -142594 -236840 -55257 -202597 -242104 -426252 -541368 -91012 166062 115249 253834
7651 253834 450364 136879 415062 200046 -87925 -64270 -291389 -39878 130633 -230281
7641 -230281 -230213 -208203 -191626 -449377 -463853 -393646 -129268 6556 111138 -156458 20320
7630 20320 46789 -37449 215763 -198549 119637 253161 169204 212082 81562 -52475 45403
7619 45403 -109529 128978 -80322 -128399 94700 200876 100502 -23397 5598 53374
7609 53374 61085 36344 170770 290786 241388 -8360 127109 -1784 -346254 -350121 -234870
7598 -234870 -325421 -104447 -92144 -301692 -35820 261500 53644 -113682 60455 66278
7588 66278 -93208 -341532 -53163 -103667 155300 169875 244939 182287 231568 38649 82925
7577 82925 36944 -175895 66376 162307 -88701 -183679 131116 120486 -64187 201849 63030
7566 63030 -204741 -479362 -403668 55188 198103 130792 -50273 299681 254003 -190363
7556 -190363 -232824 -346787 -570547 -262084 135791 37955 -165799 55097 -106361 279449
7546 279449 -146881 49449 132511 -33780 -175495 -192792 13100 96523 -85725 196399
7536 196399 93345 51369 594919 165281 155337 -295283 -223784 57311 32153 47024 421280
7525 421280 165977 -45342 -68131 -173297 302 190810 -24387 -94193 -175721 -140042
7515 -140042 292023 97976 16191 308344 59159 -280869 138367 -147825 64052 74960
7505 74960 66340 -120145 -186640 -294984 -120964 205761 315233 171708 -84982 -330005
7495 -330005 -238169 14783 -77154 -147318 -88820 351853 244593 183033 90151 102100 482242
7484 482242 347267 164112 -178531 -211701 80749 -110786 -294243 81244 169265 32212
7474 32212 -119526 -112947 -99256 -92538 -156931 -198929 163797 -48742 -281261 -17199 -46786
7463 -46786 203317 106241 -203465 -407422 -646624 -417601 -51049 189390 -70156 -155144
7453 -155144 22834 -182666 -363359 -315289 -303362 3521 216275 351289 75822 -99320
7443 -99320 -69026 -237026 -392265 -375308 -196154 215619 485575 468333 69471 -94633
7433 -94633 15605 371713 629227 172864 105537 -46501 -127686 149952 -26988 -74896
7423 -74896 -335090 -374099 -84518 139336 111142 250249 51803 -388424 -252337 -206191
7413 -206191 -361969 -69696 119932 194616 -42875 58471 52404 -277444 -149072 -86600
7403 -86600 -167622 -369851 -358796 -129575 -297302 -211014 -24885 -14465 -51628 293840 24199
7392 24199 20939 55457 -9857 -145772 -211928 252223 335367 -70896 -198130 -472884 -393014
7381 -393014 -99190 82681 181335 -36479 -126610 -123248 -33820 -66650 -19209 -95452 -344792
7370 -344792 -126493 154129 -98703 46706 -150788 -71273 -108478 -76095 -92655 218746
7360 218746 -132698 52031 387588 -74112 -106893 122432 84519 352022 -107301 -668265
7350 -668265 -277683 -248977 -376110 79629 382621 246297 103165 -147213 -162770 -324232
7340 -324232 -163943 -241533 -396427 -495303 -339163 -230100 -384542 -237172 -20666 -98404
7330 -98404 -236100 -129688 -139580 -46206 -84160 43282 519298 36511 -23163 20606 -45780
7319 -45780 -87333 -384093 -430018 -416471 -236037 -20414 -194734 -319937 -268744 10968 -146058
7308 -146058 -120886 -254372 32280 302693 480513 157782 -106147 41540 117081 228468
7298 228468 -53250 -287271 -576935 -201431 -388624 152001 -181840 -494025 -436268 -171295
7288 -171295 -475170 -652897 -206426 105484 146946 -39124 -157324 -159001 -40765 161393
7278 161393 -3058 -565400 -580983 244278 181435 -199 -183714 -543124 -367680 -418466
7268 -418466 -561976 -114551 -295026 -205081 -378109 -349959 -413025 -70970 80603 -260665
7258 -260665 124378 -172612 56244 181822 -143892 -221284 174668 294164 92926 119719
7248 119719 -119717 -165693 -225462 -146771 -156392 -188477 -239209 -345137 -343607 -522165 132271
7237 132271 146315 201495 -56900 394677 273828 -213518 -315717 124908 -185607 -352729
7227 -352729 -385304 -168972 -151882 19261 250418 139449 101607 245812 50858 -13095
7217 -13095 -213214 16100 -13993 -390314 -70059 -50391 -1433 -246524 -562553 -24220
7207 -24220 206305 -59433 333738 108524 -68806 -66145 156187 242585 37997 -196844
7197 -196844 -155763 -193913 -218555 -332052 -266792 -271594 -158582 -67906 308129 266920 -14803
7186 -14803 -248725 66884 160068 -164935 137491 -156447 -286704 -348880 -165239 -3616
7176 -3616 -143675 124223 247921 -94115 -133588 -295506 108982 -161437 -299720 -77212
7166 -77212 -90821 -152089 -68910 240786 -352736 40966 102324 65065 271721 -98405 -513009
7155 -513009 -194731 216948 400450 51304 -134060 27707 125222 532554 273505 -119254
7145 -119254 190358 81420 -39195 3953 44555 -380185 -394757 -356125 -180896 -174825 -290661
7134 -290661 59044 -83248 121524 -13363 -322957 -402433 141011 166527 -214432 178839
7124 178839 161332 -137454 -23912 -154098 -206985 -310546 -155512 -222378 -128150 -37578 -60418
7113 -60418 23714 41531 392269 148837 232743 313601 26362 71827 169811 -48961 412332
7102 412332 421499 133470 41370 -230396 -267772 -129186 -2263 91540 15597 -351388 -390574
7091 -390574 -304128 49998 -336279 -461428 -193318 -10952 -344984 -134482 -189930 -201429
7081 -201429 -43085 -302309 -318435 -246897 68171 -83448 -53854 402325 -101492 -310385
7071 -310385 133592 124271 4009 -65107 54184 312977 504300 173110 143980 199678 -21913
7060 -21913 -133060 -154870 -138400 146022 4467 274460 180369 78748 -99301 -110263 -62398
7049 -62398 18942 -238589 7013 371176 463674 355833 -70826 267010 142123 -53128
7039 -53128 -73899 155983 380505 -123598 34157 265462 160675 123908 336403 207671
7029 207671 -2239 157836 282005 388257 599385 343190 317106 349655 370796 448093
7019 448093 557147 473897 494052 530322 428074 436501 224507 425182 380968 205926 153810
7008 153810 291625 28387 32870 92615 -113615 -276417 121174 325432 216134 -243441
6998 -243441 -282683 -177321 -309636 -344513 12208 -239907 -316620 -288583 -48217 -258960
6988 -258960 -306356 -5563 -41272 -132592 62769 161726 162252 -101164 -153788 -154862 -264510
6977 -264510 -122843 -60346 131966 285123 366879 241866 -9076 111590 273929 103721
6967 103721 33650 -352995 -250241 -154301 -68945 53790 -222214 -116878 -117780 -215399 3455
6956 3455 321623 16102 -119720 -22216 -81704 -134882 -88981 -58519 -146460 -203170 -546952
6945 -546952 -286655 52865 -9485 -79817 -124348 -190481 -544967 -550322 -538961 -535435 -318122
6934 -318122 -215789 207817 -105706 55448 258684 -261443 -285122 -7201 -387649 -248233
6924 -248233 -132656 137825 -51157 178291 54891 44907 149220 -57547 129763 -124160
6914 -124160 180499 52528 -72728 252308 69482 -13301 185209 314807 215111 -119123
6904 -119123 -231511 -286893 -406112 -239168 56490 -5801 -2522 83175 -62656 -255217 -118640
6893 -118640 -203266 -243252 -108865 -152724 -187328 -597946 -543356 -199076 -58552 -113437 -340179
6882 -340179 -173997 -94644 -325211 -630894 -550488 -408615 -210826 -273910 -273054 -158430 -34880
6871 -34880 -60518 -102212 -366213 -462346 -385465 -357006 -314060 -446552 -200483 -42329 16966
6860 16966 -409951 -404975 -172478 -17310 45496 19587 -243751 -203541 -572369 -102132 24190
6849 24190 -284332 -18397 -300664 -523060 -235364 257331 -249398 -165528 -5563 347674
6839 347674 326331 17216 -295253 -515464 -405772 -252598 35573 96655 259283 71427
6829 71427 -296256 -29424 -24531 -135877 -152401 -507037 -503035 -536861 -656457 -452440 -90079
6818 -90079 3606 -59055 202118 138200 -112458 -488827 19706 167211 -334455 -368960 12353
6807 12353 -41109 90645 325865 319104 150139 116715 172110 -6355 -272736 -353427 -201841
6796 -201841 103411 304580 34604 -214852 -210994 -216819 4272 -72740 -363515 -278815 -339726
6785 -339726 -35591 -81729 -17083 -265621 -447091 -231572 -87531 -175182 -203023 -132226 -2210
6774 -2210 -61110 -76333 235357 644611 221553 62704 238578 226106 229477 -164769 -319016
6763 -319016 -308381 -186671 -226528 -77210 110160 -47769 -112400 -276862 -338789 -110016
6753 -110016 -50931 -261620 -163229 -344827 -521070 -242711 -203035 -180512 -192038 -205677 -369433
6742 -369433 -498609 -512826 -202649 -94157 -287169 -251815 -198447 -353045 -329592 -64485
6732 -64485 -290692 -463901 120097 -279561 -363619 -240127 -58468 -40272 -322642 -244326
6722 -244326 39171 142675 -42314 -411955 -440152 -36363 -19792 -161243 -102639 -210296
6712 -210296 -164025 -123717 -282940 -209814 92700 -24675 -465710 -90651 66140 -144158
6702 -144158 -804769 -468229 -180507 -136808 -323533 -368751 -490329 -291625 -29161 -148915
6692 -148915 -295631 -107 372466 430159 297632 2471 -113681 -269043 -143513 -155710
6682 -155710 -315295 -228298 -266843 33368 120300 -101860 -168410 -111105 100072 88560 10436
6671 10436 238792 576128 457732 47689 -173344 15655 -278608 -369592 -159966 -195079
6661 -195079 -364610 -255007 -388050 55133 59555 -187483 127346 -114314 -282884 -163317
6651 -163317 -185758 -151126 -245849 -661585 -269010 -161772 -101876 25037 -296535 -220748 -66730
6640 -66730 28405 -248852 -294407 -185889 -347625 60723 61005 -211524 -470496 -398030 -388661
6629 -388661 -246015 -44092 -192989 -302641 -218050 -127226 -241688 -363282 -495948 -209758
6619 -209758 261587 149108 109459 12248 -184743 93580 215497 -210005 -592738 -59303
6609 -59303 194594 94356 52700 129695 416693 383429 -133517 -281524 -409510 -321217 -330668
6598 -330668 -215100 -215963 73657 -41322 -49065 -438556 -220303 -415544 -553470 -422319 -578986
6587 -578986 -220916 -359302 -462784 -205183 47974 43482 -371580 -384253 -256056 43034
6577 43034 45394 136571 5289 77393 -54883 -108552 112520 33821 280824 -223367 14002
6566 14002 -12369 -155744 -252003 -144045 -241254 -122271 -192536 -32523 -221628 -221171 -176021
6555 -176021 -281632 -156296 14325 324418 271737 189036 126506 126848 -331100 -241318 -205398
6544 -205398 -368342 -151254 -327634 -252883 -165911 -90809 -267396 -553118 -171011 71722
6534 71722 -237387 -166654 -394766 -455897 -223244 -166557 -324519 -319028 -357916 -404295 -185833
6523 -185833 -441074 -458258 -393336 -241886 -181282 -522865 -209832 -352495 -64872 -96129
6513 -96129 110444 -43542 922 -64878 47799 90016 -137042 -221101 -228672 -332416 -294327
6502 -294327 -161251 88239 4693 -297486 -207389 -196954 243933 -59684 -356307 -482269
6492 -482269 -11827 -388217 -77711 57787 292362 -139402 -525576 -339373 -445817 -388657
6482 -388657 -161352 -6623 240389 446791 -278657 -352684 -465997 -388308 16022 -45093
6472 -45093 83908 -133739 -240006 -217352 -422619 -429909 -614900 -369684 -223350 -43495
6462 -43495 -406288 -706966 -657404 -210362 131717 -39566 347175 64297 177322 226805
6452 226805 401767 30545 180234 -122115 -329924 -349337 -205529 -92170 -280533 -71580
6442 -71580 -335680 -407814 -302386 27275 -306921 -86776 15675 -279613 -171883 68127
6432 68127 -98486 8951 109845 -93892 -388865 -388838 -328628 -368268 -522222 -451939 -199902
6421 -199902 -284122 -61095 185992 -5990 -151578 258295 354907 -38410 -373227 -206286
6411 -206286 -491286 -334693 -227029 -289301 -94268 -211623 -422935 -136986 120694 -175066
6401 -175066 -189645 -322122 64437 23927 -336863 -703996 -827893 -547852 -219581 15499
6391 15499 -193457 -116988 -440691 -701856 -501119 -310917 -82134 85953 73876 -312072
6381 -312072 -316302 -447346 -235274 -696644 -875651 -330295 -410557 -593267 -753007 -193711
6371 -193711 -530396 -399589 -189174 -171284 -139262 387 310102 188280 174689 270593
6361 270593 299467 33325 -266275 -311784 -283057 -292312 -203924 -126526 -232766 -213008 -254884
6350 -254884 -168307 104200 217730 23573 -388986 -380404 -407705 -110899 -103117 359 -262561
6339 -262561 -349602 -410803 -591405 -418025 -299898 -339656 -326264 24317 -50903 -58879 96578
6328 96578 -162777 -191553 -185739 -338212 -286254 -38307 -358941 -48313 89971 160959 -110915
6317 -110915 -276699 -111477 -392955 -136654 218570 24490 -146155 -79499 -137907 -268360
6307 -268360 1777 301289 149380 -69771 -131166 -356258 -524873 -242359 239596 -110923
6297 -110923 -523669 -214275 -71175 -23160 -406314 -250523 -66764 -468036 -535602 -422849
6287 -422849 -455327 -512578 -225160 -208949 -31134 -141235 49155 165822 55014 -198243
6277 -198243 -142846 27482 -594850 -259728 -137279 -239400 -158794 -120162 -269218 -178414
6267 -178414 -263341 -291794 -188172 20893 -198462 -346312 -435264 -121052 -217483 -146119 -49882
6256 -49882 -102115 -198664 17304 190637 191199 333864 266304 148967 333699 53547 38219
6245 38219 231347 154707 23835 54509 -34229 102870 -87651 -498761 -612286 -746750
6235 -746750 -9537 35920 -120375 -288297 -91597 27797 -306418 -351183 -651852 -490225
6225 -490225 -213345 -478085 -468400 -471759 -309640 -838809 -619107 -638582 -753095 -100485 -21451
6214 -21451 18788 73301 217769 -106607 -169815 -60383 -62290 1155 67152 14837 -322035
6203 -322035 -189045 750 447940 231725 -165697 -191560 -323255 -103925 -235381 -186667
6193 -186667 -5069 -179492 74212 -115805 -330776 -245583 -159158 -443489 -658634 -682598
6183 -682598 -370957 176539 147176 -155484 777 222042 148054 172883 42689 6826
6173 6826 -199903 -305307 -70406 33619 161416 -192916 -523407 -577858 -684756 -241419
6163 -241419 -790 -58834 143214 31152 308305 351678 28967 9576 -245321 47697
6153 47697 -277583 -385946 -271125 -488072 -225406 -309527 -139943 -18635 -151914 -120641
6143 -120641 64206 277384 299521 190905 46104 -124880 -264140 -339364 -257450 -91504
6133 -91504 -425344 -555768 -234455 -197216 -90097 -43962 -430615 -224903 -108482 -78795
6123 -78795 -229123 -446749 -10894 -9188 -141837 17551 -109189 -307098 -137841 -329300
6113 -329300 -205778 -284783 -537197 -480859 -453952 -47899 -130736 -38412 -171129 -257846 219246
6102 219246 330433 -109312 -61638 31327 47629 45499 -97284 66832 242695 221410 -157427
6091 -157427 -363564 -324817 -554109 -334074 -110551 36840 12026 115643 218899 211564
6081 211564 49945 -43655 -410689 -277434 31787 -85462 26895 -34105 -242300 -480751
6071 -480751 -85864 -37832 106578 -253716 -81051 191584 -49933 -231252 190524 -3400
6061 -3400 -65131 141057 299514 435783 413231 217939 88938 237812 -18022 -103863 -111190
6050 -111190 81465 -199770 -87157 -28946 177551 244816 396201 460533 360440 72628
6040 72628 -318502 -277062 -118652 154251 172441 236030 257489 -96638 -28421 193583 17623
6029 17623 263660 116944 291808 502247 298558 496025 518609 317464 443319 295861
6019 295861 263734 372882 310779 -9472 1485 -4164 -98102 -88575 397168 304092 245009
6008 245009 37440 284501 96468 360837 579932 131361 117967 -298662 -43365 181893
5998 181893 115296 124493 132410 333233 278839 154557 338093 404203 474974 298177 450747
5987 450747 431023 641995 929753 1160147 926322 855642 582897 662629 745972 391159
5977 391159 470576 877300 560772 784676 855834 901943 895224 967700 1096578 1292315 1433781
5966 1433781 1146942 1416919 1296126 939365 1104478 1161176 1507234 1662701 1741468 1405393
5956 1405393 1540231 1944376 1923550 1888777 2035009 2363989 2301603 2014327 2081249 2296802
5946 2296802 2322134 2250126 2174432 2280434 2325461 2693853 2585259 2323675 2434388 2523419
5936 2523419 2745369 2649354 2709369 2892009 2980401 3141829 3242564 3190878 3548074 3772162
5926 3772162 3588359 3614472 3286642 3314195 3958150 4342450 4540285 5142720 5407038 5506743
5916 5506743 5390331 5022074 4980810 4732869 4633810 4315898 4038374 4084778 3758383 3349171
5906 3349171 3511060 3959809 3545664 3770654 3578665 3840476 3775281 3568888 3534991 3617536
5896 3617536 3133110 3291420 3499444 3651559 3808634 3921210 3830288 3789629 4311307 4145987
5886 4145987 4523559 4635291 4266103 4109601 3631466 3115444 2784757 2715763 2807063 2738813
5876 2738813 2734975 2686309 2581719 2640836 2297932 2095390 2058165 2146101 2292968 2165391 2121542
5865 2121542 1813779 1725954 1695441 2297919 2123427 1890789 1754872 1787751 2275421 1868681
5855 1868681 2092972 1824760 2040152 2218251 1792748 1535748 1285283 1435845 1286258 1521579
5845 1521579 1531329 1507675 1637595 1552388 1440977 1397952 870228 712785 726414 468374 574862
5834 574862 1037954 1158747 1308257 961798 849661 992794 735767 920205 1064022 1081825
5824 1081825 687361 814899 618631 837245 1069433 672974 695032 503760 524506 529988
5814 529988 409891 294322 325935 283243 501143 941035 814771 857499 1242716 979471
5804 979471 647895 751616 468250 250351 526758 456423 401737 160524 166667 237053 299898
5793 299898 804164 871722 794693 859344 689745 639931 541664 936391 471236 420049 550819
5782 550819 756574 489450 288943 558374 529955 386535 464157 430563 386798 478073 597156
5771 597156 582966 586267 339326 401744 528765 254438 650244 635087 776689 835569 864878
5760 864878 777944 637540 796453 563747 185863 245062 377859 574395 355927 180617
5750 180617 348919 405826 573933 935075 782024 592057 451996 648476 702564 759476
5740 759476 316774 97956 296501 486311 255286 408612 687572 636187 677016 604673
5730 604673 591899 359463 506201 610378 257601 181037 314964 380069 477052 404082 337412
5719 337412 75042 92661 -101852 -104123 -20184 -172842 -150746 223110 310987 -155603 61086
5708 61086 283780 68317 -116371 108316 -5681 153991 54485 122764 419946 182821
5698 182821 221076 630808 274027 71927 378528 198352 8703 266509 60735 18239
5688 18239 155300 364250 -14900 -53101 519484 549240 577490 197831 -240154 -360476
5678 -360476 -139763 -126527 90695 3991 -209565 60327 223151 590653 459188 164164
5668 164164 191670 332516 -52318 51963 172898 12639 -82900 -349377 -209300 30936
5658 30936 194852 -95855 -40073 69715 432733 333889 426415 353093 390800 141532 -378844
5647 -378844 -427355 -389297 -394405 -531669 -110626 -128537 -323083 -45602 -20807 -157547 -124362
5636 -124362 219774 186738 287840 -53194 -165019 -231822 -108611 -275267 40279 465388
5626 465388 324663 161541 4817 -130489 256576 308683 145781 35622 -59592 -147626
5616 -147626 -78862 4941 -33676 370155 394359 199626 -167830 314431 330180 350962 364764
5605 364764 22347 305971 615141 196539 -49182 -55596 225699 515190 141073 83351
5595 83351 182422 464422 391129 486748 368306 83067 150667 25739 -78157 -73614 137493
5584 137493 296472 587420 584116 7592 -158098 319358 603802 664912 298574 534016
5574 534016 577989 340684 294246 117521 341315 588658 443468 272627 321595 752089
5564 752089 558163 644807 537815 344084 719269 757760 664467 780089 861481 754304
5554 754304 577659 938697 1338713 975589 831911 1008654 1314590 1369070 1072667 1275893
5544 1275893 774064 786735 919634 930913 1025489 918212 803162 1113583 1521916 1243708
5534 1243708 1009469 1052791 1300816 1173198 847594 869123 1262885 1527319 1887894 2086646
5524 2086646 1981307 2058244 2256606 2265518 2121414 1992085 1894832 1481228 1486822 1672367 1638329
5513 1638329 1491577 1181579 1068629 1214903 786045 745798 918799 1289210 1110859 1431938
5503 1431938 1392362 1090373 1377307 1241010 1250723 1388698 1145774 704429 1064086 1057077
5493 1057077 1297227 1604470 1457368 995993 1138110 1080739 881420 1077948 983080 866838
5483 866838 1064529 1104668 1018405 995637 1111240 1087775 1108571 1156591 1108254 1224248 1200180
5472 1200180 826912 684522 856584 863588 1203704 1366860 1577229 1236580 893703 1061445
5462 1061445 1251169 1486896 1209518 747252 1033553 932529 1424787 1700464 1811464 1837075
5452 1837075 1709618 1588656 1569655 1491924 1475899 1071566 1089516 1293229 1709690 1655967
5442 1655967 1362978 1311400 1305748 1162451 869140 933307 1036370 1416177 1193537 1187884 1417620
5431 1417620 1406047 1489391 1602226 2001971 2114698 1638641 1666288 1860126 2062158 1902345
5421 1902345 1729669 1748211 1785088 1813807 1494481 1639925 1937671 2055716 1898276 1914814
5411 1914814 2054643 2258328 2433667 1997009 1997657 1904301 2343085 2405432 2075126 1973377
5401 1973377 2192756 2018930 2465443 2763818 2889605 2820045 2823052 2848900 2980879 3362965
5391 3362965 2918740 2941496 3292795 3358883 3072347 2760477 2997147 2901590 3171683 3440547
5381 3440547 3096687 3264258 3657729 3544861 3804283 3480125 3218455 3154587 3372359 3515998
5371 3515998 3674796 3635396 3732282 3909703 3777309 3896795 4031975 4122815 4450991 4327086
5361 4327086 4198752 4316509 4385175 4028411 4350006 4668037 4697570 4693135 4588709 4669190
5351 4669190 4520557 4805729 4914391 4975648 4802982 4982215 4776158 4984084 4917781 4786499
5341 4786499 4816573 5301281 5882584 5716386 5330001 5640079 5500886 5581792 5335149 5641110
5331 5641110 5575325 5724703 5942371 5969257 6522361 6266785 6109723 6286098 6501930 6478734
5321 6478734 6519653 6749540 6768251 6822081 6884968 7281122 7613367 7884431 7853317 7539399
5311 7539399 7343426 7730180 7816045 7687299 7917709 8182538 8597996 8615715 8611991 9215231
5301 9215231 9581061 9481981 9838815 10423245 10614207 11293830 11651469 11884956 12117763 12645710
5291 12645710 13133989 12902701 13558917 14251837 14738161 14826220 15286877 15957666 16654713 17107813
5281 17107813 18101641 18727984 19017805 20410282 21599511 22222409 23313592 24358053 25270694
5272 25270694 25967644 26913699 27943878 29050610 29918755 30930481 31868639 33154594 34614510
5263 34614510 36034225 37592387 39022536 40426794 41995210 43181671 44332509 45894585
5255 45894585 47755806 49694974 51509928 52866342 54946927 57268614 59309100 62128477
5247 62128477 64682035 67126607 69852034 72926130 76409712 80227751 83791224 87818603
5239 87818603 92471024 97687903 102164149 106889419 112135373 117147766 122118013 127440575
5231 127440575 133090256 139835070 147305490 156264507 167017281 178888829 192354171 207139031
5223 207139031 222045113 235582183 247927539 256411075 257805686 255204347 250017113 239061320
5215 239061320 223040516 206491903 190750519 175511143 161585176 149707720 139816294
5208 139816294 131131906 123296154 116482526 110365592 104716586 99308934 94594247 89974910
5200 89974910 85246801 81261359 77748489 74063557 70765951 67821098 64936068 62050388
5192 62050388 59263528 56243249 54074802 52298780 49713951 47480377 45377620 43529339
5184 43529339 41948041 40370800 38685804 37407443 36334790 35363325 34213375 33509626
5176 33509626 32731658 31896127 31280007 30572485 29970277 29623656 29025416 28615700 28372895
5167 28372895 27950866 27526155 27152139 26458329 26232353 26009991 25643443 25309264 25449537
5158 25449537 25242230 25328162 25397238 25833086 25946986 26108020 25510380 24639602 23497422 22491469
5148 22491469 21579431 20144199 19422573 18716528 17937989 17318642 16718631 16005891 15371751
5139 15371751 15034604 14802412 14197556 13997684 13482506 13060183 12572577 12537323 12110816 11789056
5129 11789056 11671701 11561225 10917845 10522301 10350965 10028453 9739304 9571804 9211586
5120 9211586 9279956 9143776 8856659 8752260 8371445 8124242 7563873 7744207 7483320 7567516
5110 7567516 7549566 7279437 6987813 6912444 7063435 6848634 6588148 6199856 5908751 5978710
5100 5978710 6062199 5681352 5675103 5831911 5532412 5276538 5036714 4732891 4851914 4666458
5090 4666458 4603184 4085559 4247191 4580510 4124516 4036275 3818621 3809085 3851766 3544387
5080 3544387 3659932 3674656 3697218 3322755 3441509 3229507 3319649 3328908 3380584 2884875 3007055
5069 3007055 3267470 3110090 3186611 3181333 3449518 3151113 2916285 2981570 2998491 3084826 3216285
5058 3216285 2966496 2639579 2651549 2855609 2903943 2831387 2643992 2552680 2658938 2529385
5048 2529385 2440850 2884534 2676188 2317730 2724453 2948761 2551455 2719479 2456480 2486239
5038 2486239 2453070 2597985 2924391 2712583 2774525 2597776 2238378 2278900 2455836 2517661
5028 2517661 2521632 2444115 2535739 2530899 2201174 2046088 2386363 2567862 2798694 2742811 2223551
5017 2223551 1807397 1268185 1636953 2010563 2052950 2014645 2103542 1756259 1951817 1986448
5007 1986448 1815017 1669161 1717230 1680418 1607191 1484130 1669424 1701291 1532966 1512889
4997 1512889 1495768 1869404 1672585 1548243 1529851 1717179 1834442 1772251 1478991 1476910
4987 1476910 1644279 1675619 1678330 1823470 1267963 1481643 1535874 1358522 1516073 1421032
4977 1421032 1431886 1394360 1302703 1184914 1235832 1182435 1319103 1360941 1532393 1735933 1732604
4966 1732604 1738540 1429360 1567625 1811987 1375800 1716485 2007781 1800332 1533508 1584096
4956 1584096 1685795 1282166 982359 825441 963950 1453290 1232041 1282749 1280966 1195156
4946 1195156 893530 868834 1263833 1307296 1398418 1034995 1074403 1228973 1271409 971986
4936 971986 790072 962076 971824 1397429 1538679 1746465 1758273 1541106 1273502 1406278
4926 1406278 1710485 1706893 1880462 1974957 2100124 2101574 1934183 1930917 1929331 2292301 2023187
4915 2023187 1824958 1820730 1688183 2084522 2126365 2097375 1781608 1480928 1263948 1217865
4905 1217865 1259165 1171984 1245414 1310208 1323591 1491863 1621920 1412209 1308569 1497686
4895 1497686 1449662 1591070 1272847 1187351 1301714 1223102 931573 854215 796142 888218 945426
4884 945426 1018900 1172571 940610 941915 897858 937221 1127108 1183909 912608 423761 753905
4873 753905 896225 817740 802936 489803 663170 904400 885693 490423 104343 379568
4863 379568 406775 460672 502028 839093 853083 822566 1046068 1059143 1103767 1176496 943601
4852 943601 732887 946741 1162534 975710 614713 791334 889468 855803 749650 388808
4842 388808 95139 329038 386645 199649 277936 749601 873396 843100 908787 695147
4832 695147 754534 709781 381364 370016 379388 501838 630882 395875 376499 690877 538800
4821 538800 174225 207115 181526 443248 614242 471032 316932 450545 382433 189149
4811 189149 230837 44657 187558 356051 363288 475335 443471 595053 637039 239636 102661
4800 102661 83622 36194 84777 143838 385887 84288 -166398 131742 376458 566525
4790 566525 751094 491223 294017 536102 193371 198148 227649 162761 89324 595486 741829
4779 741829 431335 353596 459650 374748 348602 397111 315036 333087 207554 273696 293513
4768 293513 400914 574813 495394 525458 437963 293959 290472 244264 11529 -73483 -36008
4757 -36008 245042 248022 99407 36352 274778 326314 -12456 -179281 -152894 -93632 29620
4746 29620 215828 74594 -22927 116251 450007 247752 -126449 410875 191696 -88459
4736 -88459 69500 230954 517489 125369 37758 177731 251784 90466 319612 293948
4726 293948 282972 269028 323407 199411 66875 41798 63897 348173 -21940 279335 17379
4715 17379 -36397 -126271 -226254 -12089 248995 427926 -172975 -168517 -160284 -432631 -359432
4704 -359432 82085 185638 167122 -57557 -202485 -85163 47710 141882 435292 384272
4694 384272 234695 198526 94584 100943 104214 -200722 -220908 -40105 46137 57180 71395
4683 71395 -109129 -182163 19608 392862 506728 388789 379470 58881 373695 71267
4673 71267 176217 281708 -18693 92586 602998 464039 30361 47841 297981 304759
4663 304759 640373 415164 -306911 -230825 50191 480559 208125 467685 532833 878594
4653 878594 568617 155093 -38614 -7904 521383 271995 -27168 211008 97259 309736
4643 309736 125010 513003 702681 269431 449761 388290 316163 508975 549495 582338
4633 582338 513853 117021 127396 87664 -68954 -113186 156760 300513 336883 57707 -202504
4622 -202504 -127570 -160511 177868 320411 100945 -59738 -194697 284659 726582 502833
4612 502833 234505 140756 -247304 -141192 178099 64743 186386 334505 490969 298608
4602 298608 168348 211651 415294 312237 283549 135189 266210 338968 325762 155669
4592 155669 -78858 11152 287454 171599 82704 167664 329207 489816 335682 356867
4582 356867 395351 395961 85109 440579 340462 244024 20537 58030 192796 384263 381898
4571 381898 284920 101249 -253019 -62519 192934 156450 98645 381210 476126 492355 -57096
4560 -57096 -44671 -13991 -83147 227167 264405 273320 252108 55639 34557 144777 -130689
4549 -130689 -347413 -216922 377810 144124 481139 243751 299095 171946 160245 514798
4539 514798 301073 208914 311452 430520 859643 438869 415013 388146 587413 718839
4529 718839 375191 416124 550962 686845 853403 708791 537273 733348 843956 741974
4519 741974 634794 553603 366458 246661 80186 417945 392829 675588 543426 712981
4509 712981 981082 971249 814528 221429 85394 140867 19107 295132 432876 206921
4499 206921 300628 217333 372253 179627 141522 166367 -55204 271922 236989 219008 212050
4488 212050 397117 625783 549175 378398 40127 79807 265982 538641 673103 224004
4478 224004 274472 262887 637465 1015138 828297 428991 449667 437755 778456 851811 861626
4467 861626 523039 240850 123281 318350 422693 518226 857469 283922 173854 180019
4457 180019 -10131 -45106 156740 674291 748587 720251 723534 629820 606898 635617 544123
4446 544123 671873 843866 765869 550995 392504 305782 651692 647813 837623 346393
4436 346393 134594 625707 990934 600919 695571 894531 781977 750999 900030 1053292
4426 1053292 809811 775756 1110388 1170568 1107523 1171724 945638 1231971 1538332 1261632
4416 1261632 1313049 1017324 1358226 1615435 1211942 1242913 1190045 1471930 1687908 1783549
4406 1783549 1732695 1845667 1890821 1924020 2177468 2264872 2103468 2192703 1971228 2252266
4396 2252266 2284708 2499446 2667811 2789470 2732361 2772456 2933704 3153998 3399323 3175579
4386 3175579 3053421 2953541 2418793 2436751 2486740 2256102 2651390 2368697 1845051 1859948
4376 1859948 1576981 1950750 1680175 1813937 2059181 1999566 1954754 1953332 1716410 1870370
4366 1870370 1952596 2082251 1944866 1757696 1861742 1817280 1759270 1489276 1680309 1773599
4356 1773599 1984999 2033016 2058729 2366840 1836762 1879547 2069516 1635359 1764168 2185620
4346 2185620 2108266 2169977 2173475 2233501 2275636 2084223 2291816 2741163 2879578 2739602 3080143
4335 3080143 3268775 2865426 2744039 2858080 3174248 3109382 2915884 3235435 3434566 3765534
4325 3765534 3863512 3825351 3879272 4327469 4433178 4256813 4507423 4194536 4254104 3860735
4315 3860735 3944823 4094282 3957658 3973384 4124152 4253009 3939479 3772271 3900835 3911129
4305 3911129 3880781 4200537 3948519 3886622 3712597 3708730 3893076 3997197 3858122 3886188
4295 3886188 3710900 3942248 4707743 4740626 4409785 4505607 4755160 4930083 4950438 4951207 4979954
4284 4979954 5069477 4479195 4699895 4899280 4609203 4608104 4841328 4950556 4904184 4604289
4274 4604289 4679506 4825444 5052616 4685001 4913443 4956597 4974823 5068558 5093451 5324803
4264 5324803 5414138 4804160 4941136 5129166 4925749 5161764 5317225 5149407 5163700 5013890
4254 5013890 5186546 5180026 5176860 5274902 5524973 5559596 5712963 6127750 6503535 6690810 6859806
4243 6859806 6632058 6284341 6632825 6748620 6812181 7018146 7280167 7243564 7412540 7483334
4233 7483334 7335508 7754546 7856269 7837974 7778135 7831236 7985570 7487083 7574071 7571539 7844986
4222 7844986 7572562 7406593 7578106 7666548 7503267 7612311 7815508 7855807 8155961 8481812
4212 8481812 7949668 8051705 8019433 8095866 8111350 8387640 8782320 8955204 9272637 9459339
4202 9459339 9207270 9600482 9763472 9632614 10241090 10592284 10755776 11049631 11138637 11128897
4192 11128897 10738287 11146226 11486514 11777608 12096860 12546186 12722966 12658199 12774368 13162300
4182 13162300 13510207 13530288 13997461 14455559 14403101 15005024 15658070 16158484 16455276 16899598
4172 16899598 17264307 17532906 18242631 19190917 19927653 20677666 21147314 21648141 22154172
4163 22154172 22893308 24106784 25289056 26507787 27564913 28848533 30072214 31602612
4155 31602612 32801063 34079530 35423478 36994351 38625826 40049449 41072290 42817599
4147 42817599 44337339 45697338 47634768 49738277 51639027 53448242 55463979 57723282
4139 57723282 59812350 61775766 63934264 66252935 68930780 71702866 73987683 76510884
4131 76510884 79303313 82534424 86085305 89270082 93101605 96696495 100004293 104042830
4123 104042830 108181718 112604935 117739093 123525477 129840449 136818858 143880243 151105275
4115 151105275 158634543 165569470 172697439 179691575 186596551 194308727 203176518 213894727
4107 213894727 226312344 240870558 257867351 278469780 301518037 326121247 352069214
4100 352069214 373931712 388937028 399904734 401258147 386424385 363750837 340351855
4093 340351855 313548174 284898232 259617506 239141092 221604322 206178606 192918433
4086 192918433 181649843 171797312 163089386 154580430 146922717 139612244 132776635 126667260
4078 126667260 120642496 114557954 109402737 104694609 100129615 95552295 91863522 87513049
4070 87513049 83344001 79875832 75944473 72254376 69015264 65817697 62790137 60037776
4062 60037776 57698829 55620494 53186090 51380654 49207085 47598255 46435392 45350142
4054 45350142 44165308 43081224 42187776 40866783 39764353 38924869 38011226 37166088 36404548
4045 36404548 35666566 35313056 34355826 33262058 32584858 32021313 31240548 30161884 29573048
4036 29573048 28949201 28181697 27414472 26776189 26063332 25164389 24477495 23597224 22742621
4027 22742621 22041570 21746451 21606872 21058320 20719108 20215307 19603913 19342604 19076177
4018 19076177 18437610 18153003 17614098 17346244 17316910 16654973 15749178 15173885 14782480 14468706
4008 14468706 14005639 14165606 13639072 13381639 13106438 12974242 12564178 12434439 12121456
3999 12121456 11623702 11125304 11242002 11014810 10667865 10706818 10295600 10242206 10109217 10023192
3989 10023192 10005769 9719586 9859691 9727166 9005051 8986916 8632116 8671391 8737436 8276610
3979 8276610 8240862 8122207 7811497 7554860 7300022 6917765 6805215 6910146 6784868 6555421
3969 6555421 6507002 6365565 6362836 6370603 6489417 6436526 6005992 5827253 5874174 5672521 5409751
3958 5409751 5445496 5821268 5797385 5106362 4964091 5127165 5665583 5787997 5516879 5391266
3948 5391266 5428334 5091025 5600027 5287064 4823557 4954044 4536782 4728417 5025077 4993366
3938 4993366 5093409 5247493 5230480 5171134 4844184 4655287 4557151 4410008 4522753 4239734
3928 4239734 4442406 4611365 4777569 4328066 4703430 4842918 4780024 5121555 5084760 4909913
3918 4909913 4904341 5036819 5247330 5058060 5313412 5397789 5741898 5551987 5522804 5741163
3908 5741163 5678071 5619631 5434146 5512270 5532793 5961193 5882395 6336356 6467140 6471578 6043064
3897 6043064 6235346 6526415 6635126 6805109 6953985 7183022 7440109 7668227 8002975 8001865
3887 8001865 7857235 7796531 8224083 8867092 9308694 9625621 10099430 10403652 10951491 11779592
3877 11779592 12570403 13428504 14187961 15138388 15392797 15123446 14128796 12631709 11632570
3868 11632570 10943934 10347520 9483446 9035923 8554572 8331657 7653611 7342663 7121937
3859 7121937 6841225 6800675 6341942 6257775 6327836 5986897 5624131 5588046 5442794 5284996
3849 5284996 5184808 5016486 4727732 4559280 4669290 4655300 4538623 4336007 4263403 4243476
3839 4243476 4310685 4599871 4361311 4024454 3955223 3641824 3345145 3456693 3036637 3189123
3829 3189123 3259497 3661351 3873204 3851165 3309898 3157314 3242441 3548229 3304238 3252495
3819 3252495 3448603 3690166 3820751 3190973 2987467 3338284 3622131 3434774 3735139 3931465
3809 3931465 4003370 4131052 4246704 4252989 4479432 4641499 4549563 4553104 4304374 3818161 3649700
3798 3649700 3417941 3581623 3588663 3262365 3098727 2697088 2770678 2754126 2348851 2323062
3788 2323062 2522102 2185454 2341908 2432248 2045441 2167758 2343464 2404583 2237133 1869684
3778 1869684 1631980 1987568 2332392 2244873 2092877 2215502 1764285 2104513 2113015 1959788
3768 1959788 1945016 1814654 1539476 1606687 1868818 1707511 1796956 1900731 1875410 1674310
3758 1674310 1572037 1632986 1938344 2057589 2042291 1925725 1840712 1989955 1746257 1746742 2102519
3747 2102519 2337510 2153774 2176881 1767452 1834250 2330178 1904635 1774315 1858441 1707801
3737 1707801 1633590 1604659 1497108 1415808 1842970 2111160 1703932 1591926 1652533 1773405
3727 1773405 2117265 1728057 1831483 1855384 1818248 1973746 1918215 1765126 1755420 1522954
3717 1522954 1832290 1926387 2181606 2573187 2068790 1935076 1862092 1887759 1668302 1824435
3707 1824435 1694648 2045719 1998715 1716433 1842708 2051117 1825656 1999753 2284484 2236304
3697 2236304 1968541 2070076 2268326 2606131 2879769 2754077 2515904 2519783 2546273 2616039
3687 2616039 2433745 2454396 2707603 2981514 3331532 3304254 3137951 3343437 3112174 3142848
3677 3142848 3478642 3518923 3650395 3563334 3702295 3748255 3555738 3516522 3852423 3827990
3667 3827990 4123801 4290336 4257157 4186438 3834171 3991071 4029290 4195297 4426586 4442467
3657 4442467 4792352 5027091 5189342 5521144 5615464 5612656 5681294 6022478 6091106 6461846
3647 6461846 6435392 6315082 6830404 7025523 7416909 7584361 7986129 8436973 8771302 8799769
3637 8799769 9140862 9195592 9513390 9903752 10308681 10519895 10925384 11103505 11546022 12060006
3627 12060006 12005898 12470963 12844432 13026259 13424637 13920448 14133088 14441381 15015006 15640647
3617 15640647 15768465 15951803 16519062 16489714 16316191 16445125 16533529 16579805 16400568 16123650
3607 16123650 15632605 15535543 14923235 14686274 14623305 14091439 13394633 12932008 12591846 12201844
3597 12201844 12017877 11520233 10926649 10307640 10084434 9929461 9935967 9668597 9150046 8975415
3587 8975415 8253991 8277771 8120841 7635768 7518850 7462711 6947578 6822706 6984341 6808397
3577 6808397 6442106 5874617 5570436 5402661 5150344 5101980 5216601 5035527 5049269 4708211
3567 4708211 4753554 4562873 4356123 4249369 4170739 4172433 4344663 4331073 4118005 3976646
3557 3976646 3928289 3753480 3541882 3623851 3500727 3524884 3408993 2901417 2728070 2992919
3547 2992919 2787654 2620476 2670919 2587071 2418064 2423478 2810361 3015416 2834984 2547440
3537 2547440 2472205 2541863 2495016 2436247 2352267 2391697 2496143 2464291 2043132 1868212 1878349
3526 1878349 1654253 1771519 1675434 1594644 1900020 1819948 1682491 1990210 1785137 1456584
3516 1456584 1520463 1695554 1899988 1803926 1574809 1629767 1183557 1332172 1623815 1521059
3506 1521059 1445482 1609294 1437979 1415982 1532740 1710693 1815712 1403980 1123857 1346399
3496 1346399 1353531 1224589 868094 1231775 1299719 1524498 1318894 924814 1115932 965920
3486 965920 1113231 1174372 1170589 1298762 1454419 1360696 1253030 994407 1391486 1243632
3476 1243632 1280553 1403998 1304542 1095852 1014196 871891 953667 1198014 1258764 1234447 942212
3465 942212 635502 1204073 1369796 1093302 708279 1239421 1275983 1057450 951401 777936
3455 777936 831742 633213 717686 964016 1034068 966451 966957 1045903 939249 862940 1157044
3444 1157044 965512 379732 657222 1034493 809749 828320 947583 1247224 1133383 826563
3434 826563 956104 822848 995228 908420 714009 1050171 1074108 1201766 907526 989691
3424 989691 1016556 1250710 1551011 1225481 1214513 1137787 1233003 1074393 519985 708491
3414 708491 841726 711517 907049 1006277 743482 533816 982777 1143378 790031 759555
3404 759555 1179691 1292344 1223338 996976 847330 965880 1265980 1472808 1097915 797315
3394 797315 843247 1345644 1679561 1725857 1549906 1576176 968572 907725 840483 848931 1001434
3383 1001434 927446 834530 687519 918484 845688 1032212 1072146 921252 949522 1065519
3373 1065519 1028149 1244287 1407045 1086542 788075 558218 786349 1097410 1071759 816970
3363 816970 963300 1301018 1439000 1121073 1083135 1142162 1301638 1516863 1209618 1259624
3353 1259624 999142 1563338 1417234 1383332 1558423 1506103 1467265 1616332 1692769 1116673
3343 1116673 1250384 1395602 1880486 1796183 1937209 2187448 2106470 2244059 2121063 1839766
3333 1839766 1808214 2297855 2578249 2482356 2617127 2741758 2554945 2416404 2467737 2525304
3323 2525304 2810613 3274863 3444678 3363607 3610813 3697858 3688170 3500791 3609909 3640990
3313 3640990 3769462 3928549 4302687 4150136 4083572 4798416 4994094 5063982 5142544 5558737
3303 5558737 6024232 5913650 6183032 6574293 6245322 6232495 5875683 5600674 5395109 5382560
3293 5382560 5310523 5647329 5761813 5800324 5733252 5833180 6054991 6239161 6452348 6423298
3283 6423298 6699675 6620284 6607974 6703216 6777240 7179640 7347038 7786390 8537332 8645413
3273 8645413 9032416 9922600 10138087 10182711 10720772 11120116 10762588 9807882 9212599 9075423
3263 9075423 8642639 8268727 8118789 7964899 8106849 7764432 7652529 7606881 7771223 7868553
3253 7868553 7659377 7717374 7945323 8062682 8263385 8388103 8684637 8909104 8461557 8748801
3243 8748801 8963596 9119439 8770220 8829325 8980303 8784708 9196649 9344669 9064417 8587584
3233 8587584 8237258 7887558 7938845 7573284 7808973 7273495 7045192 7069105 6957747 7498133
3223 7498133 7701487 7841766 8192375 8329915 8239447 8229315 8800446 9186195 9015261 8427845
3213 8427845 7468636 6994491 6967620 6759302 6148965 5825212 5677627 5877271 6101870 5991382
3203 5991382 5918084 5541079 5406257 5479301 5216311 5614583 5439696 5497199 5943090 6135701
3193 6135701 6071687 6257864 6666884 7094702 7333046 7675771 7260977 6447085 5601106 5075112
3183 5075112 4737633 4401554 3985715 3696950 3547132 3507395 3460734 3223440 3044903 2871674
3173 2871674 2758310 2796811 2437414 2214332 2440327 2636832 2385685 1891820 2207032 2762245
3163 2762245 2658011 2241028 2045784 1444777 1119760 1352990 1446035 1488364 1724340 1451374
3153 1451374 1287185 1185649 1097552 1218084 1071193 897513 1087649 1208303 929205 1081576
3143 1081576 1397514 1418180 1353221 1197898 1105620 999595 1036484 1205177 1097450 758300
3133 758300 696527 1043062 1241026 780405 332730 688002 900983 826912 981657 913578
3123 913578 828480 599120 423208 232573 345707 431324 712602 603912 826039 763584
3113 763584 693329 839658 811169 807984 249054 243371 491432 455727 227546 295563 313644
3102 313644 425107 678288 605998 620748 462385 422808 410264 464088 535404 246074 303465
3091 303465 -153304 77168 317921 552461 605950 462620 543512 429415 328254 498237
3081 498237 494039 451889 246947 81599 479463 616393 827351 617100 419549 407278
3071 407278 150062 -114919 -9631 -120542 41678 447475 394531 550550 500640 166659
3061 166659 225494 -2388 290662 284981 240057 402335 406698 134387 317779 632940 263695
3050 263695 293707 276065 24869 233847 329382 474624 446855 534040 99699 -108362 265840
3039 265840 -138213 -138761 122636 20454 -288107 -232679 -181105 -160297 -436472 -199390 104341
3028 104341 -98791 151141 204775 277932 185353 178774 162513 162017 -9858 55790 54275 -3802
3016 -3802 34046 -22291 258067 14235 -56476 110055 201412 78541 231013 262885 294409
3005 294409 356712 269618 231178 151261 12557 15837 135550 107349 314122 116810 -139
2994 -139 426726 506559 678940 540685 506321 430527 -206631 -83589 311197 299353 71324
2983 71324 427635 242388 125555 304170 152755 408886 -91782 -225356 -151728 205019
2973 205019 -45539 -149364 -260775 -98221 303519 526652 393108 325845 88289 189996
2963 189996 75545 -55816 -213410 -286816 372480 222703 -127163 64935 91767 98
2953 98 -13776 7507 110718 105288 46654 -299865 -211799 -122021 -268533 -516152 -65305 -33322
2941 -33322 187801 145894 353022 413136 65814 169015 55198 299092 -23961 -7156
2931 -7156 303410 304112 -145533 -190745 987 85444 104096 310033 274887 -118499 -334144
2920 -334144 -313132 -327592 -456249 -276317 -127837 89077 91952 -39801 -219264 68493
2910 68493 -32149 -70338 -288941 -404977 -89345 298057 253811 126385 307482 313729 138428
2899 138428 38393 152866 -257721 -214841 145628 312899 469805 239116 334510 480257
2889 480257 245217 109822 158648 -5470 249529 381020 310933 135965 215241 246900
2879 246900 442363 473592 510024 491826 -120979 -243245 -34252 -23982 -235399 131302
2869 131302 -29205 -514331 -196387 35184 -169331 -308559 95367 526023 464207 114749
2859 114749 22052 -2238 104091 -125102 -303295 -190733 314756 82172 -70309 46561
2849 46561 95675 77038 456267 473645 132168 177043 -217394 -153912 70424 150458 296960
2838 296960 514861 52522 -43480 63818 -99481 -410985 -267969 -135942 302495 386482
2828 386482 88109 175342 172554 -198635 -90120 134116 60785 104357 59795 202908 144078
2817 144078 156099 134682 351080 39640 -100157 405337 365337 75442 -201147 -370116
2807 -370116 -315602 -63376 121778 83534 -22860 315945 293439 106737 -6082 28834
2797 28834 19542 -51661 -18717 31098 547290 624682 338377 372960 307140 180845 26914
2786 26914 -45559 -168058 -33329 -300083 -435301 -126932 -200246 -330452 -586072 -116155
2776 -116155 235993 -111885 -150839 -90627 -39829 -18115 -241027 -229797 -228825 -276391 19468
2765 19468 57288 33541 -229614 -318993 -175911 40315 113520 -231250 -212435 150770 71981
2754 71981 -36330 177470 124203 291127 -183838 -570145 -325321 -312553 -276008 -357617 -298054
2743 -298054 -242738 -350910 -107767 150326 -120806 -119789 109321 238542 -107374 -413001
2733 -413001 -535157 -281690 -529637 -330771 -267875 -343371 -138446 84737 38755 -189627
2723 -189627 26063 171744 52332 -118091 -16624 355350 279044 166928 302562 -186400
2713 -186400 -9360 86340 -198933 -443767 -463473 -464513 -387817 -229147 -209807 -35794 -211033
2702 -211033 -533027 -105359 6240 -315539 115905 -13622 -443766 -123215 22262 196210
2692 196210 168575 -35702 -32143 -53819 27381 101258 68279 42636 -549578 -441650 -41354
2681 -41354 208815 201353 -114365 74200 254199 157908 87919 -331275 -465245 -201715 46753
2670 46753 191021 128372 -138036 -129165 78694 -62911 -260830 -231129 -145719 42594 -80032
2659 -80032 -144739 62924 139394 86301 117102 -77522 -86183 121603 212094 -126660 -256154
2648 -256154 276527 104347 24687 153000 509132 474239 97595 -298738 -152644 -195273
2638 -195273 -568467 -290152 -395560 -414775 -341537 -310567 -9274 -145469 -355620 -57319
2628 -57319 -109529 -322842 -609206 -513268 -137297 -290256 -430336 -390091 -640376 -488194
2618 -488194 -197812 209 -76760 -232255 -225581 -65833 -24729 -329428 -310717 -65460 -182904
2607 -182904 -45055 76603 -150535 -190381 -252933 -617200 -472313 -332702 -115216 -288728
2597 -288728 -168857 -141545 -193075 -150123 -268986 -304049 -511661 -383192 -230787 -276318 -798577
2586 -798577 -719786 -247250 67448 -225540 -271155 -108603 -230432 -182540 -397663 -655143
2576 -655143 -567553 -739958 -301213 81015 -218706 -381006 -181038 -109918 -72033 -202210
2566 -202210 29444 7313 -94419 -73786 -75325 -197354 -4674 -277082 -210524 37996 -209591
2555 -209591 -349324 -292105 -267203 -347487 -251036 -1898 205526 347679 144039 99631 -127504
2544 -127504 -278062 -267103 -435047 -249256 -403326 -195843 19157 -255302 -145562 -108896
2534 -108896 -29123 -110039 -116008 -122109 -159195 -47357 12404 -113007 115106 128036 -61045
2523 -61045 -51979 -120191 215909 150409 -47433 -110193 179911 148102 97612 -96090 -264503
2512 -264503 -145529 -79726 -168128 -532294 -630028 -500440 -305397 -387923 -510920 -319100
2502 -319100 -483206 -322934 -141198 -296835 -427279 -362920 -132052 -232085 -516715 -390155
2492 -390155 -410662 -244824 -57347 -131789 -27411 -19582 18545 138954 -97849 -224825 -182918
2481 -182918 40568 89653 152182 312913 -183913 -239826 -429096 -197865 -488375 -570593
2471 -570593 273252 279983 -398923 -513924 -251614 -336812 -83283 -64471 -451217 -189482
2461 -189482 168963 211711 22198 -220565 32270 12469 366000 219249 -5201 -145433
2451 -145433 313354 279287 -96605 5874 -45453 -346926 -357842 -15739 -206002 -161115
2441 -161115 -320238 -438763 -114703 -84616 127218 92040 -200274 -462581 -218768 -230226
2431 -230226 106077 274670 346351 350066 295570 97306 325510 332506 403571 461689 368895
2420 368895 138459 -85858 -9069 -239322 -184179 -34966 -148474 -329930 -249781 -314015
2410 -314015 283448 183288 63567 -219936 -463649 -57319 174675 141152 168221 262046
2400 262046 224651 411971 635309 592552 378081 238617 -292645 -429328 -268177 70504
2390 70504 208528 67673 427009 747053 689665 128336 286072 223783 90705 -170462
2380 -170462 30149 326201 542454 383080 614377 1008890 909599 552541 436523 627067
2370 627067 370656 -62521 -52008 11860 344756 413041 391698 660694 764202 116168
2360 116168 189644 439390 241752 636662 602518 469337 695488 512910 109748 109870 64203
2349 64203 79988 288817 468920 182767 203331 366659 338316 230299 418182 342620 -58364
2338 -58364 193689 310050 171408 322143 371308 462601 601032 418720 151438 -25553
2328 -25553 -44713 -190196 -164432 270744 426836 63154 -28428 -39161 38544 52688 -214249
2317 -214249 6961 64015 26863 -6601 10845 223247 103844 30603 578677 404402 107986
2306 107986 234205 98370 286824 322912 482374 586744 545735 609565 519544 466991 149835
2295 149835 279745 772861 621004 320511 150038 186667 455662 471175 483868 379632
2285 379632 416945 497882 373877 511629 565339 410747 552052 381083 425293 706743
2275 706743 373717 453430 737769 660109 740475 774489 420941 190939 458675 514305 563013
2264 563013 347252 517659 707228 601436 735236 651909 579938 973918 1212055 1129744
2254 1129744 759131 1024978 959740 1344299 1331171 1062196 1114231 1074292 1220741 1123695
2244 1123695 1256567 1018059 895875 1095125 1174406 1179269 1211927 1281866 1308893 1236009 1153449
2233 1153449 1292713 1378784 1222944 1382786 1131077 1124572 1176282 1336713 1356392 1281171 1217796
2222 1217796 1212261 1163730 975044 1214379 1157972 755553 755616 1006549 1177082 1696474 2063848
2211 2063848 1896300 1910348 2052669 2043565 1631570 1666133 1888893 1824187 1765403 1525557 1763341
2200 1763341 1864485 1674745 2095583 2733487 2507786 2041302 2177195 2242226 2352906 2370455
2190 2370455 2549480 2763666 2717841 2805185 3001463 3015965 2782162 3052734 3131823 3068181
2180 3068181 3148532 3161919 3241305 3625832 4076966 4116851 4008734 3792355 4065548 4545068
2170 4545068 4758631 5176777 5256388 5399903 5734915 5806418 6613669 6990095 7390556 7270513
2160 7270513 7423672 8033880 8216314 8365581 8660009 9057355 9387300 9756708 10550819 10940110
2150 10940110 11374020 11741927 11747665 12418797 13025993 13416622 13785385 14317201 14611785 15500622
2140 15500622 16162849 16883123 17688972 18234939 18836690 19837545 20272514 20865867 21694445
2131 21694445 22762340 24029172 25401181 26709383 28240282 30244067 32063080 33985714
2123 33985714 35321347 37097949 37950752 38650550 39430132 40848622 43094177 45686679 49020894
2114 49020894 52811247 57036409 61498677 66698305 74425712 81906610 89581930 94767730
2106 94767730 90216441 79041545 68955201 61646855 55646942 51145950 47222946 44278011
2098 44278011 41482514 38862430 36815831 35026075 33391854 32203380 31150059 29927451
2090 29927451 28094408 26000222 24593092 23404890 21975405 21154647 20069638 19229164
2082 19229164 18635287 17618224 16572393 15619308 14631523 14348070 13779048 13288772 12731882
2073 12731882 12141782 11481329 11058952 10839159 10211013 10111252 9463500 8716262 8854649 8652132
2063 8652132 8205541 8226120 7840398 7891233 8068583 7623922 7642192 7604999 7127366 6801987
2053 6801987 6618842 6426156 6211069 6143133 6200164 6186015 5733687 5707553 5601073 5655838
2043 5655838 5731518 5546322 5268202 5025103 4650938 4400344 4116367 4130195 3942012 3862121
2033 3862121 4047307 3944207 3573963 3552763 3723536 3634968 3604048 3482547 2890351 2910336
2023 2910336 2927448 2747630 2929135 2697628 2968849 2840779 2645038 2297155 1985397 2008973
2013 2008973 2125311 2034334 2158511 2045291 1895901 1955483 1705857 1660109 1847048 2114550
2003 2114550 2065494 1884369 2066974 1846826 1574498 1612669 1979812 1774446 1542856 1351576
1993 1351576 1584923 1528760 1451820 1608616 1444987 1232511 1136029 1098834 1233174 1205017
1983 1205017 1025815 1035991 931766 1061724 983390 1184557 1169424 1253685 1093499 1168532
1973 1168532 1053022 867656 553931 483350 893585 870278 1031063 1214500 771195 793369
1963 793369 783097 524298 327170 640091 653284 662406 466337 640555 759233 437651
1953 437651 600187 821060 524491 646719 644648 549671 699827 425767 384574 185576
1943 185576 442158 545360 681879 527220 574357 838855 728148 685747 855873 471322
1933 471322 259172 219527 -140455 306360 45844 -74118 328464 -17757 125975 186795
1923 186795 399042 546781 459938 316231 325122 346782 391901 214805 454304 565731 316513
1912 316513 340863 249817 109671 173980 416939 69152 -58191 32784 377894 699160
1902 699160 540609 209997 30369 424778 559258 291143 302840 255711 437244 335426
1892 335426 336241 370821 -12920 -107335 205306 397402 260043 252618 365865 -99087 -52375
1881 -52375 350313 198529 183094 223714 264949 389211 336551 154192 -20173 168266 721513
1870 721513 618853 577005 467326 439396 251729 336795 642241 581731 272401 121345
1860 121345 398235 249331 217134 449106 305010 244450 173000 373755 265471 341511
1850 341511 223225 290145 152437 259473 498500 289911 348373 102166 43075 371560
1840 371560 335074 472300 537951 374574 539666 372180 317332 217811 444019 413084 124214
1829 124214 81317 214299 223119 326955 226606 60067 171982 568005 187983 -147514
1819 -147514 89523 221675 323059 277784 238251 169678 -47835 303638 238904 -7072
1809 -7072 -26106 223248 361369 363194 319420 165319 272989 115960 -7111 -168947 10680
1798 10680 286037 236921 248728 473809 84914 -36278 151588 66999 -21290 -90378 -197332
1787 -197332 -25438 268388 351552 203308 85373 98574 131019 332944 -103152 -44121
1777 -44121 4403 335177 103654 104721 243001 -72074 -51663 190485 386497 30850 -170831
1766 -170831 -324401 -101216 1350 436375 675436 199053 -160240 8288 37010 263094
1756 263094 273442 134532 335199 56013 -151806 -124143 -109258 -154220 46740 263990
1746 263990 232125 -35040 186148 -82688 -409686 -455949 -157389 109686 -199810 22025
1736 22025 210556 65932 64234 -293114 -309038 -63731 -207194 -34943 67416 -30179 149651
1725 149651 421989 177009 79258 22379 376629 327414 468904 244737 -163804 -269773
1715 -269773 51506 264391 241485 44409 81068 -35310 -96485 84235 -17069 -156291
1705 -156291 318173 335968 -54285 -159666 -90506 167963 -17497 -143038 41287 411226
1695 411226 183651 16189 -263974 -341402 47020 -120 -181936 -485517 -187311 8157
1685 8157 -262434 -257309 -26727 -57266 -191318 -234045 -84199 -25985 124847 -39885 -299527
1674 -299527 -159978 -248319 -220037 -141631 -242344 -60179 -56670 -291424 191880 209740 144308
1663 144308 130858 -306458 -163065 335482 182163 130245 204724 384357 203303 -18145
1653 -18145 -62648 132524 51696 -189247 -82625 -23132 -481324 -315786 -206905 -78177
1643 -78177 95424 56953 149551 413234 94478 83960 -75060 -339194 -363758 171849 315137
1632 315137 139147 158983 65030 -18028 -161717 -192339 -186032 -227361 43428 -3137 -308835
1621 -308835 -185887 -72179 -248610 74495 312619 89367 56443 -154553 30732 -110646
1611 -110646 -21960 -155614 -176799 -301838 -121437 106980 -204717 -253906 65009 -36655
1601 -36655 86579 -435920 -449916 -431366 -382140 -21787 441133 121624 -240063 222892
1591 222892 214480 221931 -102806 -182817 -149347 -61243 319537 166484 36064 -142733 372116
1580 372116 91667 -458694 -251084 -196517 -160493 -56865 42377 170044 179799 104806 58889
1569 58889 116260 256024 195182 52058 -15461 291769 38775 136110 -118186 -85347 318224
1558 318224 158008 -32587 -55219 -50425 -290470 -619230 -396848 -387244 -548995 -514942 -378704
1547 -378704 -135370 31169 -71441 -276221 -50884 -163555 -445185 -124016 145666 189383
1537 189383 179207 -133283 -353313 208401 143240 -108442 145462 -344961 -422069 -170044
1527 -170044 -357514 -203030 -442134 -978628 -1032621 -374563 -33243 -62815 -15933 -615
1517 -615 -81434 -125177 -36580 1741 136063 413275 385746 154103 -185464 -389797 -205296
1506 -205296 -84582 403825 127471 256350 127208 -67718 206355 363761 388454 41030
1496 41030 166934 69271 337242 218797 187979 -187380 -164437 48401 -63971 -147114 -97697
1485 -97697 -178715 -372300 -69708 -8306 -217166 -297657 56498 -350586 -255279 22274 -54583
1474 -54583 57213 -11151 -226564 -110125 -121764 -207457 -569125 -599431 -320857 -52857 8293
1463 8293 -245787 -546578 -498646 -345553 -92064 43808 -28215 180873 -64288 86998
1453 86998 -172378 -196846 -259974 -199967 130115 211931 3899 29390 -195560 -306908 -341533
1442 -341533 -331692 -284244 -309231 -136286 -262939 -109174 470484 619242 154344 29813
1432 29813 -349212 -175403 -406522 -16096 50369 -35584 156835 -144732 -200712 -180605 84041
1421 84041 -338396 -497644 -101210 -137948 264401 155571 183254 260031 375047 150442
1411 150442 -110452 -250183 -121984 -372057 -318064 23844 -120498 -124488 1991 84625
1401 84625 -96582 44483 -164343 -18231 35852 2045 -162151 -225242 -365267 -12905
1391 -12905 57107 -237189 -36285 -96271 -214919 280411 32322 -1744 188303 110134 -13191
1380 -13191 -273966 1377 -48594 -13709 -117593 -36064 -381640 -577942 -202748 -155365 -215265
1369 -215265 -256244 -177496 -407836 -390424 -448395 -26060 -280151 -191172 51986 -848 75100
1358 75100 58988 -30382 5156 71453 -233136 -145729 -104287 -443863 -380358 -458831 -355612
1347 -355612 135164 164398 -137049 -717349 -405682 -276028 -488660 -519456 -297228 -212526
1337 -212526 61022 1604 129151 196454 106011 397784 217788 -386457 -419334 -187322
1327 -187322 -138746 -281973 -275490 -365513 -198530 -38225 -187843 -192980 -314931 -241353 -397618
1316 -397618 -409595 -319945 -365313 -68699 260204 -151310 -573522 -554089 -693459 -467771
1306 -467771 192407 -11564 95196 74182 303362 200795 151449 -272061 -201332 43855
1296 43855 -248242 -157880 84747 319779 210567 56139 78515 -37017 117068 294462
1286 294462 378190 367235 61451 -99554 -242905 -80431 184630 128129 4580 78752
1276 78752 -36816 -198052 -14554 -213687 -496623 -34458 211348 -336141 -415413 -520332
1266 -520332 -163999 197837 31847 78167 -52635 222493 -82446 56949 -92039 -499591
1256 -499591 -356600 92196 -123864 -234915 -229577 -269298 -230951 -323159 -237658 91682 123689
1245 123689 202882 -123259 156679 313561 120824 215386 226222 -213417 -275152 -229006 -268853
1234 -268853 -202076 11424 151244 -28905 -151568 -386404 -97177 -19622 -88459 194531
1224 194531 41639 58229 217805 201995 -158842 -29000 -252626 -348518 36972 -36122
1214 -36122 -37277 -140023 -379455 -331607 -230727 -171279 -171470 -498524 -291985 -193066 94380
1203 94380 -212437 -436896 -443173 -124843 51562 -409880 176884 192307 -322566 -9036
1193 -9036 85694 212540 -57362 -127442 -257689 52803 -88935 -131587 -223338 -397492 -70895
1182 -70895 -56474 -70855 128067 226029 -343963 -428840 -119838 -104145 -259137 -163811 257935
1171 257935 159930 165764 187866 46668 -138870 -476999 -453365 -269337 -186958 -361537 -358775
1160 -358775 6598 35754 -9277 -213299 -64350 -313018 -448372 136843 46412 -143153
1150 -143153 -104396 -163187 -288408 -109306 -6260 141964 -71594 27637 265552 347486
1140 347486 217270 163732 288886 207439 59515 77507 -335805 -299697 -473527 -250585
1130 -250585 56054 -25045 330500 -109699 -180781 -232311 -313902 -388116 -319112 -510387 -336743
1119 -336743 -24811 -350654 -256094 -416742 -470613 -50791 -71454 -2279 -151279 207270
1109 207270 294019 228553 -111905 -20239 15211 346631 150535 -344702 -186625 105125
1099 105125 -233366 -290967 -218174 -354933 -75891 16388 -110272 -428746 -405756 -84714
1089 -84714 -60972 -216685 28993 171114 380478 145165 196678 176059 205249 -45404 207939
1078 207939 308695 266352 230470 6526 317621 129021 -471624 -186344 -30138 -155044
1068 -155044 -134775 -371649 -549482 -260957 -198752 -241282 -219121 83942 174521 298512 305708
1057 305708 48411 75285 -26488 -130471 -188284 -16022 563966 590051 522805 307270
1047 307270 -83480 313364 172236 -26190 207507 -112636 -363963 -287197 48390 135281
1037 135281 40109 22760 87875 13235 325375 327752 -331204 -659746 -15780 218382 154839
1026 154839 -102721 -93290 -196465 -32358 43761 102076 -36207 -108235 -75045 81233 -134903
1015 -134903 -380515 -239202 -201357 -182602 -367554 -194458 -346477 -430649 -418304 -23105
1005 -23105 -441671 -203532 112247 478270 218413 -391043 141533 422250 87090 -205183
995 -205183 -130836 -51441 -104581 40489 198321 465275 215249 164569 125657 -43105 -468
984 -468 65522 -277415 -88916 64243 -13970 51476 82421 -30406 -137052 -120847 -147826
973 -147826 203803 156652 -219717 -128476 -421488 -306870 279300 415110 351724 536031
963 536031 216215 -111246 20331 109937 36679 -386872 -677242 -634466 -695692 -566408 -562260
952 -562260 -452618 -457164 -264250 -313232 -459674 -40978 397882 359391 60262 57876 -374052
941 -374052 -261212 -118753 -189629 -468250 -584492 -316966 -410213 -280915 -291509 -167489
931 -167489 346080 183133 -93138 -38241 -139164 -27216 298233 90841 -280513 -49172
921 -49172 -323892 -89879 192420 204262 -25193 -438098 -291408 -31810 146749 -452473
911 -452473 -158399 -22477 -229669 134108 598015 -21680 -55476 -243073 60954 34691
901 34691 417371 671879 444909 73134 -99725 -191444 -314325 -99262 240440 27090
891 27090 -110161 -182226 -224795 55580 113155 -127652 -6327 -225535 -326480 88146 256003
880 256003 600940 328657 378095 208380 -95028 -198674 -408364 -518923 -342337 -237451
870 -237451 -303016 -267336 -49685 -333767 -323527 -304488 -17129 -255865 -128873 -160517 -247214
859 -247214 -134029 -328336 -177873 -246271 116740 328972 169400 155270 -81901 75485
849 75485 -349629 -197588 -216272 -57064 -228316 -157269 -7890 136406 -181257 86745
839 86745 253305 223160 336202 9284 11771 -294462 -273310 5670 -141638 100120 328446
828 328446 124732 72515 276114 205192 -2868 26444 173249 299859 120822 207232 -227072
817 -227072 -308181 -416202 -164049 -141563 -148256 -217487 88503 72454 302569 305397 -75507
806 -75507 -176466 -168589 -525422 -340593 -74603 84402 355102 266395 424754 339645 49686
795 49686 224230 -48490 -267143 71039 365397 32956 -211301 127700 70936 -154173
785 -154173 -342189 41228 -3651 200752 214971 -50978 -120499 160954 270366 179101 -119819
774 -119819 -80215 -5502 -2823 219176 58884 -192869 -196656 134181 -48984 101802 217850
763 217850 124002 151692 58342 -25132 -35738 48613 7090 6359 39743 -140514 -136286 -220681
751 -220681 -36358 35541 385848 425896 135772 54192 184168 314143 310787 76649 425916
740 425916 363473 344039 410101 -148880 -49520 -43904 -526811 -347727 -52477 -7693 433335
729 433335 161339 -29729 -30518 136025 189942 -92076 -278543 -170564 95391 247800 165379
718 165379 16677 -4264 -251889 -299764 -196468 -93588 263318 471164 142768 297105
708 297105 -116573 -111240 81664 -355865 170765 303727 61404 -37562 -53891 132925 -43058
697 -43058 70396 -131081 54925 501362 367115 283859 -218098 -29324 236223 305338
687 305338 93939 -302672 -512040 -265712 -673288 -667741 -113526 -170666 -19297 51462 -2862
676 -2862 44073 178198 119098 -223661 -31785 -53404 -23986 74921 -72077 -348144 -132838
665 -132838 13977 -126889 -341495 -339687 -445785 -213388 -138899 -333800 -200915 -91676
655 -91676 -397680 -145098 16361 165256 84588 -56986 -16466 -69377 -88369 162063 164975
644 164975 -153852 -102933 -108572 32917 8512 -203080 -84588 -266370 -459018 -443798 -292184
633 -292184 -346455 -87165 -239954 -67726 45605 -156772 -94141 -90735 116581 -67283 174236
622 174236 198076 309545 -171136 -139510 -121283 162082 230619 -247846 -151450 53495 179092
611 179092 8195 134000 268387 396320 202891 93451 103136 -76277 486987 276869
601 276869 403572 410433 44931 266020 197644 27340 394056 205998 72758 -173017
591 -173017 -118417 -189020 -33532 423925 188044 173604 214920 -18781 -221898 -325293 -177905
580 -177905 -8101 260867 551692 474406 262498 366176 176565 109704 120919 197469 25856
569 25856 45440 199067 211962 182862 280753 64888 -161861 -74285 58564 16095 474149
558 474149 580640 488438 119051 141201 377512 223516 -106665 -30982 233625 187243 135910
547 135910 -17828 -196720 20038 375148 134627 373649 167492 279294 230144 -6239
537 -6239 -121865 57531 -73056 -114362 43444 -185503 -408232 -399974 -413504 -226018 129288
526 129288 204219 -106726 -192986 197067 -37915 133941 195250 10636 -34195 24543 26940
515 26940 13401 80733 199266 199459 47790 217984 143800 -26876 50677 298656 165160
504 165160 317240 300822 201210 -243334 -110945 -312894 -203293 122069 333741 204762
494 204762 8722 -23021 331196 148691 -50135 10087 -184610 -469714 39328 232944
484 232944 156631 246877 469851 629768 203679 162927 375453 361572 426454 423908 390075
473 390075 87270 -89830 -39485 -21700 252476 204973 167101 -48801 145258 162634 87091
462 87091 202612 279702 530059 279497 75364 -27397 -19540 -94999 297768 361297 508512
451 508512 498147 323678 189246 88226 -108572 -362256 -85888 -64961 99921 169805
441 169805 244817 281133 -15690 -242567 177249 114982 65390 -128507 -153636 239888 297269
430 297269 415855 275628 52329 135625 357502 182627 -34135 -237660 -472412 -254840
420 -254840 -65348 -23447 -132517 -133185 213712 172160 -220 560521 367779 748253 214370
409 214370 -270071 -411161 35348 250556 274690 334157 82891 98470 98861 -50945 295044
398 295044 370629 616563 479123 380262 350894 292466 583039 452281 206011 135368 178325
387 178325 78104 -195663 -73095 141236 221820 289553 425691 321265 293777 369945 364452
376 364452 390837 277150 -252099 -38664 275422 164610 44086 -225427 -111592 -83895
366 -83895 -233294 7524 186497 -53169 19446 90582 -38116 107162 442887 342906 185832
355 185832 26159 440867 139992 140542 63632 -21920 50991 25144 184154 430285 330365
344 330365 503481 126042 360859 479587 208397 164325 291544 654371 534900 544652
334 544652 498304 462413 587440 118704 -140700 55258 359313 168523 -46833 120272
324 120272 392909 325166 360570 385565 392038 290052 -87619 -115371 -167778 -388976 -198638
313 -198638 22678 -55001 261482 266273 93733 244628 131986 274643 772398 641158
303 641158 348327 283531 161774 219815 -71065 -24126 -29587 30516 490646 379953 249122
292 249122 475964 480640 117050 27577 421255 31928 -221097 -116682 135250 -86346
282 -86346 -279585 104812 -98292 10460 224510 265282 172660 266766 182677 -25353 -56158
271 -56158 414597 307736 -81986 304740 312070 263070 455842 355471 258942 -159322 -13083
260 -13083 292507 121497 37628 141299 134850 322192 360683 172975 -214931 236140 530460
249 530460 785817 393939 -62085 73980 310784 440666 628697 473623 731087 647668
239 647668 181651 -35881 42870 497483 392609 540956 613366 510044 314845 362401
229 362401 348027 125488 -178121 98057 314339 275566 432006 482541 246383 -79583
219 -79583 33210 176148 99102 87157 24907 177732 231471 333619 739398 672270 535442
208 535442 571525 491797 439098 259520 114131 -146276 -77234 -37265 126334 -46706 -95583
197 -95583 -18839 -194169 105600 179529 -54114 222571 358859 470922 397360 439384 329060
186 329060 376963 566076 265436 76155 91621 302751 332182 314088 50948 229636 262325
175 262325 -102177 -128416 -68720 255993 609251 287342 -81293 448020 203143 140613
165 140613 143366 -216459 315211 287335 236072 181025 158640 275538 172757 93760 222566
154 222566 592458 746865 220686 29505 206432 250251 260886 532339 443883 474202 511894
143 511894 266235 411656 218844 -51046 -312014 -1480 173376 252126 353293 85945
133 85945 -63502 -45173 340976 207785 218584 147778 219125 615884 602892 459256 610748
122 610748 441706 352557 498116 296950 387058 -120746 90079 338253 380033 77583
112 77583 233633 401945 6496 150476 383715 379133 201429 482589 357920 309519 61007
101 61007 8853 128501 85677 379404 282507 241067 261084 305200 390201 -15099 -52643
90 -52643 -16939 88147 252548 114905 360042 257857 263614 375059 440095 362055 -21801
79 -21801 200938 447165 368170 356104 284260 364314 509778 148939 221414 415584 335360
68 335360 221515 235366 94630 154425 343776 347064 545167 441848 84432 152378 198222
57 198222 249131 205970 117505 51993 202046 287982 101610 91398 289685 392508 454730
46 454730 287311 434427 257300 432548 485820 329027 77505 -140449 81205 384624
36 384624 475229 501737 625258 268564 334632 217166 228867 215601 213154 333279 374199
25 374199 428802 441448 280557 395981 331402 334046 350982 225018 232758 272104 119132 297502
13 297502 211694 273270 330965 284497 349624 292543 330432 289209 116671 296072 267937 122129
1 122129 176979
0 176979
$$ Imaginary data points
##PAGE= N=2
##DATA TABLE= (X++(I..I)), XYDATA
16383 -691701 -778874 -938065 -972596 -800294 -656171 -826566 -846697 -680459 -754151 -738280
16373 -738280 -935031 -1103569 -1059136 -1095062 -951763 -638287 -548098 -578841 -861461 -691000
16363 -691000 -615375 -594250 -763226 -539980 -586635 -603486 -661297 -744501 -615542 -650594 -386241
16352 -386241 -293444 -131892 30592 -60651 94224 -23775 115560 -64418 -110773 29283
16342 29283 253778 231282 87017 342345 426758 306449 284400 109583 161774 -36002
16332 -36002 80918 308677 365524 264157 291768 142081 41063 121833 108839 238130
16322 238130 446041 324072 -19064 327792 225938 433977 507966 448232 472188 455361
16312 455361 295703 303606 547755 321812 329739 673304 628971 321865 350658 577663 637691
16301 637691 925383 950615 885650 608738 601951 784880 718867 686474 696442 609809 643339
16290 643339 848007 831807 552165 671759 810004 951383 654668 873214 988503 775013
16280 775013 579395 655302 769691 954099 1043872 1261276 1416175 1121650 957199 922624
16270 922624 1131140 1179030 1403028 1460795 1484742 1554212 1514374 1478182 1406098 1275031 1324331
16259 1324331 1327540 1375746 1410335 1522389 1496676 1216271 1444548 1560670 1472846 1580406
16249 1580406 1455686 1523437 1511335 1500192 1498487 1009936 1218616 1460950 1481904 1449311 1398487
16238 1398487 1689181 1453079 994518 1352618 1529764 1386844 1527225 1388344 1301186 1512359
16228 1512359 1687302 1593429 1547487 1694807 1817390 1803263 2112543 1873964 1708038 1875579
16218 1875579 1733839 1930606 1863039 1663254 1754496 1945929 1811522 1812395 1792563 1719576 1578189
16207 1578189 1459249 1744419 1750995 1754334 1597372 1766805 1662804 1934946 2117478 2100638
16197 2100638 2102050 1769072 1778382 1566725 1488476 1452901 1958954 2071609 2040457 1995674 1798009
16186 1798009 1866957 1688256 1957844 1930610 1809490 1737440 1691551 1813424 1992353 1939771
16176 1939771 1930199 2111010 2427076 2540010 2487218 2289419 2019087 2376092 2444496 2178925
16166 2178925 2055854 2067003 2106607 2365233 2352866 2207900 1844213 2204794 2245493 2192942
16156 2192942 2326837 2483462 1913082 1976416 1923056 2215391 2333082 1887067 2210418 2102730
16146 2102730 2525241 2445348 2609699 2498256 2446116 2189830 2390882 2088468 1979664 2072562
16136 2072562 2445361 2504170 2344750 2212950 1963336 1824393 1687596 1906165 1975957 2013537
16126 2013537 2114983 2198310 2102907 1738061 1869968 2190783 2602596 2559307 2299264 2370205
16116 2370205 2520232 2542393 2326669 2160886 2094874 2437351 2625245 2386713 2093022 1788912
16106 1788912 1758486 2102232 2007473 2268668 2300565 2469314 2423663 2220239 2117369 1932681
16096 1932681 2367298 2379307 2409666 2349897 2241475 2259527 2470645 2630633 2452768 2467003
16086 2467003 2434211 2275686 2287820 2411731 2539256 2458995 2208498 2268649 2024027 2190886
16076 2190886 2246093 2345485 2694299 2054989 2174602 2624474 2585055 2531573 2177048 2337371
16066 2337371 2302684 2339998 2259335 2469962 2357776 2289047 2549577 2590088 2244846 2374845
16056 2374845 2347192 2471319 2501241 2348164 2477624 2298082 2298398 2430408 2354900 2437860 2339893
16045 2339893 2459037 2743326 2456586 2505713 2580152 2514198 2347406 2249141 2325342 2218019
16035 2218019 2315831 2173528 2212966 2218763 2234335 2474732 2366571 2250836 2487559 2205426
16025 2205426 2027080 2239907 2234112 2672972 2702417 2714287 2251057 1870406 2283010 2333782
16015 2333782 2210232 2462319 2142536 2407722 2353605 2333360 2605569 2556200 2353792 1994584
16005 1994584 2306928 2494998 2450952 2317057 2264215 2313077 2402458 2396156 2432981 2407776 2577715
15994 2577715 2292428 2526041 2720083 2693017 2663347 2229918 2375219 2218075 2346987 2523795
15984 2523795 2520599 2492026 2446314 2399348 2485405 2225435 2379105 2536956 2297048 2536490
15974 2536490 2781856 2608956 2518216 2605890 2638784 2433527 1972842 1782256 2118256 2134228
15964 2134228 2605148 2530328 2018483 2111205 2166188 2180119 2703998 2504054 2084946 1834532
15954 1834532 1953302 2025845 1859680 1958193 1993818 2084894 2280500 2699253 2508009 2544249
15944 2544249 2608641 2487841 2303327 2282914 2545027 2308355 2013841 2301869 2503551 2307671
15934 2307671 2148478 2088130 2100985 2378099 2284418 2084500 1969253 2310550 2198260 2214761
15924 2214761 2526094 2670736 3059889 3026285 2510764 2202592 2343607 2212221 2426141 2320237
15914 2320237 2368860 2589493 2700285 2749351 2812280 2880325 3001520 2766587 2721577 2796819
15904 2796819 2489043 2497737 2523447 2307572 2227803 2518066 2726021 2682763 2355500 2514332
15894 2514332 2370381 2295440 2361924 2717698 2907025 2377714 2354769 2397103 2233830 2678138
15884 2678138 2622408 2985493 3162111 3187267 2999128 2731753 2847441 2602646 2334687 2284788
15874 2284788 2104932 2512458 2831670 2846342 2521122 2524010 2478453 2316158 2375029 2548166
15864 2548166 2650568 2295716 2283994 2338778 2285173 2383210 2219045 2623780 2560182 2166193
15854 2166193 2195921 2479931 2505582 2050878 1964020 1950385 2089685 2146314 2330015 2290204
15844 2290204 2456210 2202779 2357267 2634818 2892348 2710188 2598981 2665488 2748706 2948264
15834 2948264 2724030 2476246 2302284 2491603 2494782 2339294 2433150 2372490 2289353 2443358
15824 2443358 2667349 2549796 2528352 2061525 2175805 2272028 2542097 2438762 2223778 2164269
15814 2164269 2258133 2399292 2372597 2445729 2383973 2575776 2398236 2513713 2660042 2722331
15804 2722331 2490388 2176102 2627487 2850960 2564978 2378334 2284897 2057677 2372674 2557939
15794 2557939 2627347 2627272 2500090 2316988 2057310 2524070 2759989 2602971 2780651 2841181
15784 2841181 2551185 2760075 2767033 2279786 2211965 2499281 2674464 2790627 2714017 2490715
15774 2490715 2110212 2263892 2656910 2381079 2012137 2399176 2417930 2290526 2391783 2661402
15764 2661402 2524398 2354290 2472808 2725256 2912186 2925429 2515116 2240982 2370069 2395915
15754 2395915 2382834 2362111 2564932 2640676 2805516 2724201 2321890 2736682 2954265 2872381
15744 2872381 2942107 2766545 2587256 2746818 2655919 2631039 2365297 2464299 2446714 2492347
15734 2492347 2903671 2263599 2423900 2674527 2525092 2407878 2634702 2658828 2227847 2176117
15724 2176117 2612616 2693090 2381852 2347970 2668559 2111440 2145845 2775778 3022801 2557945
15714 2557945 2454883 2651669 2822642 2838736 2527081 2660516 2631804 2580696 2688819 2627526
15704 2627526 2425809 2682887 2464728 2774642 2992316 2559115 2171828 2142012 2348032 2620517
15694 2620517 2584887 2223233 2318030 2399308 2453967 2570360 2640475 2541951 2292206 2141662
15684 2141662 2563593 2402682 2343565 2588133 2661049 2464455 2359306 2316842 1817786 2106205
15674 2106205 2381559 2300419 2471651 2669449 2878503 2544950 2593202 2549344 2322718 2206620
15664 2206620 2486740 2549907 2234548 2537799 2614568 2345241 2517185 2573327 2591653 2745232
15654 2745232 2383667 2334209 2424448 2438868 2388507 2425047 2339668 2765820 2515029 2326212
15644 2326212 2249792 2141720 2256213 2735544 2922018 2826655 2495857 2388404 2242935 2702498
15634 2702498 2883441 2508855 2591509 2620555 2487901 2350834 2577245 2528139 2764295 2682408
15624 2682408 2561878 3157542 3030309 2412099 2291311 2349989 2345780 2578378 2658097 2450368
15614 2450368 2198038 2617287 2734797 2581798 2784613 2668138 2690510 2512436 2400914 2611374
15604 2611374 2800068 2708776 2241758 2400964 2584867 2651476 2841006 2679533 2585100 2683317
15594 2683317 2913652 2489062 2552577 2422673 2278439 2355422 2414106 2434898 2575952 2499056
15584 2499056 2317303 2351056 2654345 2786654 2617643 2573321 2305635 2518057 2471561 2439861
15574 2439861 2503919 2378670 2554874 2389402 2490242 2486229 2481982 2875501 2873787 2755878 2844441
15563 2844441 2852744 3045051 2334667 2179645 2328049 2562050 2697803 2375126 2252057 2469210
15553 2469210 2755878 2652391 2508024 2390081 2426140 2726125 2648725 2498236 2609635 2942407
15543 2942407 2858223 2632539 2447361 2716049 2258343 2388086 2529799 2354368 2593961 2342690
15533 2342690 2470095 2714034 2820195 2287156 2197206 2277563 2505809 2563366 2332254 2645161
15523 2645161 2600594 2268439 2414229 2453745 2371316 2458949 2361594 2333767 2583983 2509787 2459140
15512 2459140 2426146 2495445 2403317 2269438 2487884 2504534 2388963 2462006 2627711 2559781
15502 2559781 2422035 2647344 2401662 2270816 2371347 2833545 2945688 3043294 2950320 2766309
15492 2766309 2427850 2530543 2636471 2557758 2151980 1689529 1964605 2303731 2407028 2458341
15482 2458341 2838814 2624707 2579429 2309964 2149308 2357997 2379249 2856583 3015067 2975806
15472 2975806 2606550 2600881 2533495 2572110 2519310 2414555 2306042 2534002 2645677 2603963
15462 2603963 2509997 2318698 2291649 2302023 2486247 2345732 2312209 2351841 2613159 2709116
15452 2709116 3045725 2608878 2316441 2734872 2607429 2454505 2343646 2893501 2703482
15443 2703482 2563389 2674574 2546566 2392297 2722763 2672432 2209611 2196626 1986359 2316155
15433 2316155 2320814 2492614 2703108 2924601 2983784 2559267 2770413 2725472 2618773 2557786
15423 2557786 2664112 2650039 2470341 2485435 2648900 2432513 2292167 2176817 2327807 2709831
15413 2709831 2691451 2902886 2850939 2517106 2352154 2707650 2706600 2319939 2229336 2315790
15403 2315790 2336346 2378184 2705632 2498519 2188415 2422490 2358236 2657401 2512385 2429290
15393 2429290 2368768 2244267 2267978 2325538 2291330 2677508 2779963 2327032 2222657 2291438
15383 2291438 2531447 2916005 2654326 2647295 2424323 2601300 2517816 2847138 2801115 3040596
15373 3040596 2605599 2418063 2662258 2558711 2801093 2916100 2756757 2725463 2897175 2649821
15363 2649821 2546633 2610566 2612803 2502346 2620623 2508081 2602688 2606693 2410352 2582694
15353 2582694 2695953 2513384 2259839 2085843 2183921 1984029 2104240 2556198 2651400 2428922
15343 2428922 2369162 2587087 2456020 2120635 2640939 2999238 2952175 2622778 2787518 2679133
15333 2679133 2400316 2115499 2229931 2415006 2931974 2730540 2486567 2766390 2521113
15324 2521113 2550066 2776892 2907172 2961369 2631743 2686901 2526310 2355424 2415365 2315537
15314 2315537 2623511 2350160 2532214 2480116 2755084 2770964 2425768 2302334 2451455 2721143
15304 2721143 2539146 2470667 2629151 2600637 2497268 2368047 2543845 2376568 2389435 2749379
15294 2749379 2859679 2567395 2518289 2681044 2498402 2688255 2647087 3051704 3035658 2647450
15284 2647450 2645166 2457087 2260866 2180805 2198490 2561185 2299113 2386025 2400451 2430588 2399460
15273 2399460 2739012 2632663 2491166 2626532 2831082 2773442 2834056 2814551 2739580 2607731
15263 2607731 2659826 2699812 2633392 2526855 2636688 2723407 2377890 2478399 2609840 2669325
15253 2669325 2576777 2525973 2553658 2375820 2624647 2598915 2380438 2437704 2526826 2531807 2467606
15242 2467606 2297888 2460175 2603043 2293440 2467305 2590012 2330671 2310976 2546016 2630664
15232 2630664 2527330 2551344 2662392 2619037 2659041 2605557 2659273 2752540 2818415 2590852 2395218
15221 2395218 2760459 3035351 2615888 2456750 2800839 2701668 2403598 2610202 2531133 2821140
15211 2821140 2732225 2675114 2618388 2937218 2863254 2715525 2454579 2753638 2777381 2987326
15201 2987326 3129755 2765431 2849221 2534913 2178371 2301415 2712108 2876172 2568875 2502324
15191 2502324 2717324 2558537 2442095 2691644 2511258 2224204 2159917 2385742 2608170 2732550
15181 2732550 2627902 2776218 2767445 2533067 2802705 2713107 2630354 2742177 2617057 2926106
15171 2926106 2747886 2575863 2333582 2306988 2466708 2540251 2535023 2444592 2862743 2577062
15161 2577062 2779849 2976119 3151784 2564080 2440583 2441733 2853819 3145367 2958826 2571827
15151 2571827 2484465 2629835 2712543 2725576 2707950 2665256 2704197 2581860 2525865 2703573 2733805
$$ [...]
##END NTUPLES=NMR SPECTRUM
##END=
