##TITLE=1H_CG-1157
 CDCl3
 8 sc, 
 9.11.2021
##JCAMPDX= 6.0         $$ Bruker NMR JCAMP-DX V2.0
##DATA TYPE= NMR SPECTRUM
##DATA CLASS= NTUPLES
##ORIGIN= UXNMR, Bruker Analytische Messtechnik GmbH
##OWNER= root
$$ XWIN-NMR		Version 3.5
$$ Tue Nov  9 10:46:17 2021 Russian Standard Time (UT+4h)  she@DPX200
##.OBSERVE FREQUENCY= 200.1313468511
##.OBSERVE NUCLEUS= ^1H
##.ACQUISITION MODE= SIMULTANEOUS
##.ACQUISITION SCHEME= undefined
##.AVERAGES= 8
##.DIGITISER RES= 18
##SPECTROMETER/DATA SYSTEM= spect
##.PULSE SEQUENCE= zg30
##.SOLVENT NAME= D2O
##.SHIFT REFERENCE= (INTERNAL, D2O, 0, 15.7678)
##AUDIT TRAIL= $$ (NUMBER, WHEN, WHO, WHERE, WHAT)
$$ ##TITLE= Audit trail, XWIN-NMR		Version 3.5
$$ ##JCAMPDX= 5.01
$$ ##ORIGIN= Bruker BioSpin GmbH
$$ ##OWNER= she
$$ F:/spectra/data/she/nmr/H-F/1/pdata/1/auditp.txt
$$ ##AUDIT TRAIL=  $$ (NUMBER, WHEN, WHO, WHERE, WHAT)
(   1,<2021-11-09 10:44:39.03 +0400>,<she>,<DPX200>,
      <created by zg, POWCHK disabled, PULCHK disabled
       configuration hash MD5:
       00 E9 B6 7A A2 85 ED C7 34 08 36 98 17 FE 4E 26
       data hash MD5: 16K
       DD 43 7B 11 17 F1 3D 94 A6 FE E4 7D F0 8D 5F F9>)
(   2,<2021-11-09 10:44:41.67 +0400>,<she>,<DPX200>,
      <Start of raw data processing
       efp BC_mod = 2 LB = 0.24 FT_mod = 6 PKNL = 1 PHC0 = -15512.39 PHC1 = 10.80082 SI = 16K 
       data hash MD5: 16K
       85 84 AF F2 2A DB 6C 95 38 9B E4 CE 2F 76 93 B9>)
(   3,<2021-11-09 10:44:56.90 +0400>,<she>,<DPX200>,
      <pk PHC0 = 0.3740001 PHC1 = 1.8 
       data hash MD5: 16K
       D3 72 23 68 E3 90 35 05 CE 6B A3 7D AE A8 91 F8>)
(   4,<2021-11-09 10:45:00.37 +0400>,<she>,<DPX200>,
      <abs ABSG = 5 
       data hash MD5: 16K
       29 02 64 36 E6 43 34 17 88 86 B8 D7 91 61 30 A3>)
(   5,<2021-11-09 10:45:47.29 +0400>,<she>,<DPX200>,
      <pk PHC0 = 0.6767383 PHC1 = -1.8 
       data hash MD5: 16K
       42 26 4A 8B 7D DA CC D2 F4 72 96 D7 83 3B 45 CF>)
$$ ##END=
$$ 
$$ hash MD5
$$ 61 90 74 ED E6 57 9B 9E 14 7D 9B B7 95 3A D2 50
##$RELAX= 
##$RELAX= 
##$RELAX= 
##$RELAX= 
##$RELAX= 
##$RELAX= 
$$ Bruker specific parameters
$$ --------------------------
##$DU= <F:/spectra>
##$EXPNO= 1
##$NAME= <H-F>
##$PROCNO= 1
##$TYPE= <nmr>
##$USER= <she>
##$AMP= (0..31)
100 100 100 100 100 100 100 100 100 100 100 100 100 100 100 100 100 100 
100 100 100 100 100 100 100 100 100 100 100 100 100 100 
##$AQSEQ= 0
##$AQ_mod= 1
##$AUNM= <au_zg>
##$AUTOPOS= <>
##$BF1= 200.13
##$BF2= 200.13
##$BF3= 200.13
##$BF4= 200.13
##$BF5= 200.13
##$BF6= 200.13
##$BF7= 200.13
##$BF8= 200.13
##$BYTORDA= 1
##$CFDGTYP= 0
##$CFRGTYP= 5
##$CHEMSTR= <none>
##$CNST= (0..31)
1 1 145 1 1 1 1 1 1 1 1 1 1 1 1 1 1 1 1 1 1 1 1 1 1 1 1 1 1 1 1 1 
##$CPDPRG= <>
##$CPDPRG1= <>
##$CPDPRG2= <>
##$CPDPRG3= <>
##$CPDPRG4= <mlev>
##$CPDPRG5= <mlev>
##$CPDPRG6= <mlev>
##$CPDPRG7= <mlev>
##$CPDPRG8= <mlev>
##$CPDPRGB= <>
##$CPDPRGT= <>
##$D= (0..31)
0 1.2 0 0 0 0 0 0 0 0.06 0 0.03 0 0 0 0 0.0002 0 0 0 0 0 0 0 0 0 0 0 0 
0 0 0 
##$DATE= 1636440278
##$DBL= (0..7)
$$ [...]
##$SUBNAM2= <"">
##$SUBNAM3= <"">
##$SUBNAM4= <"">
##$SUBNAM5= <"">
##$SUBNAM6= <"">
##$SUBNAM7= <"">
##$SUBNAM8= <"">
##$SUBNAM9= <"">
##$SW= 18.0517286264689
##$SWIBOX= (0..15)
0 0 2 0 0 0 0 0 0 0 0 0 0 0 0 0 
##$SW_h= 3612.71676300578
##$TD= 16384
##$TD0= 1
##$TE= 0
##$TE2= 300
##$TE3= 300
##$TEG= 300
##$TL= (0..7)
0 120 120 120 120 120 120 120 
##$TP= (0..7)
150 150 150 150 150 150 150 150 
##$TP07= 0
##$TPNAME0= <>
##$TPNAME1= <>
##$TPNAME2= <>
##$TPNAME3= <>
##$TPNAME4= <>
##$TPNAME5= <>
##$TPNAME6= <>
##$TPNAME7= <>
##$TPOAL= (0..7)
0.5 0.5 0.5 0.5 0.5 0.5 0.5 0.5 
##$TPOFFS= (0..7)
0 0 0 0 0 0 0 0 
##$TUNHIN= 0
##$TUNHOUT= 0
##$TUNXOUT= 0
##$USERA1= <user>
##$USERA2= <user>
##$USERA3= <user>
##$USERA4= <user>
##$USERA5= <user>
##$V9= 5
##$VALIST= <valist>
##$VCLIST= <CCCCCCCCCCCCCCC>
##$VD= 0
##$VDLIST= <DDDDDDDDDDDDDDD>
##$VPLIST= <PPPPPPPPPPPPPPP>
##$VTLIST= <TTTTTTTTTTTTTTT>
##$WBST= 1024
##$WBSW= 4
##$XGAIN= (0..3)
0 0 0 0 
##$XL= 0
##$YL= 0
##$YMAX_a= 268352
##$YMIN_a= -314578
##$ZGOPTNS= <>
##$ZL1= 120
##$ZL2= 120
##$ZL3= 120
##$ZL4= 120
##$ABSF1= 15.8714
##$ABSF2= -2.180451
##$ABSG= 5
##$ABSL= 3
##$ALPHA= 0
##$AQORDER= 0
##$ASSFAC= 0
##$ASSFACI= 0
##$ASSFACX= 0
##$ASSWID= 0
##$AUNMP= <proc_1d>
##$AZFE= 0.1
##$AZFW= 0.1
##$BCFW= 0
##$BC_mod= 2
##$BYTORDP= 0
##$COROFFS= 0
##$CY= -3
##$DATMOD= 1
##$DC= 0
##$DFILT= <>
##$DTYPP= 0
##$F1P= 0
##$F2P= 0
##$FCOR= 1
##$FTSIZE= 16384
##$FT_mod= 6
##$GAMMA= 0
##$GB= 0
##$INTBC= 1
##$INTSCL= 0
##$ISEN= 128
##$LB= 0.24
##$LEV0= 0
##$LPBIN= 0
##$MAXI= 10000
##$MC2= 0
##$MEAN= 0
##$ME_mod= 0
##$MI= 1.114404
##$NCOEF= 0
##$NC_proc= -5
##$NLEV= 6
##$NOISF1= 3.799351
##$NOISF2= 2.8
##$NSP= 0
##$NTH_PI= 0
##$NZP= 0
##$OFFSET= 15.76782
##$PC= 1
##$PHC0= -15511.34
##$PHC1= 10.80082
##$PH_mod= 1
##$PKNL= yes
##$PPARMOD= 0
##$PSCAL= 0
##$PSIGN= 0
##$REVERSE= no
##$SF= 200.129997595435
##$SI= 16384
##$SIGF1= 3
##$SIGF2= 2
##$SINO= 5.538805
##$SIOLD= 16384
##$SREGLST= <1H.CDCl3>
##$SSB= 0
##$STSI= 16384
##$STSR= 0
##$SW_p= 3612.71676300578
##$SYMM= 0
##$S_DEV= 0
##$TDeff= 16384
##$TDoff= 0
##$TI= <>
##$TILT= no
##$TM1= 0
##$TM2= 0
##$TOPLEV= 0
##$USERP1= <user>
##$USERP2= <user>
##$USERP3= <user>
##$USERP4= <user>
##$USERP5= <user>
##$WDW= 1
##$XDIM= 16384
##$YMAX_p= 342838724
##$YMIN_p= -184877
$$ End of Bruker specific parameters
$$ ---------------------------------
##NTUPLES= NMR SPECTRUM
##VAR_NAME=  FREQUENCY,     SPECTRUM/REAL,   SPECTRUM/IMAG
##SYMBOL=    X,             R,               I
##VAR_TYPE=  INDEPENDENT,   DEPENDENT,       DEPENDENT
##VAR_FORM=  AFFN,          ASDF,            ASDF
##VAR_DIM=   16384,         16384,           16384
##UNITS=     HZ,            ARBITRARY UNITS, ARBITRARY UNITS
##FACTOR=    0.220516191357247, 1,           1
##FIRST=     3155.6138503871, 0,             0
##LAST=      -457.10291261868, 0,            0
##MIN=       -457.10291261868, -184877,      0
##MAX=       3155.6138503871, 342838724,     0
$$ Real data points
##PAGE= N=1
##DATA TABLE= (X++(R..R)), XYDATA
$$ [...]
8212A016165J451k0806L3663M1449L9504j679K5540J03295L4816K8544K8867R4792
8200A425601N9712J29081K0050J53732P865K46384J66781M49052j34064o79900
8190A844294J26437n8194P426j15862k1165o7872L689j26806m3324r158k6877
8179A512588J6466K8178O0933K4257J24083R0110R2018J53078J32450J66772J81841
8168B582774J42917K84642K73643L00070K55678O2782R823K3045M9761L9267r8113
8157C926289j83122k39018k17556k26328k72425j67073j53708j50428j50520j65662
8147B000449r7882j56587m2426J3945l9848K007O9239J4972K8107O1665J10102
8136A963743J23011J56508P3393J51303Q1521R1091J64013J23520Q4206L7234
$$ y = [1016165, 1017616, 996810, 1030473, 1071922, 1111426, 1109747, 1135287, 1238582, 1273398, 1301942, 1330809, 1425601, 1485313, 1614394, 1634444, 1788176, 1796041, 2042425, 2209206, 2658258, 2524194, 1844294, 1970731, 1912537, 1919963, 1804101, 1782936, 1715064, 1718753, 1591947, 1548623, 1539465, 1512588, 1529054, 1557232, 1618165, 1642422, 1766505, 1856615, 1948633, 2101711, 2234161, 2400933, 2582774, 2725691, 3010333, 3283976, 3584046, 3839724, 3902506, 3912329, 3935374, 3985135, 4024402, 3926289, 3743167, 3504149, 3286593, 3060265, 2787840, 2620767, 2467059, 2316631, 2166111, 2000449, 1902567, 1745980, 1703554, 1717499, 1677651, 1679658, 1748897, 1763869, 1791976, 1853641, 1963743, 2086754, 2243262, 2316655, 2467958, 2549479, 2640570, 2804583, 2928103, 3012309, 3049543]
8126C049543N8379L1631r4924j65014j39253j22203k10491k98351k02858k01859
8116A704600j37815j53550r4689q7100p2725M213n1740o570o2711j37065J229
8105I06077k9137j1735n8872q1060k325m4447l1451m8484j1200L2277o9530k0911
8093E29202N8467J6227k7968K7405j2137p652R605j0673o8521j574M5115J0997
8081E68493n4099n3966K804k0735n64k3195l6273j0275L230k5475J8110K698j8602
8068C52151k5566m2494l3040m007M9957k1668M6260L1157K0118n8174L4062o8562
8056B80194J0513O074J6014L1373l8292K2122o751L0298L0020J5007l7336m4904
8044C14332J2040m1095o4792M2176n1752J8820J63k3594o478j5350J8291k9945
$$ y = [3049543, 3107922, 3139553, 3044629, 2879615, 2740362, 2618159, 2407668, 2109317, 1906459, 1704600, 1566785, 1413235, 1318546, 1231446, 1158721, 1162934, 1111194, 1104624, 1041913, 904848, 906077, 876940, 865205, 806333, 725273, 722948, 678501, 647050, 598566, 587366, 619643, 550113, 529202, 587669, 603896, 575928, 603333, 591196, 583544, 593149, 582476, 513955, 512381, 557496, 568493, 514394, 460428, 463232, 442497, 441933, 418738, 382465, 372190, 375420, 349945, 368055, 370753, 352151, 326585, 284091, 251051, 247044, 297001, 275333, 321593, 352750, 372868, 314694, 348756, 280194, 290707, 296781, 312795, 344168, 305876, 327998, 321247, 351545, 381565, 396572, 359236, 314332, 326372, 285277, 220485, 262661, 210909, 229729, 229892, 206298, 199820, 184470, 202761, 172816]
8032A72816k6898K690j1688k8927M0320M1466j424l6365m408L00o5837p43L5417
8019A16719J3205J6041k50l1509m73R729J1095L468K1167O204n491k1232J3003
8006A51676m5383J2945Q45n0401l9699K4056O2595m3222m525J4250j7872l8519
7994B6746J9902N5784l3212N6835m5054M0113J4451m88m0182l0963j1425Q373
7982F0880N2981l8545k4941K481l7834j6093K4661J1891J7320J1154n532Q283
7970F6706l3484j3164K0941j3073Q9069m7781l0581j9402P344O0283l737l2445
7958E0676P987K7907J0180l4197m4005q174j2873R4564j0800j0151J4538l0733
7946E4919k9580K8531j4981P652J1935Q929K2685J947l6987l3964K6503j1798
$$ y = [172816, 145918, 148608, 136920, 107993, 148313, 189779, 188355, 151990, 147582, 147882, 82045, 81302, 116719, 129924, 145965, 145715, 114206, 113733, 123462, 134557, 138025, 159192, 165396, 159905, 138673, 151676, 106293, 119238, 120083, 69682, 29983, 54039, 116634, 73412, 68887, 83137, 65265, 26746, 46648, 102432, 69220, 126055, 81001, 121114, 135565, 135077, 94895, 63932, 52507, 60880, 113861, 75316, 50375, 52856, 15022, -1071, 23590, 35481, 52801, 63955, 58423, 66706, 33222, 20058, 40999, 27926, 116995, 69214, 38633, 19231, 26575, 86858, 83121, 50676, 58663, 86570, 96750, 62553, 18548, 10374, -2499, 92065, 81265, 71114, 85652, 54919, 25339, 53870, 38889, 46541, 58476, 67405, 90090, 92037, 55050, 21086, 47589, 35791]
7934C5791J2630l1756K205J0352J4717L5010m3657J1295m3808J4607L1107j9140
7922B9353m002n2279O3696M2637l6927j5768L2814l7733Q3437k0568p2124M7884
7910F0420J1064o0648R238L4059j3957K9398k3646j0021m321K230o854m0273L5020
7897B1709j1716l3980J7420J7474l0137M8345P300n478L9392j1414M416j8818
7885D4513k170L230l4486l4217P604K2801q518n2894k5872J5424P382J8349L1413
7872g441L3889n3733m171P020J0508k2655J7363j1986J1000r103M3109n133p682
7859I85J7693m1832N1105J1156l2040j4360K4013N1725r348j0360k6829p19m111
7846A7078j367l144o350O638j6445L7520o422P8m0848J2216K4209l4608j7579
$$ y = [35791, 48421, 16665, 18870, 29222, 43939, 78949, 35292, 46587, 2779, 17386, 48493, 29353, 25351, -26928, 36768, 79405, 42478, 26710, 59524, 21791, 105228, 84660, 12536, 60420, 71484, 10836, 20074, 54133, 40176, 69574, 45928, 35907, 31586, 33816, 26962, -13311, 21709, 9993, -23987, -6567, 10907, -19230, 29115, 36415, 30937, 70329, 58915, 63331, 44513, 42343, 45573, 11087, -23130, -15526, 7275, -1243, -54137, -80009, -64585, -57203, -38854, -7441, 26448, -27285, -31456, -24436, -13928, -36583, -19220, -31206, -20206, -29309, 13800, 8667, 985, 18678, -23154, 27951, 39107, 7067, -7293, 16720, 68445, 59097, 48737, 21908, 21189, 17078, 15711, 12567, 6217, 12855, -3590, 33930, 27508, 27586, -13262, -1046, 23163, -11445, -29024]
7833b9024O0769L2059k8929m3582M6023L648J5109j0281N755k9872m5222J306
7821b2241k612p614Q584L3548R660j7310k7306K1039K5260l1214j1645o941k1126
7808d9918J1300j46259K01894K8742l8606M6502k1073l820o7570K8729L1800j8598
7796C123J1435j1117o5487M5027L6834N1676K0746n361p6420K7196j0597K7939
7784E4994m7555m88O3609j0891J679J699k6737K216j3134l1807M9758k8560n5686
7771d0903L3968J6449o0925L52K5823o2204M6810o357l977O5414n339j8034j7713
7758b6636m1502l509Q769J2853R205N4883j2585p924K1662J8478j8564k557k9084
7745a6511n2035J1608N1951K734n0017m4749K4499K1547K5258k1521J251P2362
$$ y = [-29024, 31745, 63804, 34875, -8707, 37316, 40964, 56073, 45792, 51547, 21675, -23547, -22241, -24853, -32467, -23883, 9665, 19325, 2015, -25291, -4252, 21008, -10206, -21851, -28792, -49918, -38618, -184877, 17017, 45759, 7153, 53655, 32582, 28762, -38808, -10079, 21721, 3123, 14558, 3441, -62046, -17019, 19815, 71491, 92237, 86876, 10456, 37652, 27055, 54994, 7439, 6951, 70560, 59669, 61348, 63047, 36310, 38526, 25392, -6415, 43343, 14783, -40903, -6935, 9514, -51411, -51059, -25236, -87440, -40630, -46987, -50964, 14450, 9111, -8923, -26636, -68138, -71647, -62878, -50025, -40820, 14063, 1478, -6446, 15216, 33694, 15130, 12573, -16511, -68546, -56938, -4987, -2253, -52270, -97019, -72520, -50973, -25715, -47236, -45985, 26377]
7733B6377l6846j6096L5254J4446J3172k1010n5973l5569L7066O0772K5793n947
7721D1439k047k438k9809j8668l7361J1986O2580P004p5775J758K065P691J6099
7708a5476J1351J5845k5540m3692J1470L7371j856j6678K2172j1442m162M4023
7696B3386J8274k5828K7202j0138m9987k4094L1101J1790M539k0218o717j1803
7684c2493K4502r705K3575j4975P24l6682l7386M5041k1798j0744K1863k9061
7672g7139L3919M6705M230j92J96n4594L3559P435O042m2616k2245J7337K2906
7659b4457K9288J8386J7601J6814L8291M223j7257r8947J6151j9350j9532M8303
7647I514M2978M118p358j6192o280m2602p0990P0735K5277k1266m749k5102L0091
$$ y = [26377, -10469, -26565, 8689, 23135, 36307, 15297, -40676, -76245, -39179, 21593, 47386, 41439, 39392, 36954, 7145, -11523, -48884, -36898, 25682, 32686, -43089, -41331, -39266, -31575, -15476, -4125, 11720, -13820, -57512, -46042, -8671, -10527, -27205, -5033, -16475, -20637, 23386, 41660, 15832, 43034, 32896, -17091, -41185, -10084, 1706, 6245, -13973, -20690, -32493, -7991, -17696, 5879, -9096, -8372, -45054, -82440, -37399, -59197, -69941, -48078, -77139, -43220, 3485, 7715, 7523, 7719, -46875, -13316, -5881, 161, -42455, -64700, -47363, -24457, 4831, 23217, 40818, 57632, 95923, 100146, 82889, -16058, 93, -19257, -38789, 9514, 52492, 56610, 49252, 33060, 26780, -15822, -86812, -16077, 9200, -12066, -16815, -41917, -11826]
7634a1826M3352o5500J4527M0884k0133j20Q711K057l0323k048L8874K5324m9258
7621e479j9688L8692k3440r587J2545q705l5964k9416P4388l9581J9536K7049
7609C50N0748Q242q7464j2165m390J2441K5464K4544n920m0635k445m064m196
7596c9490P5202k5900r165k1m4664L1853J7949k2078M864K8050j5987K3232m1350
7583a7505P099M5179k4634j4444k4005l4038j7108M492O6422l4253q898M2960
7571h733J3833l6988K8909N620J7318j459l915M736k3995l5542K9883l8847j76
7558d9356M4210k5830N268N0887K5328n4696m7372l9491j8701N8004M3328k1331
7546b9752l513J6664K3514K9497M232j0762k9404J7112O901m0501M003N0945k0120
$$ y = [-11826, 31526, -33974, -19447, 21437, 1304, 1184, 9895, 11952, -18371, -20419, 18455, 43779, -5479, -25167, 13525, -9915, -19502, -6957, -15662, -51626, -81042, -6654, -46235, -26699, 350, 51098, 59340, -28124, -40289, -44679, -32238, -6774, 17770, 11850, -28785, -31230, -35294, -39490, 35712, 9812, 647, 626, -44038, -12185, 5764, -16314, -11450, 16600, 613, 23845, -17505, -10406, 34773, 10139, -4305, -28310, -62348, -79456, -74964, -8542, -42795, -51693, -8733, 5100, -31888, -2979, 2641, 19959, 18500, 14585, 19321, -4674, -40216, -10333, -49180, -49356, -5146, -30976, -25708, 25179, 50507, -4189, -51561, -91052, -109753, -51749, -8421, -29752, -33265, -16601, 6913, 36410, 40642, 29880, 476, 17588, 24489, -16012, -12009, 38936, 18816]
7533A8816P741K0052q1486J2716M6906o1631k2361L9178K3640m813n111l656M841
7520e168N6422m1646j6932M4910k259n9560J6958M122k685j8356k1485m344N9927
7507I904m1078o8630K3194J3110M1393J0212r181J2688k7137J1003N0382j7700
7495H160K8548m3408k2017M5839k9302p386k112K1793m4809L9431L0404l6212
7483a1071k5502r221M5356L1727j5356K4878l6120k9129j6123K2707J2182J7358
7471A1686k1659j4631q19J000L3216j7461n0423J0341N6409q981k3525J3659K3243
7458A2055m4690r821L1343L4392j1616l4326l523M6789j1886K3707M3798j0918
7446F5304l9041j0841J0680Q815R209k2734k4476l2736N0831K6919J732m4276
$$ y = [18816, 26557, 46609, -34877, -22161, 24745, -36886, -59247, -20069, 3571, -1242, -6353, -10009, -5168, 51254, 9608, -7324, 37586, 35327, -24233, -7275, -3153, -5838, -24194, -45679, -50023, 9904, -31174, -99804, -76610, -63500, -22107, -11895, -21076, -8388, -35525, -24522, 25860, 8160, 36708, -6700, -28717, 17122, -12180, -19566, -21678, 115, -44694, -5263, 25141, -11071, -36573, -45794, -438, 31289, 15933, 40811, 4691, -24438, -40561, -17854, -5672, 11686, -9973, -24604, -25423, -24423, 8793, -8668, -59091, -48750, 7659, -1322, -24847, -11188, 12055, -32635, -42456, -11113, 23279, 11663, -22663, -26186, 20603, 8717, 32424, 76222, 65304, 26263, 15422, 26102, 34917, 44126, 21392, -3084, -35820, 15011, 41930, 43662, -614]
7434f14J3390r127M1356l4629l8405J3829P660j9029N8923l416j818k4748l1575
7421b8203L8129j854R503j5991k8333K607N0654q1281J1742M4405K4307m1236
7409a5551J1630P333o2311O934J5293N0350m1103j8858J5747J0691j45l3845L1023
7396b2812p521p913j6869L3775M9649N7943p5289J3434j0570j4737m1440l138
7384d5488M395J0333K0150p840J0122L3290k7865j4788O856K5836P387m3392k8111
7371d9115L7010J9481J7188j4398l0485Q34k8660J9971L2711J606J9567k3265
7359B445j2017K9048l240L6924O043l9531j7536K0469j9199j327j3068l978K9171
7346A4204J7622j5434J1495l8163m3351O5601m8691M064P615J3448Q06L9300K12
$$ y = [-614, 12776, 3649, 45005, 10376, -28029, -14200, -6540, -25569, 33354, 29938, 28120, 3372, -28203, 9926, 8072, 17575, 1584, -26749, -24142, 26512, -54769, -43027, 1378, 25685, -15551, -3921, 3412, -58899, -51965, -36672, 13678, -27425, -46283, -30536, -19845, -19990, -53835, -22812, -30333, -38246, -55115, -21340, 28309, 86252, 10963, 24397, 13827, -910, -42350, -45488, -41093, -30760, -10610, -18450, -8328, 24962, -2903, -17691, -10835, 15001, 22388, -21004, -49115, -12105, 7376, 24564, 10166, -20319, -19485, -48145, -28174, 4537, 6143, 25710, 2445, -9572, 19476, 16236, 53160, 59203, 19672, 2136, 22605, 3406, 2079, -10989, -14967, 14204, 31826, 16392, 27887, -10276, -53627, 11974, -36717, -32653, -25038, -11590, -10784, 28516, 28728]
7333B8728N551n72q32J354n9286j4767j2990M2585K151N7249q36l4331J5363N2128
7319H1495n5941j3759j4286m8772K9967J3167l4972K1185J7003M4839l3700K6672
7307C2898l7101k3524K6680K5489k0507J4701l312l7872K6613r150L201J6287
7295A4403J4751K5745m6266l180L6413k9777o894l2367M5315L6986j7382k2675
7283A5072k1857l0845l8061J4091K474M292L979r71j5998K6571o383N3764o693
7270e65N966N686l3488O920J0687J599k3379j6331m2789O6351K3480R822j2724
7257A235l312L519K5238l1182M245L5571k4998n3819L8964m60m9250n70K3895
7244c0924k5815J5451O9693k4287j5017p199k3257K0657j9321k5939M5563J9942
$$ y = [28728, 34279, 33707, 32875, 34229, -25057, -39824, -52814, -10229, -8078, 49171, 48335, 14004, 29367, 81495, 25554, 11795, -2491, -51263, -21296, -8129, -43101, -21916, -4913, 39926, 6226, 32898, -4203, -27727, -1047, 24442, 3935, 18636, 15324, -22548, 4065, -5085, -1884, 14403, 29154, 54899, 8633, 5453, 41866, 12089, 5195, -27172, 18143, 55129, 37747, 15072, -6785, -37630, -75691, -61600, -59126, -54834, -50855, -51826, -67824, -41253, -47636, 6128, -565, 5401, 11087, -22401, -15481, -4794, -3195, -26574, -42905, -85694, -19343, 4137, 13959, 1235, -2077, 1442, 26680, -4502, -257, 35314, 10316, -43503, -4539, -4999, -54249, -54819, -30924, -56739, -41288, 28405, 4118, -10899, -18098, -41355, -20698, -40019, -65958, -20395, -453]
7232d53N066m874j9308K8948m9020K7508k0383Q810Q082n6277N7466L37K1437
7219G339l2128l8712K5571J4731m3999K7729K3702k5178n839L6158Q570J0023
7207G967L0767j6609k2722K1604m5577k3347L1936K261m614L295L3672p1442m326
7194e7135M4559J1667j0754l3349j1159M164m0259M1075M8326N495j5388J7361
7182D603K7848j1748k5987R544J1470q550K7437o3155N9379l641N959l3958l8230
7169c9029J3110N787J7142l0566j1999O168J3842m7865l039Q0790K795l1671R061
7156a5474l4226J8266k0602L0550k3341N2088K764n4159k669N4825k053l0509
7144b4540L8798r988k394m6746L6501k988j5630r505J3166O6678n5856O250J6466
$$ y = [-453, 4613, -261, -19569, 9379, -39641, -12133, -32516, -23706, -15624, -71901, -14435, -14098, 7339, -24789, -63501, -37930, -23199, -67198, -39469, -15767, -40945, -46784, -10626, -2056, 7967, 38734, 22125, -597, 21007, -24570, -47917, -15981, -13720, -18334, -15039, 18633, -52809, -57135, -12576, -909, -11663, -45012, -56171, -52007, -92266, -51191, -2865, 2630, -12758, 4603, 32451, 20703, -5284, 4260, 15730, 7180, 34617, -28538, 30841, 27200, 33159, -799, -39029, -25919, -20132, -2990, -33556, -45555, -39387, -25545, -73410, -76449, 4341, 7136, -24535, -15474, -49700, -31434, -52036, -21486, -44827, 7261, 10025, -44134, -46803, 8022, 5969, -24540, 14258, 4270, 1876, -44870, -8369, -11357, -26987, -36492, -23326, 43352, -12504, -6254, 10212]
7131A0212r817k4870J2250K3879M375N0085l8205r12m8662J6332j955R341J4613
7118A6666M5113k3924l0794l8748L0908M1845l6694j0402N686k8689K3209P6374
7106G0550n5205j3557l0325J2294J0587P572M1890K0839k8616k4686k0522k3025
7094c2204J2288J593J9944m4560K1746k9917L821M1066O248j1096n6096N6901
7082a0266l5149j5500J4177M3381J2501l4247o034L7999Q338j0510j2772k3159
7070c1241m181L0157o334m9120L3296N2760J7914k2484k2038K9552L7588k7241
7058C8628L379O024l4792L1173n793l3701m085k3362R082k4228p922N7578K8644
7045D0625j1191l8567k7814k1255R169l734N7351m7576n679K9719M8615l695r236
$$ y = [10212, 395, -24475, -12225, 11654, 16029, 66114, 27909, 26997, -21665, -5333, -7288, 2053, 16666, 61779, 37855, 7061, -31687, -779, 41066, 4372, -6030, -344, -29033, -5824, 70550, 15345, 1788, -28537, -16243, -5656, 1916, 43806, 64645, 36029, 11343, -9179, -32204, -19916, -18323, 1621, -42939, -21193, -51110, -47289, -6223, 25, -11071, -67167, -10266, -45415, -60915, -46738, -3357, 9144, -25103, -31137, 6862, 15200, 4690, -8082, -31241, -35422, -5265, -11599, -60719, -27423, 25337, 43251, 20767, -1271, 28281, 65869, 38628, 42007, 48031, 13239, 44412, 38619, 4918, 833, -22529, -13447, -37675, -45597, 11981, 40625, 29434, -9133, -36947, -58202, -49033, -52767, 4584, -42992, -48671, -18952, 29663, 25968, 16732]
7032A6732L0612n6954m6275L9439O1749k3225k0984j7742N8412l7144k41j6634
7020a2255j4087J6666k1982M6377p721k0464j8419l9184r704N5935N4840K240
7008C2242k7919P865q744m9322M2310M086Q584J8669k3452N406L4280j9776m053
6995B0176O017L7667p449k6120O137L4133k021k8037J6345r388o7937j4593K291
6982c2779J0977M6193K2464l3614k126J4885r725m373j8944K5299K145l609Q685
6969B5478K8536k5491M898j1266j0988K905j2280k6231L673L2063O335k5081j626
6956i075L4067M4065Q048m6580m7056J4258k3819N3413M2219j4260m9807k8594
6944b3121L3180j7750m6990L8536N3948J7781J9582n7775M613J9462j4289j1963
$$ y = [16732, 47344, -9610, -55885, -16446, 45303, 22078, 1094, -16648, 41764, 4620, 4379, -12255, -26342, -9676, -31658, 14719, 6998, -13466, -31885, -71069, -80773, -24838, 30002, 32242, 4323, 12188, 3444, -45878, -3568, 518, 9102, 27771, 4319, 9725, 44005, 24229, 20176, 26193, 63860, 56411, 30291, 36428, 70561, 68540, 40503, 56848, 47460, -20477, -35070, -32779, -21802, 24391, 46855, 13241, 11115, 26000, 16275, 11902, -7042, 18257, 20402, 16793, 25478, 54014, 28523, 33421, 22155, 11167, 14072, 1792, -24439, -20766, 11297, 17632, -7449, -9075, 24992, 69057, 77105, 30525, -16531, -2273, -26092, 27321, 69540, 55280, 5473, -23121, 10059, -7691, -54681, -16145, 37803, 55584, 75166, 17391, 22004, 41466, 27177, 15214]
6932A5214J2185j9092p548J9514l4722K2921M0627j5282m1937m439L0395j5833
6920B003K0430l3657m499N105K5727o8737P930K590K4846L4328J2210n13K092
6907B9855l9279J5550m586N911k1282M678L6989l6312M4655J9353m0508j0649
6895D375R592K0765P101n6515J4069J5707j097k5258L4753m7345j1933K5199J0242
6882c45j4350J3696K0108J5457L665j4424m2637J9017J3018M143p9522M1872L9388
6869A9086m3194q588M0689N8259j8333m0419o599j3103O002k416m31j4337k0565
6856d3949L7038j9937L9649j5703j1711k997R978R411k5532j3523M9234n5656
6844d3698M413M1882J5618j1529j5787L0181l2112J1393n0753j8475n163L2940
$$ y = [15214, 27399, 8307, 759, 20273, -14449, 8472, 49099, 33817, -8120, -12559, 17836, 2003, 22433, -11224, -15723, -10618, 15109, -53628, -45698, -43108, -18262, 16066, 28276, 27763, 29855, -9424, 6126, 1540, 7451, -13831, -9153, 27836, -8476, 36179, 55532, 15024, 4375, 13967, 34732, 41833, -14682, -613, 15094, 13997, -11261, 23492, -23853, -35786, -10587, -345, -14695, -999, 19109, 34566, 38231, 23807, -18830, 187, 13205, 17348, -62174, -20302, 19086, -24108, -32696, 7993, 66252, 47919, 7500, 901, -12202, -6200, -8616, -9047, -23384, -43949, -6911, -26848, 12801, -2902, -14613, -17610, -7632, 1779, -23753, -37276, 11958, -43698, -39285, 2597, 18215, 6686, -9101, 21080, -11032, 361, -50392, -68867, -74030, -41090]
6832d1090r465P8626j7259j0941K8398l5135K1094L6952m1473l6282J2416M866
6820i293l6562L4136J1235k4401l645K8271K3517L75J4166l1986j4793k5093L7206
6807C133J2251k2814n166L6670M28N893l7112J8004k9861J5206K2126M4829p523
6794E6064n2976k0647k8546J7196j1017m389J5864k094L4753j0002K2761j4778
6782B189k3818K2105J7330j2941O65j3505l3288M0648M1510J7925J0292p859J9225
6769H0478l5645k3807k2860J4601L1361m9260O2960p5249K3326K4164k2743J1408
6757A8734J872l9312l4536L2629O221J9459j2804k2447o312J9762J7530j054j433
6744a691L206l619m5776l5546L1507K0563J7341K4099O073j6660K1813o2743L1974
$$ y = [-41090, -50555, 28071, 10812, -129, 28269, -6866, 14228, 51180, 9707, -26575, -14159, -9293, -45855, -11719, -484, -24885, -28530, -259, 23258, 23633, 37799, 5813, -8980, -34073, 3133, 15384, -7430, -12596, 24074, 24502, 30395, -6717, 11287, -18574, -3368, 18758, 63587, 56064, 3088, -17559, -46105, -28909, -39926, -44315, -28451, -30545, 4208, -5794, 16967, 2189, -21629, 476, 17806, 4865, 5530, -7975, -41263, -615, 40895, 58820, 69112, 61253, 80478, 44833, 21026, -1834, 12767, 44128, -5132, 57828, -17421, 5905, 30069, 7326, 18734, 20606, -18706, -53242, -20613, -14392, 5067, -7737, -30184, -36496, -16734, 796, -258, -1691, 1515, -2104, -47880, -83426, -51919, -31356, -14015, 10084, 16157, -503, 21310, -41433, -9459]
6731i459k7113J8939M1510L7696o889j4914M0964l5962m2902k4714N1221P7486
6719A05863m3327l5783k5783k0635N4508J2919j4427k3255n2383k7267K768N7105
6707i697L5887j4441k0510K0984L826k4347O0720k2777K6298j7300l9591m2627
6695d3575M6092K2213J8271n4429j9768K1145L80j4463L6620J1593r878L5280
6683D9481p675m2387k3519L0501j5720k4703N9125O652q6404J10L9080j9464K6829
6670h094k4967j0572N4428o183J5427K144o5781N5849N4107m3073n5062L437j3757
6657d2097O6217O4979m0030O926k9408n9848K9546J6322O1351L9841j4633k6802
6645G2364l4507k0968l2558J9473J3868J1714j1261j0001q465K8373M5919k7316
$$ y = [-9459, -36572, -17633, 23877, 61573, 54684, 39770, 80734, 44772, 1870, -22844, 28377, 105863, 62536, 26753, 970, -19665, 34843, 47762, 33335, 10080, -42303, -69570, -66802, -9697, 26190, 11749, -8761, 12223, 16049, -8298, 52422, 29645, 55943, 38643, -948, -43575, 2517, 24730, 43001, -11428, -31196, -10051, -9671, -24134, 12486, 24079, 14201, 49481, 41806, -581, -24100, 6401, -9319, -34022, 25103, 31755, -54649, -54539, -15459, -34923, -8094, -33061, -43633, 10795, 4612, 20039, 22183, -43598, 12251, 66358, 23285, -31777, -28340, -42097, 24120, 89099, 49069, 55995, 26587, -33261, -3715, 12607, 73958, 113799, 99166, 72364, 37857, 16889, -15669, 3804, 17672, 29386, 18125, 8124, -341, 28032, 73951, 46635]
6633D6635l8290K4586k9112L474L0164P254l255O792n5590n0921L83P8630L1501
6620E2251j5810J4214k2858k3626K0579P500j1702P353K3720r624M144k5556K0635
6607D1220o4905M9997J3869O968n4151K9704Q231k0962N176K3248q010l5208l0318
6594c5141J0328J4599J6608N6577n4637j6021L827J9571j4396m164j6088k7156
6582d6093K2896K5025L577j0614o663L9728k0295K7501p7279J1524L2566q440
6570f567j2027K605j0042N7855O411l4031l1464K6037L8114Q601n3237J0633N5705
6557E8593O341j8557l0114j5159l2041J19J4363O803p426o442o694N5368J2465
6544C7619j5312j2481J8571L2389j6605J0922j4881K4092j6762o8689j2738L0063
$$ y = [46635, 8345, 32931, 3819, 7293, 37457, 44711, 41456, 48248, -7342, -58263, -57880, 20750, 52251, 36441, 50655, 27797, 4171, 24750, 32250, 20548, 27901, 51621, 41997, 46141, 20585, 41220, -23685, 26312, 40181, 47149, -7002, 22702, 30933, 9971, 15147, 38395, 30385, -4823, -35141, -24813, -10214, 6394, 62971, 8334, -7687, -3860, 15711, 1315, -2849, -18937, -46093, -23197, 1828, 5405, -5209, -11872, 27856, 7561, 35062, -42217, -30693, 1873, -6567, -18594, -15989, -26031, 31824, 38235, 4204, -27260, -1223, 36891, 45492, -7745, 2888, 58593, 64934, 46377, 16263, 1104, -30937, -30818, -16455, -9652, -17078, -23520, -30214, 25154, 37619, 22307, 9826, 28397, 60786, 44181, 55103, 40222, 64314, 47552, -21137, -33875, -3812]
6532c812M2467L845l6837K1808K6052k143n2909k2120k0089K0764J1533J3489
6520B048L9947k6868n651j8792M4472L3944o7702l5865P010j2929L8897L94j4244
6507a5339j5976k6634J5485L5664k1412K556N9229K4254n6282l3381j9456J1654
6495c9638O707J6469j1296J9660L6292m6566Q244L767J1229K6756m4646k6393
6483c9415J8002j7673k5018K9488K9653J9643j7371q1501J4168K0781k7205N7535
6471a8913O1266j6364j8786j7548J887M7286j2034K4650N08J3905l3450k9656
6459B751J1686M125l1555M1474o758l7154J4972M1783L9741p895l8147L898L4868
6446G3789j4779l1322o976k6443J414K6310M3932K4699q6579m74j2568n3988K1357
$$ y = [-3812, 38655, 42500, 5663, 27471, 53523, 51380, -1529, -23649, -43738, -22974, -11441, 2048, 41995, 15127, 9476, -9316, 35156, 69100, 1398, -34467, -27457, -40386, -1489, -1095, -15339, -31315, -57949, -42464, -6800, -28212, -25656, 33573, 57827, 1545, -31836, -51292, -39638, -32931, -16462, -27758, -8098, 28194, -18372, -10128, -6361, 4868, 31624, -13022, -39415, -21413, -39086, -64104, -34616, -4963, 14680, -2691, -84192, -70024, -49243, -76448, -18913, 42353, 25989, 7203, -10345, -8458, 38828, 26794, 51444, 51952, 65857, 32407, 2751, 14437, 18562, -12993, 28481, 21723, -15431, -459, 41324, 81065, 73170, 35023, 38921, 73789, 59010, 27688, 20712, -5731, -4317, 21993, 65925, 90624, 4045, 3571, -8997, -62985, -41628]
6433d1628P1690R095k7152L2543K0440J388o1458J0590K2585k8140M2543q637
6421D3859l4513k2449M8900R954k1911L162j5613K7109J9882k1485k2991M863
6409A8767l6127j0371J7341J2104O623K3053L2078k7952j6298J3798J9739L80
6397E3135j4960k1033K0583l8889N322M2682K4740l3593j0249M998K5946N322
6385F4004K267l4256M493J396L8192J3402l0529Q31m5719m4600L2977L7026p336
6372C2148n084k1064K8762J3515n5418K6709P0584N032l7011K976K503l3090O516
6359C7078K2334l203j204m1190j0773K3523L2595K3719j7788P271k9401J3106
6347E6067r881M3605K3532J8659K9031l1119L288N1011J870K3321J152p9706l745
$$ y = [-41628, 30062, 39157, 12005, 44548, 64988, 66376, 4918, 15508, 38093, 9953, 52496, 43859, 9346, -13103, 35797, 45751, 23840, 27002, 11389, 38498, 58380, 36895, 13904, 18767, -17360, -27731, -10390, 1714, 8337, 31390, 63468, 35516, 19218, 33016, 52755, 53135, 38175, 17142, 37725, -1164, 4158, 46840, 71580, 37987, 27738, 32736, 58682, 64004, 66271, 32015, 36508, 37904, 76096, 89498, 58969, 59800, 14081, -30519, 2458, 39484, 32148, 27064, 6000, 34762, 48277, -7141, 19568, 90152, 95184, 58173, 61149, 63652, 30562, 37078, 59412, 56209, 55005, 13815, 3042, 26565, 59160, 82879, 65091, 72362, 42961, 56067, 46186, 89791, 113323, 131982, 161013, 129894, 133182, 184193, 186063, 209384, 210536, 130830, 127085]
6334A27085N1535L1361p948J1140l9927m9873k161r894k7417Q420l1668K0550
6322H1203k1564j5898J1200Q896R555J5970J1195m9081l040j4783k3346j1769
6310a462L6216L4263k899j5140M9177m6841j9307k6401l3753N8950k0706k6686
6298a4589L2442M046K3453K443J0162N4876k4198m6977j11M0842k304j0228M4043
6285A13900o8483P921K9864K248k5778J6547K3872o8321R662R835j5747N6035
6273I1555K6263n5515J3689j6426n8752K6230O7293J387o4952M1439J6737o0717
6261B8231M4470k9797l2596L8900j278k9172J9026K505j2976j8163N2024R530
6249G0704o2159N054j0374j7003Q3716Q955n7166o867j0085J0968J5197J6859
$$ y = [127085, 178620, 209981, 202033, 213173, 173246, 123373, 121212, 111318, 83901, 92321, 60653, 81203, 59639, 43741, 54941, 63837, 73392, 89362, 100557, 51476, 48436, 33653, 10307, -1462, 34754, 69017, 66118, 50978, 100155, 53314, 34007, 7606, -26147, 32803, 12097, -14589, 17853, 21899, 45352, 47795, 57957, 112833, 88635, 41658, 41547, 82389, 80085, 69857, 113900, 45417, 53338, 83202, 85450, 59672, 76219, 100091, 31770, 41432, 51267, 35520, 91555, 117818, 62303, 75992, 59566, 814, 27044, 94337, 95724, 30772, 72211, 88948, 28231, 72701, 42904, 10308, 49208, 47930, 18758, 37784, 40289, 27313, 9150, 61174, 70704, 8545, 13599, 3225, -13778, 69938, 78893, 21727, 14860, 4775, 15743, 30940, 47799]
6237D7799k0831j1705K6674L2358o1441l043K4503J6974k5368J4842J1961P791
6225F0514m0355J7936M199k1763O3407m461n2460J448K3937K5595k8261k1840
6213B7896q120P745m7233R7178K037j5823J3454k2750k5050K887N3154o0321L0523
6200E5577M8359m2892l4637p288J1424N5521p301L2828j8473l8825r629J7156
6188F1820k1472O222p499j2226K601K4414m803m86j3012J9286k7904k2661J6829
6175B1109L9750P249J2054j9029L1058m43n4135O3809K4886l6187K1770k3445
6163H8446J1202k3426J5798j0738m9445L7154Q918k3035m130P568N191j4122J8477
6150F7858m27k700j4173K8049l2943o159L7741l7147k1753J7861J4526j9294J1424
$$ y = [47799, 26968, 15263, 41937, 74295, 12854, 9811, 34314, 51288, 25920, 40762, 52723, 60514, 20159, 38095, 42294, 20531, 83938, 79477, 27017, 28465, 52402, 77997, 49736, 27896, 19776, 27521, -19712, 77466, 79503, 63680, 77134, 54384, 29334, 32221, 85375, 25054, 55577, 103936, 61044, 26407, 19119, 30543, 86064, 78763, 111591, 93118, 54293, 44664, 61820, 40348, 46570, 39071, 26845, 29446, 53860, 49057, 48571, 35559, 54845, 26941, 4280, 21109, 60859, 68108, 80162, 61133, 92191, 91748, 37613, 101422, 126308, 90121, 111891, 88446, 99648, 76222, 92020, 81282, 31837, 68991, 77909, 54874, 50744, 58312, 63503, 49381, 67858, 67431, 64731, 50558, 78607, 45664, 39505, 77246, 40099, 18346, 36207, 50733, 31439, 42863]
6137D2863j2Q032k3055j6094M3204K056O008o2026P329O9499k3090n7878L1325
6124B8161J4963K102m339j3254k210K6756Q751l2496k0618j001Q1395O02K730
6111I1542n6710k8693K4628j4488K0958L4931l495j3930L6459K734o7495L7468
6099F3909l2679j4591L3843L9567o2898K6179K3688k6433n994q856j5505K5388
6087D5618k4176K4754L3750k6109l364k3085O2415M1608l9262m6449K0104L1644
6075I7448r323l1871m7983K3490q25j390J4334k1721l770L6127J3582q032k5651
6062C4415j4119M0582J0789m700j1196M9327O697k859Q324k1159j5746k4133M4300
6049A00522j4508J7204J9592l1235n9056k1416O560O093M1050M1633l4798k7007
$$ y = [42863, 42851, 50883, 27828, 11734, 54938, 56994, 63002, 976, 8305, 77804, 54714, -3164, 28161, 43124, 45226, 40887, 27633, 25423, 52179, 60930, 28434, 7816, 6815, 88210, 88812, 91542, 34832, 6139, 30767, 16279, 37237, 72168, 68673, 54743, 91202, 93936, 26441, 63909, 31230, 16639, 50482, 90049, 27151, 53330, 77018, 50585, 44591, 35735, 20230, 45618, 21442, 46196, 79946, 53837, 50473, 27388, 89803, 131411, 92149, 45700, 65804, 97448, 88125, 56254, 8271, 31761, 30936, 29546, 43880, 22159, 18389, 54516, 68098, 60066, 34415, 20296, 60878, 71667, 66967, 55771, 105098, 111795, 108936, 117260, 96101, 80355, 56222, 100522, 86014, 103218, 122810, 91575, 32519, 11103, 17663, 23756, 64806, 106439, 71641, 44634]
6037D4634K7262O3566K279Q739m2162j2573l8693j4259l2251J8107N4876M1220
6025A20745l5071k7804l589k6947K6248R67K7930l1188N2085l1449J3930m3699
6013D2158m982N2403r900j5554J3037R454m666L5342l4867j3145L0939p2404K241
6000C0056M4492K70k7956p782M600q098J5212l464J5118K6823p135n384j2577
5987F4175K3826j8373j1029M5346P137l1927N9104J4855n8121l2043m106M3745
5975A02589O9095l4814j6447R061m0683M8718j206l8582J476n886L4540N791o4373
5962F9279j1810L8197N919J1649J3823p178J0736o571k9895K1606j2598k8400
5950G4757j6675N1810K0469p6994q199L6714L0171L6544n8228j3507J205L1295
$$ y = [44634, 71896, 135462, 137741, 146480, 104318, 91745, 53052, 38793, 6542, 24649, 79525, 120745, 85674, 57870, 54281, 27334, 53582, 54549, 82479, 51291, 103376, 71927, 85857, 42158, 37176, 89579, 79679, 64125, 77162, 86616, 81950, 117292, 82425, 69280, 100219, 27815, 30056, 74548, 74818, 46862, 39080, 43680, 35582, 50794, 47330, 62448, 89271, 82136, 76752, 64175, 88001, 69628, 58599, 103945, 111082, 79155, 138259, 153114, 94993, 62950, 58844, 102589, 171684, 136870, 120423, 129484, 88801, 137519, 136313, 97731, 99207, 93321, 127861, 133652, 69279, 57469, 95666, 101585, 113234, 127057, 119879, 130615, 124044, 94149, 115755, 103157, 74757, 58082, 109892, 130361, 53367, 45168, 81882, 112053, 148597, 90369, 76862, 78067, 109362]
5938A09362k2939n8836j0354K6478j8816j6866L2737O1805p160r584L4479l6641
5926H3665L0985j9203m8107J2201N3489K4874p0997L9400K72J3039J597j389L5543
5913A55369k3125m3365k990j6511J6962R0261m5005n1209M7415O842j6191J5251
5901A33704j4824M649l9083N862L1263n988j183K846J7938j649l1246j4035n219
5888H3035K723J0244L6908q065K1049j1537p560N037m0295q913N3934k7951j2133
5875I6476N7381R257l7502K2465J134o880o4444L7696L979l0371L0175k5500J1886
5862A05752M5233K631k1343j1868m671K4088L6264j9831P118j7251L0966J0279
5850A87367k4829n4517M2311r283k1648L1401p477Q119j652L5075k5470p637K7222
$$ y = [109362, 86423, 27587, 17233, 43711, 24895, 8029, 40766, 102571, 95411, 85827, 120306, 83665, 114650, 95447, 47340, 59541, 113030, 137904, 66907, 106307, 106579, 119618, 121215, 119826, 155369, 132244, 88879, 85889, 69378, 86340, 176601, 131596, 80387, 127802, 134644, 118453, 133704, 118880, 123529, 84446, 90308, 121571, 115583, 114400, 117246, 135184, 133535, 102289, 88254, 83035, 85758, 96002, 132910, 124845, 145894, 134357, 126797, 131834, 91539, 82626, 136560, 108609, 96476, 153857, 163114, 125612, 148077, 149211, 142331, 77887, 115583, 119562, 89191, 119366, 93866, 105752, 150985, 153616, 132273, 120405, 115734, 139822, 176086, 156255, 163373, 146122, 177088, 187367, 162538, 108021, 150332, 141049, 119401, 150802, 143325, 151444, 149792, 184867, 159397, 151760, 178982]
5837A78982j7662K4707k6577j9740j6433L5706L1114N707j6241n3431K2863L9715
5825A88710K3549k2494l6036J749j6966k2529J7542j1795m208K6054l327M2598
5813A82847n5216k4535N7073k4136j2817k2468N8305L0614Q69l6966n890l2340
5801A15340J9193J8607n3512K717O3101J4755o3336K1840O9408M992k1549l1043
5789A60513O568l014M514p51N4297n7531k3207J4914M4313P624m0509J6647P725
5776A92103l9235K4472j249P949j5055J5687j5534O310J1054J3755j0339k4783
5764A65135o477J8338j2562J1172M4550n4934n237j4003R664l2320K8443K7004
5752A78773J0501l5004l3210N5927J2706m4041J6739N7563J6409l2484m1030Q795
$$ y = [178982, 161320, 186027, 159450, 139710, 123277, 158983, 190097, 195804, 179563, 126132, 148995, 188710, 212259, 189765, 153729, 155478, 138512, 115983, 133525, 121730, 117522, 143576, 140249, 182847, 127631, 103096, 160169, 136033, 123216, 100748, 159053, 189667, 190536, 153570, 147680, 115340, 134533, 153140, 99628, 102345, 165446, 180201, 116865, 138705, 208113, 213105, 191556, 160513, 167081, 164067, 168581, 167830, 222127, 164596, 141389, 156303, 200616, 208240, 167731, 184378, 192103, 152868, 177340, 176091, 184040, 168985, 184672, 169138, 175448, 186502, 200257, 189918, 165135, 158658, 176996, 164434, 175606, 220156, 165222, 159985, 145982, 155646, 123326, 151769, 178773, 189274, 154270, 121060, 176987, 189693, 145652, 162391, 219954, 236363, 203879, 162849, 171644]
5740A71644L9564l0531m9092j2155P7211M0434l764L1804k9635l538k3115M834
5728B13661l5978j8758O61P011L3918j6162R444J6379l2399J0250J6544Q412k7664
5715A85319R538K918k1218K1320J495k6164j4415N0128j8511m3034L7966J2542
5703A97884O019R510j6898K2827j5854j2372q220j1740l2084J1961N3499j9225
5691A85307j5965J4473p0324J9107J8657j8197K0572N248M5018m7870k3041Q4068
5679B17053q168l9098j5313L4189o045J3037k567k0865L580L5970j6156R36M1303
5666B37856J2551n9203o754P343k9734M324j9805L4737l154K8863R128j8045j8135
5653A79972J9812P0196j6191l6323J3488l4691N222L594J9787M4885n1946k0795
$$ y = [171644, 211208, 180677, 131585, 119430, 196641, 237075, 233311, 265115, 235480, 231942, 208827, 213661, 177683, 158925, 159586, 166597, 200515, 184353, 193797, 210176, 177777, 188027, 204571, 212983, 185319, 194857, 197775, 176557, 197877, 199372, 173208, 158793, 208921, 190410, 147376, 185342, 197884, 203903, 213413, 196515, 219342, 203488, 191116, 182896, 171156, 139072, 151033, 204532, 185307, 169342, 183815, 113491, 132598, 151255, 133058, 153630, 158878, 203896, 156026, 132985, 217053, 208885, 169787, 154474, 188663, 182618, 195655, 193088, 172223, 175803, 211773, 195617, 196553, 237856, 250407, 191204, 184450, 191793, 162059, 166383, 146578, 181315, 178161, 207024, 216152, 198107, 179972, 199784, 269980, 253789, 217466, 230954, 196263, 201485, 205079, 224866, 269751, 217805, 197010]
5641A97010r417K8225r710j5289O986m221R02R222J209L8817P473l2872j9572
5628A98763J9214J7613J8044J7359m5873l9028j776n036M7173J3831j083l9663
5616A99538L2438J3647J1013M1699j4662j3144K9316q577l4716l0028K8827K4767
5604B80118p591j5833k1553J03984K4958l7174K222l9696m2316J5085J2854k5212
5592B49846K5238k7999j7740J5958n1465K1416n447J034n5996M3435K8664K0765
5580B47709p819o656k0512J3960k5765J1811N4127l8144N541K9155p972p839l2726
5567B14870l5903L0821L9122J8993K179J0088q0984o529k9361k3551K2249O634
5555A68628R530r035K5749J5309P6983J9796n1543n9973N696N3542l3958o2252
$$ y = [197010, 187593, 215818, 206108, 190819, 197805, 193584, 194486, 203708, 204917, 243734, 251207, 218335, 198763, 217977, 235590, 253634, 270993, 225120, 186092, 184316, 179280, 226453, 240284, 239201, 199538, 231976, 245623, 256636, 298335, 283673, 270529, 299845, 291268, 256552, 226524, 255351, 280118, 272527, 256694, 235141, 339125, 364083, 326909, 329131, 289435, 247119, 262204, 275058, 249846, 275084, 247085, 229345, 245303, 193838, 215254, 209807, 210841, 154845, 198280, 226944, 247709, 239890, 233234, 212722, 226682, 200917, 212728, 266855, 228711, 234252, 263407, 255435, 247596, 214870, 178967, 209788, 248910, 267903, 270082, 280170, 199186, 192657, 163296, 139745, 161994, 168628, 178158, 169123, 194872, 210181, 287164, 306960, 255417, 195444, 201140, 254682, 220724, 158472]
5543A58472N2300N1635k4593o959q088N797R684L266O592k637L483Q227k3882
5530B33297j5699J3792L3362P399l0633k4813L911r756o054N2300M7065K3611
5518C27782q2578k9766J9164K9567j7321O316m6556M9430K3789K119r428n2572
5506B19946q141O440M2809K5236k4938l0457k7950J2204L4652O8936L4672p7851
5494B75558l3276K4186O4265l4493l1882m0451L1178q621m5893M0666K4470j8219
5482B47488K611l2734M5735J9181k7014j1065j8173M8714K351l136M9689p743
5470C15904m0742j9363p998L9597n2048k5221J4402R980K4111k1586J8432R542
5458B65010K4402J4839J5413k8924J014k1711m911J032J5914o468k7210j3319
$$ y = [158472, 210772, 262407, 237814, 230855, 222767, 228564, 238248, 241514, 248106, 245469, 248952, 257179, 233297, 217598, 231390, 264752, 272151, 241518, 216705, 220616, 210860, 204806, 257106, 304171, 327782, 245204, 215438, 234602, 264169, 246848, 253164, 206608, 256038, 279827, 281946, 272518, 219946, 211805, 218245, 261054, 286290, 261352, 230895, 202945, 215149, 249801, 318737, 353409, 275558, 242282, 266468, 330733, 296240, 264358, 223907, 255085, 246464, 200571, 241237, 265707, 247488, 250099, 217365, 263100, 282281, 255267, 244202, 226029, 274743, 277094, 273958, 323647, 315904, 275162, 255799, 247801, 287398, 235350, 210129, 224531, 234511, 258622, 237036, 255468, 265010, 289412, 304251, 319664, 290740, 291754, 270043, 265132, 266164, 282078, 275610, 248400, 235081]
5446B35081N0470o674r363j0947R95M5685k3003j4748k9681P077K2399J1448J7857
5433B96596k7550J0102L1461o1580P6802N1816l6625J9735j8797O2319j5223O729
5421C95785N7004Q0710N2515L0852n1509l6824o6500k5209Q407m6410l8314P661
5409C68168p663n9243J5665o8561Q1098l8149L391K0011m7637J4900k3143J2001
5397B70838l346p229M0249k6072r657M26J276m6131l609Q3922l915k968m3212
5384B50572N1900k5312j6437j1978M3835M0552k0249o1834l5948N0056q053k1772
5372B35332L5608j3783K6428M011o208M081J6072N523n4105J1418j7640P2869
5360C19606M2959M543o8545k1784l6653O8265K0012l5655K9553L5011k6267M209
$$ y = [235081, 285551, 278877, 269514, 258567, 259562, 305247, 282244, 267496, 237815, 244892, 267291, 278739, 296596, 269046, 279148, 310609, 249029, 325831, 377647, 341022, 360757, 341960, 404279, 389056, 395785, 452789, 533499, 586014, 616866, 565357, 528533, 462033, 436824, 445231, 398821, 360507, 368168, 360505, 301262, 316927, 248366, 329464, 291315, 294706, 314717, 267080, 281980, 258837, 270838, 267492, 260263, 300512, 274440, 264783, 265209, 266485, 220354, 216745, 300667, 296752, 293784, 250572, 302472, 277160, 260723, 248745, 292580, 333132, 312883, 251049, 215101, 265157, 257104, 235332, 270940, 257157, 283585, 287596, 281388, 285469, 301541, 307064, 252959, 264377, 246737, 319606, 362565, 367108, 298563, 276779, 240126, 308391, 328403, 292748, 322301, 357312, 331045, 335254]
5348C35254J8430m833k2344n6253L2780N0599R411k1892J9072j3625j4383j0922
5336C21294m3259m678l8697L1895j5798j3839M0246p789j5691L9869n276K2648
5324C10925m8753L5588J7226n1223K2736q859L3971k7089j9233Q144J6270J8079
5312C07782j6750l5237L4645M7981k3012l0032l4029K1440L2982l0984R146J2646
5300B96578l4512j1937M987o561N3821k3534l607R265M1925l8851l5806K4389
5288B76157n709J3471k0251L6109K8121k980l311k7901j8702N1743L7225j8593
5276C45379k3549K198n786L0275K1564k7101j9741n42k6833p514L2047K8012j1905
5263C36504P458J028R055j1810o1756j1632k8173J7497K7961K1977L9068J8622
$$ y = [335254, 353684, 348851, 326507, 270254, 303034, 353633, 363044, 341152, 360224, 346599, 332216, 321294, 278035, 273357, 234660, 266555, 250757, 236918, 277164, 269375, 253684, 293553, 288277, 310925, 262172, 297760, 314986, 263763, 286499, 277640, 311611, 284522, 265289, 273433, 289703, 307782, 291032, 255795, 290440, 338421, 315409, 285377, 251348, 272788, 305770, 274786, 283932, 296578, 262066, 250129, 255116, 248555, 302376, 278842, 275235, 284500, 326425, 287574, 251768, 276157, 270448, 283919, 263668, 299777, 327898, 324918, 321607, 293706, 275004, 326747, 363972, 345379, 321830, 324028, 318242, 348517, 370081, 342980, 323239, 322697, 295864, 288350, 320397, 348409, 336504, 343962, 344990, 354045, 342235, 280479, 268847, 240674, 258171, 286132, 308109, 347177, 365799]
5251C65799m423L7681j4890l5079l8282M3691p984k47k040j8661Q300o217n2325
5238B75323R882M6151K0494N5034p285n7828r32m460k2809k6680j5031j8707k9295
5225B23857L7378L1109L0604j2185j6086K1398N248J3372j5885J7430l0091M72
5213C06621k844R563p595q470K4994N3667J9867n3180L2157n269o189p8277L1232
5200C16277K1510k7453J4979J0563m9918K6217J3319m919L4155j0498j4595n5734
5188B73903K7093K9475j0966k102K9313m3973J4740J5162n9698J9546O4795M0518
5176C97806k5674j7934J6857J6300l5250L6143M831j7792r929m4766J5248J711
5164C37551M8712J4657K6085l8872j968K918m2661J2148m559J6739J5920k2747
$$ y = [365799, 361376, 399057, 384167, 349088, 310806, 354497, 346513, 346266, 344226, 325565, 333865, 327648, 275323, 285205, 331356, 351850, 406884, 399599, 341771, 340839, 336379, 313570, 286890, 271859, 253152, 223857, 261235, 292344, 322948, 310763, 294677, 316075, 321323, 334695, 318810, 336240, 306149, 306621, 303777, 313340, 305745, 297275, 322269, 375936, 395803, 342623, 374780, 369511, 363322, 285045, 316277, 337787, 310334, 325313, 335876, 285958, 312175, 325494, 320575, 354730, 344232, 329637, 273903, 300996, 330471, 319505, 317403, 346716, 302743, 317483, 332645, 272947, 292493, 357288, 397806, 372132, 354198, 371055, 387355, 352105, 388248, 393079, 375287, 365358, 320592, 335840, 337551, 386263, 400920, 427005, 388133, 386165, 389083, 346422, 358570, 354011, 370750, 386670, 363923]
5152C63923l1193k7142M6944j8341j0191Q6146K7790J5679k2277l9171k7102K4211
5140C89276j1340J2285k8498J4720k2924M675J5537M9301L8431k7716N4174K5669
5128E13590L2473k8029k5460P731J1624R789l9054p783N0935J4812M740N2630
5116E97998j2436L403k4557K4172K0790k1351o244o124o97L671J9499l2545J2060
5103E77639N7253n7466m1628K4954L0018M1651j8610N898j5018M095Q3980m548
5091F88218L2297K9975N1510M3469K8883K7745K3756M5702L2727M5154N9877M4927
5079A154240J40519J14814J21774J27773J56649K03256J43340J26332K3199j20001
5069B191895j69215j68918k17529j97887j43192r3186o8794m2925m7994k0655
$$ y = [363923, 332730, 305588, 352532, 334191, 324000, 410146, 437936, 453615, 431338, 392167, 365065, 389276, 377936, 390221, 361723, 376443, 353519, 358194, 373731, 423032, 461463, 433747, 487921, 513590, 546063, 518034, 492574, 500305, 511929, 521718, 482664, 474881, 525816, 540628, 545368, 597998, 585562, 588965, 564408, 588580, 609370, 588019, 581775, 575651, 574954, 578625, 598124, 565579, 577639, 634892, 577426, 535798, 560752, 590770, 632421, 613811, 619709, 604691, 608786, 692766, 688218, 720515, 750490, 802000, 845469, 874352, 902097, 925853, 971555, 1004282, 1049436, 1109313, 1154240, 1294759, 1409573, 1531347, 1659120, 1815769, 2019025, 2162365, 2288697, 2311896, 2191895, 2022680, 1853762, 1636233, 1438346, 1295154, 1201968, 1133174, 1090249, 1042255, 1021600]
5059A021600m2247j3773j7801k6742l2172n520k1858N477J6317j6574k266n6572
5047H07869M7533N464n3001K1463Q765k3256k296K9241K2054L6241K4744j7454
5035I07367j6379L9019o4443o30k7694K4151M5831p574l8289J9585M0530k1082
5023I00392k5418l96M7455J1539o1261L7801O4338L9265q94M6532J9522J06552
5011A185427R0487N7534P4230J49817J42161J26766J45269K10472J94740O7792
5001B444695J2590m5637j26439k00620k03474j46273j18275j39943p0932j02495
4991A303197j04610o3820o5017M6263K5866o3282P418m3335M0835M215J4068j3578
4979A088220j6219K0222K2726J9163k8174J3416K0947n3602L2825Q679L2386j101
$$ y = [1021600, 979353, 965580, 947779, 921037, 888865, 883345, 861487, 866964, 883281, 866707, 864441, 807869, 855402, 860866, 807865, 829328, 838093, 814837, 812541, 841782, 863836, 900077, 924821, 907367, 890988, 930007, 865564, 864934, 837240, 861391, 907222, 899648, 861359, 880944, 921474, 900392, 874974, 874578, 922033, 933572, 872311, 910112, 974450, 1013715, 1012821, 1059353, 1078875, 1185427, 1275914, 1333448, 1407678, 1557495, 1699656, 1826422, 1971691, 2182163, 2376903, 2444695, 2457285, 2411648, 2285209, 2084589, 1881115, 1734842, 1616567, 1476624, 1405692, 1303197, 1198587, 1134767, 1069750, 1116013, 1141879, 1078597, 1086015, 1042680, 1083515, 1087730, 1101798, 1088220, 1072001, 1092223, 1114949, 1134112, 1105938, 1119354, 1140301, 1086699, 1119524, 1128203, 1160589, 1159488]
4967A159488m540Q947k7953O1202K6823N2606Q2266j9341K9604K9153l2421o103
4955A359731N0823J1400j3612k3481o744J742k5089k1704N0728N1706L6535m7747
4943A424288K7156M7472j5531j4174k0477J1125Q8481K5898O1764N8833j2074
4932A682761J9321Q9495M5571M761K0918J4362M614J6819N5690O668k5965M0585
4920A975600P057j7143n675n4759J9319N200M5152o036l9218l2806M6292N7099
4908B000082K7466K0865N9309Q5016M3760R643R2717N5282M7988O6889N1472P4116
4896B634605L2374P8804P4597L2344K0659L386K1859L9858M8516M098O0746M3336
4884C095182M9951N9900J01170K1129J00521J44926N2477M4870L2122P9299M2825
$$ y = [1159488, 1154948, 1163895, 1135942, 1197144, 1223967, 1276573, 1358839, 1339498, 1369102, 1398255, 1365834, 1359731, 1410554, 1421954, 1408342, 1384861, 1378117, 1379859, 1354770, 1333066, 1383794, 1435500, 1472035, 1424288, 1451444, 1498916, 1483385, 1469211, 1448734, 1459859, 1548340, 1574238, 1636002, 1694835, 1682761, 1702082, 1791577, 1837148, 1841909, 1862827, 1877189, 1881803, 1898622, 1954312, 1960980, 1935015, 1975600, 1982657, 1965514, 1959839, 1905080, 1924399, 1929599, 1974751, 1968715, 1929497, 1896691, 1942983, 2000082, 2027548, 2048413, 2107722, 2192738, 2236498, 2246141, 2338858, 2394140, 2442128, 2509017, 2560489, 2634605, 2666979, 2745783, 2820380, 2852724, 2873383, 2876769, 2898628, 2938486, 2987002, 2991100, 3051846, 3095182, 3145133, 3205033, 3306203, 3327332, 3427853, 3572779, 3625256, 3670126, 3702248, 3781547, 3824372]
4873C824372n839P204Q3363J4035J01470P2107P5372J30635J08365J05010J04380
4862D620474J06550P6421Q9031J31530P9345J35665P5557J08773J85101J23616
4852E732063J17784O9976J01307R4908J02975J32496J49671J13614J55237K15674
4842F985705K09608K29553K74364K35070K49438K16662J86643J86625K45369K75942
4832I294979K31970K61120K15555J62862K15630J53936K10411K42761K46928L05520
4822A1541672K87370K28705K96648K58037K43537K10897J99759K41928K27511
4813A3736064K73098K64911K34978L13715L51490M01280M12659L87125M44711
4804A6820031M25367M87575N03714O34526O44727P42391P72423P31471Q27527
$$ y = [3824372, 3818533, 3825737, 3909100, 3923135, 4024605, 4096712, 4172084, 4302719, 4411084, 4516094, 4620474, 4727024, 4803445, 4892476, 5024006, 5103351, 5239016, 5314573, 5423346, 5608447, 5732063, 5849847, 5919823, 6021130, 6116038, 6219013, 6351509, 6501180, 6614794, 6770031, 6985705, 7195313, 7424866, 7699230, 7934300, 8183738, 8400400, 8587043, 8773668, 9019037, 9294979, 9526949, 9788069, 10003624, 10166486, 10382116, 10536052, 10746463, 10989224, 11236152, 11541672, 11829042, 12057747, 12354395, 12612432, 12855969, 13066866, 13266625, 13508553, 13736064, 14009162, 14274073, 14509051, 14822766, 15174256, 15575536, 15988195, 16375320, 16820031, 17245398, 17732973, 18236687, 18871213, 19515940, 20258331, 21030754, 21762225, 22589752]
4795B2589752R16994R56990R58669J000996J041563J100594J167471J270059J401143
4786C2404231J589518J687110J949257K235284K482054K874125L297393L844027
4778E2362999M415670N174442O159682P411926Q854026J0586018J2306589J3870633
4770A21141985J5606021J7665712J9793694K2241799K5097947K8477416L1897361
4763B81921935L1800406K3445244N671139j7427652l5433353m2729399m0122131
4756B07126189l2049459k4791448j9033671j4693623j1625748r556679q045402
4749H7330159o928507n853240m982498m219958l560453l111963k841498k560693
4741E3271349k304759k173053j847832j617380j494474j274568j063522r88046
$$ y = [22589752, 23506746, 24463736, 25422405, 26423401, 27464964, 28565558, 29733029, 31003088, 32404231, 33993749, 35680859, 37630116, 39865400, 42347454, 45221579, 48518972, 52362999, 56778669, 61953111, 68112793, 75524719, 84378745, 94964763, 107271352, 121141985, 136748006, 154413718, 174207412, 196449211, 221547158, 250024574, 281921935, 313722341, 337167585, 342838724, 325411072, 289977719, 247248320, 207126189, 175076730, 150285282, 131251611, 116557988, 104932240, 95375561, 87330159, 80401652, 74548412, 69565914, 65345956, 61785503, 58673540, 55832042, 53271349, 50966590, 48793537, 46945705, 45328325, 43833851, 42559283, 41495761, 40507715]
4733D0507715q31300o44181o16519m24471l29437k28367j42728J9545J41289K26267
4723C7677813K54167K77665K78722K75871L89944M63816N71927O58726Q29677
4714D1678328R34795J127263J383148J678244J978312K318205K811605L287136
4706E7197036L915192M638192N648130O947103Q313894R912145J1630076J3342697
4698A21544465J5297398J7507091J9337425K1789971K4717863K7822158L0061864
4691B78078235K8150964J9160286M376977j2809648k6955250l6263972l9183736
4684B14553856l4004582k6616153k0836767j6363613j3047536j0560651q876908
4677H4247646p481832o333971n426084m597114m014976l569236l162882k848720
$$ y = [40507715, 39676415, 39032234, 38415715, 37991244, 37661807, 37433440, 37290712, 37310257, 37451546, 37677813, 37931980, 38209645, 38488367, 38764238, 39154182, 39617998, 40189925, 40848651, 41678328, 42613123, 43740386, 45123534, 46801778, 48780090, 51098295, 53909900, 57197036, 61112228, 65750420, 71398550, 78345653, 86659547, 96571692, 108201768, 121544465, 136841863, 154348954, 173686379, 195476350, 220194213, 248016371, 278078235, 306229199, 325389485, 329766462, 316956814, 290001564, 253737592, 214553856, 180549274, 153933121, 133096354, 116732741, 103685205, 93124554, 84247646, 76765814, 70431843, 65005759, 60408645, 56393669, 52824433, 49661551, 46812831]
4669D6812831k648294k437890k177130j970146j819304j670207j487158j382950
4661C1219752j343793j223569j178604j009272r21281q78313r25292p56790p16523
4652B2266315o51318o51950o81021p13655o76081o51420o37058o41245n84618
4643A6377949m76246m48248m26960l96223l77661l75988m05571l91202l83462
4634A2696388l04235k60871k84791k60338k84496k09980k26706k42385j66259
4625A0456327j73738j98660k05002j90926j80710j98764j68125j59314j31464
4616H849624j54557k12563j96679j06504j86460j50887j89453k13325j23581j87164
4606G128451j28941j23908j40393j74457j98793j78520j75904j35858j37823r1130
$$ y = [46812831, 44164537, 41726647, 39549517, 37579371, 35760067, 34089860, 32602702, 31219752, 29875959, 28652390, 27473786, 26464514, 25543233, 24664920, 23739628, 22982838, 22266315, 21614997, 20963047, 20282026, 19568371, 18892290, 18240870, 17603812, 16962567, 16377949, 15901703, 15453455, 15026495, 14630272, 14252611, 13876623, 13471052, 13079850, 12696388, 12392153, 12131282, 11846491, 11586153, 11301657, 11091677, 10864971, 10622586, 10456327, 10282589, 10083929, 9878927, 9688001, 9507291, 9308527, 9140402, 8981088, 8849624, 8695067, 8482504, 8285825, 8179321, 7992861, 7841974, 7652521, 7439196, 7315615, 7128451, 6999510, 6875602, 6735209, 6560752, 6361959, 6183439, 6007535, 5871677, 5733854, 5642724]
4596E642724o1121j35416j11722q5705j39475j25401r8639n9126j00240m3152
4586D682727m4606j07764l1766j3536n9176j24369o8539m7903l9439j6993j19731
4575D008905o6077r8380j29261j7749j4180o4703m6833M0216J0223J9675n1817
4564C590019m7262K512n8429q0888l1031p7821J9168l3580m8935j7737J888k9765
4552C188139n2161M772n5636k0874o678m1089N0359k0981j2217L1873n6526n0307
4540B958674k2164m4954o2377o281r2422p7861o5463m5667M2711k400o8379m2994
4528B470423j8665k6706m5410L54l0708r391l2741J0164J6464l714o7648R359
4516B271781J9805L1170M0889j9936l169J2077j3782n3100p0409l9333N4876K2196
$$ y = [5642724, 5581603, 5446187, 5334465, 5248760, 5109285, 4983884, 4885245, 4826119, 4725879, 4682727, 4638121, 4530357, 4498591, 4485055, 4425879, 4301510, 4232971, 4185068, 4145629, 4128636, 4008905, 3942828, 3844448, 3715187, 3697438, 3683258, 3618555, 3571722, 3611938, 3622161, 3641836, 3590019, 3542757, 3545269, 3486840, 3405952, 3374921, 3297100, 3316268, 3282688, 3233753, 3216016, 3217904, 3188139, 3135978, 3140750, 3085114, 3064240, 3057562, 3016473, 3066832, 3045851, 3033634, 3065507, 3008981, 2958674, 2936510, 2891556, 2829179, 2822898, 2730476, 2652615, 2587152, 2541485, 2584196, 2581796, 2513417, 2470423, 2451758, 2425052, 2379642, 2379996, 2349288, 2339897, 2307156, 2317320, 2333784, 2330070, 2262422, 2271781, 2291586, 2322756, 2363645, 2343709, 2340540, 2352617, 2338835, 2285735, 2215326, 2175993, 2230869, 2253065]
4504B253065J1933l3741l7590k8906L7379J7382j03681l2617K7253n9935n0397
4493B000145J0588m9450M8691j6815o2000k5705P373N586J4031L955O1242n4041
4481A943600O2405j259n9215J9324M9056L3317k2669n8958l958Q2687k1559K1469
4469B044240M0499J0390J2249K4327O507K2048M5650J8638J1008O9363j5476M4396
4457B333839Q2466J00538K1777J23782J07993J36426J49688J32869J35969J58587
4447C483934M3884j35730k72898k03998j53224j96287j23743j23555o6349n0693
4437B201341q6175m2066o3887l4955n2752k1640k4427l8160J7406J029m2887n2204
4425A760623n8144m0969j7154l0799n3276Q286K7503K0816q021k0293l5308J5008
$$ y = [2253065, 2264998, 2231257, 2193667, 2164761, 2202140, 2219522, 2115841, 2083224, 2110477, 2050542, 2000145, 2010733, 1961283, 2009974, 1993159, 1931159, 1905454, 1912827, 1918413, 1932444, 1936399, 1997641, 1943600, 2006005, 2004746, 1945531, 1964855, 2013911, 2047228, 2024559, 1965601, 1961643, 2044330, 2022771, 2044240, 2084739, 2095129, 2107378, 2131705, 2138212, 2160260, 2205910, 2224548, 2235556, 2304919, 2289443, 2333839, 2416305, 2516843, 2538620, 2662402, 2770395, 2906821, 3056509, 3189378, 3325347, 3483934, 3527818, 3392088, 3119190, 2915192, 2761968, 2565681, 2441938, 2318383, 2252034, 2201341, 2115166, 2073100, 2009213, 1974258, 1921506, 1899866, 1875439, 1837279, 1854685, 1855714, 1812827, 1760623, 1702479, 1661510, 1644356, 1613557, 1560281, 1568567, 1596070, 1616886, 1608865, 1588572, 1553264, 1568272]
4413A568272l8810k6417M7043n4421Q8241j2208K0120J1729m6653q7081M46J1994
4401A482255p418J1175K6861j1772P796L3229n189j651j2175J7356M4675J8727
4389A603869O1681N5043Q7649M0019O515K9430J06353J11418M8591P9794J06847
4378B337209J79868J86824J72882J04853M8945L0804n8037j95550k30819j88347
4368B388632j71877j80547o9285j09198m1193l9118m1543k5551q5522l8103M7626
4357A634321r497l9792l4869N4839p9872n8408n1728J734N3175j5325l7004L7898
4345A455472j9832q179J0885p902j6967p0154J5847L0873K2567q675j5880j0452
4333A377603N683j4570R412r278K1978m7931n509K0574L9582J878R653L6220k2737
$$ y = [1568272, 1529462, 1503045, 1550088, 1495667, 1583908, 1571700, 1591820, 1603549, 1556896, 1469815, 1470261, 1482255, 1474837, 1486012, 1512873, 1501101, 1508897, 1542126, 1536937, 1535286, 1523111, 1540467, 1585142, 1603869, 1665550, 1720593, 1808242, 1848261, 1854776, 1884206, 1990559, 2101977, 2150568, 2230362, 2337209, 2517077, 2703901, 2876783, 2981636, 3030581, 3061385, 3003348, 2807798, 2576979, 2388632, 2216755, 2036208, 1966923, 1857725, 1816532, 1777414, 1735871, 1710320, 1624798, 1586695, 1634321, 1624824, 1585032, 1550163, 1605002, 1525130, 1466722, 1414994, 1416728, 1469903, 1454578, 1417574, 1455472, 1435640, 1427461, 1438346, 1430444, 1413477, 1343323, 1359170, 1390043, 1412610, 1403935, 1388055, 1377603, 1383286, 1368716, 1378128, 1368850, 1390828, 1342897, 1337388, 1357962, 1397544, 1399422, 1409075, 1445295, 1422558]
4320A422558K213K493o8239M5878Q669l5144O813L5136Q57k9286j9673R481k5429
4307A356327N376L9212j8331K5517k3969N1811L1865k9044Q42J0108L6922K0763
4295A507399k0377j0089l5480m8283o231M0743k162J3685l7774k8869K9870P351
4283A409783R290K1516j1938o6852L8710M3027L5796l461n1705O925J6047M5238
4271A492376K1390l4561J429N662j7805M4773L6692l7764N4487J1965N9352k0546
4259A617450j289M1617K4862K2010M6181P1996Q135L1530L3628R8138Q7778L6012
4247B118048M3432P8033R2309M489l1690m9734q8458q0317m5485p9563l3672l4508
4235A892884j5711m8098Q438M763k2340k9026k6558l05j1668r740l3713K0715
$$ y = [1422558, 1424771, 1427264, 1359025, 1404903, 1413572, 1378428, 1385241, 1420377, 1421234, 1391948, 1372275, 1381756, 1356327, 1361703, 1400915, 1382584, 1408101, 1384132, 1435943, 1467808, 1438764, 1439606, 1449714, 1486636, 1507399, 1487022, 1476933, 1441453, 1393170, 1386939, 1427682, 1425520, 1439205, 1401431, 1372562, 1402432, 1409783, 1419073, 1440589, 1428651, 1361799, 1400509, 1443536, 1479332, 1475871, 1424166, 1431091, 1447138, 1492376, 1513766, 1479205, 1480634, 1486296, 1468491, 1513264, 1549956, 1512192, 1566679, 1578644, 1637996, 1617450, 1616161, 1657778, 1682640, 1704650, 1750831, 1822827, 1830962, 1862492, 1896120, 1994258, 2082036, 2118048, 2161480, 2239513, 2331822, 2336311, 2304621, 2254887, 2166429, 2086112, 2040627, 1961064, 1927392, 1892884, 1877173, 1829075, 1837513, 1842276, 1819936, 1790910, 1764352, 1764047, 1752379, 1742639, 1708926, 1729641]
4223A729641K696n3954j9326Q85J4046R162l2085O989j2352q257J9153p266K2088
4210A671420j9251M6768P3298o6247o4089L2208M7157m0000O5O0137N7013l12
4198A798167P462N4351L8953j4585L2144n1788N4161O9515P804l3767J0252k575
4186A970094K3045L5774k6582Q945j8408k1332L2492k5287o5370L5505Q8442k038
4174B035280r629N0018O5794M0114P6196j0665K9134N5993M1299M7801P1144L1464
4162B523943M6508O2511J1921K7214j4012q6882q1851j2972m9036p8247m8435
4151B300662o0203J9085m6549m7365J8092j9547m5312p8350J312J8944k1685o588
4139B032496K749k8046j731k336k0124k3402K6540m0568O3792K4250j17300k8002
$$ y = [1729641, 1732337, 1678383, 1659057, 1659942, 1673988, 1683150, 1651065, 1658054, 1645702, 1637445, 1656598, 1649332, 1671420, 1652169, 1698937, 1772235, 1705988, 1641899, 1674107, 1721264, 1681264, 1681329, 1741466, 1798479, 1798167, 1805629, 1859980, 1898933, 1884348, 1916492, 1864704, 1918865, 1988380, 1996184, 1962417, 1972669, 1970094, 1993139, 2028913, 2002331, 2011276, 1992868, 1971536, 2004028, 1978741, 1913371, 1948876, 2037318, 2035280, 2025651, 2075669, 2141463, 2181577, 2257773, 2247108, 2276242, 2332235, 2373534, 2421335, 2492479, 2523943, 2570451, 2632962, 2644883, 2672097, 2658085, 2571203, 2489352, 2476380, 2427344, 2349097, 2300662, 2240459, 2259544, 2212995, 2165630, 2183722, 2164175, 2118863, 2040513, 2041825, 2060769, 2039084, 2032496, 2035245, 2007199, 2005468, 2003132, 1983008, 1959606, 1986146, 1945578, 2009370, 2033620, 1916320, 1888318]
4127A888318m0834k0860K9250j2677K443O43o4748K0806r68K160M3825p9153j6484
4114A751721k1078o610j4885J984k3543J0089p323N104k5477m1943k7712l9588
4102A560739Q8858R537l093O3320K014l1838L146k871N396j1726R259N023J3225
4089A710989M6489N836J9163Q929m6937k7655P331k0021J2740o643j120K6892
4077A735993j638o7157K070k8184q126L7995k5879j6204k1213q26M45K7730M3089
4064A678095o4247m749j107m7075L0474j063K5088p3534p782Q1714r0361k435
4052A523018L6314j0174m7295J2755j6727k8804o189l413K1264j7118n8641l9988
4040A365002j8940J7673k0379q281l1211k1720M4475m2596j1293n40L6389k3819
$$ y = [1888318, 1847484, 1826624, 1855874, 1843197, 1845640, 1846283, 1781535, 1802341, 1801373, 1803533, 1847358, 1768205, 1751721, 1730643, 1724033, 1709148, 1711132, 1687589, 1697678, 1690355, 1695459, 1669982, 1628039, 1600327, 1560739, 1649597, 1659134, 1656041, 1719361, 1721375, 1689537, 1692683, 1689812, 1695208, 1683482, 1692741, 1697764, 1710989, 1757478, 1763314, 1782477, 1791406, 1744469, 1716814, 1724145, 1704124, 1716864, 1710221, 1709101, 1735993, 1734355, 1667198, 1669268, 1641084, 1632958, 1670953, 1645074, 1628870, 1607657, 1606831, 1607276, 1635006, 1678095, 1613848, 1609099, 1607992, 1560917, 1591391, 1590328, 1615416, 1541882, 1534100, 1615814, 1525453, 1523018, 1559332, 1549158, 1501863, 1514618, 1497891, 1469087, 1462898, 1459485, 1480749, 1463631, 1404990, 1365002, 1346062, 1363735, 1343356, 1335075, 1303864, 1282144, 1326619, 1284023, 1272730, 1272190, 1308579, 1284760]
4028A284760k2782O9305k6112J8240Q472R195o8630L110j9012o533K918l45N489
4015A258075L3999m0323m9362j5862m0114L8261j285n8494j6878P0583J3229L3587
4003A225416l1984l5916O165M1819j04963j9141N8239j0492r215R080n7664R536
3991A080880n17N4944L156o9528K3083J8783k5714R926l4935K0583j5061m4811
3979A020789k5961q527J8875L6377L384k7374l4192K3604L3708l2722L0046M6371
3967A084378M646j8215M6323O2597l2440m2916J923L9062L9644l0328l3783l4930
3955A085961j8788k4795n4538M492n598L376J7167K3967l3k8759o3950p111j2336
3942I19055N830J3076L6021L0897l1387j200p066J2767Q6681j3169J758K3694
$$ y = [1284760, 1261978, 1331283, 1305171, 1323411, 1331883, 1341078, 1272448, 1275558, 1256546, 1250013, 1252931, 1252586, 1258075, 1292074, 1251751, 1202389, 1186527, 1146413, 1184674, 1183389, 1124895, 1108017, 1178600, 1191829, 1225416, 1193432, 1157516, 1163681, 1205500, 1100537, 1081396, 1139635, 1129143, 1119928, 1129008, 1071344, 1080880, 1080363, 1135307, 1138463, 1068935, 1092018, 1110801, 1085087, 1095013, 1060078, 1080661, 1065600, 1020789, 994828, 986301, 1005176, 1041553, 1044937, 1017563, 983371, 1006975, 1040683, 1007961, 1038007, 1084378, 1089024, 1070809, 1117132, 1179729, 1147289, 1104373, 1106296, 1145358, 1185002, 1154674, 1120891, 1085961, 1067173, 1042378, 987840, 992332, 986734, 990110, 1007277, 1031244, 1031211, 1002452, 938502, 931391, 919055, 924885, 937961, 973982, 1004879, 973492, 972292, 965226, 977993, 1064674, 1051505, 1053263, 1076957]
3930A076957p8542m6214k0432l7312J0418J3122j4952R106k2035J1957P352K3205
3918I32630k0246L3035K2075p860j5502j8035N0605L0167m669r997j1773l0809
3906I49621j2206M840K2541J7115j5832j7003q564K9084N6429K3641l1225P5665
3894A094106M7948M8401J7246M2913L9977P9318P2151L0959L8075P6970J52376
3883A740440J78219P9981n7608j13771j71065j77087p2725l1522n7732p1758k302
3872A243070l877k6231M460k806q606P0579M0203q940J14252Q6740M1021N1757
3860A601622J09388J33650M7597o428p7655j40520j33032j58129q2600j08334
3850A185559l3745o3024n4638N4838k9963o6362m0238k1958J9629k1668k6595
$$ y = [1076957, 998415, 952201, 931769, 894457, 904875, 917997, 903045, 912151, 890116, 902073, 909425, 932630, 912384, 945419, 967494, 959634, 944132, 926097, 976702, 1006869, 1002200, 992203, 980430, 949621, 937415, 942255, 964796, 981911, 966079, 949076, 940512, 969596, 1026025, 1049666, 1018441, 1094106, 1142054, 1190455, 1207701, 1250614, 1290591, 1369909, 1442060, 1473019, 1511094, 1588064, 1740440, 1918659, 1998640, 1941032, 1827261, 1656196, 1479109, 1406384, 1374862, 1317130, 1245372, 1243070, 1239193, 1212962, 1217422, 1214616, 1206010, 1276589, 1316792, 1307852, 1422104, 1508844, 1549865, 1601622, 1711010, 1844660, 1892257, 1885829, 1808174, 1667654, 1534622, 1376493, 1293893, 1185559, 1151814, 1088790, 1034152, 1088990, 1059027, 992665, 952427, 930469, 950098, 928430, 901835]
3839I01835O0724l7452n1213K6438m2952l7204k2507L359K5106j4720J8528k7330
3827H02612N2795m1478n9217L3623L7843m5874L0021K3770k374K591m741O948
3815H36519J2488k0858J8996K729J4022l0433k8060N0969J331J7701P9844J7976
3803I73224q377R3775N7896Q2714O7064P4035Q0695Q7329L3034J8520J8748q2796
3791A495861j15981j06540k7169j2274o6292o1033k9099m7414l2143L536j0679
3780I90773j7550M3450N2580k1073N0193K7804O4435K4741K7216J23129J07439
3769A473137O6089n0903j29752p2664r0942j03051o5988j1151l4031p7540m5569
3758H57635L5834N133r586l5741l5001J0652p360L9385j0311j5555K7125k6780
$$ y = [901835, 962559, 925107, 873894, 900332, 857380, 820176, 797669, 801028, 826134, 811414, 829942, 802612, 855407, 813929, 754712, 788335, 826178, 780304, 810325, 834095, 831721, 834312, 829571, 836519, 849007, 828149, 847145, 849874, 863896, 833463, 805403, 856372, 857703, 875404, 955248, 973224, 964847, 1058622, 1116518, 1199232, 1266296, 1340331, 1421026, 1508355, 1541389, 1559909, 1578657, 1495861, 1379880, 1273340, 1246171, 1233897, 1167605, 1106572, 1077473, 1030059, 997916, 1001452, 990773, 973223, 1016673, 1069253, 1048180, 1098373, 1126177, 1190612, 1215353, 1242569, 1365698, 1473137, 1539226, 1488323, 1358571, 1285907, 1194965, 1091914, 1025926, 1014775, 980744, 903204, 857635, 893469, 898602, 889016, 853275, 818274, 828926, 821566, 860951, 850640, 835085, 862210, 835430]
3746H35430n38l3694j8595k0597M2081K416K1572k9659k1270j6793M186m1888
3734G22651n040j3350q150K866N4040Q2160n3428K9961n9426m1873N2655K330
3722G65396K6662l9798M267J6014K7833l6896k3877n176J2266J5536Q309m38O215
3709G76313O2153q826p8465R0K8061J8527L551J320q659J780M4174K4074k2300
3696H41793k3998k97n9569K2749K7775J6672L559J7560M1925L3818k9965N953
3684H97975L4169l960k9839M8721l6245Q948M8334N8509K5038k6771n31K504j8913
3671A007939J362n0432M3761J3443j9134n2880O0064Q710l2082M5724J1502k0678
3659A017299j2001j6163k5304P4650J6947j2501k7139n132O3028l0116l115N523
$$ y = [835430, 834892, 801198, 782603, 762006, 804087, 806503, 828075, 798416, 777146, 760353, 764539, 722651, 717611, 704261, 696111, 698977, 753017, 835177, 781749, 811710, 752284, 710411, 763066, 765396, 792058, 752260, 756527, 772541, 800374, 763478, 739601, 734425, 746691, 762227, 770536, 770098, 776313, 838466, 829640, 751175, 751265, 779326, 797853, 801404, 802724, 794065, 795845, 840019, 864093, 841793, 817795, 817498, 757929, 780678, 808453, 825125, 828684, 846244, 888169, 921987, 892022, 897975, 932144, 928184, 898345, 947066, 910821, 919769, 968103, 1026612, 1051650, 1024879, 1024348, 1026852, 1007939, 1009301, 958869, 1002630, 1016073, 996939, 944059, 1004123, 1012833, 980751, 1026475, 1037977, 1017299, 1005298, 989135, 963831, 1038481, 1055428, 1042927, 1015788, 1010656, 1073684, 1043568, 1040453, 1045976]
3647A045976k938N4493K0884j55R930n6739N8530M1239n1741K6036l0935M0770
3635A155350J2503m5977K9223J4234j7421P2113Q051p247L8793j3779m323K3133
3623A264653R991j5596L5096k0336M37j0701J2443J8486Q144m480j0907m6551
3611A240679J3930J4288K98m3729K1420J7708p584j7503k5322O4516k2879K7884
3599A283706K822K535k9808n367j8047J6167M6604K5937m3037L3750O495l4219
3587A287538N5071Q9K2007j2737j2464N2743J6933m7641N555O4603k7300J4257
3575A418654n998l0741l087L5844k6461m1417q182L2996R875o210r054k8259L163
3562A341123J9923n3627J0950P1638k8770j1083l5405j375O5368K9795j8891K7787
$$ y = [1045976, 1043038, 1097531, 1118415, 1118260, 1128190, 1071451, 1129981, 1171220, 1119479, 1145515, 1114580, 1155350, 1167853, 1121876, 1151099, 1165333, 1147912, 1220025, 1228076, 1220829, 1259622, 1245843, 1241520, 1264653, 1274644, 1259048, 1294144, 1273808, 1274245, 1263544, 1275987, 1294473, 1302617, 1298137, 1287230, 1240679, 1254609, 1268897, 1269195, 1225466, 1246886, 1264594, 1257010, 1239507, 1214185, 1278701, 1255822, 1283706, 1286528, 1289063, 1259255, 1253888, 1235841, 1252008, 1298612, 1324549, 1281512, 1315262, 1321757, 1287538, 1342609, 1342698, 1364705, 1351968, 1339504, 1392247, 1409180, 1361539, 1367094, 1431697, 1404397, 1418654, 1412656, 1381915, 1378828, 1414672, 1388211, 1346794, 1338612, 1371608, 1381483, 1375273, 1366219, 1337960, 1341123, 1361046, 1307419, 1318369, 1390007, 1361237, 1350154, 1314749, 1313374, 1378742, 1408537, 1389646, 1417433]
3550A417433K5466K644m176K6766K0429l7068K2896J9815m3079n2530j8114R758
3538A390240Q104k8933J4P31M4641j0129m8700J033J3836M32o147p895J5838L4310
3524A407375l6588k6665J0374Q70R584J6185K2847K5782k4661j8616L287J0489
3512A400263K5344m2036M0665n094k7589j8522R049j1712O7903l9533k2433j8118
3500A358187k702L9267K0021J9906J6547j4227K8389m0296j2488N963j6600N1551
3488A453518k4570L9738J6233q1473m329K1919L5486J7552n0490j7169N0914M7578
3476A504907j2453k014o8760M4645n7031L6826L6963O8666m5961n6318k0793N9778
3464A488455J0393l3447k4162j2546o484K5653k0132J8315j9023m576O1705j0752
$$ y = [1417433, 1442899, 1445543, 1441367, 1468133, 1488562, 1451494, 1474390, 1494205, 1451126, 1398596, 1380482, 1390240, 1398344, 1369411, 1369425, 1370156, 1414797, 1404668, 1355968, 1357001, 1370837, 1371269, 1365122, 1357227, 1373065, 1407375, 1370787, 1344122, 1354496, 1355366, 1364950, 1381135, 1403982, 1429764, 1405103, 1386487, 1389774, 1400263, 1425607, 1383571, 1424236, 1419142, 1391553, 1373031, 1382080, 1370368, 1438271, 1398738, 1376305, 1358187, 1355485, 1394752, 1414773, 1434679, 1451226, 1436999, 1465388, 1425092, 1412604, 1418567, 1401967, 1453518, 1428948, 1468686, 1484919, 1403446, 1399117, 1421036, 1456522, 1474074, 1423584, 1406415, 1457329, 1504907, 1492454, 1490440, 1421680, 1466325, 1409294, 1446120, 1483083, 1551749, 1505788, 1449470, 1428677, 1488455, 1498848, 1465401, 1441239, 1428693, 1422209, 1447862, 1427730, 1446045, 1427022, 1422446, 1484151, 1473399]
3452A473399K4613J2964l5456J4404L7829j9931m5593O388N893r635L3011l2275
3440A465611J4234J4716n0802K5240O3724j3480O037j6987J3429J593k3018O2736
3428A563033j7995j9103M1175L4685K1674K991j9136K473l3924k3037K637q548
3416A546925q156q945K4670N4343J4073o6009k9545K5942O867L5856O0169J5950
3404A672140k4603n3243K7228L7571o35k7420J1430J7123K1890j7834l7279j8552
3392A607816P2414J3364k7157M948N402k687K4861K3467J8028k2205J0920K9655
3380A758826m1244R200K6064p479K1459K9675j7865J1221P013K7194P2487K7335
3368A923886J956j6697j2932J5083J9204J692j1818M4735k0491L6203M5353L8562
$$ y = [1473399, 1498012, 1510976, 1475520, 1489924, 1527753, 1507822, 1462229, 1468617, 1474510, 1464875, 1497886, 1465611, 1479845, 1494561, 1443759, 1468999, 1532723, 1519243, 1525280, 1508293, 1521722, 1523315, 1500297, 1563033, 1545038, 1525935, 1567110, 1601795, 1623469, 1626460, 1607324, 1609797, 1575873, 1552836, 1555473, 1546925, 1538769, 1529824, 1554494, 1608837, 1622910, 1556901, 1527356, 1553298, 1560165, 1596021, 1656190, 1672140, 1647537, 1594294, 1621522, 1659093, 1658458, 1631038, 1642468, 1659591, 1681481, 1663647, 1626368, 1607816, 1680230, 1693594, 1666437, 1671385, 1676787, 1674100, 1698961, 1722428, 1740456, 1718251, 1729171, 1758826, 1717582, 1726782, 1752846, 1745367, 1766826, 1796501, 1778636, 1789857, 1796870, 1824064, 1896551, 1923886, 1925842, 1909145, 1896213, 1911296, 1930500, 1932192, 1920374, 1965109, 1944618, 1980821, 2026174, 2064736]
3356B064736L0602K6077k3305k6421n2752O239M9711M241K8256K1473l5146j4775
3344B078936P8529j3203K1605N7554M9279n0992M7140J2617j1288o451K168M8270
3332B314164M7840N2346m744m362k7985O678J02572K1176k5940K4516J1733N7622
3320B575616r209J1188K1496K1803L8216n332M3894k4312M5776N5553J2195M6000
3308B832884p017k2529L9719M8709K9425K2138O5772M7918M8592M6140M5999M9573
3296C247323K3767N6417N6702k6433Q1260M4958K8047L2914K505M7112K1989M9314
3284C665875O0649K2041L3189K7877N2482K0434Q9238Q3077O5078L8616M5558
3273D204114M9588Q9042Q4126J0186P6999Q0001J29592P5755K1834L8019J78971
$$ y = [2064736, 2095338, 2121415, 2098110, 2071689, 2018937, 2025176, 2074887, 2079128, 2107384, 2128857, 2093711, 2078936, 2157465, 2144262, 2165867, 2223421, 2272700, 2221708, 2268848, 2281465, 2270177, 2263726, 2265894, 2314164, 2362004, 2414350, 2409606, 2405244, 2377259, 2383937, 2486509, 2507685, 2481745, 2506261, 2517994, 2575616, 2566407, 2577595, 2599091, 2620894, 2659110, 2653778, 2697672, 2673360, 2719136, 2774689, 2786884, 2832884, 2825867, 2803338, 2843057, 2891766, 2921191, 2943329, 3009101, 3057019, 3105611, 3151751, 3197750, 3247323, 3271090, 3327507, 3384209, 3357776, 3439036, 3483994, 3512041, 3544955, 3547460, 3594572, 3616561, 3665875, 3726524, 3748565, 3781754, 3809631, 3862113, 3882547, 3971785, 4054862, 4119940, 4158556, 4204114, 4253702, 4342744, 4426870, 4437056, 4514055, 4594056, 4723648, 4799403, 4821237, 4859256, 5038227]
3262E038227M9534L7577M7857O2972O1414N6891J1516Q1246J49316J07780O8185
3251E772515R8872R2305J06733J10890J22153J14116J42040J81323J12348Q1313
3241F934608J43321J32712J17354J34145J59215K46612J89518J84150K12895K39372
3231H693902K64049L20103L15639L35855L91883L72751M05744M35172M68623M68044
3221A2471765N30743M54645M50882M29332L61410L50223K39899P0291N4206p8244
3211A5335152k53563l86825m18909m75250n96561n62121o30564n74088n47621
3202A0889650n21773m72041m49035l98082l10601l38435l37452k42484k26421
3193G593326k00748j88965j78741j30840j40278k14098j66050j19587j31819j15812
$$ y = [5038227, 5087761, 5125338, 5173195, 5236167, 5297581, 5354472, 5365988, 5447234, 5596550, 5704330, 5772515, 5871387, 5963692, 6070425, 6181315, 6303468, 6417584, 6559624, 6740947, 6853295, 6934608, 7077929, 7210641, 7327995, 7462140, 7621355, 7867967, 8057485, 8241635, 8454530, 8693902, 8957951, 9278054, 9593693, 9929548, 10321431, 10694182, 11099926, 11535098, 12003721, 12471765, 13002508, 13457153, 13908035, 14337367, 14698777, 15049000, 15288899, 15359190, 15413396, 15335152, 15081589, 14694764, 14275855, 13800605, 13204044, 12641923, 12011359, 11437271, 10889650, 10367877, 9895836, 9446801, 9048719, 8738118, 8399683, 8062231, 7819747, 7593326, 7392578, 7203613, 7024872, 6894032, 6753754, 6539656, 6373606, 6254019, 6122200, 6006388]
3183F006388j12624o4904j07165j17666r2065r7209j13025j22085j00904q7021
3173D991720q9115l2652l3295j18648q7965j16888r4419N334r8416o5920j8130
3162D241606k3014l7333q0829p1370m2795k8713l8860n8677k7753l6234l3712
3151C762316p1409l6768j9734o3121l3734K6397n2583l2077m3015q5813m805j1352
3139C334302M9735m0400o5376j1217j3696n5170k7067j3727k4253l9010l5601
3128C058520p5941l7496o434k0639J7283K4478J609l9344l5190J332o810m3989
3116B837379o6285r302J6708J3630m9558o0727m0471l8335K232o850j2375k507
3104B583539k6488K1383l9022k1628o486j00561k0653M619j085j4024J1127m2900
$$ y = [6006388, 5893764, 5828860, 5721695, 5604029, 5511964, 5414755, 5301730, 5179645, 5078741, 4991720, 4902605, 4869953, 4836658, 4718010, 4630045, 4513157, 4418738, 4424072, 4325656, 4259736, 4241606, 4218592, 4181259, 4100430, 4029060, 3986265, 3957552, 3918692, 3860015, 3832262, 3796028, 3762316, 3690907, 3654139, 3634405, 3571284, 3537550, 3563947, 3511364, 3479287, 3436272, 3350459, 3345654, 3334302, 3384037, 3343637, 3278261, 3267044, 3253348, 3198178, 3171111, 3157384, 3133131, 3094121, 3058520, 2982579, 2945083, 2938649, 2918010, 2935293, 2959771, 2961380, 2922036, 2886846, 2888178, 2881368, 2837379, 2771094, 2761792, 2778500, 2792130, 2742572, 2681845, 2641374, 2603039, 2605271, 2598421, 2586046, 2583539, 2557051, 2578434, 2539412, 2517784, 2511298, 2410737, 2390084, 2394703, 2393618, 2379594, 2390721, 2347821]
3092B347821k0220m1528M6226k8849k043L7763J3304m8238q346j2712o9548k1770
3080B191860L0243k3528o5285r17j6338k0249j9524L668L4932K0151o2406M2999
3068B115606J1962o8857N529J6415o8880j6953n465k1944m8570N9157L3245K6840
3056B038085J9717l9195j0367k8202l4328l042k6290K2596N9611J1773m5990n5781
3044A908587o533k4760K1137j9427K1746o0899j1806K0416J2324J6662l3834Q102
3032A851715j0658k4928L9707l6227J5776p396k5191k8432N311j2748Q99K1482
3020A789310l2821J0177j815k2619q30K1945N657L6352q639j6518j7155J9994
3008A783038K5644j1072l2281K3512L0788j8370J1438J9952R842M310l6881k9812
$$ y = [2347821, 2327601, 2286073, 2332299, 2303450, 2301407, 2339170, 2352474, 2304236, 2295890, 2283178, 2213630, 2191860, 2222103, 2198575, 2133290, 2132373, 2116035, 2095786, 2076262, 2079930, 2114862, 2135013, 2072607, 2115606, 2127568, 2058711, 2064240, 2080655, 2011775, 1994822, 1989357, 1967413, 1918843, 1978000, 2011245, 2038085, 2057802, 2018607, 2008240, 1980038, 1945710, 1942668, 1916378, 1938974, 1998585, 2010358, 1964368, 1908587, 1902054, 1877294, 1898431, 1879004, 1900750, 1839851, 1828045, 1848461, 1860785, 1877447, 1843613, 1851715, 1841057, 1816129, 1855836, 1819609, 1835385, 1827989, 1802798, 1774366, 1779677, 1766929, 1767828, 1789310, 1756489, 1766666, 1764851, 1742232, 1741402, 1763347, 1769004, 1805356, 1796717, 1780199, 1763044, 1783038, 1808682, 1797610, 1765329, 1788841, 1819629, 1801259, 1812697, 1832649, 1842491, 1846801, 1809920, 1780108]
2996A780108J0958M1452K4214L3724l880l4983O854K7898j940n3075o2198k8906
2984A740226L359N6614L5746K3364o23q309m630O2454k2222L4302N1386K9647
2972B001314j9056o969N7503N7855M6654M8582k152M9320P483K6201p574O9961
2960B329122O906j4464M5747L2999J509r124K9164j0717k2487J7578L9813p230
2948B438816K9452j8795K690K9593J5287N1058L0221K9189K771m6958K0851l655
2936B580520M0793M6305K4734N509N9673O6703L1758K2307J05741K06K3525L2848
2924C040622L2362M8406N2015M8139O2778K4893j4184L2321M4151N1902P7470
2913C500875P247N4609R3172K2511J19912M4770O7504J21084Q3141N1569M4651
$$ y = [1780108, 1791066, 1832518, 1856732, 1890456, 1886576, 1851593, 1858447, 1886345, 1884405, 1831330, 1769132, 1740226, 1743585, 1800199, 1835945, 1859309, 1858686, 1850377, 1845747, 1908201, 1885979, 1920281, 1971667, 2001314, 1982258, 1975289, 2032792, 2090647, 2137301, 2185883, 2183731, 2233051, 2240534, 2266735, 2259161, 2329122, 2336028, 2321564, 2367311, 2400310, 2401819, 2392695, 2421859, 2411142, 2388655, 2406233, 2446046, 2438816, 2468268, 2449473, 2452163, 2481756, 2497043, 2548101, 2578322, 2607511, 2610282, 2563324, 2584175, 2580520, 2621313, 2667618, 2692352, 2697861, 2757534, 2824237, 2855995, 2878302, 2984043, 2984249, 3007774, 3040622, 3072984, 3121390, 3173405, 3221544, 3284322, 3309215, 3295031, 3327352, 3371503, 3423405, 3500875, 3508122, 3562731, 3655903, 3678414, 3798326, 3843096, 3910600, 4031684, 4114825, 4166394, 4211045]
2902D211045L6396Q2982R0320M2759J2497K9221N8847J3608P7640L8109M3840
2891D737264P8958Q7184K7934J04139J13019P5722J37884J62308J82488J52356
2881E859256O6476J89743K05985J40509K57456K05004K20870J34414J02017J00812
2871G482542j13295j21833j05758j39180j71576j92118j74457n9381p5798p6440
2861F252706m6913J1182J1599P7257K7152Q8213Q4640J10767M7238Q1557M7065
2850F792463J1049O2382J17357L4428j4020M0607j04975o9895j48562j09469j41881
2839F469484j37203j33507j94031k19000j45389j20074j44491j14727n6558r2524
2829E111980l0192n8667j1044o0980p2260j7718o0075j28575j07228o8547q1056
$$ y = [4211045, 4247441, 4330423, 4420743, 4463502, 4475999, 4505220, 4564067, 4577675, 4655315, 4693424, 4737264, 4816222, 4903406, 4931340, 5035479, 5148498, 5224220, 5362104, 5524412, 5706900, 5859256, 5925732, 6115475, 6321460, 6461969, 6719425, 6924429, 7145299, 7279713, 7381730, 7482542, 7369247, 7247414, 7141656, 7002476, 6830900, 6638782, 6464325, 6404944, 6329146, 6252706, 6205793, 6216975, 6228574, 6305831, 6332983, 6421196, 6505836, 6616603, 6663841, 6745398, 6792463, 6803512, 6865894, 6983251, 7017679, 7003659, 7044266, 6939291, 6869396, 6720834, 6611365, 6469484, 6332281, 6198774, 6004743, 5785743, 5640354, 5520280, 5375789, 5261062, 5204504, 5111980, 5081788, 5023121, 5012077, 4951097, 4878837, 4861119, 4801044, 4672469, 4565241, 4496694, 4415638]
2818D415638r1315r4218r6131j37091j40061o9740j42383j13012q8993n8885j00025
2807C283784j10477n6619m8480j18310l4500j4897l6115k6163n3631j8173n2056
2796B714363q6745p7468o1493J0259k9904j03871m9370k4514q2047m1384m0218
2785B127608j7555l6981k2193k0542R887k3678m1481p8114j9485k2299l0288J6986
2773A841865n2746o3210l1992n958o3525k173J6334n0308p4671N014k4517P67
2761A494880l7939J7023j6983m0098n7807L906j0788n8540j909j8835m9303k8576
2749A195031m862J5427j102l3872o7132n4258n961L7815M6438n276m4406l5030
2737A042812j7269n8756j7628r451L468K1147p8004M854M2002n75l9042n573J51
$$ y = [4415638, 4324323, 4230105, 4133974, 3996883, 3856822, 3787082, 3644699, 3531687, 3442694, 3383809, 3283784, 3173307, 3116688, 3068208, 2949898, 2915398, 2900501, 2864386, 2838223, 2784592, 2766419, 2714363, 2627618, 2550150, 2488657, 2498916, 2469012, 2365141, 2315771, 2291257, 2209210, 2167826, 2127608, 2110053, 2073072, 2050879, 2030337, 2040224, 2016546, 1975065, 1896951, 1877466, 1855167, 1824879, 1841865, 1789119, 1725909, 1693917, 1687959, 1624434, 1622261, 1638595, 1588287, 1513616, 1518630, 1494113, 1494880, 1456941, 1473964, 1456981, 1416883, 1359076, 1362982, 1352194, 1293654, 1291745, 1272910, 1223607, 1195031, 1190169, 1205596, 1204494, 1170622, 1103490, 1049232, 1043271, 1081086, 1127524, 1122248, 1077842, 1042812, 1025543, 966787, 949159, 939708, 943176, 964323, 886319, 891173, 933175, 932600, 893558, 887985, 888136]
2724H88136m4776m4653J9896k9995q328K0738k1769m0385p278K6339n1975m2078
2712F63872K4626l9147L5618l7667k2032O418N445J5270p3260j8876L9807J4818
2700F14892j0591M0126k0363k4289l4586l2357K2940m5839L2800L7068j1017l6795
2688E31989n3273j5667l1139k0563L772K035J0536J7125N936N521n4084m1139
2676C61049K4448J4583J5720m1657m0774J6852K1139l2878J5678N4454L2565Q292
2664D49471J085l9160l3046M4381j1665P890J1210j5927o1751N1977K2454K099
2652D29018j6705k5748J103p216L000j7114l4298j750r302j9035k7801M8596j567
2639C21181O67k2203N2304m3294l4622N8608K3207J3784l9777k0642M7449m593
$$ y = [888136, 843360, 798707, 818603, 788608, 780280, 801018, 779249, 738864, 731586, 757925, 705950, 663872, 688498, 649351, 684969, 647302, 625270, 631688, 637133, 652403, 579143, 560267, 600074, 614892, 604301, 644427, 624064, 599775, 565189, 532832, 555772, 509933, 542733, 579801, 568784, 531989, 478716, 463049, 431910, 411347, 415119, 417154, 427690, 444815, 450751, 456272, 402188, 361049, 385497, 400080, 415800, 374143, 333369, 350221, 371360, 338482, 354160, 408614, 441179, 449471, 450556, 411396, 378350, 422731, 411066, 418956, 430166, 414239, 352488, 404465, 426919, 429018, 412313, 386565, 387668, 380452, 383452, 366338, 332040, 330290, 320988, 301953, 274152, 322748, 321181, 321848, 299645, 351949, 308655, 274033, 332641, 355848, 369632, 329855, 309213, 356662, 352069]
2627C52069Q498R23k7429N6036m902l8338J2733k9760O362J1163k8422l0511K566
2614B90988J2767N507l8207L6806J5765m5179M614J663O666j0143K1896j2286
2602B90857l432j6454j0606r733k207M2437q918k7546j4464q494K1380L748K6799
2589B83367k7404l198K677J0729K0286K1556m4047l9154Q806M4069J2833k1774
2577B68746k8227k2621l1723J1993K2850P4385q43j0509m1012n5501R109j4146
2565A82501k3445K3265M293J6424L0372j0390n6811j0282K5209L0526K0887n9917
2553A72632l301r451P43l3301N5949p5873j0771O2880J3545l9407j7632O3418
2541A79431l7920o3260k2691j1768L868L4453N5463L018N480K3718k7725J0355
$$ y = [352069, 360567, 361490, 334061, 390097, 385195, 346857, 359590, 329830, 336192, 347355, 318933, 288422, 290988, 303755, 309262, 271055, 307861, 323626, 278447, 283061, 284724, 291390, 281247, 303143, 290857, 287425, 270971, 260365, 250632, 248425, 290862, 281944, 254398, 239934, 231440, 252820, 256568, 283367, 255963, 252765, 255442, 266171, 286457, 308013, 263966, 224812, 233618, 277687, 290520, 268746, 240519, 217898, 186175, 198168, 221018, 295403, 294560, 284051, 243039, 187538, 196647, 182501, 159056, 182321, 186614, 203038, 233410, 223020, 166209, 155927, 181136, 211662, 232549, 172632, 169331, 159880, 160623, 127322, 183271, 107398, 96627, 159507, 173052, 133645, 116013, 179431, 141511, 78251, 55560, 43792, 47660, 82113, 137576, 140594, 146074, 169792, 142067, 152422]
2529A52422o9065K9492O958j9018j4681P6162j2790k7000m6058j3829L2290J22
2517I5005j5962M7225J4967k2973j0662M2875n1388l7664j2264o757L9397K9847
2505A11646J795q660q814n7580K4440K1804K9165k8719j5673k2229n4358M659
2493b524Q7980j2472m190k4543K0633l2525k8648L6547L217k7487L5261K7178
2481G8427O0571l3369n8991n969k3571L1941R058j9970L5663m5222j9561l1981
2469b2974N097M2781o246M5210L1941q976q7099K163J6517J7719M6310j7720J2013
2456G6736k8101j1942K0874j5975L3448K075m2179l7450J0200O571N0732j0714
2444E4275p374l9387p043O279K4314n900k8605L4020k2211M9587m8335P729J7327
$$ y = [152422, 83357, 112849, 119807, 100789, 86108, 162270, 149480, 122480, 76422, 62593, 94883, 95005, 79043, 126268, 141235, 118262, 107600, 150475, 99087, 61423, 49159, 42402, 81799, 111646, 113441, 104781, 95967, 38387, 62827, 84631, 113796, 85077, 69404, 47175, -7183, -2524, 85456, 72984, 68794, 44251, 64884, 32359, 3711, 40258, 43475, 15988, 51249, 78427, 138998, 105629, 46638, 40669, 17098, 49039, 58097, 38127, 73790, 28568, 9007, -22974, -17877, 24904, 18658, 63868, 95809, 86833, -266, 1897, 18414, 36133, 82443, 64723, 76736, 48635, 36693, 57567, 41592, 75040, 77115, 34936, -2514, 7686, 14257, 64989, 54275, 46901, 7514, 471, 6750, 31064, 25164, -3441, 30579, 8368, 57955, 9620, 17349, 34676]
2431C4676K1208j2013K0577k7246L2735n1518J3722L173o9627M214J6490N4126
2419D0517n0522l421L9833k5607j6555j3503M3262k2656k1315L3157l834M8541
2407D7897n4145J1276m890R601l5509K8391r288r0721L6214O9700M619r599L574
2394G120q887N918l1095k1634O017m188n930M0757M2438p962k8449M1110j0379
2381B4836j1275n5032J9357J4363l8508L0623j7206Q369j0937m390M5328l1335
2369b5807J3631K5010l8424P681n3874N3670L3661M4930J0577k9937l7776J9117
2357B2459m7499j5373N3522N801k7615J6559Q993M0272k2488L576k792K872Q223
2344D6510N3065M5919k3348K1204m7738k425O188l414K7676J3846q5533o7106
$$ y = [34676, 55884, 43871, 64448, 37202, 69937, 18419, 32141, 35314, -34313, -30099, -13609, 40517, -10005, -13426, 26407, 800, -15755, -29258, 14004, -8652, -29967, 3190, -644, 47897, -6248, 5028, 138, 9739, -25770, 2621, -6667, -97388, -61174, 8526, 13145, 3546, 7120, -1767, 4151, -26944, -48578, -42561, -46749, -52679, -11922, 30516, 22554, -5895, 35215, 24836, 13561, -41471, -22114, -7751, -46259, -15636, -32842, -24473, -35410, -39800, 5528, -25807, -12176, 12834, -25590, -17909, -71783, -18113, 15548, 60478, 71055, 41118, 3342, 22459, -25040, -40413, 13109, 18910, -8705, 7854, 16847, 57119, 34631, 38207, 35415, 38287, 46510, 99575, 145494, 122146, 143350, 95612, 93187, 99375, 95961, 123637, 137483, 51950, -15156]
2332a5156l245M6129p758k9673K5771j5956l1146j4583J5190L3642J680N579J1071
2319B1545M131L6557k8257p8741j1515P3547K1134J4904m1317J3155r696j4244
2307A203k1175R748L8560L2025j7797l0750l6370Q085L2676M745k2089l7407K2773
2294a5773K1656M306l755J8828j6170J7203M172m707l0637M0630n3667O733K2325
2281A1144k2723J7455j4783K2024l0002J1742N9292j0712k5729J2625o526j5374
2269H433O9376k5042R219k4508Q816m8553K4213j237k139r081l3442J2341J6350
2256D746M703M9728k8031j7047J1697j6414l422M4405J450n7938M0482J5260o3113
2243a3494L7560K0660j7188J7953O12J8134j5375J4708J0902l7823r944J0508
$$ y = [-15156, -18401, 27728, 19970, -9703, 16068, 112, -31034, -45617, -30427, 3215, 4895, 10474, 21545, 25676, 62233, 33976, -44765, -56280, 17267, 38401, 53305, 11988, 25143, 15447, 1203, -19972, -10224, 28336, 60361, 42564, 11814, -24556, -16471, 16205, 20950, -1139, -38546, -15773, 5883, 10189, 6434, 25262, 9092, 26295, 30467, 25760, -4877, 35753, -17914, -11181, 11144, -11579, 5876, -8907, 13117, -16885, -5143, 54149, 43437, 17708, 30333, 23807, 8433, 77809, 52767, 61986, 37478, 46294, -2259, 21954, 20717, 18578, 9497, -23945, -11604, 4746, 9449, 59177, 31146, 14099, 25796, 9382, 5960, 50365, 51815, -6123, 34359, 49619, -13494, 24066, 44726, 27538, 45491, 46103, 64237, 48862, 63570, 74472, 36649, 26705, 37213]
2231C7213M5333j7087m3272j5403M2740J2065k4421K9927q9810K920N0072L2931
2219F3208M596J0638P934j1917j4479k1933K8071o377J128K8623m0927J6368L3678
2206I8611j3240J1422j5417J7767J7530j8420J6388k2538L5148J6805J443j9721
2194A25778J8256J0142N4456l2174m9702l5661J1220M4401n7076R7943K8732l4997
2182A81318m2903J0452j0748j1881J4458p576N096L7199j931K9948N4389r797
2170B48024l5589l9878P896J1454P6284J0173l7437K276J4643l768N6964L1856
2158C42898k2710q120O902L2309j1467r745N5921j6703L3093L6083O0052m7011
2146D51502j2726M2704J3940l740M6518k2838N683M8090o789L9977J7521k47l0397
$$ y = [37213, 82546, 65459, 22187, 6784, 49524, 61589, 37168, 67095, -22715, -19795, 30277, 63208, 67804, 78442, 86376, 74459, 59980, 38047, 66118, 59741, 60869, 89492, 48565, 64933, 98611, 85371, 96793, 81376, 99143, 116673, 98253, 114641, 92103, 127251, 144056, 145499, 125778, 144034, 154176, 208632, 176458, 126756, 91095, 102315, 146716, 89640, 187583, 216315, 181318, 138415, 148867, 138119, 126238, 140696, 133120, 138216, 175415, 173484, 203432, 257821, 248024, 212435, 172557, 180453, 191907, 268191, 278364, 240927, 243203, 257846, 254078, 311042, 342898, 320188, 312068, 318970, 351279, 339812, 330067, 385988, 369285, 402378, 438461, 498513, 451502, 438776, 481480, 495420, 491680, 538198, 515360, 521043, 569133, 562344, 602321, 619842, 619595, 589198]
2133E89198L8855M5084j5928m874j6619K8517m964L2008L1347L5064L5656J673
2121G95017K1813k233K5168J3599J5935N7718P250O5291M5028K5904K5514L1187
2109A127191O6803J00786L7873L8153J03738L6137R0354P2054Q2137R4712N8829
2098A908767J12699R6079J47944J58543J81048K10503K27348K50879L13121L27272
2088C934203L86820M55553M32460N12814O16437P85585R60646J043874J185199
2079A0313591J534226J662491J816974K075850K451777K909492K907961Q88983
2071B6561345j803682m240574m154632k757625k179468j702458j268884r95942
2063G458080p84918n54620n09599m07685l85964k70045k49076k86900l44450k59888
$$ y = [589198, 628053, 673137, 657209, 652335, 635716, 664233, 659269, 691277, 722624, 757688, 793344, 795017, 816830, 814597, 839765, 853364, 869299, 927017, 934267, 999558, 1044586, 1070490, 1096004, 1127191, 1193994, 1294780, 1332653, 1370806, 1474544, 1510681, 1601035, 1673089, 1755226, 1849938, 1908767, 2021466, 2117545, 2265489, 2424032, 2605080, 2815583, 3042931, 3293810, 3606931, 3934203, 4321023, 4776576, 5209036, 5721850, 6338287, 7123872, 8084518, 9128392, 10313591, 11847817, 13510308, 15327282, 17403132, 19854909, 22764401, 25672362, 26561345, 24757663, 20517089, 16362457, 13604832, 11425364, 9722906, 8454022, 7458080, 6673162, 6118542, 5608943, 5201258, 4815294, 4545249, 4296173, 4009273, 3664823, 3404935]
2053C404935j93919k03924k31297j95781j48444q7623j27864j08828j01509j44299
2043A861447q2947n2943o7169o3089k4433n4692n0974n9306o0165l9651k5508
2032A280570p4512j8958q5302p0552m9645n7078j9188J3064J7940p3854q4365
2021G78120l7218k1667m5504K9718M0751j5670k5494m0275l7831N72o5440p759
2009E52303Q153l4310j9646N269j8940j9636o108k219k7232k8591j4479J8807
1997D13371K352J3327K2467K5927L646m7479l277k2008K2281r6138j3356m861
1985C16252k5046K3518k7845K3747j9743j2431n1340O220J4784k2472K151Q853
1973B36648o2641K5049k4147m75j085l349j7682N3785o0209k5542O00M8018Q523
$$ y = [3404935, 3211016, 3007092, 2775795, 2580014, 2431570, 2343947, 2216083, 2107255, 2005746, 1861447, 1778500, 1725557, 1658388, 1595299, 1570866, 1516174, 1465200, 1405894, 1345729, 1306078, 1280570, 1206058, 1187100, 1101798, 1031246, 981601, 924523, 905335, 918399, 936339, 862485, 778120, 740902, 719235, 673731, 703449, 744200, 728530, 703036, 662761, 624930, 625502, 560062, 552303, 560456, 526146, 506500, 511769, 492829, 473193, 467085, 464866, 437634, 409043, 394564, 413371, 415723, 429050, 451517, 477444, 481090, 433611, 430334, 408326, 430607, 334469, 321113, 316252, 291206, 314724, 286879, 310626, 290883, 278452, 227112, 233332, 248116, 225644, 227795, 236648, 174007, 199056, 174909, 174434, 173349, 170000, 152318, 206103, 145894, 120352, 120952, 168970, 177493]
1960A77493j16K2694k9576j8866k3154K792m3027P6958K8417l2426k7459L2664
1948A66394j7868m7949L5546k6077J6719j5571m9856M739J375M4777M154L614
1936A19997l1836M341k2976m2509N5603J8158J6294m1595m9980O3410L4010J4331
1924A37248n1908J0226j8773q54M682j3068J1029Q531n6028K9784J854K312q738
1911E6297P027k7676j9136k549J894J1128J5954P579m8396M2971L5036m012m1128
1898C4989M97J6767j0256j2865M3151l0953l6372M4991j047l2653M3242J11K8058
1885H7660o2141m2132M1839m3714j1771R1003k4334j7578r839K0714J1647J6408
1873E7762j0982n6469l7749J4975N7865J1555j7287j110j5234O734M0647J0120
$$ y = [177493, 177377, 200071, 170495, 151629, 128475, 131267, 88240, 165198, 193615, 161189, 133730, 166394, 148526, 100577, 136123, 110046, 126765, 111194, 61338, 66077, 67452, 112229, 116383, 119997, 88161, 92502, 69526, 27017, 82620, 100778, 117072, 75477, 25497, 88907, 122917, 137248, 85340, 95566, 76793, 75939, 80621, 67553, 78582, 87113, 31085, 60869, 62723, 65035, 56297, 63324, 35648, 16512, 13963, 15857, 26985, 42939, 50518, 2122, 45093, 80129, 76117, 34989, 35486, 52253, 41997, 29132, 72283, 41330, 4958, 49949, 48902, 16249, 59491, 59602, 87660, 25519, -16613, 25226, -18488, -30259, 60744, 36410, 18832, 8993, 29707, 41354, 57762, 46780, -9689, -47438, -32463, 25402, 36957, 19670, 18560, 3326, 10060, 50707, 60827]
1861F0827k8584N632J3842l4398k5503N4144j1353K134K0932Q396L4679l2683
1849F8065k4968n0845q462J5269M2223k6657L7037Q287j6771k6228L2404k344
1837D7010j4570j0225k5276J8213J4312k655j812k186O0234j02112k8699O9294
1825B1528J7395j7340j122l0501L3841K4598m2958K7844J6672p6853K8965L0376
1813C2445p177K8560K617J9839R023j6646j0787Q8096k3124j7826j6455l4383
1801E4182k3482K5888K7292m8391n1636N6801O858m5877p469M4718J6731N373
1789F0988j5066J7164m2804k6148K9409L2824j9112m5436o205K7382l4006J9474
1777a536n5692j8498J4558O951P2819j1792n0466k8205Q422P307L6475R935L0130
$$ y = [60827, 32243, 37875, 51717, 17319, -8184, 45960, 34607, 36741, 57673, 66069, 100748, 68065, 43097, -7748, -16210, -941, 41282, 14625, 51662, 59949, 43178, 16950, 49354, 47010, 32440, 22215, -3061, 15152, 29464, 26809, 24997, 22811, 83045, -19067, -47766, 21528, 38923, 21583, 20461, -10040, 23801, 48399, 5441, 33285, 49957, -26896, 2069, 32445, 25268, 53828, 56445, 76284, 85307, 68661, 57874, 145970, 122846, 105020, 88565, 54182, 30700, 56588, 83880, 35489, -16147, 40654, 47512, 1635, -5834, 38884, 55615, 60988, 45922, 63086, 20282, -5866, 23543, 56367, 37255, -8181, -14386, 12996, -21010, -1536, -57228, -75726, -61168, -54217, 18602, 6810, -43656, -71861, -63439, -56132, -19657, -9722, 20408]
1764B0408j5760j6442j7936N724L9605k0667L7423K6395l6436l1130o26l322k9124
1751d1888P2920n3284L63L6103j9098l6620p149K8087L5759K6690K3121q6971
1739b1967k1036l1367L9035j4243q245N938M9212j0321m6781J4165K2933q866
1727c1543j0864M0993n1241k3272K0691K2350l9869k1261K2103M6907k0896k2354
1715f8256J4822M3900o8109J1359O105K4601M3376l7315j3499L9550k2600P8963
1703E2897l4462m2029l984j8965K1299l6987m1656J6325M7580R426j3928m2919
1691h7403n917Q72J6137L9934L9498l3330M07N1452l7418j105J3959j2256j3281
1678b8451L6346p2970J5025J9251L5675n439j2436n3107K1406O430J9657K075
$$ y = [20408, 4648, -11794, -29730, -24006, 15599, -5068, 32355, 58750, 22314, -8816, -9442, -12764, -41888, 31032, -22252, -21889, 14214, -4884, -41504, -48653, -20566, 15193, 41883, 65004, -21967, -43003, -74370, -35335, -49578, -57823, -51885, -2673, -12994, -59775, -45610, -22677, -31543, -42407, -1414, -52655, -75927, -55236, -32886, -72755, -94016, -71913, -25006, -45902, -68256, -53434, -9534, -77643, -66284, -60179, -35578, 7798, -29517, -43016, -3466, -26066, 52897, 18435, -23594, -27578, -46543, -25244, -62231, -103887, -87562, -39982, -30556, -44484, -87403, -93320, -92448, -76311, -36377, 3121, -30209, -29802, 21650, -15768, -16873, -2914, -15170, -28451, 7895, -65075, -50050, -30799, 4876, -563, -12999, -66106, -44700, -38270, -18613, -16538]
1666a6538O117K2488l5707J2708j2283p807r450K1047n647J1910k8525l2649j7726
1653i2062R696N19M7150p176m708j6134n3792J909L8207K8695K2201j2215j6713
1640e4423J074L7176q321m9106L2563J7301m1310J7580J369N1070n4335M3457
1628e905J4679k2755j893j3595k6055M8218J2247q708R879j5243J7290k8871l1315
1615e2027K758J8909J2628j7879l7150J4485M1081M2543j5025q090L444k5680
1603b0003p410L9148p298k2995n2500J5332m21L8580J5664l3389J6048O717j5127
1590b7654r393j8887l5618N1332k809M858k5087J1549J906J014n484K2138n7271
1577h9406P999L4004J6436j2105N782k120l156q382l4624Q551J2241N693k0794
$$ y = [-16538, -10421, 12067, -23640, -10932, -23215, -31022, -40472, -19425, -25072, -13162, -41687, -74336, -92062, -82366, -81847, -34697, -41873, -46581, -62715, -116507, -114598, -76391, -47696, -25495, -37710, -54423, -53349, -16173, -24494, -73600, -41037, -23736, -65046, -47466, -46097, 4973, -49362, -5905, 8774, -13981, -15874, -29469, -55524, -7306, 4941, -3767, 6112, -9131, 8159, -20712, -52027, -49269, -30360, -17732, -35611, -72761, -58276, -17195, 25348, 10323, 2233, 5677, -20003, -27413, 11735, 4437, -18558, -71058, -55726, -56147, -17567, -1903, -35292, -19244, -12527, -27654, -37047, -55934, -91552, -40220, -43029, -38171, -63258, -51709, -49803, -48789, -54273, -32135, -89406, -81407, -47403, -30967, -43072, -37290, -39410, -42566, -50948, -85572, -77021, -64780, -59087, -79881]
1564g9881Q27m049K8148q445M4937l64J4428j8076l5427J1527o610K935l3140
1551h3190K8641k4693n7717L7281J8199L9966k3348M019K1556n8m1484L294J5758
1538f1776J905J554m025N1015l2042l2901N0359N32N5940r738l3373q488L2234
1525A1196j0079j3091q26p872J0173J5464m818l1756k0165K2728j154N176k3675
1512d8699k739K5928m7080K7453L088Q536J2004k0650j552k145j8133k2626k188
1499h8803M6148o689M519m512m6206n393o410N0537M1808j4238M0393l2377p4361
1486i5584j167M5722k1593J0147J6951K7874o459j3906l1368k5636j784J2575
1474h4228J9486k3181M9544M0118l173j0775K0637k3860k4373m4363J4364M775
$$ y = [-79881, -79054, -83103, -54955, -63400, -18463, -18827, -4399, -22475, -57902, -46375, -52985, -50050, -83190, -54549, -79242, -136959, -99678, -81479, -41513, -64861, -60842, -39286, -39344, -80828, -77534, -61776, -59871, -58317, -62342, -11327, -43369, -76270, -25911, -25379, 30561, 20823, -12550, -21038, 11196, 1117, -11974, -12800, -20672, -10499, 4965, 147, -31609, -51774, -29046, -30200, -25024, -48699, -51438, -25510, -72590, -45137, -42049, -33513, -21509, -42159, -43711, -45856, -63989, -86615, -88803, -42655, -49344, -44825, -49337, -95543, -100936, -107346, -56809, -15001, -29239, 11154, -21223, -95584, -96751, -51029, -72622, -62475, -45524, -17650, -24109, -38015, -69383, -95019, -96803, -84228, -64742, -87923, -38379, 1739, -1434, -12209, 8428, -15432, -39805, -84168, -69804, -65029]
1462f5029j2179Q797N630l754J5792L1317N8894J4892k5878L2748k8480o4529
1450c1779k4693k9890N316O2701K5693m8017k3663j0517K0779J1254k0139P893
$$ y = [-65029, -77208, -68411, -62781, -66535, -50743, -19426, 39468, 54360, 28482, 61230, 32750, -31779, -56472, -86362, -81046, -18345, 7348, -40669, -64332, -74849, -54070, -42816, -62955, -55062]
$$ [...]
##END NTUPLES=NMR SPECTRUM
##END=
