##TITLE=1H_CG-1157-0
 CDCl3
 8 sc, 
 9.11.2021
##JCAMPDX= 6.0         $$ Bruker NMR JCAMP-DX V2.0
##DATA TYPE= NMR SPECTRUM
##DATA CLASS= NTUPLES
##ORIGIN= UXNMR, Bruker Analytische Messtechnik GmbH
##OWNER= root
$$ XWIN-NMR		Version 3.5
$$ Tue Nov  9 10:39:13 2021 Russian Standard Time (UT+4h)  she@DPX200
##.OBSERVE FREQUENCY= 200.1313468511
##.OBSERVE NUCLEUS= ^1H
##.ACQUISITION MODE= SIMULTANEOUS
##.ACQUISITION SCHEME= undefined
##.AVERAGES= 8
##.DIGITISER RES= 18
##SPECTROMETER/DATA SYSTEM= spect
##.PULSE SEQUENCE= zg30
##.SOLVENT NAME= D2O
##.SHIFT REFERENCE= (INTERNAL, D2O, 0, 15.8714)
##AUDIT TRAIL= $$ (NUMBER, WHEN, WHO, WHERE, WHAT)
$$ ##TITLE= Audit trail, XWIN-NMR		Version 3.5
$$ ##JCAMPDX= 5.01
$$ ##ORIGIN= Bruker BioSpin GmbH
$$ ##OWNER= she
$$ F:/spectra/data/she/nmr/H-F/1/pdata/1/auditp.txt
$$ ##AUDIT TRAIL=  $$ (NUMBER, WHEN, WHO, WHERE, WHAT)
(   1,<2021-11-09 10:37:39.10 +0400>,<she>,<DPX200>,
      <created by zg, POWCHK disabled, PULCHK disabled
       configuration hash MD5:
       00 E9 B6 7A A2 85 ED C7 34 08 36 98 17 FE 4E 26
       data hash MD5: 16K
       5B 70 FF D2 DD C0 DF C6 F2 88 03 9C 4C 31 CD C3>)
(   2,<2021-11-09 10:37:41.76 +0400>,<she>,<DPX200>,
      <Start of raw data processing
       efp BC_mod = 2 LB = 0.24 FT_mod = 6 PKNL = 1 PHC0 = -15310.94 PHC1 = 9.00082 SI = 16K 
       data hash MD5: 16K
       B9 F5 C2 D0 C7 83 45 0F 93 36 15 DF 93 86 F2 1A>)
(   3,<2021-11-09 10:38:03.15 +0400>,<she>,<DPX200>,
      <pk PHC0 = -201.4487 PHC1 = 1.8 
       data hash MD5: 16K
       7E 3E E2 57 AE CF 2C EA DF 6B E3 99 A0 06 D6 B4>)
(   4,<2021-11-09 10:38:06.25 +0400>,<she>,<DPX200>,
      <abs ABSG = 5 
       data hash MD5: 16K
       DB D2 32 CA D2 76 49 3E CD 63 40 1C 80 3F 0D 69>)
$$ ##END=
$$ 
$$ hash MD5
$$ F0 92 B7 CA 8E 25 88 D5 65 F7 90 7C 25 6C 2C 9D
##$RELAX= 
##$RELAX= 
##$RELAX= 
##$RELAX= 
##$RELAX= 
##$RELAX= 
$$ Bruker specific parameters
$$ --------------------------
##$DU= <F:/spectra>
##$EXPNO= 1
##$NAME= <H-F>
##$PROCNO= 1
##$TYPE= <nmr>
##$USER= <she>
##$AMP= (0..31)
100 100 100 100 100 100 100 100 100 100 100 100 100 100 100 100 100 100 
100 100 100 100 100 100 100 100 100 100 100 100 100 100 
##$AQSEQ= 0
##$AQ_mod= 1
##$AUNM= <au_zg>
##$AUTOPOS= <>
##$BF1= 200.13
##$BF2= 200.13
##$BF3= 200.13
##$BF4= 200.13
##$BF5= 200.13
##$BF6= 200.13
##$BF7= 200.13
##$BF8= 200.13
##$BYTORDA= 1
##$CFDGTYP= 0
##$CFRGTYP= 5
##$CHEMSTR= <none>
##$CNST= (0..31)
1 1 145 1 1 1 1 1 1 1 1 1 1 1 1 1 1 1 1 1 1 1 1 1 1 1 1 1 1 1 1 1 
##$CPDPRG= <>
##$CPDPRG1= <>
##$CPDPRG2= <>
##$CPDPRG3= <>
##$CPDPRG4= <mlev>
##$CPDPRG5= <mlev>
##$CPDPRG6= <mlev>
##$CPDPRG7= <mlev>
##$CPDPRG8= <mlev>
##$CPDPRGB= <>
##$CPDPRGT= <>
##$D= (0..31)
0 1.2 0 0 0 0 0 0 0 0.06 0 0.03 0 0 0 0 0.0002 0 0 0 0 0 0 0 0 0 0 0 0 
0 0 0 
##$DATE= 1636439858
##$DBL= (0..7)
120 120 120 120 120 120 120 120 
##$DBP= (0..7)
150 150 150 150 150 150 150 150 
##$DBP07= 0
##$DBPNAM0= <>
##$DBPNAM1= <>
##$DBPNAM2= <>
##$DBPNAM3= <>
##$DBPNAM4= <>
$$ [...]
##$SUBNAM2= <"">
##$SUBNAM3= <"">
##$SUBNAM4= <"">
##$SUBNAM5= <"">
##$SUBNAM6= <"">
##$SUBNAM7= <"">
##$SUBNAM8= <"">
##$SUBNAM9= <"">
##$SW= 18.0517286264689
##$SWIBOX= (0..15)
0 0 2 0 0 0 0 0 0 0 0 0 0 0 0 0 
##$SW_h= 3612.71676300578
##$TD= 16384
##$TD0= 1
##$TE= 0
##$TE2= 300
##$TE3= 300
##$TEG= 300
##$TL= (0..7)
0 120 120 120 120 120 120 120 
##$TP= (0..7)
150 150 150 150 150 150 150 150 
##$TP07= 0
##$TPNAME0= <>
##$TPNAME1= <>
##$TPNAME2= <>
##$TPNAME3= <>
##$TPNAME4= <>
##$TPNAME5= <>
##$TPNAME6= <>
##$TPNAME7= <>
##$TPOAL= (0..7)
0.5 0.5 0.5 0.5 0.5 0.5 0.5 0.5 
##$TPOFFS= (0..7)
0 0 0 0 0 0 0 0 
##$TUNHIN= 0
##$TUNHOUT= 0
##$TUNXOUT= 0
##$USERA1= <user>
##$USERA2= <user>
##$USERA3= <user>
##$USERA4= <user>
##$USERA5= <user>
##$V9= 5
##$VALIST= <valist>
##$VCLIST= <CCCCCCCCCCCCCCC>
##$VD= 0
##$VDLIST= <DDDDDDDDDDDDDDD>
##$VPLIST= <PPPPPPPPPPPPPPP>
##$VTLIST= <TTTTTTTTTTTTTTT>
##$WBST= 1024
##$WBSW= 4
##$XGAIN= (0..3)
0 0 0 0 
##$XL= 0
##$YL= 0
##$YMAX_a= 171156
##$YMIN_a= -95917
##$ZGOPTNS= <>
##$ZL1= 120
##$ZL2= 120
##$ZL3= 120
##$ZL4= 120
##$ABSF1= 15.73146
##$ABSF2= -2.32039
##$ABSG= 5
##$ABSL= 3
##$ALPHA= 0
##$AQORDER= 0
##$ASSFAC= 0
##$ASSFACI= 0
##$ASSFACX= 0
##$ASSWID= 0
##$AUNMP= <proc_1d>
##$AZFE= 0.1
##$AZFW= 0.1
##$BCFW= 0
##$BC_mod= 2
##$BYTORDP= 0
##$COROFFS= 0
##$CY= -3
##$DATMOD= 1
##$DC= 0
##$DFILT= <>
##$DTYPP= 0
##$F1P= 0
##$F2P= 0
##$FCOR= 1
##$FTSIZE= 16384
##$FT_mod= 6
##$GAMMA= 0
##$GB= 0
##$INTBC= 1
##$INTSCL= 0
##$ISEN= 128
##$LB= 0.24
##$LEV0= 0
##$LPBIN= 0
##$MAXI= 10000
##$MC2= 0
##$MEAN= 0
##$ME_mod= 0
##$MI= 1.114404
##$NCOEF= 0
##$NC_proc= -8
##$NLEV= 6
##$NOISF1= 3.799351
##$NOISF2= 2.8
##$NSP= 0
##$NTH_PI= 0
##$NZP= 0
##$OFFSET= 15.8714
##$PC= 1
##$PHC0= -15512.39
##$PHC1= 10.80082
##$PH_mod= 1
##$PKNL= yes
##$PPARMOD= 0
##$PSCAL= 0
##$PSIGN= 0
##$REVERSE= no
##$SF= 200.129976867144
##$SI= 16384
##$SIGF1= 3
##$SIGF2= 2
##$SINO= 5.538805
##$SIOLD= 16384
##$SREGLST= <1H.CDCl3>
##$SSB= 0
##$STSI= 16384
##$STSR= 0
##$SW_p= 3612.71676300578
##$SYMM= 0
##$S_DEV= 0
##$TDeff= 16384
##$TDoff= 0
##$TI= <>
##$TILT= no
##$TM1= 0
##$TM2= 0
##$TOPLEV= 0
##$USERP1= <user>
##$USERP2= <user>
##$USERP3= <user>
##$USERP4= <user>
##$USERP5= <user>
##$WDW= 1
##$XDIM= 16384
##$YMAX_p= 419308338
##$YMIN_p= -1352881
$$ End of Bruker specific parameters
$$ ---------------------------------
##NTUPLES= NMR SPECTRUM
##VAR_NAME=  FREQUENCY,     SPECTRUM/REAL,   SPECTRUM/IMAG
##SYMBOL=    X,             R,               I
##VAR_TYPE=  INDEPENDENT,   DEPENDENT,       DEPENDENT
##VAR_FORM=  AFFN,          ASDF,            ASDF
##VAR_DIM=   16384,         16384,           16384
##UNITS=     HZ,            ARBITRARY UNITS, ARBITRARY UNITS
##FACTOR=    0.220516191357247, 1,           1
##FIRST=     3176.34289072463, 0,            0
##LAST=      -436.373872281146, 0,           0
##MIN=       -436.373872281146, -1352881,    0
##MAX=       3176.34289072463, 419308338,    0
$$ Real data points
##PAGE= N=1
##DATA TABLE= (X++(R..R)), XYDATA
$$ [...]
13570 192254 290659 259479 -34786 -399729 -466536 -254241 -250001 -180316 -4848 -358535 25366
13559 25366 -4708 36698 -569857 -197659 587112 162765 -108384 -484103 -121014 102251
13549 102251 359586 -106396 152860 133571 146281 226344 410272 229757 180667 298743
13539 298743 111271 67232 50414 220784 -5459 53483 -54330 -67850 54450 -185645
13529 -185645 -365100 -344748 -300957 -93436 -310606 -415619 -327863 -420119 -454033 18724
13519 18724 -84290 -220641 127789 -269034 -585176 -241274 -94796 -190890 -160879 62690
13509 62690 270950 45222 222155 452922 618297 600105 236455 85380 -74908 -390819
13499 -390819 -133999 3996 112661 52920 98560 217805 -99004 76461 238793 3036
13489 3036 234969 289347 61767 309201 475614 348061 634947 523596 346749 62936
13479 62936 105356 232547 185130 178753 113902 -51883 -187499 -312239 -149279 -147630 -310397
13468 -310397 -421022 -518340 -231433 -148572 -261792 -174508 -121001 -237082 -357787 72603
13458 72603 332135 467956 581347 741739 574931 410250 607762 369911 15289 235391
13448 235391 517408 84580 -120979 -376587 -2480 284486 496671 247802 68739 -263590
13438 -263590 -776207 -605618 -538479 -616599 -475506 -508290 171543 91819 -170272 135366
13428 135366 544760 571493 591271 152345 -265458 -304974 -193864 -335218 -101833 -236649
13418 -236649 -281713 167240 112482 -251966 13285 -140205 -43876 -548558 -589750 -388615
13408 -388615 -453985 -141496 102050 82494 -209433 -231894 97434 392368 151170 -287518
13398 -287518 -357833 -128217 504879 414411 -224099 2039 -341813 38095 237647 -86898
13388 -86898 -317846 -302988 -430375 -22868 240440 153738 76833 440169 183873 120961
13378 120961 -81994 -334286 -329742 -112416 -104444 -315013 -364532 -242298 -158682 -393868 -467828
13367 -467828 100512 347739 -48473 -115813 251889 29940 -85724 -199567 -679727 -737813
13357 -737813 -795307 -432998 -203065 4131 122903 533341 87404 -48345 4214 -344184
13347 -344184 -73650 -222751 -23981 108589 63048 257108 307276 97494 -1866 44457
13337 44457 44795 205301 -81610 1789 -184225 -97466 -20240 70462 207898 34677 -270917
13326 -270917 -172958 106307 219785 4028 -457269 -230137 -275301 -120955 162827 158686
13316 158686 -247176 -273196 -579102 -595387 -292050 -463059 -472459 -158450 -528304 -473041
13306 -473041 -650556 -423637 -184727 154562 199550 -138544 -457020 -195595 -371967 -215449
13296 -215449 -43124 -253277 131326 -203437 -561383 -480534 -189158 -214727 259625 390059
13286 390059 -232992 -293868 -472045 -364472 -84623 -359162 -376541 -386194 -65569 81169
13276 81169 240221 -113846 48633 192563 722582 787747 140386 320037 508984 350441
13266 350441 -47748 -95947 68917 -145225 -158510 31770 130419 -7495 -174587 206793
13256 206793 292336 21022 -55319 -325187 -359984 -131703 -337820 -203665 -220082 -65462
13246 -65462 -96836 56831 203133 224049 86197 92790 30503 -205845 -232601 -312928 -82808
13235 -82808 -152376 -802362 -657155 -324527 166201 369115 -167787 -226611 -78193 32035
13225 32035 -287017 -13310 354180 24063 310313 239546 16953 131212 116171 314543
13215 314543 254736 29271 -130720 -69789 -187786 277827 368014 -13885 76220 265368
13205 265368 -2729 -139727 -251665 -184020 -601910 -462491 -434075 -207501 -59655 -121030
13195 -121030 -283305 -424355 -610244 -385802 -27072 -172868 -56868 156515 -76796 -275379
13185 -275379 -129087 -84422 -384573 -339887 -186438 -97537 -145749 -380579 -547872 123906
13175 123906 147065 20415 -189117 -84100 51383 -107314 -332532 -427682 -261754 -32094
13165 -32094 -202505 -497240 -552280 -261260 -18867 -90599 -94210 -37081 -128982 -265635 47749
13154 47749 -154048 -266466 60336 -70863 -133002 291497 -176394 -146548 -48998 -71987
13144 -71987 -273245 273181 196438 -94089 -287552 -299286 -362325 -161715 42759 109995
13134 109995 -45539 -163718 -27350 -196018 -193892 -195726 -93741 -30831 -258973 -321840 -43405
13123 -43405 187717 -156894 87100 22473 -330731 -256944 -44359 197209 146592 -254315
13113 -254315 47036 -400927 -72278 352745 173790 358692 -339534 -73912 63930 1160
13103 1160 7592 -450551 -289075 147228 465926 172553 -71931 85697 -121897 -458863
13093 -458863 -475678 -406621 -60666 -54296 179801 60530 11792 -16347 556386 835054 690778
13082 690778 293355 124732 76638 92140 215368 -294124 25891 72339 98061 -255799
13072 -255799 -189554 -94257 -143912 -49011 249758 -63361 -24132 254317 185164 114088 293214
13061 293214 399299 372683 -194441 -14785 156639 59805 74924 -270884 -164533 406907
13051 406907 658095 442014 133421 17538 77554 -232364 -536705 -643110 71226 -92340
13041 -92340 -277990 -342696 96905 -26843 -121822 -202672 -93962 459533 91912 -15755
13031 -15755 -177721 245398 147643 -176458 258383 -59343 -264199 -29537 91040 162801
13021 162801 -179347 12181 -233010 -393510 314631 142010 404262 128710 -75896 64640
13011 64640 49427 108148 -72296 -48693 -180199 -21305 174851 352580 114313 253945
13001 253945 205223 282668 113155 245710 28018 246982 111844 -90798 4329 426277
12991 426277 567574 428682 187565 -52447 -335060 -157435 -252791 55099 383532 413750
12981 413750 502739 331631 424170 214478 301773 402840 12154 85486 254784 -50249
12971 -50249 79209 -357258 -319370 -186384 -153483 -111603 231527 412216 -236450 -7862
12961 -7862 257808 608230 263037 -41307 -45205 62925 29078 -95438 295877 358882 86492
12950 86492 112063 129529 -111203 -93260 -296186 -54395 -294225 -293890 -60239 -199517 -390662
12939 -390662 -80500 -124638 -391493 -422666 -403199 -367820 -164288 -333499 -383267 -139606
12929 -139606 -243334 -476321 -230723 -26837 33466 22637 39270 90372 452873 375307
12919 375307 70015 -33268 56293 310646 377534 -53182 -319573 -167138 -54781 -27454
12909 -27454 -413423 -389860 386735 376369 131188 183346 50938 304534 623374 20064
12899 20064 -343537 -215642 -62417 -84005 -317767 -300001 -182117 -127541 -272225 -438251
12889 -438251 -141743 209778 119403 -227087 -313228 -199701 158593 195944 -295366 -324502
12879 -324502 -53003 -193053 -316363 -283234 -153859 -195604 -238806 -340583 -182219 251146
12869 251146 200943 328425 -54512 -230624 -262849 -353659 -315591 -75703 38206 402868
12859 402868 21999 -92284 81833 90990 -64974 -42232 333787 60992 260148 517644
12849 517644 410796 372384 157211 474200 209182 167271 53794 -222911 -102207 -8962
12839 -8962 -123260 -323291 91298 101552 2148 -216110 253309 94086 -40013 175783
12829 175783 401522 362352 -75253 -208863 271102 363680 170421 55227 -185864 -224586
12819 -224586 -152857 -207671 -157108 -357629 -430033 -633561 90598 -147331 -184778 -86708 -491688
12808 -491688 -189850 -157084 -147039 -187615 139798 316686 60103 254994 327915 158327
12798 158327 -269552 -40589 -52924 -207614 -53881 152495 -78596 -206566 9769 -179564
12788 -179564 201762 359922 133054 -68062 164750 -461526 -307517 -561546 -382800 -39703
12778 -39703 21939 -28010 -351941 -203084 11330 23176 -198717 -20431 383947 462643
12768 462643 761131 47492 -187386 -202061 -365570 -669687 -69884 213300 -4660 -299220
12758 -299220 -199949 -146910 -162554 -500081 -331817 117305 -377302 -330246 -365859 -350530 -299923
12747 -299923 -132089 328117 863 72883 -301953 -50005 240130 15160 109007 -183547
12737 -183547 -116555 250465 -59858 66610 625744 792554 300795 -88365 94772 42191
12727 42191 161624 -33303 92059 12917 -163756 -23752 233520 202355 -157507 2626
12717 2626 308460 294540 214598 361484 377489 238274 52039 -208926 12763 -108842
12707 -108842 27484 169810 188125 169440 280514 -55185 -8096 138904 -121190 -744579
12697 -744579 -425575 71562 149463 -196105 -437268 -456984 -194411 -45952 72483 292679
12687 292679 159304 -271732 320308 81758 -105549 145955 22834 -258080 -354779 -360693
12677 -360693 229746 521016 57198 147345 149379 53183 -88695 -136446 -782868 -866750 -430973
12666 -430973 27432 313685 289819 -57445 -332123 -103731 -423879 -344535 -337755 10307
12656 10307 188446 -90251 -378713 -124398 65453 -311554 -359800 164120 -54203 -239974
12646 -239974 31415 363075 385363 198940 97059 34948 -152825 107279 409116 387132
12636 387132 159132 -155452 42834 -70091 334072 376397 276450 99749 233290 284322
12626 284322 249531 65406 331730 523024 317456 181668 151810 300870 291521 384414
12616 384414 387273 66836 -89801 -36292 105142 40023 194674 -104501 -258131 147722
12606 147722 286597 87753 -389722 -402958 -211965 -101013 361751 100454 355353 621097
12596 621097 348848 186538 539750 -77065 -133185 -268644 -620215 -341235 -337783 -458038
12586 -458038 -431651 -40465 -6078 45342 -298 185203 -127927 -23132 -256613 -373078
12576 -373078 -431754 -204516 -12144 -312013 -56996 -126452 -187311 196518 -86463 101980
12566 101980 -353291 -406128 -2216 -415604 -286289 -427965 -209848 -701537 -440891 -64324
12556 -64324 68836 57584 -166248 -152258 59662 -59082 53396 -79550 -113580 361677
12546 361677 860018 477212 111443 -155611 -509032 -537481 -61783 302420 428794 175101
12536 175101 26754 115223 -139289 -232580 -156823 133107 73257 321331 543487 728308
12526 728308 453001 331102 468583 217978 39101 284095 623795 303884 145629 -50668
12516 -50668 -558621 -54206 -77257 -378909 -389502 -497773 -283215 -204805 -374272 -127486
12506 -127486 -288750 -352992 -105318 -382396 -182178 -29453 -273187 -117536 -231442 -89228
12496 -89228 142560 349438 147695 182423 255980 311425 240721 314661 273420 -18619 -159250
12485 -159250 -303748 -128795 191141 -179605 -396380 -386146 -136767 -9612 -274690 -20543
12475 -20543 39652 -156649 117075 416050 142112 -195671 -397737 -622132 -429175 -402085
12465 -402085 -62495 413294 385976 105089 -119762 -258468 -195008 -440204 -488132 -460269
12455 -460269 -590378 -292972 -9436 -7282 76434 -451065 -156280 217022 -246438 102704
12445 102704 -138685 -428421 -376348 178853 81347 274560 277050 347686 -74619 -285088
12435 -285088 -334529 -278601 117315 -36143 314903 -111720 -238508 -116909 -187205 -72788
12425 -72788 -127718 -56763 31159 -87722 -34664 -321266 7318 31700 28549 131002 -224045
12414 -224045 -494327 -557999 -174833 -79399 -459955 -673534 -324982 -226393 47150 51909
12404 51909 -99166 -207694 353013 98467 24402 -8865 -349461 -376452 -758291 -600435
12394 -600435 41942 121231 -33324 109338 84552 62930 -306758 -59542 -152794 -494772
12384 -494772 -350707 -196081 -166058 -269249 51893 -52603 -53671 74442 82912 -41239
12374 -41239 -5612 402743 268379 177050 -65392 -371304 -523813 26213 -95785 -252945
12364 -252945 -87760 208136 261521 -5282 82015 319695 575622 180611 374960 398488
12354 398488 59528 360341 180408 9613 -180449 264193 383336 -180634 -417903 -109889
12344 -109889 32347 25060 168479 -91233 -540534 -709814 -197587 -179704 -361032 76704
12334 76704 46201 -72167 102495 -119485 369755 351212 -351103 -430294 -223339 -63740
12324 -63740 111406 380214 151089 204475 285610 -421948 -221617 -120022 38020 -442246
12314 -442246 -387591 -101866 259838 -57755 -172444 -89141 -75809 -253242 -128517 -151547
12304 -151547 -196390 -291228 -47173 -31621 -178894 -53058 88316 -155198 -347937 60047
12294 60047 100257 348458 502983 311611 124175 -91620 87216 286832 212624 129658
12284 129658 -53042 179658 115973 311985 374523 213191 66932 -64254 -292566 -271795
12274 -271795 -388114 -331165 -656962 -320184 -143224 -137535 -111353 120785 -133353 -388570
12264 -388570 -118869 354485 525498 296320 -38668 -117869 -310547 -128057 -288638 -272682
12254 -272682 -81296 213927 118754 139387 330151 358391 278931 -92351 180249 568343
12244 568343 -59427 -391918 -191986 -402048 -94005 80345 380050 166481 72289 403514
12234 403514 49452 -152454 342658 613973 496904 320871 31055 171236 368748 334970
12224 334970 275842 28339 385393 278801 30282 -345440 -391555 139091 -41413 -55159
12214 -55159 -41147 -63800 69454 -122541 -36486 225241 -24333 -250811 9082 139956
12204 139956 436813 591574 251946 8132 82129 377376 163547 -191157 -246307 -301330
12194 -301330 -176210 -268115 -643399 -431992 -144356 -226093 -375505 -245412 23583 109494
12184 109494 260987 43302 -251511 -180529 102332 325498 400342 336028 236882 99300
12174 99300 180669 147164 114053 -71278 -60645 60645 231868 220943 -52272 -237353 -252094
12163 -252094 -528781 -154733 -236790 -192453 -184615 30818 423610 -292964 -440307 -309533
12153 -309533 -292623 166049 -221317 -312387 -193399 -248789 82675 40417 67214 -419404
12143 -419404 -99905 -45690 78640 11407 -116966 -263159 -418922 -517766 -48726 55830
12133 55830 -314982 -388096 -338932 -72561 -127912 -29731 -101280 -441242 -113116 51380 206005
12122 206005 116125 275607 165262 -182793 232228 290940 -48746 121518 91100 -256882
12112 -256882 -399700 -364861 -340314 -278288 -530733 -255131 111327 -99551 87484 78512
12102 78512 -215662 -106 45812 -176610 -54603 -220688 10852 -214807 71045 6676
12092 6676 41070 -29203 -134981 86591 200543 60448 99144 -26725 -165538 -130167 -32932
12081 -32932 -6227 -188474 28972 251593 116163 106010 142194 -7161 -93937 198157
12071 198157 130548 -49786 -439563 -178217 106172 184967 -238122 -292510 -129679 -206497
12061 -206497 -439006 -330509 12373 77125 -30254 131974 655822 14059 -196391 -60852
12051 -60852 118990 -25876 -390759 -452719 -288603 111423 45813 49774 217215 -57646
12041 -57646 -199393 -83549 -14317 216168 70981 -261267 39941 -205306 -33870 77558
12031 77558 -134053 222061 219181 -296583 -66790 -253657 -249025 -127255 -164682 -199898 -335244
12020 -335244 -413507 -414859 111083 405827 127103 -135250 -101767 -77820 -112019 -189187 -304404
12009 -304404 10433 221673 344774 355763 329889 -31943 80868 247549 208448 36520
11999 36520 56328 101034 -298227 -432046 -370948 -94298 234538 -51959 -174585 -271287
11989 -271287 -194165 417438 240646 133235 152804 326009 6579 -306054 220149 75354
11979 75354 -35517 -174086 -139117 -311878 -386281 -315145 -116588 65010 230453 377246
11969 377246 187763 87108 -90817 -150193 -239378 -529169 -151201 100925 -10064 -31000
11959 -31000 -279180 294556 -65019 -310088 -51164 -145589 -369306 -653296 -296412 -197253
11949 -197253 -187806 6716 287063 236465 149989 74119 14574 14404 167726 111646 -124659
11938 -124659 -106572 -100407 70745 -254683 -290151 -344596 22705 154504 6759 104828 -47451
11927 -47451 -249331 -331903 -533643 -146387 124398 533492 369255 113120 126296 466729
11917 466729 336339 339604 149173 117491 46910 -65863 -213006 -411285 9485 -145506
11907 -145506 -13974 192665 402898 338319 -155725 -156217 180361 208805 172260 28122 -59412
11896 -59412 -423173 189893 450855 -199170 35065 -6554 -400644 305390 175223 -267753
11886 -267753 -217654 49025 -14025 120551 16037 158388 70854 -208120 -14581 -198873
11876 -198873 -161956 39074 493968 341745 -36992 36471 -226367 -254089 -260596 37748
11866 37748 -77212 299160 197931 61112 227451 -217294 268624 293613 -60126 -373247
11856 -373247 -434691 -187279 6641 -204098 -299042 -55592 -226112 -318902 131994 -109108
11846 -109108 45602 240010 152521 303551 355412 260581 466140 424302 -28344 -399615
11836 -399615 -244890 228755 360976 -34904 -364119 58393 -64747 69983 549373 3078
11826 3078 -79543 -118771 83758 -87820 78193 93415 -93866 -233467 -105981 159808
11816 159808 440509 241893 248244 513862 521757 285224 -49884 42793 -29898 448714 639831
11805 639831 314679 14415 -140511 98964 220166 74882 11788 -150238 -326618 -286876
11795 -286876 221618 97895 74701 118544 -427705 -697071 -213908 -49416 -308318 -410034
11785 -410034 -276851 -112306 190513 -97994 -304186 222697 61045 -200009 -87917 204801
11775 204801 38420 37183 -191904 -292390 -384038 -334821 -119390 -303779 92279 131999
11765 131999 -12242 -280858 -277303 -127294 487850 720297 448607 1351 25949 128815
11755 128815 32152 937 -113040 -384440 -94047 -159816 1967 -192434 -113342 -239853
11745 -239853 -258590 -332281 -706302 -467555 -97221 -340542 -183924 -222753 100260 95718
11735 95718 -293937 -60901 -3141 22855 -125818 61465 236435 -157214 -42398 91822
11725 91822 -141950 64198 -190205 176406 -9961 -65681 -76331 -170852 128700 263373
11715 263373 -129108 27082 426191 189194 144989 56167 -256233 -269984 -14493 130258
11705 130258 -217014 -254748 127224 -335964 -548466 77522 -174751 -309127 -473869 -184618
11695 -184618 298618 335829 19955 -81198 20260 119021 308373 279432 178738 -36607
11685 -36607 -231492 -61111 276392 412083 70403 58600 -17878 -43930 -235060 -267511
11675 -267511 -350569 257634 442482 190184 248063 461077 457509 57453 -108373 -56552
11665 -56552 -145596 186931 245480 -211321 -388249 105050 371884 477216 246010 84997
11655 84997 269617 250248 151331 -149460 261200 187163 -122099 -127742 555677 337024 389393
11644 389393 304703 501212 430362 177890 219841 448832 145666 -366623 -134135 28016
11634 28016 18974 278255 385286 126218 158552 -65771 -129669 -138366 -16293 162082 294252
11623 294252 -184278 -142912 105859 70356 21342 -216390 106338 286685 64142 30083
11613 30083 -117345 -258619 -303883 -32872 -160816 -529699 -324933 -397189 -353010 -413676
11603 -413676 -248098 -287973 -95055 124017 -65871 107179 -249433 -223611 -1652 36959
11593 36959 373912 37578 -134985 28070 47529 210359 161812 19498 -74923 214872
11583 214872 336953 -110765 -70140 227442 -91359 -223912 -32167 38706 -36090 46477
11573 46477 95922 122730 86730 454398 97155 333459 263297 75195 164943 -219653 214149
11562 214149 -233737 -320233 -16559 224664 -98809 -2858 422445 344779 330883 547617
11552 547617 399748 -63318 -247771 -96945 330851 764782 808965 383985 -46315 408524
11542 408524 187386 -334264 -166912 -89937 -70102 -330626 -167498 -68975 -409935 132999
11532 132999 270544 90200 36976 154903 229748 195837 48221 -38432 -58398 -285598
11522 -285598 -249451 -462129 70 -123421 -61215 322340 486302 429760 361682 290616
11512 290616 84229 -137987 -375198 -187813 -529140 -979073 -710774 -313719 -34104 -701
11502 -701 46368 37341 -94770 -99692 -35060 791104 571750 53802 11371 -372129 -159358
11491 -159358 -111640 52183 -182214 -372209 210745 403271 302967 297379 314463 -232266
11481 -232266 -193031 -333768 -92321 260760 95198 -105128 168553 -213821 145444 463045
11471 463045 -20203 122357 61268 -59559 -362547 -303601 -347164 -120399 49250 431730
11461 431730 294305 321522 60659 -196052 -353429 -313542 51778 -102710 -12196 147628
11451 147628 -118126 -15787 233770 556774 273143 -279234 -99846 -390987 -314099 -271208
11441 -271208 -78252 410827 281431 -13273 264498 19524 -161417 90109 -20081 7749
11431 7749 57024 21969 -337417 -511911 -304295 -106961 -390615 -508645 -347293 5891
11421 5891 205167 -42876 -298349 -165824 -200825 -247305 -78915 254653 17140 116848
11411 116848 -215363 -470208 -290732 90109 326928 314871 168431 139048 96462 21128
11401 21128 -237548 -369899 48622 -8454 -100949 -328733 -351290 -298150 -281253 175615 -174069
11390 -174069 -146000 82260 108064 -17250 97026 239544 164364 261427 130938 381741
11380 381741 -200077 -71947 -163532 -185959 -167848 -106659 -149805 -333720 -258807 -199347 -159414
11369 -159414 27153 77603 266554 687556 638906 4919 -452247 -555179 -527740 -439633
11359 -439633 -448655 -628315 -520009 -285275 -21352 151877 109950 183125 -143930 -420976
11349 -420976 -201457 10482 159318 433747 159382 -23863 226648 296370 3872 -19334
11339 -19334 -135660 164949 53196 84880 144582 -91871 -291395 120091 377617 102597
11329 102597 321963 230094 203945 216551 400927 435610 363820 231823 500614 405441 498272
11318 498272 -35832 105225 242022 344267 89894 15839 382073 -222913 -292093 37060
11308 37060 37067 189159 -8135 -258063 -79356 -180572 -473127 -283807 261379 302894 156288
11297 156288 -67154 313030 29525 -19215 -75511 -455010 -292969 -230840 87823 170441
11287 170441 221759 398472 39362 432178 397286 -98069 138915 50739 141533 124031
11277 124031 87358 -355287 -193474 265766 164751 338410 343725 -279317 145167 192123
11267 192123 -160543 -177325 -561924 -405440 -162187 106301 -321299 -85972 158272 291501
11257 291501 36457 190872 100813 -77866 40842 -37505 -253904 -615726 -808274 -441382
11247 -441382 27250 -68673 -236090 -151516 -280968 -212804 -371765 45645 383560 248889
11237 248889 -64122 -306872 -529290 -440404 5087 267717 168617 -262067 -45229 -406364
11227 -406364 -287042 -82518 -179151 69436 497046 499665 250999 124958 494285 528643
11217 528643 -84379 -257012 -47456 -206256 -84637 58155 81962 -88576 -464477 -393531
11207 -393531 -196329 -188883 -98888 -137634 -95463 861 -193183 -257347 -87405 -120535 85455
11196 85455 214229 168084 114574 98662 -132 249136 245782 -112114 154904 174176 103278
11185 103278 -262172 -601492 -208034 217608 86570 -354087 -567063 -329321 67243 23977
11175 23977 -452242 -165780 233701 -283498 32746 23785 -100002 -125655 -33993 -54467 -59797
11164 -59797 3240 -148278 -441020 -465764 -157216 -31903 -177329 -14360 170329 -370753
11154 -370753 -176061 -149028 -244315 -2239 585408 769420 449947 60412 -341642 -481201
11144 -481201 -347373 165 376573 349708 201450 -162822 271013 460176 63764 439282
11134 439282 621672 29333 -31173 20369 -322315 -337326 257857 15107 -100812 105007
11124 105007 295965 69425 -78903 -212180 -107589 -314361 -256363 132129 189020 302515
11114 302515 507163 239029 258640 125662 -264970 -220971 214320 40919 2130 338620
11104 338620 288072 -158522 750 251679 269192 183858 -100887 -154629 -250365 -87354
11094 -87354 -214507 192507 -35890 -141 139151 -93794 -6235 165960 251551 -92213
11084 -92213 -461390 -166556 -82120 174276 110432 -49715 -141869 -256999 -529148 -335676
11074 -335676 -159910 340703 86120 -169462 -7252 265393 -132797 -240443 256172 117948
11064 117948 -458711 -351833 -330403 -104780 125235 -228770 -239937 -128344 -399799 -784839
11054 -784839 -692479 -583255 -497813 97808 375017 241836 -305066 -214490 53656 319310
11044 319310 172053 47132 -175673 -88839 31484 -307393 -231110 -108986 -91445 -401514
11034 -401514 263349 402020 -13639 106870 -56722 315291 157582 222038 -275169 -164956
11024 -164956 39219 -275257 52652 -238045 -574266 -796371 -440527 -416099 -205799 58684
11014 58684 12087 -179057 39599 178954 20581 -152840 179970 43994 -275345 -516760
11004 -516760 -350574 -1710 -318100 7463 219310 306859 473300 236645 204180 162454
10994 162454 187975 -273886 -416749 -468743 -256800 -89514 -193769 -439204 -301218 -171095
10984 -171095 -181834 -562228 -157213 -183130 -170644 -324188 -449142 -345970 -406009 -518050
10974 -518050 -431271 -530572 -271012 31506 141278 -6500 -269758 -169051 -561161 115262
10964 115262 -139682 -495440 -128254 -5161 -11388 -196972 27786 109094 -12097 2299
10954 2299 479238 376431 204639 -91344 -21904 151305 401039 474154 658640 598268
10944 598268 619170 -53577 -242542 -150109 -125589 -166906 -160756 30216 -289213 -109070 -234378
10933 -234378 -284459 -25312 164412 176045 316247 348215 -241862 -285690 -204401 -757907
10923 -757907 -584144 -262567 416650 415931 -86588 -242396 -518256 -246574 94480 70607
10913 70607 208608 159770 227331 100910 196155 298825 127791 -239446 -35151 -236521
10903 -236521 36335 200236 -127172 -105305 271425 160929 -87555 -172683 -164137 -226230
10893 -226230 -219798 -418515 -587146 -365369 -310383 -540126 -14846 173809 11863 -227707
10883 -227707 296608 147153 66321 239605 211831 310915 19887 -2347 209770 51442
10873 51442 -361862 -432920 -569269 -94342 388382 466242 124915 -177354 -95171 -356345
10863 -356345 -663425 -281754 16176 -120433 -108578 -398211 -385014 18762 -359636 -318506
10853 -318506 243487 235250 -27594 -185559 239415 94416 -383300 -215417 -432004 -8074
10843 -8074 87013 137797 -192786 -227066 -2580 -272784 -78319 31942 -107085 -63108 161429
10832 161429 128915 -140801 -543224 -164029 -113084 -171543 -355208 82241 129117 126905 44779
10821 44779 -164957 -215314 -263923 -143776 30532 -157339 -303138 -159388 279146 569094
10811 569094 124609 -2198 -239164 -281693 -34219 45719 129243 -134051 -247719 95532
10801 95532 -221486 -6662 -391278 -244940 79488 -186574 36530 177048 -87401 -270747
10791 -270747 -54871 -197187 -95992 -139163 -185285 417820 115455 -27400 -24613 71651
10781 71651 108775 264687 199385 -60740 92206 282665 49092 -135763 -335215 -310107
10771 -310107 -68553 -134893 14869 236235 316625 519888 -56054 48128 367027 213148
10761 213148 74927 147692 -237390 -22166 413617 115774 142686 -85243 71533 295056
10751 295056 -153021 -69326 -41702 184353 -176800 -336994 -126868 -102293 -471945 -330701
10741 -330701 -65445 133553 -173758 -258977 -571892 -860263 -511127 127929 -107415 96452
10731 96452 -5358 -242296 117690 -285815 185006 483756 873803 675509 -140227 -388483
10721 -388483 -372204 -292011 -259168 -121162 54951 82696 224237 -11287 467617 135781
10711 135781 218678 -55852 -204235 -795089 -898198 -510989 -360210 -196032 -55614 -106109
10701 -106109 90619 -81893 -162053 -323052 -443701 -72934 149904 150362 19204 -195922
10691 -195922 459788 553982 337046 174368 -279607 -506526 19975 -342028 -703376 -185028
10681 -185028 24948 -80000 -311977 -504782 -675386 -119714 488218 59866 -432110 -309629
10671 -309629 -257773 -155005 -201264 -237528 -402117 -76795 394935 299247 524339 466048
10661 466048 -69045 62036 299085 406026 356783 486078 518632 188434 -327954 -382919
10651 -382919 69025 175908 -85647 -172540 -326777 -188831 -7556 292592 54093 18722
10641 18722 106123 -207803 -118814 -496404 -140786 21264 -371445 -332920 -196249 -306517
10631 -306517 -299023 -45602 -181628 -267562 -152495 173237 472214 457084 -167261 -378490
10621 -378490 -487693 -447581 -697517 -715607 -25747 410745 251897 189078 505280 385434
10611 385434 118362 -14149 163629 299095 393941 317605 43109 205953 261876 41079
10601 41079 213037 86652 248083 247773 209194 231735 284587 592481 221572 224847 -7590
10590 -7590 165416 584978 181222 -126060 38016 -205906 137064 254268 -131283 -241456
10580 -241456 -330215 -68517 107981 495604 631935 625024 707864 589123 301941 -201666
10570 -201666 -285864 -454541 -82017 179994 329007 17165 -314613 111468 349088 74814
10560 74814 55476 166801 -58890 -483677 16423 122951 -97978 -154808 -45236 125828
10550 125828 113579 356122 773593 722681 142337 -69485 -100642 -134999 -298836 246315
10540 246315 528711 553772 598541 800088 380917 418609 477859 382305 413266 -73256 -188948
10529 -188948 40492 -189272 -270746 -137250 239683 197533 202149 -37508 -240625 -67305
10519 -67305 191845 182769 -166800 -63403 83254 47924 77244 5077 83473 250700 -98617
10508 -98617 -53608 191880 242778 72464 72812 -59493 -319772 -62626 119859 43391 -267678
10497 -267678 -212003 -196453 -319036 -71221 152182 193769 -16430 146305 305154 51687
10487 51687 -122650 24365 -56227 -315861 -111712 -4546 -271791 59224 -305464 -398659
10477 -398659 192068 147293 244593 433313 271233 532263 -8921 -365247 -142401 -160416
10467 -160416 8383 58490 96589 78847 107589 144545 -114347 -13561 -13711 -235393 -220026
10456 -220026 -616884 -745757 -194576 -226400 -21881 312545 33098 -67081 -241248 -455498
10446 -455498 -296583 4057 -43563 -247347 -30666 -58459 111281 502228 620616 165808
10436 165808 107276 89976 39701 383301 -38056 -426699 -168336 539585 378776 1742
10426 1742 -290929 31388 -76515 -156345 -238005 -526828 -620573 -263336 -384649 -14010
10416 -14010 -315840 21186 150735 162526 353857 92636 242275 527536 379701 58507
10406 58507 -205614 -358184 -224129 -272219 -2982 279743 50083 -89067 72010 -280230
10396 -280230 -336285 -357311 -442928 -322420 -173278 185214 -27465 -153565 76223 365412
10386 365412 186585 400534 167063 264900 134907 159927 275026 -22680 -54748 -208010
10376 -208010 201655 -161289 63583 87730 89411 13804 114957 86485 28488 -53122 5204
10365 5204 -200519 -298529 -198864 -65094 -248783 -398789 -232613 -19176 258667 90594
10355 90594 282600 189711 -180096 154439 107235 205621 256996 280772 204226 -55145 -157936
10344 -157936 206274 419830 280504 30526 401334 535952 332624 347294 550396 30207
10334 30207 -183830 -95123 279669 290974 453529 361066 -5258 -287211 -132270 -283085
10324 -283085 -51167 53666 52675 -386694 -419699 -74472 400046 374704 -344270 -10592
10314 -10592 273404 672540 819840 539259 198162 330860 23889 -196178 -122276 -345840
10304 -345840 -71992 -237957 -613339 -425740 -731821 -539970 -111001 -156593 -21565 218741
10294 218741 219208 147426 -114518 -136339 -77883 186520 129634 139336 -233459 -353025 -270122
10283 -270122 -7330 -195235 124695 223269 193336 -347929 -118734 -80038 -291749 -161553
10273 -161553 -93160 -58646 -232362 -316633 6929 90148 76854 -72014 -17507 97966 327216
10262 327216 357056 397262 376638 480041 296043 384216 626376 479241 269403 -250308
10252 -250308 -61447 525081 559421 208979 363809 569892 457692 92356 45308 63089
10242 63089 174810 -331775 -175589 79906 -55551 -312442 103603 247680 208059 409724
10232 409724 152755 7677 520064 512064 203977 75803 -377905 -292418 -181462 249781
10222 249781 429854 634505 660679 -36882 196251 262106 87314 276631 648110 745140
10212 745140 9685 -449809 -2186 168830 159728 204713 -20874 110700 153385 -169530
10202 -169530 -42380 -127859 144718 316168 12867 113945 113432 158337 542087 234833
10192 234833 -254516 -470150 -134337 181323 105485 -179246 -181683 226182 -208962 -149783
10182 -149783 177107 367755 188267 369059 143724 -29218 220475 190724 202535 305638
10172 305638 280889 454514 290268 451659 346262 13313 -59566 -436324 112074 291133
10162 291133 100542 335177 148433 -60325 11349 76505 274263 -224241 -169818 136251
10152 136251 -53570 168639 105396 47698 515771 203523 -19514 29406 198503 107944
10142 107944 117247 292940 -27011 112520 500827 436223 557271 269428 221778 410931
10132 410931 191416 -79813 -22225 -203445 -279625 -251767 -124118 99997 219977 341178
10122 341178 153774 266112 615878 682655 450759 21784 217689 171128 124620 239506
10112 239506 160668 257636 96960 450177 541878 364390 340020 140159 -3101 -1497 -60564
10101 -60564 -150367 125715 47687 192021 305553 191275 255245 221712 171959 346296 320763
10090 320763 -68765 474392 399635 135078 -240975 -239129 -124601 -47310 -83819 -269513
10080 -269513 -376410 -202370 -77000 -66654 114850 63060 18615 114526 216268 -100750
10070 -100750 305597 48183 11811 330929 166079 32322 -72530 -506429 -241734 299449
10060 299449 444420 182785 -184528 114544 -237649 -174104 -414059 -152099 -70988 -214782
10050 -214782 148879 87616 310671 414459 205875 101530 -80461 216068 120404 -2379
10040 -2379 40948 88109 328952 299213 148599 -10002 147036 625818 679991 253760 -97167
10029 -97167 79045 58055 20222 19370 53616 -213063 -520522 -699566 -396989 -90697 15860
10018 15860 -62473 -273714 169954 18614 -203235 -108237 -190188 -178295 -34237 -367655
10008 -367655 -122763 -246628 -130311 80828 13506 379204 200372 -78690 318336 395677
9998 395677 -262838 13059 142699 205660 277690 -6662 -19394 482419 -9001 -220116
9988 -220116 275659 53958 -173335 -326411 -280868 241939 345249 -91324 25442 293778
9978 293778 447264 100598 -53416 192704 448190 434724 235608 565939 515495 -159722
9968 -159722 -419890 -336800 -248331 -351276 -164050 -239621 154684 154874 339559 -120023 74842
9957 74842 390243 223488 -160066 -25428 226095 36762 -41013 50589 -99853 -219029
9947 -219029 200799 181298 236979 -77104 20318 -90999 164239 78866 -187698 149858
9937 149858 148255 222193 -96525 -230530 -393503 -503980 -383532 -271552 64878 92294
9927 92294 154394 321448 70099 27151 -99716 -87914 317252 -235185 -201202 -1181 -239735
9916 -239735 175556 320813 -51420 -6659 134317 -48219 -130675 179010 294242 311278
9906 311278 156403 221272 287844 101931 675920 567027 238328 325886 256388 137970
9896 137970 60825 281637 -194760 -128479 -81787 168566 213913 58934 17005 19351 -154516
9885 -154516 -53558 255967 296394 257123 212386 126879 -48832 -161421 -213604 104720 306006
9874 306006 229814 234232 126717 704420 693561 407844 240403 433750 255740 -3514
9864 -3514 -75636 -190374 88634 198643 67897 20046 54227 -83981 -25801 -141636 273345
9853 273345 639656 340654 51714 65738 -14870 140148 -260505 -30276 254737 119619
9843 119619 -195953 -122182 603725 579941 141440 42990 57409 136208 147275 218590 113672
9832 113672 184146 232764 311544 301410 324060 -201890 18874 258237 -157541 402243 216308
9821 216308 -11539 730021 855377 474209 21629 -131690 -77078 95765 76490 384529
9811 384529 206728 -236126 -30735 356638 266369 373086 471478 302750 366094 300660
9801 300660 652783 813756 220434 225969 482718 655673 614955 194218 168375 239310 -123604
9790 -123604 -250671 -103143 159303 12255 -158738 161248 274486 364536 183709 221411
9780 221411 62331 -15374 -585798 32083 -8434 -169082 83293 134204 338184 230318
9770 230318 -53651 109431 87542 27770 405129 72522 -5085 -169882 -352272 -306299
9760 -306299 -162488 -267216 -214578 71255 109500 425297 407457 701965 22162 -97257
9750 -97257 -7618 67722 224014 292756 180733 139060 271197 -164492 -215887 -259295 -57255
9739 -57255 14961 23623 117692 264662 237018 -1353 -109379 272474 387817 264426 217651
9728 217651 470062 122915 -31932 206105 52536 -53641 111988 -226036 -216031 181315
9718 181315 306920 389863 151521 -291214 -258657 -183168 182117 -110699 -329941 -180701
9708 -180701 -86558 -50790 5423 341165 214182 233468 -63107 -160713 60490 75327 285221
9697 285221 -16941 16751 34958 102796 197834 -66649 -132102 255510 435079 409005 315050
9686 315050 -178210 -116978 129919 70260 200056 360509 361867 454538 320370 292154 375857
9675 375857 436805 453997 533400 666650 406350 163964 361041 -114559 -122166 114900 248456
9664 248456 673423 490622 139428 440245 159131 107836 -138519 -86297 152299 196823
9654 196823 -34085 -91235 145682 205677 217298 242108 180660 72608 322963 423666 180656
9643 180656 304969 329831 27731 146785 12580 -5641 220022 226023 -333206 -14721
9633 -14721 44757 -28808 -340664 -30932 101994 -120848 -151111 -269493 213501 442419
9623 442419 473458 178467 27890 113984 311668 331662 33915 298738 525931 626929
9613 626929 460135 587273 410166 29326 41313 -108502 -194328 -144464 -31354 -38147 214692
9602 214692 366617 166946 234830 1512 -90330 166265 110942 218040 342155 376907
9592 376907 337206 161605 312845 78495 -228581 85422 423890 -71228 -286034 72523
9582 72523 182326 364550 208124 -331085 -304368 -118934 -2696 287576 7071 184219
9572 184219 -12411 -189842 -425158 -266700 164768 29093 -90172 -307477 -476576 -312806
9562 -312806 -348437 -143431 -22833 9495 -165850 -107161 -37067 -57732 -103859 143363 240295
9551 240295 381264 727193 466171 259493 182603 84534 124983 -127224 230836 432670
9541 432670 369584 76223 -8830 156296 20157 365228 84066 -522720 -577997 -124292
9531 -124292 -687 234805 425314 -147643 -46558 344391 172948 204477 304764 327561
9521 327561 539913 416756 494327 534516 374584 256039 233962 510196 500478 470251 387349
9510 387349 738706 572222 373947 320399 418054 294965 215272 430867 691405 572938
9500 572938 519846 496346 359855 153938 347654 524383 634082 728508 460482 459908 544699
9489 544699 217104 -7825 -133405 -149937 -82364 -52853 156605 -25163 99312 213619
9479 213619 119258 281100 155714 322128 549782 663670 705077 643194 252762 492705
9469 492705 533830 164729 40831 -11989 137518 484361 434471 364255 266313 317626 464128
9458 464128 613003 581420 340458 165224 59866 -145099 -110952 -289657 182368 411039
9448 411039 315025 764778 553710 362785 357461 370414 252321 239904 318248 428968 183463
9437 183463 291397 400346 494256 355306 278744 58464 279753 237753 57924 -95769
9427 -95769 243245 -75486 488394 466081 231791 1842 230545 230726 -59600 138386 253530
9416 253530 513080 424749 -44036 94449 422491 52665 158679 287759 40333 -123183
9406 -123183 115652 -44644 101009 603078 652557 606619 371166 527386 427220 256456
9396 256456 606418 304251 12940 -174582 -156754 91738 226848 637832 941501 738890
9386 738890 676844 957985 927280 488304 211985 390611 804109 546110 670756 794195
9376 794195 734012 560956 443571 309991 291331 374267 281838 -3957 61030 96287 175611
9365 175611 261611 567292 704026 574653 398110 472417 444548 797448 712924 975595
9355 975595 566875 374814 587785 317233 685345 1015896 627835 288371 76130 274160
9345 274160 799108 635659 450401 542795 274521 71775 644634 658742 191496 388967
9335 388967 514825 514564 739470 557098 690121 893164 1075610 989350 784074 917676
9325 917676 847131 673101 633350 768876 540984 302592 234832 276638 120964 653791
9315 653791 656327 536607 1080688 901853 1238388 1092324 786517 895017 906760 987233
9305 987233 800336 471235 106371 81403 493161 542991 507756 570309 1285687 1041943
9295 1041943 1066281 1020840 993740 1089600 920675 985317 1212083 1027885 1021712 758525 724928
9284 724928 992759 1073110 766785 763682 729516 726691 529613 692690 667398 626381 682605
9273 682605 748587 1043087 1117759 1064630 602646 508509 655172 947781 911480 1006195 1295963
9262 1295963 1124615 1033561 1299699 1188564 1400469 1252275 1119743 1001171 1227195 1105991
9252 1105991 745310 872732 782885 1010773 1191311 1490574 1775428 1626505 1870862 2160061
9242 2160061 1888832 1303485 1615702 1768779 1948665 1701179 1703060 1406727 1332550 1485028
9232 1485028 1630461 1269351 1473112 1478136 1108912 1259198 824795 1063718 1286106 1058831
9222 1058831 1344461 1376621 928725 1056368 1009618 1093787 1324376 1326757 1436537 1297876
9212 1297876 1019608 1070541 555228 1001680 971259 660113 872026 869428 864503 816484 783579
9201 783579 574860 723307 902450 883667 819415 872999 1110052 1033973 1126743 1294465 755640
9190 755640 935703 991613 1262681 1396491 1303853 1283169 827402 897722 629196 997971
9180 997971 1156403 1010892 1065061 1102350 1195886 1377998 1397999 1273201 1306379 927978 896071
9169 896071 1031399 1124995 903213 869004 998940 1159811 1177832 1239178 1048227 609474
9159 609474 886523 1023452 855432 1045075 1529503 1840441 1780070 1355306 1664758 1604761
9149 1604761 1216900 1242749 1226258 1204824 1251674 1091373 998932 821957 1119836 1598168
9139 1598168 1368043 1299993 1287632 1232801 1667191 1401994 1261242 1036255 1017393 1277738
9129 1277738 1517860 1381646 1286791 1251769 1674930 1672836 1306608 1672820 1605493 1389331
9119 1389331 1036222 1134774 1250802 1671857 1229445 1550326 1606430 1638970 1594056 1680341
9109 1680341 1831978 2068063 1802789 1501442 1561632 1547552 1574374 1301466 1571884 1875168
9099 1875168 1998739 2055094 2098353 1872620 1619699 1539592 1535706 1794385 1840914 1713691 1628934
9088 1628934 1588105 1527362 1341958 1455077 1372325 1461831 1432358 1470927 1379055 1421100 1250943
9077 1250943 980893 1292700 1250900 1494508 1270055 1012099 1061619 895003 1277564 1337912
9067 1337912 1352919 1331220 838967 1079542 911309 853251 1023045 858407 989044 761269
9057 761269 1094954 1273138 1185137 1086184 1124557 699640 937503 1127919 895170 985302
9047 985302 1102796 1074354 817979 976131 1026772 884655 1073863 1011372 904754 1098594
9037 1098594 925000 1000099 1074993 574573 692527 685061 667751 690310 785536 761858 998041
9026 998041 869115 895305 1010251 981315 1040216 1364868 1228001 877026 904572 1225039
9016 1225039 1489065 1418590 1486354 1467983 1249305 1140371 990939 1063518 1131946 902385
9006 902385 885714 994069 1529360 1202278 1476378 1500032 1408774 1103212 1301919 1585337
8996 1585337 1508209 1156139 1108063 1171246 1003159 735488 1151671 1634336 1785096 1408394
8986 1408394 1212669 1073520 804935 1040029 1900528 1980016 1261515 1401440 1674068 1664613
8976 1664613 1141277 1046094 1023740 1148751 1359763 1551521 1076828 1118536 1398850 1405661
8966 1405661 1583069 1357283 1342970 1366444 1474670 1304428 1156882 1447546 1327538 1298812
8956 1298812 1181012 1362121 1455610 1502236 1712093 1269339 1257431 1225585 1638298 1510052
8946 1510052 1066793 1614954 1506655 1344151 1221609 1259054 1421755 1564499 1722649 1391411
8936 1391411 1613679 1684664 1264203 1154476 1495380 1285399 1291048 1129557 999887 1369362
8926 1369362 1431818 1127490 1217020 1579786 1460020 1313342 1332278 1311493 1294565 1891316
8916 1891316 1592601 1784267 2243487 2318987 2216881 2290324 2202907 2268887 1886465 1973741
8906 1973741 2117844 1752296 1736504 1944892 1965437 1962995 2119507 2171729 2260507 2362553 2699282
8895 2699282 2605104 2348485 2314502 2246315 2471468 2155669 2474797 2222188 2226842 2400011
8885 2400011 2429889 2647796 2609923 2497730 2194861 2512483 2942836 2854980 2203269 2112374
8875 2112374 2309220 2560840 2214089 2574373 2765996 2737448 2798444 2865363 2721857 3133711
8865 3133711 2913330 2965584 3516484 3591515 3100427 2959886 2773726 2774182 3153457 2924112
8855 2924112 3081295 2911387 3115548 3835622 3549938 3281031 3147510 3454635 3496810 3762858
8845 3762858 4181813 3911506 3708975 3836491 4092766 4062362 4391935 4130461 4065621 4251541
8835 4251541 4315741 4130656 3998116 4043921 4067939 4460247 4137422 4576077 4999289 4985912
8825 4985912 4670721 4471938 4255802 4348711 4568041 4748077 4884365 5019115 5076110 4826193
8815 4826193 4981773 4624075 4395622 4673864 5414934 5241760 5322169 5247282 5150336 5439377
8805 5439377 5584588 5633855 6063467 5975476 5934118 6296815 6453094 6112811 6048666 6261631
8795 6261631 6769458 6730438 6817375 6764185 6912834 6946192 7110599 7279330 7348531 7384045 7437514
8784 7437514 7594795 7676242 7724597 7832851 7845300 8009756 8378426 8392976 8621200 8575306
8774 8575306 9004342 9173475 9087712 8960644 9265570 9490261 9439733 9533374 9553530 9931858
8764 9931858 10499155 10377807 10414164 10906130 11347878 11277464 11656175 11772955 11911530 12276873
8754 12276873 12707661 12962652 13109340 13656288 14106379 13892336 14311811 14948703 15305011
8745 15305011 15544300 15948345 15793575 16376538 16761424 17026523 17621170 18079798 18315429
8736 18315429 18569551 18821999 19330693 19784559 20663562 21242860 21822290 22637693 22878692
8727 22878692 24075792 24774380 25673816 26918185 28561985 29907346 30995380 32412082
8719 32412082 34979297 37503938 40773243 43710129 46660631 49358226 51100089 52626741
8711 52626741 53645742 53777469 53594493 52123507 49936268 46656030 43561220 41105647
8703 41105647 39035395 38056272 37273269 36751088 36917135 36681027 36459469 36795518 37487305
8694 37487305 38094939 38341677 38806735 39513329 40201211 40961088 41710346 42608059 43436378
8685 43436378 44350254 45803048 47276467 49050983 50461920 51379319 52593017 55127203
8677 55127203 56841257 58163648 59589493 61683235 63515190 65419807 68219986 71047997
8669 71047997 73496939 75928785 78912454 82241413 85088544 88567280 92257746 95678602
8661 95678602 99558902 103773765 107998736 112387307 116396326 120494715 124186850 128924531
8653 128924531 133161445 136833331 140125342 142778719 145480624 147320159 148558100 149484482
8645 149484482 149611159 149036312 147232972 144959539 142280088 138838312 135089198 130879733
8637 130879733 126300920 121800147 116969944 111805401 107569305 102654274 98191096 93918669
8629 93918669 90176043 86080887 82545275 78956734 75308579 72043270 68637809 65580003
8621 65580003 63339064 61053257 58469012 56302368 54451266 52293028 50357976 48558853
8613 48558853 46435130 45044483 43476328 42071526 40958682 39593308 38270917 36959052
8605 36959052 35836143 35276985 34416543 33503252 32445522 31986742 31504521 30432095 29481199
8596 29481199 28812880 28421464 27604512 26979018 25809061 25145524 24920247 24301837 23864455
8587 23864455 23025858 22420292 22083317 21582737 21084198 20106047 19457094 19462567 19413430 19023804
8577 19023804 18736748 18485701 17991143 17777828 17319125 16870234 16457183 15818034 15681269
8568 15681269 15763237 15642524 14993298 14777115 14491044 14114089 13947356 14176111 14095472 14169246
8558 14169246 13591695 13394741 13133943 13196698 13309269 12762728 12739719 12484421 11975621 11965076
8548 11965076 12338096 11938312 12070781 12431739 12229024 12199008 11765343 11241196 11462921 11681812
8538 11681812 11307651 11301955 11114225 10880694 10784518 10665554 10810115 10664525 10993271 11165393
8528 11165393 11176917 10905550 11284790 10832410 10644677 10884823 10880329 10534838 10395624 10450449
8518 10450449 10446441 10263259 10544224 10975648 10893098 10929374 10896339 11742289 11462160 10864124
8508 10864124 10907724 10961983 10820611 10481726 10611201 10759492 10729806 10543112 10917554 10475891
8498 10475891 10133651 10424289 10753892 10710310 10521150 10583027 11120577 11261975 10843573 10486196
8488 10486196 10909979 11428609 11353559 11584918 11511459 11536399 11790112 12248079 12185705 12258086
8478 12258086 12369141 11983301 12182448 12269329 11947892 11899782 12145012 12234996 12166544 11750425
8468 11750425 11761713 12254884 12475498 12257167 12387085 12287190 12163868 12171398 11841279 12143160
8458 12143160 12236355 12184048 12762345 12707996 12868546 13117452 13254394 13422863 13602693 13591855
8448 13591855 13378214 13660510 13968907 13884613 13636938 14239793 14705274 14425064 14182916 14113207
8438 14113207 13966079 14152343 14057638 14364444 14412249 14108257 13950920 14137986 13822385 14119218
8428 14119218 14405868 14446654 14452645 14714540 14954223 15548428 15935113 16177246 16166362 15906879
8418 15906879 16323760 16450681 16902840 17320074 17625011 17837731 18389575 18695709 19040891
8409 19040891 18875678 18888398 19644371 19812554 19639047 19667929 19943484 20352059 19909639 19868061
8399 19868061 20300124 20729963 21591068 21748149 21905259 22168404 22713377 23218295 23398226
8390 23398226 23795507 24442651 24939916 25258524 25927285 26503363 26699250 27016324 27751767
8381 27751767 28499696 28561692 29175148 29826197 30601984 31044615 31263142 31584184 32024498 32607928
8371 32607928 33671233 34791927 35586348 36317512 36984777 37500686 38025255 39221127 40305983
8362 40305983 41128446 42313369 43183179 43893827 45534970 47127705 48419887 49501862 50814165
8353 50814165 52025138 53385579 54894216 56099477 56973484 58531919 60485539 62082988
8345 62082988 63774237 65215096 66698913 68588348 70740169 73214568 75461196 78177824
8337 78177824 81307042 84449429 88323737 92877518 97814264 103837966 110684839 118146598
8329 118146598 125881145 132925299 139729700 145843787 151758624 157978758 164265559 170133219
8321 170133219 173980709 175133402 174384214 172625364 170834688 169785737 168243810 166706596
8313 166706596 163765482 159769961 156444244 153860133 152750632 152860159 154295910 156613644
8305 156613644 159519560 163648024 169214286 175745019 183221701 192331281 202977969 215671210
8297 215671210 229484839 244460120 260029153 276071288 291409428 306156899 321168561
8290 321168561 335036343 347926506 359129575 366759566 370540273 369890336 367270421 363807658
8282 363807658 359636512 355580685 350613780 345674174 341055077 337243248 335054753 335424335
8274 335424335 337331475 341175936 346262742 351729932 357848340 363440197 368432520 371986797
8266 371986797 373602146 373302212 371312759 369917440 369230461 368210406 366990624 365681673
8258 365681673 363679577 362339129 363286789 365886674 368480622 369206130 367410971 363086564
8250 363086564 358524765 356029361 354515900 353193173 351224549 348207922 346074632 347349358
8242 347349358 352607771 362001678 373998094 385853143 396921250 406669247 413442029 417757221
8234 417757221 419308338 416719980 409447180 396945595 379537088 358953936 336623718
8227 336623718 314496505 293339866 272979532 253179332 233334274 214971351 198209262
8220 198209262 182935091 169818052 158663260 149209781 140952967 133741258 126948276 122043770
8212 122043770 116837653 112292201 108411941 104711285 100884261 98052077 95163128 92451595
8204 92451595 89469827 87390849 85432561 83662854 81911718 80435484 79368269 77838890
8196 77838890 76797449 76869782 76309395 77792466 79111352 73073049 72179355 72170389 72177817 72293948
8186 72293948 72188693 71966421 72424065 72504326 72845404 73287181 73614377 74173317 74487812 75196343
8176 75196343 76320890 77528000 78429810 79482833 80700856 82071434 83075590 84510890
8168 84510890 86199798 88241323 90470567 92373042 94395578 97105559 99904087 103677053
8160 103677053 107331002 111793899 116874344 121937716 127944327 135791332 145194770 156662045
8152 156662045 168597802 181794044 195407491 208746308 221884589 232982519 243115209
8145 243115209 253644419 262903526 269105118 270413271 266282820 257222354 247823051 239426730
8137 239426730 231277089 222013363 209674197 196286577 184445182 174757811 168177664 163529445
8129 163529445 160140028 158240334 157985319 158630507 159849078 162623880 167040734 172699698
8121 172699698 180600896 189911420 201033892 214263092 228249442 242566246 256360550
8114 256360550 268309862 279178261 288732153 296204306 301527420 302668016 298612658 290427384
8106 290427384 280414456 267871732 253836799 238910386 224398172 210216118 195730501
8099 195730501 181450419 168535068 157168904 148009897 141052165 135652646 131590430 128201747
8091 128201747 125382538 123540427 122469297 122142416 123037263 124782470 126990244 130503102
8083 130503102 133764080 137467762 141265109 144669951 146840985 148961915 151174462 152529767
8075 152529767 152822943 150516974 146071603 140514293 135288851 130552108 125960192 120541551
8067 120541551 114504357 108360871 103064962 98543548 95372711 92549350 90993999 89856665
8059 89856665 88775530 88518522 88048781 87435586 87253775 88167373 88862447 89174247 89897478
8050 89897478 90918277 91608612 92706340 94583935 96966704 99004381 101006778 103880356
8042 103880356 106485343 109173635 112929681 116857014 121360202 126579345 131889523 138960942
8034 138960942 146907924 155641328 166525803 179896857 195476134 212941808 232369854
8027 232369854 253432753 274062547 292413227 308137350 321891186 334104749 344418820
8020 344418820 350568516 350892606 344385367 331950614 317192693 301562897 286357599 270345848
8012 270345848 253158067 235147752 217836648 201610754 187972369 177337175 169022158
8005 169022158 162477108 158078006 155011673 152863868 151924878 152444280 154150859 156876533
7997 156876533 161328256 167691433 176251567 186350729 198140614 211899695 226015286
7990 226015286 239496224 251391261 261423043 270307161 277130267 281116238 280941929 275049357
7982 275049357 264004847 250026644 234405711 218680330 202895834 186825866 169943910
7975 169943910 153129095 138142639 125246613 114220862 104962368 97480657 91334873
7968 91334873 85664539 81032430 76817631 73207365 69295585 65658363 62374451 59633337
7960 59633337 56822024 54117372 51752945 49552093 47275905 45497441 44270722 42383222
7952 42383222 40451979 39337937 37925959 36911109 35522799 34215492 33229603 32357092
7944 32357092 31660512 30469626 29932973 28939471 28039390 27097289 26389844 25632711 25233014
7935 25233014 24485521 24017053 23407287 22993469 22440147 22123999 21523491 20823997 20185668
7926 20185668 19620872 19079967 19137644 19039632 18762966 18449414 18061186 18115995 17555941 17257475
7916 17257475 17062473 17032732 16364426 16323585 16345570 16113889 15497006 15346295 15057854 15295345
7906 15295345 14848217 14353444 14143958 14013884 13674371 13825050 13916626 13640206 13688527 13255329
7896 13255329 12685273 12614012 12216169 12076694 12525729 12708383 12041978 11383252 11046028 11015501
7886 11015501 11286968 10976913 10842946 11047895 11125198 10636629 10675807 10321034 9914785 9856219
7876 9856219 10086876 9855382 10480314 10548918 10544613 10323229 9792454 9373432 9262083 8850472
7866 8850472 8887288 9025976 9132363 9086014 8833878 8311994 8082021 8067438 7757961 7363230
7856 7363230 7955692 7878067 7314260 7304818 7021944 7098138 7077148 7099013 7214603 6958922 6859615
7845 6859615 6511737 6115885 6003491 5419327 5762438 6054079 6043599 5863493 5536019 5858887
7835 5858887 5402816 5239738 5377995 5186896 4709718 4864789 4696346 4656936 4845667 4859578
7825 4859578 4640639 4727481 4966423 4683879 4785982 4525030 4779777 4744885 4585498 4631041
7815 4631041 4415403 4200378 4020320 4113801 4120594 3498785 3574439 3247758 3326297 1503868
7805 1503868 2443572 3776847 3920807 3989712 3799440 3892886 3425742 3243304 3037222 3071921
7795 3071921 3177539 3267793 3283929 3393131 2972056 3251145 3415517 3256105 3538125 3362260
7785 3362260 3859637 3958201 3797209 4046087 4191017 4090835 3715205 3677350 3816400 3738285
7775 3738285 3899470 3837466 3950704 3650992 3497628 3802558 3773196 3602299 3672912 3684876
7765 3684876 3469656 3823086 3361567 3429359 3506243 3421666 3591282 3449166 3235924 3230450
7755 3230450 3102424 3130809 2801213 2844402 2752317 3084752 3375367 3794011 4009872 4029430
7745 4029430 4127576 4075018 3804101 3946969 3564245 3738508 3892559 3854280 3820761 3876272
7735 3876272 3595950 3025492 3230230 3175533 3347020 3163621 3018936 2798816 2725730 2756990
7725 2756990 2784790 2624447 2915960 3010923 2981975 3105532 2966748 3035356 3084196 3385832
7715 3385832 3409815 3150187 3322989 3585461 3770781 3735529 3894312 4260475 3813418 3964156
7705 3964156 3574297 3235979 3647360 3077887 3088764 2851582 2826377 2763720 2856531 2625075
7695 2625075 2626777 2431031 2393699 2478935 2493183 2114369 2249201 2270130 2360035 2479320 2268646
7684 2268646 2512968 2478448 2759851 2527395 2444992 2212240 2247923 2427618 2289397 2244527
7674 2244527 2556210 2554053 2784442 2893888 2814249 3217599 3521483 3292972 3014245 3307638
7664 3307638 3677846 3795243 3674431 3372418 3460242 3583227 3454304 3253653 3305762 2826128
7654 2826128 2698743 2874744 2836048 2388790 2717965 2505326 1952171 2103205 2225735 2209289
7644 2209289 2015141 1853691 1941335 2277170 2015124 1849478 1385466 1699249 1838415 1884051
7634 1884051 2369489 1824110 1381015 1957038 2120486 2648893 2964062 2864786 3069401 2523875
7624 2523875 2182865 2812213 2500715 2416855 2370864 2061985 2135467 1915203 2021627 2027460
7614 2027460 1857183 1431830 1291308 1208291 1317654 1512266 1417271 1493604 1255093 825773
7604 825773 1015092 1078113 1191093 1229722 1190927 774354 651202 691093 484447 643711
7594 643711 662188 754005 596821 575485 479445 695025 1040286 858760 745589 802847 496647
7583 496647 674257 648836 605683 607849 457529 280616 610408 494974 41319 413955
7573 413955 483187 371495 537410 1102550 922602 890434 693393 668498 763190 382147
7563 382147 675314 421466 299418 867894 596622 648649 353620 296988 536113 860551
7553 860551 995136 479730 126107 285109 402693 166149 146033 55121 85368 378040
7543 378040 630181 37286 -59903 486384 519852 298786 28215 213958 770115 487448
7533 487448 308161 -20664 -131766 263707 52319 -185237 -504318 -535519 -345876 -67884
7523 -67884 223146 404171 347349 247563 398356 537391 602093 622074 542997 783730 420692
7512 420692 413085 426012 87248 -81500 53992 478131 453986 416971 379541 732705 671970
7501 671970 297679 23753 5640 -232184 195735 311388 371081 8457 442059 445085
7491 445085 609641 851721 396675 246358 305367 384851 -13640 37650 190995 439502
7481 439502 198621 369516 209311 238303 116544 133222 130899 151873 227443 443804 483065
7470 483065 428920 219991 266536 150293 369767 213299 368560 265502 -25451 265060
7460 265060 46350 31406 374103 244725 286485 439759 202611 -38652 -330997 144064
7450 144064 356999 310509 371403 756465 931533 711679 411420 418073 627072 721352 462712
7439 462712 450909 -25928 -103760 24867 204530 386850 402820 57237 510929 638832
7429 638832 169679 -245348 -473287 -197588 376454 197582 79327 93309 -156484 -485871
7419 -485871 -348331 154862 315028 352093 520176 386666 -14745 -59005 -123599 125701
7409 125701 80204 17026 184708 -23061 -115176 127843 -51152 80063 -104024 183364
7399 183364 225833 321225 150696 84653 353237 201114 -118737 -266327 -181264 -248058 115758
7388 115758 411993 153433 271061 221540 420275 602317 -41728 186860 359867 233923
7378 233923 308199 -55529 230231 617735 404593 648669 586712 688822 642708 299584
7368 299584 191241 200431 361417 229916 -153130 -91635 -190505 -279360 -84639 45562 34491
7357 34491 -332884 116437 30517 342184 466928 739028 521061 83606 104926 299952
7347 299952 238857 339237 223665 35209 18611 157231 -108510 -207666 -233908 99014
7337 99014 246985 78341 -214526 -210829 317787 287900 208279 484971 228573 47175 267907
7326 267907 41799 -646099 -756222 -225061 -95742 495243 343162 174750 -118286 -37796
7316 -37796 211670 488107 148288 315773 50020 127301 127640 290494 585856 726714 959210
7305 959210 609667 -162444 -251760 -259134 -82795 177211 366868 308264 -66598 -204378
7295 -204378 -205542 -183480 -304647 -260447 -126542 552066 405114 330834 219567 -81385 -83376
7284 -83376 35608 123712 72285 22124 286487 209201 29248 348669 55905 93530 -133712
7273 -133712 21610 -13487 220154 87563 450860 294345 -282581 -100827 187318 -91496
7263 -91496 -257802 -83319 -135038 136325 250775 109587 283130 333470 337508 -194900 -95256
7252 -95256 -89385 -202668 -142238 -361781 360240 540489 184812 91560 314727 43318 206883
7241 206883 341281 304790 -91540 121708 30794 -67490 -129616 -203395 -139805 -48231 420218
7230 420218 251033 -160052 134986 307670 248625 -113553 -223930 -303526 -249605 -210762
7220 -210762 -319722 -120910 -224868 -408984 -214944 -237338 -149461 -358599 139781 216474
7210 216474 84853 9277 -315142 -392786 -215992 -253109 -53410 -135671 -170963 -66916 -102292
7199 -102292 -331699 -293480 -433400 -517163 -569620 -156626 -31236 -275349 -189626 -23065
7189 -23065 -296915 -385100 -417970 -365264 359730 4851 91421 8222 -19405 -35957 -99217
7178 -99217 -121925 -14208 53902 -46034 -106297 -288908 -1481 -289383 -423495 -81924 116870
7167 116870 -251880 -364855 1756 -63994 -259203 -353569 -393407 -378423 -690323 -437679
7157 -437679 264332 64507 -302079 -536716 -218265 64513 -29041 -255121 -182113 -476683
7147 -476683 -161610 -214653 -59720 247977 267840 441237 418977 186044 -169068 -516837
7137 -516837 -447944 -596051 -133581 -147698 -55455 -319241 -111653 58100 185886 318477
7127 318477 176162 75248 -179464 62263 -66237 163131 -102848 -48112 -258732 -367211
7117 -367211 -226399 -11785 13783 -315739 -95989 -300434 -349537 -257082 -202984 -206103 -205284
7106 -205284 -197085 -79451 62760 -100062 -259934 -205791 -199110 -678636 -505344 -271674 264829
7095 264829 -809 88610 144115 -259119 -314329 -295682 -250831 357089 647114 426711 214048
7084 214048 11500 158073 -360957 -212403 -276382 -322611 -275866 -357287 -123567 -6729
7074 -6729 -65697 -156173 112849 190042 58484 69584 -91260 -355099 -408967 -517574 -357033
7063 -357033 -222776 -769685 -490983 -417917 -169668 -50812 -37962 -200073 -333711 -276101
7053 -276101 -142272 337606 42039 217416 -116203 -330313 -217953 -199554 -127973 250960
7043 250960 220673 10297 -62806 -355040 -353499 -517420 -429250 -369187 -86127 -169143 -396484
7032 -396484 -165146 -102908 -225922 51223 344038 190897 -185374 -150693 264497 -66607
7022 -66607 -214821 -478391 -404033 -277274 -491060 -408803 -430092 -37892 -20994 2689 -24689
7011 -24689 -126920 -229131 -201206 -189665 -225316 -530106 -645740 -152897 -192629 -696885 -606785
7000 -606785 -289965 -285270 -470698 -298827 -459121 -267929 129913 -435691 -286093 197650
6990 197650 123037 47005 5828 -328251 -317128 -731564 -870957 -732025 -494117 -449208 62099
6979 62099 502286 458535 78278 -72182 -297331 232637 181929 87205 -10704 11641 74992
6968 74992 403676 660278 302236 54068 -30062 87784 207890 -24097 10567 -18056
6958 -18056 -228318 -70195 -58001 -74863 -139225 -44484 -308947 -314010 114682 -523887 -741364
6947 -741364 -177169 98595 -9633 -94488 -12643 -101735 -101227 -721311 -488820 -270913 -481465
6936 -481465 -469214 -285378 -580459 -989800 -508659 -302011 -404333 -150121 -178614 -236948
6926 -236948 -531362 -269342 -303687 -253404 -517681 -297160 -163040 -85010 -350752 -450078
6916 -450078 -291491 -223159 83535 -339304 -354922 -7647 -170134 -226949 -41397 -274266
6906 -274266 -246224 -168285 -32621 -110241 223511 -36461 -356452 194171 44349 754355
6896 754355 523612 -283319 -371635 -202898 -621427 -905430 -645582 -95169 -313175 -273619
6886 -273619 142941 -67442 -360000 -347988 -79285 -48061 -193588 -254976 60084 -73283
6876 -73283 342907 797677 629904 371242 139463 177710 336892 331028 541399 186771
6866 186771 81360 228650 173301 100684 84151 -174659 12948 -1285 -307127 -248959 -539419
6855 -539419 -596652 -423280 -110401 -220973 -94260 -45680 -129704 -169485 -243009 -217568 -251536
6844 -251536 -323320 -128707 -161851 -374470 -78634 -110415 62744 69608 -134753 -137345 -251814
6833 -251814 -162469 -52158 -61003 -160884 -246639 -228576 -50296 -242840 -187604 -319490 -439237
6822 -439237 108880 143698 206756 271592 411811 -233744 -291249 48158 265789 67468
6812 67468 -295966 -193804 -22439 220709 -108082 -390136 -369440 9116 343625 18475
6802 18475 103735 108724 -4381 -75668 -62538 92920 332967 126526 -46360 48038 -160142
6791 -160142 -396341 -292187 53717 276466 293012 184996 13864 -251777 -131075 -143800
6781 -143800 -3241 -100227 -486781 30473 68994 72302 -185408 -393681 -616169 -274391
6771 -274391 -348257 -248136 -245213 -269436 -192353 -400231 157654 66397 -109536 -210647 -521120
6760 -521120 -593245 -586764 -438310 -171295 -505668 -437325 -1107 -76964 -170727 232714 59809
6749 59809 -117506 -399697 -407901 -424655 -559590 -614045 -347413 -586623 -748020 -599555 -995454
6738 -995454 -1352881 -634886 -342071 -464733 -359602 -239622 -210797 -338120 -151893 58979
6728 58979 69137 169757 -314300 -609712 -203541 -97397 92096 87050 121669 -214231 -139759
6717 -139759 -310533 -342378 -94966 -86453 -24521 33064 -312229 -347989 -270474 -181036 -202904
6706 -202904 -219218 486863 328536 35493 -175334 -209132 -296734 -463428 -469812 -311494 -160643
6695 -160643 -27775 -63332 101502 101223 -115994 -239780 57779 194949 157489 109831 -56451
6684 -56451 243224 227353 -108530 -381395 -113796 559 -456781 -209891 -58300 93621
6674 93621 167452 -198113 -260718 -417019 -126174 42277 96307 -361604 -479497 -238653
6664 -238653 -8591 291973 121643 39623 -51977 316736 -227576 -126753 -20778 -54690
6654 -54690 -200036 -81758 -114408 -31009 -135907 -88891 -249538 -378924 83651 -180317
6644 -180317 -295301 -261534 -65891 -142176 -102142 -492709 -166383 409197 408962 -120129 76706
6633 76706 47589 -158374 -122530 -172068 -323526 -165253 -462332 -843388 -766966 -467392 -158960
6622 -158960 -48595 -245645 -370799 -390853 -410659 -300720 -182413 -143380 98730 143937
6612 143937 -154524 -177185 -298438 -581029 -364101 -276130 -60477 -294761 -393175 171136
6602 171136 319511 -147512 -219599 -246678 -290612 -452924 -336933 -190308 -160142 100692
6592 100692 -386552 -468462 -160036 -75875 -367305 -111312 -257313 -453933 -120452 -159615
6582 -159615 -439397 -456700 -528414 -444337 -353615 -257812 -122415 -119229 -15508 -296434 -154825
6571 -154825 35044 -182356 -37634 -314064 107062 -60290 -459474 -333463 -317090 -308265
6561 -308265 -207916 -187202 -109649 -327752 -299348 32129 220337 135504 -134603 -215731 -393816
6550 -393816 -452739 -635040 -323980 -483234 -350954 -260448 -402852 -16142 -46549 -158219
6540 -158219 -225339 -402896 -603139 -330394 -186241 -82373 58601 109209 -84161 17968
6530 17968 30522 -147910 -78358 -279958 -244000 -129343 -177709 -115758 -270418 -207291 386731
6519 386731 103423 24987 163499 -49847 -312069 -330514 92646 197222 274469 401276
6509 401276 253712 10014 -271845 -227005 -172771 -35974 -123783 -572948 -309898 -219371
6499 -219371 -225914 -180726 -474142 -485056 -491517 -169667 -307608 -332563 -144160 -178756 -342804
6488 -342804 -520075 -325793 163985 263121 -116856 -246083 -668766 -600108 -44921 -193089
6478 -193089 -321401 -387625 -160451 -247031 -102979 223848 -111116 -185549 -44902 -369716
6468 -369716 -597353 -588322 -287943 100344 -55842 -56429 -50135 -147461 -316037 -319802 -321125 -456360
6456 -456360 -100805 257692 19428 -118294 -447876 -258360 -228256 -679048 -379346 -580608
6446 -580608 -469254 -262027 -73637 -25557 -551030 -667191 -448278 150551 169416 -341383
6436 -341383 -420249 -118397 -418672 -93549 -7316 98080 -169918 -669392 -363717 -391141
6426 -391141 -536449 -483104 -420110 -428550 -239698 -220626 226904 -96283 -347337 -323405 -737922
6415 -737922 -696689 -369203 83590 -101179 -23845 98682 -468243 -207739 272347 160511
6405 160511 -33836 -518046 -540874 -446259 -122416 -348712 -488396 -448213 -80707 291250
6395 291250 138255 -241661 136898 218329 47735 161526 83044 52145 -80857 -212491
6385 -212491 -132472 -96019 -51375 -306418 -118895 23177 -345389 -400637 -568106 -412079
6375 -412079 -653151 -423131 -550907 -438537 -17971 60610 -286323 -518166 -528024 -420165
6365 -420165 -483519 -144235 116733 -31897 -152462 73204 182967 15429 -186258 98419
6355 98419 40225 -18289 -163470 65444 190046 -145961 64313 56872 -355140 -460054 -259341
6344 -259341 -97871 -41535 64794 314437 47462 -118176 -279308 16002 -243667 -369163
6334 -369163 -541492 -353050 -332995 -368405 -182428 -243089 -40848 2929 -383372 -515250
6324 -515250 -282426 -489589 -486718 -459087 -596612 -369164 -123099 -107326 -205747 -316606 -87212
6313 -87212 43828 -275848 -51653 -233649 -443976 -459348 -685080 -468151 -441819 -539485
6303 -539485 -615107 -474206 -294750 -70704 -189429 -73384 -20035 -168437 -254176 -307999
6293 -307999 -249141 -102513 -44276 -299226 -520412 -222668 -195124 -69195 86811 72739
6283 72739 -259990 -178816 -344184 -412401 -314839 -324751 -103380 62348 -228210 -396724 -289567
6272 -289567 -232733 -315908 -170770 -64408 -124295 -420451 -380543 -645955 -736363 -218274 -259216
6261 -259216 -540448 -608971 -549625 -480388 -63621 -165979 36893 -313118 -474159 -431370
6251 -431370 -174787 -583236 -271866 93501 -272788 -202452 -48877 50478 442467 89315
6241 89315 -270556 -253517 -270737 -205136 -492541 -268500 42928 -226763 -473104 -132095
6231 -132095 -447117 -34498 -83086 -84395 -213819 -70189 394908 149241 332573 203351
6221 203351 294478 -253817 -125795 23380 -3989 -165579 -507626 -225785 -213891 231102
6211 231102 265150 200632 450628 -142609 -574266 -687688 -894912 -132542 -38432 -237524
6201 -237524 -31812 -97775 297057 -8233 -209129 -73389 -109540 -545073 -249562 10563
6191 10563 -55738 158067 29578 -416291 -103855 95147 -6291 -96180 -123753 -461147
6181 -461147 -278847 -292527 -418073 -517755 -368886 -232119 -121327 -244650 -237014 -105608
6171 -105608 231960 205534 -83764 -82271 -265055 203545 9287 433240 199493 188504
6161 188504 319886 -17091 -375685 -430044 -87469 115673 143171 5101 24197 297041
6151 297041 482724 363340 -114606 199814 570571 362629 216229 226742 68350 83596
6141 83596 84484 293977 -205312 -618715 -543063 -381682 -143172 -71284 -344965 37016 240929
6130 240929 -130127 -417923 -603946 -627681 -440152 -280057 -69852 13230 37905 -15579
6120 -15579 -108275 -272454 -301275 -637039 -784825 -681456 -496321 -82435 -187616 -497112
6110 -497112 -457099 -132932 152736 229776 -9298 -352593 -594890 -601830 -703594 -429303
6100 -429303 -703579 -541690 -209427 -382484 -836631 -775400 -469445 -615407 -661351 -586196
6090 -586196 -510524 -437591 -122744 71286 -216778 -267095 -43571 253876 152047 291154
6080 291154 -3773 -343265 -601110 -637601 -671422 -459420 -209474 -303233 146415 -232871
6070 -232871 -536954 -332826 -308762 236068 -144489 -467758 -459962 -245754 -200539 -237557 -237893
6059 -237893 238928 589081 319219 173855 60489 61723 86876 176036 18522 147006
6049 147006 -228174 -226020 -853647 -557740 -638414 -441317 -37129 -249813 -87604 49043
6039 49043 -11699 -376540 -270507 -266313 -19964 3117 44766 -397587 -529020 -483640 -80168
6028 -80168 181612 -430965 -189061 -296412 -469954 -307926 -193495 -388652 -383602 -463223
6018 -463223 -475184 -292554 -162851 -138183 -233585 -181407 -441445 -377354 -289401 -342984 -152779
6007 -152779 -112410 170141 -90458 -73131 -136558 -575434 -823736 -531051 -223895 -159436
5997 -159436 -332380 -367967 -1566 -245346 189287 424279 218351 41946 -260758 -622674
5987 -622674 -329236 -678281 -409209 238744 -142607 203847 171369 -148571 -206238 -435139
5977 -435139 19951 -62562 -573024 -182602 -269396 -633638 -341992 -312555 -360386 -499185
5967 -499185 -504654 -863334 -591820 -300725 -437895 -596751 79482 166045 -58602 -4612
5957 -4612 286611 626 421373 312550 -186121 -250282 -59494 -44072 -353828 -434570 -312875
5946 -312875 -367830 -728860 -320355 -133136 55743 90318 -234640 -372956 -565494 -195167
5936 -195167 102460 50728 117298 -286049 -414667 -516586 -361684 -346457 23463 -341451
5926 -341451 -182471 -70485 887 -4218 -173824 -248881 169594 530903 -273967 -614782
5916 -614782 -111436 -277916 -341060 -325641 50626 67948 -136410 -105358 56918 -403807
5906 -403807 -397020 -338596 -468401 -544441 -407190 -508923 -191391 -74914 -115236 451414 205789
5895 205789 -24155 -296731 -127176 -92449 -236853 -536596 -519868 -558990 52459 17340
5885 17340 -129162 -530197 -322169 190572 55583 -68569 -43975 187706 -258775 -296902
5875 -296902 -281794 -286950 -380495 -412366 -620442 -782194 -834853 -720632 -264824 -140302 -220040
5864 -220040 -112512 -327760 -417405 -53305 2467 -72759 214519 10239 -348104 -325792
5854 -325792 55906 -41325 -541557 -645258 -409738 -232250 -228978 -95882 -248184 -516122
5844 -516122 -110810 -11287 -40553 -453162 -652626 -560413 -551475 -501833 -177806 -102551 -212934
5833 -212934 -157949 3279 204922 46915 -14206 -309684 -331188 -135359 -702470 -890528
5823 -890528 -506632 -495629 -298707 -389432 -842688 -672754 -317992 -558913 -332088 -488517
5813 -488517 -501278 -102827 195499 -339415 -350365 234381 278248 85796 -356033 -503497
5803 -503497 -536164 -55693 83045 -374878 -782578 -559373 -199815 -488347 -335349 -112935
5793 -112935 -212658 -524986 -490697 -580816 -279982 -314785 -484734 -166122 117941 -148670
5783 -148670 -366628 -221939 -438274 -471743 -89897 -188959 -166451 -580655 -57938 -97174
5773 -97174 63776 122602 -150051 39987 -140960 -56365 -81761 -37510 33649 -144694 -654163
5762 -654163 -502836 -420959 -32364 151692 -384257 -271428 -209546 -595837 -506054 -397086
5752 -397086 -370924 -474573 -679729 -627951 -513248 -624263 -604020 -437761 -133301 -83190
5742 -83190 -383352 -795630 -366455 -227774 -341528 -273157 -349218 -389558 -368377 -325743 -598480
5731 -598480 -678247 -628470 -304971 -145061 -101692 19581 48128 -143546 -302530 -453799
5721 -453799 -219994 90487 -469542 -650356 -481542 -480516 -450140 -579355 -387757 -437241
5711 -437241 -107779 2341 -10058 377561 11156 -219323 -200944 -49497 -238130 -400668
5701 -400668 -227078 265130 -150565 -141454 189303 -36233 112377 105825 -86552 -275280
5691 -275280 -572763 -71088 -54411 -146690 162122 -116263 -188471 -181698 -331759 -459971 -480670
5680 -480670 37868 -33731 -172780 27823 -158150 -312327 -102613 85483 -331239 -267532
5670 -267532 -9069 -183311 -263633 -81604 -171253 -428716 -224336 -354017 -180218 -734703
5660 -734703 -803906 -383174 37376 -57058 -419571 -378774 50507 -61468 -265089 -286981
5650 -286981 -270516 -417159 -314403 -92285 43542 188833 -257090 -659851 -389359 170709
5640 170709 -178019 -478916 -463953 -191746 68471 -204422 -340032 -70763 -388777 -495559
5630 -495559 -430308 -473841 -696989 -573397 -611413 -271960 -73564 119969 -124988 -286331
5620 -286331 -156159 -153732 -407960 -354982 -555340 -820615 -654287 -555890 -903655 -712673
5610 -712673 -329672 -442844 -507475 -598974 -336355 13934 -209121 -473074 -594308 -776643
5600 -776643 -906431 -842260 -507142 -458657 -348907 -216646 -12352 26679 -106224 -210110
5590 -210110 -101354 -150207 -142181 -218843 -213036 -117051 -206859 -290154 -266659 -503510 -316111
5579 -316111 49612 -493534 -198163 11887 -38885 -25566 -396048 -191556 -34098 241381
5569 241381 183444 -127910 -8605 -124097 -45808 75912 408897 339976 44340 -156114
5559 -156114 -133224 -121197 -226750 -426863 -230521 -76412 209659 174248 84867 -193640
5549 -193640 -590745 -468768 -122785 -277390 -247094 24708 3383 248682 81293 127483
5539 127483 184902 181841 -337485 -631826 -137283 -94025 -201347 -249606 -147587 -174858 226895
5528 226895 488504 399521 18029 -222839 -327037 -456420 -378025 -213911 -34374 -186166
5518 -186166 87698 -292653 -570034 -434317 -347318 -723745 -66352 -12614 -71365 118649
5508 118649 28634 193935 26764 -233632 -68380 14121 142636 288843 -493934 -255262
5498 -255262 -290689 -886129 -695126 -176911 -319356 -227414 71545 -93340 -74880 43288
5488 43288 106293 -99954 -90770 -36869 -132984 -558734 -295837 67926 144631 348109 409895
5477 409895 333818 453371 219444 -298420 -499890 -127570 18130 -127647 214546 303377
5467 303377 -172683 144990 43107 -96267 -330099 90823 292938 289913 339367 356945
5457 356945 28843 -245521 -295780 -112270 116270 -354334 -90608 -76237 90055 245295
5447 245295 -322901 -532473 -557933 -509103 -168225 -46092 421179 404605 -95546 -708169
5437 -708169 -136491 -77448 -309460 -118433 -75459 -43280 -39509 -4644 248748 233329 -144582
5426 -144582 72487 239006 159109 253381 333132 -364487 -477593 16676 -43456 21805 -156619
5415 -156619 -169403 229907 164578 -304297 162172 490822 123750 228159 -44408 -408835
5405 -408835 -241957 -306505 -174215 -34362 -129140 -169411 -4 296880 368461 113949
5395 113949 -183633 27616 -171684 -195269 -314757 -589671 -295005 -263126 -132591 -318493
5385 -318493 -393370 -528587 -617895 -119436 125790 79502 340433 -6982 -7955 85884 3804
5374 3804 -465148 -186476 480931 462889 249102 -68577 -36400 155287 400189 -30925
5364 -30925 -472121 -408063 -241706 -228736 -473897 -281133 -192696 -165070 23125 -192493 -84425
5353 -84425 -241733 -336284 -143243 138607 43036 2267 77181 -397190 210657 357694 89590
5342 89590 75647 59955 108343 119237 -302413 -78973 134407 -373254 -809998 -468352 -126625
5331 -126625 174983 49512 39765 189259 -88138 -215006 134812 156028 -98608 142245
5321 142245 -150832 -175765 -172769 164499 -64675 -350466 -123206 -168891 -379346 -207281
5311 -207281 -444254 -210077 -187377 51195 119806 360748 -209415 -259025 -435145 -447309
5301 -447309 -446905 -186812 -307861 -410235 227753 285217 118194 -68858 -235118 22795
5291 22795 -7975 169618 -282277 -263029 511366 528751 58842 -392452 -69277 -93134 212380
5280 212380 320692 581084 459660 422796 254843 230450 514844 253980 -341129 -193585
5270 -193585 -131482 58523 102415 298509 -2484 -403188 -362407 -216557 288656 260501
5260 260501 60195 190163 142353 289952 185368 99956 539161 225164 222381 549900
5250 549900 99518 -443131 -142461 -99866 -630355 -620357 -355317 -9399 4502 60634 132777
5239 132777 586174 584867 445342 398348 363995 -158657 -48995 203746 292615 697696 202365
5228 202365 68278 334057 504732 443262 -108678 -52707 277164 356930 -163038 -149259
5218 -149259 -304171 -185422 371276 417163 222207 25360 147066 380611 671122 562748
5208 562748 354682 -81664 -122091 -25835 251559 -4703 -367221 56193 34024 256348
5198 256348 678371 561061 164094 146157 274750 67470 -299251 -63335 324111 100203
5188 100203 -232260 -69376 668506 476501 249583 569561 742672 777179 822639 317872
5178 317872 65036 69474 -141736 196421 280684 210566 138781 74045 280666 50000 237959
5167 237959 617618 475205 113545 27888 -217416 70982 158192 253740 57713 62927 -160084
5156 -160084 54553 387621 210244 79832 339885 494960 524833 447709 230166 -124181
5146 -124181 -31911 -64562 77497 284068 68407 -136761 105961 -36759 173683 249685
5136 249685 78999 274757 -81036 352359 443452 290711 152852 205427 54693 -96475
5126 -96475 398812 567728 289046 357846 684203 574381 168897 119095 -151707 331679
5116 331679 281383 369342 137509 99429 277915 233643 56960 -58669 166218 72689 -120110
5105 -120110 -19087 150450 222647 69196 -84032 -325056 -90951 517351 109773 238092
5095 238092 614701 494090 478438 454875 535464 856054 769609 385958 446542 21045 -249446
5084 -249446 -89393 69598 98651 438189 290499 -98833 -185323 -110293 283321 266266
5074 266266 121376 446518 505622 542101 371512 217043 809517 606302 -270482 249841
5064 249841 542507 538599 656132 383098 576446 727382 619395 333788 260058 349650
5054 349650 367985 471359 206258 305296 131145 -16596 -73352 -42984 -22138 134945 -103549
5043 -103549 -294840 -512819 -449415 -97378 81105 -40769 -238560 -11090 766015 710977
5033 710977 128263 -40814 -170688 -82463 -243178 -75589 107572 188730 -340000 -131881
5023 -131881 -105642 -58138 -269664 -389820 -16025 -300681 -289314 575568 671403 468139
5013 468139 101373 230525 147485 477019 61027 17603 147129 258233 217841 -134542
5003 -134542 -11187 251343 126292 137029 301716 276099 187275 -109361 -287538 -14846
4993 -14846 54008 342069 506453 196185 -73439 -160756 -17353 67642 -127209 455661
4983 455661 585262 573727 684957 515345 375880 237215 180559 -167800 -107101 132931
4973 132931 -315258 -57488 453025 215096 652090 454842 331816 359779 381833 527091
4963 527091 715452 166709 144844 -840 231231 233841 156363 -75883 202052 356937
4953 356937 2811 -23479 169629 244047 367243 645397 497705 7646 -252174 117693
4943 117693 470113 835219 638186 93526 -98064 477899 744165 665385 435019 112780
4933 112780 -166785 -213365 -257054 -248494 151255 347642 210656 -3256 167023 316128
4923 316128 217551 -349404 -263709 34272 221061 192297 59758 271809 137952 101132
4913 101132 366943 288119 -223895 -48426 188085 32106 346459 461301 324447 287409
4903 287409 277297 389392 94176 35387 67736 -190276 -344892 236728 522530 93576
4893 93576 535804 585516 386432 247383 354309 406515 462723 346661 481865 -21911
4883 -21911 -167163 62861 310128 109506 376835 459077 153729 139264 49194 454529
4873 454529 448800 -7977 -147444 345871 461088 131079 278196 233203 246216 50636
4863 50636 -149503 113088 -30199 273975 423027 363770 279391 382105 525131 455683
4853 455683 63628 232553 281834 235385 -7429 97091 -72894 82095 36793 517254
4843 517254 607683 594207 423201 165303 227317 479670 895351 652599 428402 130364
4833 130364 244827 171473 -35819 137868 203446 859457 1142759 317663 278602 633388
4823 633388 621569 652871 612548 339466 298319 8229 292586 469228 339481 272113 660679
4812 660679 923733 450851 238923 627715 690830 374700 927810 821262 823437 765797
4802 765797 669129 913148 1169884 962237 885785 971589 610270 633149 890307 689384
4792 689384 822307 712560 705969 739666 508360 414560 379069 195708 242583 684612 750187
4781 750187 717264 904876 799997 593162 550092 692270 1125953 1296254 1244959 693130
4771 693130 705578 761387 747958 969508 1034512 558221 723025 647196 832176 1219524 1145912
4760 1145912 931224 596532 650546 813586 815704 760188 483762 896199 1350876 1342249 1296503
4749 1296503 1216359 1316172 1503038 1376615 1361252 888497 1017339 1740161 1449519 1351992
4739 1351992 985589 1159433 1999893 1927225 1581696 1637195 1961902 1529358 1445576 1564244
4729 1564244 1431845 1603685 1786786 1886993 1772184 1792533 1779522 1831014 2165292 1699657
4719 1699657 1517060 1727645 1947826 1885480 1847952 2016013 2091496 1996369 2273850 2335295
4709 2335295 2293030 2627224 2214486 1981075 2193428 2599560 2413878 2406816 2904778 2878332
4699 2878332 2582040 2624431 2515514 2314403 2279335 2973269 2675671 2695351 2773328 3325596
4689 3325596 3357628 3461157 3263469 3044386 3420326 3251940 3172313 3250565 3257296 3500412
4679 3500412 3779037 4095947 3936885 4008094 3897118 3753365 3624463 3729679 4501364 4759072
4669 4759072 4660838 4692795 4800817 4771712 4943390 4762561 5135604 5475682 5406214 5989099
4659 5989099 6274577 6753626 7618837 8203249 9089434 9210856 9105015 9240662 9438907 9682279
4649 9682279 10097883 9898012 9410379 9091231 8818720 8336312 7737083 7551800 7639923 7368693
4639 7368693 7522812 7645357 7254936 7158331 7331139 6906430 6922719 6884252 7319902 7607792
4629 7607792 7526798 7457743 7937239 7796832 8124999 7898472 8200858 8481353 8616204 8543444
4619 8543444 8023472 8162083 8458833 8549273 8602596 9148155 9287541 9225492 9569946 9986892
4609 9986892 9943176 10245772 10440437 11151579 11435192 11173060 11246960 11620102 12293320 12843226
4599 12843226 12803505 12917156 13265151 13397059 13697962 14329664 14433549 14926080 15870479 16388303
4589 16388303 17042672 17677129 18188089 19171878 19752295 20646086 21169576 21803761 22514507
4580 22514507 23126108 24084990 24859073 24878097 24935248 25569874 25547207 25707500 26190308 26203766
4570 26203766 26796976 27222439 27800782 28294084 28233501 28860930 29438180 30086436 30902208 31560143
4560 31560143 32324114 32832885 33609233 34696754 35549464 36121434 37457077 38160761 38633904
4551 38633904 39525968 40612995 41222484 41777736 42205564 42271454 42366486 42482156 42686274 43334722
4541 43334722 42852784 42522049 42271649 42203057 41821918 40894158 40255829 39467841 39016065 38418487
4531 38418487 37520866 36625803 35661883 34478791 33508682 32624194 32265123 31530452 30588061
4522 30588061 29471825 28456734 27394664 26580662 25664839 24709411 23875270 23251943 22553283
4513 22553283 21768507 21232476 20508613 20228378 19573277 18411695 17983815 17477712 17062666
4504 17062666 16596736 16031001 15525487 15351121 14828115 14629713 14345286 13666343 13187624
4495 13187624 12673222 12328650 12440458 12329876 12014233 11565644 10663986 10749741 10656012 10238454
4485 10238454 9827388 9567941 9439040 8708561 8662882 8281035 8096489 8270962 7923959 7691811
4475 7691811 7849102 7427044 7056595 6954198 6929245 6556660 6447832 6408308 6242671 6182619
4465 6182619 6274687 6186055 6055222 5812180 5653560 5582508 5280654 5435200 5964155 5749107
4455 5749107 5547689 5608477 5193509 4639729 4801306 4578967 4920875 5018658 4671184 4988290
4445 4988290 4932066 4937616 4444218 3944320 3959055 4375482 4390005 4183210 3999205 3953510 3367302
4434 3367302 3356716 3683325 3603992 3232038 3395921 3556130 3537273 3127608 2827408 2591133
4424 2591133 2772238 2898112 3239246 2979976 2871315 3387513 3148131 2958507 2758187 3110238
4414 3110238 3283049 3065911 3204933 3165070 2951928 2630043 2674464 2759876 2638329 2705997
4404 2705997 2735138 2806109 2926469 2561906 2994521 2705081 2645801 2909125 2874953 3121590
4394 3121590 3002339 2598634 2757151 2966641 2807666 2623586 2304448 2604509 2749003 3128622
4384 3128622 2494447 2652064 2596742 2672125 3348161 2904908 2611579 2860941 2608438 2648530
4374 2648530 2621319 3009351 2775082 2705776 2393792 2499161 2453668 2664039 2632257 2765932
4364 2765932 2857261 2811520 2855083 2729933 2982890 3020286 3325387 3355273 3444173 3428044 3481438
4353 3481438 2790445 3510675 3797849 4066361 4203005 4326966 3765786 3746902 3929799 4264724
4343 4264724 4548788 4608954 4246591 4448945 5161452 5317498 5422422 5515769 5822976 6532779
4333 6532779 6816912 6950514 7684963 7988074 8130574 8596782 9231173 9607698 10290134 11147649
4323 11147649 11560381 11766920 12316445 13222198 13802700 14046802 14322373 15042204 15451633
4314 15451633 15570633 16024262 16138273 16522857 16460762 16902373 16765009 16577945 16257969 16148584
4304 16148584 16205753 15552128 14439686 13501890 12882527 12468284 12155311 12047095 11613504
4295 11613504 11010535 10349081 9641414 9016052 8528961 7744491 7165562 7119881 6925000 6478865
4285 6478865 5554427 4772122 4685246 4419257 4016261 4037763 3584894 3795786 3807002 3140235
4275 3140235 2579355 2648350 2631618 3066535 3094521 2619008 2582544 2271758 2140763 2509593
4265 2509593 2204693 1908190 2268230 2112336 1948208 1972272 2146225 1956670 1875457 1693042
4255 1693042 1504624 1221218 1335476 1499539 1488421 1847089 1657175 1311562 1111452 1084175
4245 1084175 1219251 1060375 1230721 1689693 1456485 1407078 1154570 1280206 1339726 1164274
4235 1164274 1052401 1102527 964918 1020624 1216242 987278 1024276 1018855 991567 807389 629508
4224 629508 1021242 1384247 1132055 1034465 788504 676763 472252 314151 729767 516453
4214 516453 40461 465098 890379 1184706 811029 629081 840015 1117572 771579 757822
4204 757822 913219 766724 884699 658823 904583 613268 463811 511898 460529 644249
4194 644249 658155 465862 499198 464520 741541 839081 387861 688210 957513 691654
4184 691654 943122 1140637 992333 938057 919946 733233 793486 898040 584141 354739
4174 354739 811576 650695 261239 596172 597339 673973 756822 755810 231794 310589 381595
4163 381595 683831 494437 881476 782135 455173 343788 329236 361593 357447 479326 295404
4152 295404 503984 347479 338053 420833 423570 714775 734426 414700 550406 567869 887111
4141 887111 921252 804013 603000 481953 322347 -5714 101396 465203 620078 300265
4131 300265 423129 959643 779348 551071 289829 269730 139746 566284 317992 134532
4121 134532 169993 418197 784138 405918 201911 14368 163923 418526 296211 263366
4111 263366 582199 553515 261132 396289 550122 402119 253733 197526 365977 126780
4101 126780 189735 387204 391811 350056 434698 179829 -86449 -3681 239365 267513 79834
4090 79834 314495 254459 -244299 105918 255681 326405 139880 28941 444267 220259
4080 220259 256846 -27762 73660 24466 -31818 183194 598403 204199 53974 219672
4070 219672 364388 338218 666899 283217 520803 591113 533474 575452 291346 -135983
4060 -135983 -170640 398101 411823 433190 378626 358021 360510 503741 375787 393366 384238
4049 384238 86347 135399 506642 592251 581433 532862 341583 222200 208484 475483 507354
4038 507354 509992 381459 57739 389002 550158 678174 560647 697656 640201 668845
4028 668845 686890 936074 666327 620639 601461 898098 868151 821174 651720 452738 329438
4017 329438 719770 316735 817461 786547 827781 618384 578483 493793 330768 460577
4007 460577 163487 196171 469435 669509 859443 600533 337929 773981 347099 354819
3997 354819 195026 54223 458021 244778 302639 432250 721724 1042306 687470 269364
3987 269364 381185 822014 519570 689259 601942 702808 431739 512063 422918 623112
3977 623112 744177 532865 597693 411703 570971 728321 753894 888593 1083093 894978
3967 894978 284399 305426 302808 381890 330958 96504 266887 313882 240619 310462 405120
3956 405120 651515 733291 361053 296418 709188 465515 532228 793349 1080519 845250
3946 845250 385748 -125058 176296 232832 654437 718310 693095 958291 761217 854937
3936 854937 465047 516406 1078828 894091 1237836 973937 570805 466797 403456 401958
3926 401958 566259 769283 926755 646043 303094 901245 900638 979141 1031661 840439 707810
3915 707810 762748 765110 1279349 1453546 1065588 890196 1099731 585605 902520 1206785
3905 1206785 880197 584363 339503 478594 866756 834064 387600 384594 674614 655296
3895 655296 284608 -186006 498841 1065930 524797 424517 575935 380550 345488 199912
3885 199912 358421 415277 157020 -133985 305252 196470 -79389 303062 403396 215511
3875 215511 216828 104932 155660 832072 628505 166562 -51562 -23464 414599 276920
3865 276920 32160 622365 386289 328907 108624 113741 159948 174089 414609 831791 1107960
3854 1107960 1020689 737046 908465 853295 322014 515287 682083 827069 632671 238620
3844 238620 64239 799787 868951 138993 -63167 154520 254738 68902 472135 667996
3834 667996 448338 433591 116635 222223 412843 393671 636933 517781 629530 380937
3824 380937 350239 606721 525687 959065 695465 280024 112426 -186698 -279637 -76513
3814 -76513 -96392 258697 636591 597673 789177 689470 310314 567574 631250 574386 472760
3803 472760 374357 152581 519611 374451 223768 254592 445 164321 312105 292045
3793 292045 33572 -21095 175721 222002 63819 -22902 286069 782005 458016 156422
3783 156422 89599 246216 -101329 40786 189443 -14263 83038 184634 419333 494984
3773 494984 166776 469455 311989 167663 9856 -20383 -172805 40061 172395 -24500
3763 -24500 421634 371098 57263 -217462 -222586 -139649 141128 470131 819423 643608 422311
3752 422311 243385 361485 517059 532189 140373 -133324 -63409 -20277 198648 25999
3742 25999 -28758 235460 515783 542685 339836 -237970 -586163 -327502 -69146 155581
3732 155581 88084 184033 110073 64342 -131209 -15189 -149548 -24894 340542 -34926
3722 -34926 9804 9249 82487 -223905 20168 293518 28202 -82069 339882 326627 -48442
3711 -48442 -102486 471491 655236 243400 360184 726278 432329 134392 76736 -216889
3701 -216889 123838 233844 223515 -122952 -112243 189221 142809 272178 415452 257912
3691 257912 202212 51395 -103315 -342965 -267286 -83344 -243211 -154012 -112250 -233815
3681 -233815 -184970 -34358 -156268 -259433 -244785 -51950 -15706 -39233 174929 56085
3671 56085 202657 398154 -138998 -308640 51080 169560 -157745 -166311 133635 428335
3661 428335 690682 551485 96100 9177 166121 154826 -341522 -181996 115848 232194
3651 232194 94885 196196 -48317 -345760 -432014 -363864 -332973 -156837 57805 21996
3641 21996 -43490 -234373 2104 15354 -295428 -337439 -115791 -258012 383713 403011 535238
3630 535238 437795 627918 188836 -238417 -354230 142117 382869 43486 -171246 -139842
3620 -139842 -54771 -96809 -151367 -153566 -90800 -189166 -134976 -339360 -126942 -468149 -245639
3609 -245639 145317 210281 166286 53814 165494 200435 510033 178948 -85643 304091
3599 304091 375321 502719 233025 301238 564899 376903 10510 11031 -234866 -235288 -373506
3588 -373506 -9387 -50749 -272802 -326427 -237282 -383443 -245397 215314 47422 79972
3578 79972 110978 -311723 -21474 79830 -177454 65398 24739 16371 13577 119862 69187
3567 69187 386506 -70536 42691 318904 444456 1075623 592085 321667 447078 478860
3557 478860 222629 57747 34739 70933 54273 280480 58558 -86149 101726 -291072
3547 -291072 257036 17103 320287 313520 491873 436982 21231 83213 -1043 -12353 141166
3536 141166 168707 320078 -158629 -10524 -15299 40843 -121940 80214 516634 499535 854924
3525 854924 810142 510182 -30367 163431 7369 400657 -38855 -235502 160542 194660
3515 194660 28320 201375 216082 -302171 -358832 46050 238904 -24151 -313282 -59441
3505 -59441 88687 43429 63161 105890 74906 184221 462700 643417 347222 274367 231714
3494 231714 143717 127077 280932 384655 305588 143992 21860 197513 55398 -35072
3484 -35072 -68611 52876 10843 -34605 35347 224025 178318 149197 370077 397450 97743
3473 97743 -204814 187393 216757 432540 556395 254573 30781 -72177 118688 280168
3463 280168 420816 459565 369382 425173 103883 293665 -35286 -214625 -36018 -28743 94176
3452 94176 -250360 -398338 -700697 -657875 -649041 -188385 90692 -34183 11208 237131 235631
3441 235631 15832 -100839 -101304 -50959 -127039 112470 224402 -12929 174703 -127429 70971
3430 70971 218036 197507 283613 286140 97998 -253885 34264 71492 391282 173165 291003
3419 291003 610997 501119 427455 301508 45008 -389474 -167508 -154591 -192446 -277781
3409 -277781 341 144339 -133222 -185429 6365 -100603 -229087 149201 104929 95629
3399 95629 18269 85101 164245 34297 -21240 343240 215719 330728 217489 -122060 105355
3388 105355 328884 -41214 199077 365943 291817 251405 97622 -335422 -286392 233759
3378 233759 -143873 3040 210670 44732 215206 110919 296560 503021 401981 445846
3368 445846 193028 200162 -28061 455091 674679 584673 193859 521926 310367 156497
3358 156497 281585 -23005 -364909 -344833 -232421 130491 -29868 83317 236719 61209
3348 61209 53523 -123345 -77072 35066 397535 254082 53947 -233679 22235 68893 -116102
3337 -116102 -47120 -292323 -26134 -129349 -62067 266552 256192 90900 -389529 -593387
3327 -593387 168807 72712 -243 272852 -112213 -204497 -153388 260688 88000 123428 30277
3316 30277 -75682 354005 727786 332575 350459 109907 140961 132951 -22325 -102582 276026
3305 276026 439180 9971 -31549 72261 147109 616414 694163 227679 80577 401927
3295 401927 11012 301539 64005 -134128 82457 317188 729669 588415 803496 310967
3285 310967 349689 462579 314964 178714 221644 95473 160401 33800 341573 281133
3275 281133 104923 257561 344051 514596 526276 423339 427484 309699 938953 671433
3265 671433 865585 849513 69291 308480 -69591 -86178 -76685 318908 143415 116096 -236472
3254 -236472 -193483 65845 504109 485696 632984 595651 327774 550754 568317 743955
3244 743955 823846 341277 409682 849274 566454 233536 -135492 174588 516473 463980
3234 463980 192307 145640 307016 392040 169170 329779 400350 322629 231813 716537 1041547
3223 1041547 798705 691609 638951 831324 1037553 836554 897437 853079 991815 761589
3213 761589 261239 589069 660369 720072 1088564 980048 701004 735598 750198 859586
3203 859586 684906 623718 599777 763492 1092907 1176792 1058630 904929 1000348 1243609
3193 1243609 1274127 1110757 950183 701182 1193082 1304821 880961 992054 1582841 1483776
3183 1483776 1369607 1234143 1415875 1613781 1419772 1333300 1085173 846463 788787 840699
3173 840699 1105577 1540462 1255774 1408494 2103526 1752012 1849950 1523135 1373468 1476857
3163 1476857 1793279 2186189 1789941 2442817 2403421 1997891 2091376 2060351 1989304 1815360
3153 1815360 1901695 2190702 2074879 2193287 2439666 2530219 2148987 2315512 2336759 2680656
3143 2680656 3008722 2768556 2738916 2514570 2766426 2795318 2756351 2795973 3046314 3421206
3133 3421206 3302823 3414181 3394637 3723746 4505876 4154519 3931031 4137054 4341316 4665360
3123 4665360 5177501 5610356 5370650 5755979 5845770 5642383 5698303 5711611 5467188 5575242
3113 5575242 5893690 5350531 4707873 4749089 4840505 4766900 4446755 4171144 4047642 3735399
3103 3735399 3605491 3262336 3297769 3306085 3197466 3242066 2726668 2782337 2792463 2336371 2338207
3092 2338207 2234792 2319622 2235498 1938873 1722796 1787496 2033445 1714097 1624892 2093642
3082 2093642 2041684 1882872 1920530 2033451 1700953 1707460 1526251 1284033 1081280 1200469
3072 1200469 1400771 1252430 1492902 1495504 1484268 1441033 1547566 1479298 1056037 1253019
3062 1253019 1087772 860547 994793 735065 624425 623989 825878 927109 472070 165478
3052 165478 515953 761729 974935 836761 882355 1065451 916448 506062 581323 956534
3042 956534 664396 362761 549949 497570 511795 643333 478229 778527 679373 39196
3032 39196 228794 545885 562874 509626 552661 807863 847641 796252 881769 754970 714138
3021 714138 371276 782378 369324 188462 436324 460550 360572 434298 6014 112174
3011 112174 136562 113584 446687 343713 616708 464536 560958 544838 37293 257548
3001 257548 242730 448324 954438 458872 -168 170500 632852 461104 779647 558408
2991 558408 679581 411503 669182 628322 348791 14629 95781 119990 519617 153604
2981 153604 35154 239179 -183410 270844 318276 24630 168005 474771 439452 225305
2971 225305 559252 249303 248787 142613 117744 158142 -105007 429388 280308 442025 276945
2960 276945 234789 331424 225690 -125527 -20930 -93758 -81276 -214699 -27641 510277
2950 510277 313078 310132 -60439 -366311 -177183 -83870 -348050 -386282 -379987 -59558 233884
2939 233884 84948 146611 28214 68012 297892 34681 -15529 -79923 -398025 -314862 -17747
2928 -17747 138218 105969 197751 515288 762219 450420 504772 325333 278396 369695 214908
2917 214908 160800 232070 -63174 -411405 -292929 59284 -234945 -39327 284204 367955
2907 367955 365902 262915 311968 -47002 537211 360140 157194 212210 -206930 -76719
2897 -76719 268897 174245 131304 -99898 252856 636076 336953 324338 278951 584193 499675
2886 499675 400497 633803 361209 421808 468069 722142 569309 851879 365423 164246
2876 164246 787891 451829 525140 579999 332071 347115 554092 285334 515195 374538
2866 374538 401321 607317 637301 537091 449748 263041 31524 106325 181824 133241 71773
$$ [...]
##END NTUPLES=NMR SPECTRUM
##END=
