##TITLE=1H_CG-1156
 CDCl3,8 sc, 
 26.10.2021
##JCAMPDX= 6.0         $$ Bruker NMR JCAMP-DX V2.0
##DATA TYPE= NMR SPECTRUM
##DATA CLASS= NTUPLES
##ORIGIN= UXNMR, Bruker Analytische Messtechnik GmbH
##OWNER= root
$$ XWIN-NMR		Version 3.5
$$ Tue Oct 26 10:30:58 2021 Russian Standard Time (UT+4h)  she@DPX200
##.OBSERVE FREQUENCY= 200.1313468511
##.OBSERVE NUCLEUS= ^1H
##.ACQUISITION MODE= SIMULTANEOUS
##.ACQUISITION SCHEME= undefined
##.AVERAGES= 8
##.DIGITISER RES= 18
##SPECTROMETER/DATA SYSTEM= spect
##.PULSE SEQUENCE= zg30
##.SOLVENT NAME= D2O
##.SHIFT REFERENCE= (INTERNAL, D2O, 0, 15.7006)
##AUDIT TRAIL= $$ (NUMBER, WHEN, WHO, WHERE, WHAT)
$$ ##TITLE= Audit trail, XWIN-NMR		Version 3.5
$$ ##JCAMPDX= 5.01
$$ ##ORIGIN= Bruker BioSpin GmbH
$$ ##OWNER= she
$$ F:/spectra/data/she/nmr/H-F/1/pdata/1/auditp.txt
$$ ##AUDIT TRAIL=  $$ (NUMBER, WHEN, WHO, WHERE, WHAT)
(   1,<2021-10-26 10:29:52.39 +0400>,<she>,<DPX200>,
      <created by zg, POWCHK disabled, PULCHK disabled
       configuration hash MD5:
       00 E9 B6 7A A2 85 ED C7 34 08 36 98 17 FE 4E 26
       data hash MD5: 16K
       07 BC B8 1B 69 E4 7B 57 F7 8D 33 05 0A D8 B3 47>)
(   2,<2021-10-26 10:29:55.03 +0400>,<she>,<DPX200>,
      <Start of raw data processing
       efp BC_mod = 2 LB = 0.24 FT_mod = 6 PKNL = 1 PHC0 = -15153.94 PHC1 = 12.20083 SI = 16K 
       data hash MD5: 16K
       51 51 90 B0 BF 3B 87 CD 7E 7C 0A 55 01 AF 4A FA>)
(   3,<2021-10-26 10:30:16.28 +0400>,<she>,<DPX200>,
      <pk PHC0 = 4.132817 PHC1 = -4.8 
       data hash MD5: 16K
       86 1D 3F 44 9A 49 A4 8F E0 C6 E3 59 3C 87 98 F0>)
(   4,<2021-10-26 10:30:19.64 +0400>,<she>,<DPX200>,
      <abs ABSG = 5 
       data hash MD5: 16K
       6F F3 0B F7 92 40 73 38 BB 70 D6 DD 12 1B EA 44>)
$$ ##END=
$$ 
$$ hash MD5
$$ D3 05 95 AE F1 C0 CC 9A D4 22 DB 00 74 32 F9 8F
##$RELAX= 
##$RELAX= 
##$RELAX= 
##$RELAX= 
##$RELAX= 
##$RELAX= 
$$ Bruker specific parameters
$$ --------------------------
##$DU= <F:/spectra>
##$EXPNO= 1
##$NAME= <H-F>
##$PROCNO= 1
##$TYPE= <nmr>
##$USER= <she>
##$AMP= (0..31)
100 100 100 100 100 100 100 100 100 100 100 100 100 100 100 100 100 100 
100 100 100 100 100 100 100 100 100 100 100 100 100 100 
##$AQSEQ= 0
##$AQ_mod= 1
##$AUNM= <au_zg>
##$AUTOPOS= <>
##$BF1= 200.13
##$BF2= 200.13
##$BF3= 200.13
##$BF4= 200.13
##$BF5= 200.13
##$BF6= 200.13
##$BF7= 200.13
##$BF8= 200.13
##$BYTORDA= 1
##$CFDGTYP= 0
##$CFRGTYP= 5
##$CHEMSTR= <none>
##$CNST= (0..31)
1 1 145 1 1 1 1 1 1 1 1 1 1 1 1 1 1 1 1 1 1 1 1 1 1 1 1 1 1 1 1 1 
##$CPDPRG= <>
##$CPDPRG1= <>
##$CPDPRG2= <>
##$CPDPRG3= <>
##$CPDPRG4= <mlev>
##$CPDPRG5= <mlev>
##$CPDPRG6= <mlev>
##$CPDPRG7= <mlev>
##$CPDPRG8= <mlev>
##$CPDPRGB= <>
##$CPDPRGT= <>
##$D= (0..31)
0 1.2 0 0 0 0 0 0 0 0.06 0 0.03 0 0 0 0 0.0002 0 0 0 0 0 0 0 0 0 0 0 0 
0 0 0 
##$DATE= 1635229791
##$DBL= (0..7)
120 120 120 120 120 120 120 120 
##$DBP= (0..7)
150 150 150 150 150 150 150 150 
##$DBP07= 0
##$DBPNAM0= <>
##$DBPNAM1= <>
##$DBPNAM2= <>
##$DBPNAM3= <>
##$DBPNAM4= <>
$$ [...]
##$SUBNAM2= <"">
##$SUBNAM3= <"">
##$SUBNAM4= <"">
##$SUBNAM5= <"">
##$SUBNAM6= <"">
##$SUBNAM7= <"">
##$SUBNAM8= <"">
##$SUBNAM9= <"">
##$SW= 18.0517286264689
##$SWIBOX= (0..15)
0 0 2 0 0 0 0 0 0 0 0 0 0 0 0 0 
##$SW_h= 3612.71676300578
##$TD= 16384
##$TD0= 1
##$TE= 0
##$TE2= 300
##$TE3= 300
##$TEG= 300
##$TL= (0..7)
0 120 120 120 120 120 120 120 
##$TP= (0..7)
150 150 150 150 150 150 150 150 
##$TP07= 0
##$TPNAME0= <>
##$TPNAME1= <>
##$TPNAME2= <>
##$TPNAME3= <>
##$TPNAME4= <>
##$TPNAME5= <>
##$TPNAME6= <>
##$TPNAME7= <>
##$TPOAL= (0..7)
0.5 0.5 0.5 0.5 0.5 0.5 0.5 0.5 
##$TPOFFS= (0..7)
0 0 0 0 0 0 0 0 
##$TUNHIN= 0
##$TUNHOUT= 0
##$TUNXOUT= 0
##$USERA1= <user>
##$USERA2= <user>
##$USERA3= <user>
##$USERA4= <user>
##$USERA5= <user>
##$V9= 5
##$VALIST= <valist>
##$VCLIST= <CCCCCCCCCCCCCCC>
##$VD= 0
##$VDLIST= <DDDDDDDDDDDDDDD>
##$VPLIST= <PPPPPPPPPPPPPPP>
##$VTLIST= <TTTTTTTTTTTTTTT>
##$WBST= 1024
##$WBSW= 4
##$XGAIN= (0..3)
0 0 0 0 
##$XL= 0
##$YL= 0
##$YMAX_a= 119574
##$YMIN_a= -63578
##$ZGOPTNS= <>
##$ZL1= 120
##$ZL2= 120
##$ZL3= 120
##$ZL4= 120
##$ABSF1= 15.72375
##$ABSF2= -2.328099
##$ABSG= 5
##$ABSL= 3
##$ALPHA= 0
##$AQORDER= 0
##$ASSFAC= 0
##$ASSFACI= 0
##$ASSFACX= 0
##$ASSWID= 0
##$AUNMP= <proc_1d>
##$AZFE= 0.1
##$AZFW= 0.1
##$BCFW= 0
##$BC_mod= 2
##$BYTORDP= 0
##$COROFFS= 0
##$CY= -3
##$DATMOD= 1
##$DC= 0
##$DFILT= <>
##$DTYPP= 0
##$F1P= 0
##$F2P= 0
##$FCOR= 1
##$FTSIZE= 16384
##$FT_mod= 6
##$GAMMA= 0
##$GB= 0
##$INTBC= 1
##$INTSCL= 0
##$ISEN= 128
##$LB= 0.24
##$LEV0= 0
##$LPBIN= 0
##$MAXI= 10000
##$MC2= 0
##$MEAN= 0
##$ME_mod= 0
##$MI= 1.114404
##$NCOEF= 0
##$NC_proc= -9
##$NLEV= 6
##$NOISF1= 3.799351
##$NOISF2= 2.8
##$NSP= 0
##$NTH_PI= 0
##$NZP= 0
##$OFFSET= 15.70061
##$PC= 1
##$PHC0= -15149.81
##$PHC1= 7.40083
##$PH_mod= 1
##$PKNL= yes
##$PPARMOD= 0
##$PSCAL= 0
##$PSIGN= 0
##$REVERSE= no
##$SF= 200.130011045331
##$SI= 16384
##$SIGF1= 3
##$SIGF2= 2
##$SINO= 5.538805
##$SIOLD= 16384
##$SREGLST= <1H.CDCl3>
##$SSB= 0
##$STSI= 16384
##$STSR= 0
##$SW_p= 3612.71676300578
##$SYMM= 0
##$S_DEV= 0
##$TDeff= 16384
##$TDoff= 0
##$TI= <>
##$TILT= no
##$TM1= 0
##$TM2= 0
##$TOPLEV= 0
##$USERP1= <user>
##$USERP2= <user>
##$USERP3= <user>
##$USERP4= <user>
##$USERP5= <user>
##$WDW= 1
##$XDIM= 16384
##$YMAX_p= 512890557
##$YMIN_p= -2399455
$$ End of Bruker specific parameters
$$ ---------------------------------
##NTUPLES= NMR SPECTRUM
##VAR_NAME=  FREQUENCY,     SPECTRUM/REAL,   SPECTRUM/IMAG
##SYMBOL=    X,             R,               I
##VAR_TYPE=  INDEPENDENT,   DEPENDENT,       DEPENDENT
##VAR_FORM=  AFFN,          ASDF,            ASDF
##VAR_DIM=   16384,         16384,           16384
##UNITS=     HZ,            ARBITRARY UNITS, ARBITRARY UNITS
##FACTOR=    0.220516191357247, 1,           1
##FIRST=     3142.16328490487, 0,            0
##LAST=      -470.553478100909, 0,           0
##MIN=       -470.553478100909, -2399455,    0
##MAX=       3142.16328490487, 512890557,    0
$$ Real data points
##PAGE= N=1
##DATA TABLE= (X++(R..R)), XYDATA
$$ [...]
11335i1854j01557L33170R97765r0966p28756k47440L18814l85958l61772K37354
11325a21200n9019R58378J60276P1581m24799N37518m66312j03326q13136m0960
11315c00999L88856l70354K95031M29651m92006J6229k10337M48866J6464m90853
11305b69452J03293j85258L54783o67065J65651l852M38766o0408j77377j17322
11295d18241K2845r0369J11660N34808M85583j408338m92144j04210J575539K03558
11285D20691p05592L31551p9528K4362j25881j67125O41882r76911m30826N80863
11275d86514M48712o77701O11865m75529M98097O41181m7777K12295j008077o9840
11265c53288N96177m27504n13790L57433m1505K55955m4553j80328O45732m41224
$$ plain form
11335 -91854 -193411 139759 1137524 1046558 317802 70362 389176 3218 -358554 -121200
11325 -121200 -180219 778159 938435 1010016 585217 1122735 656423 553097 -260039 -300999
11315 -300999 87857 -282497 12534 442185 -49821 -33592 -243929 204937 221401 -269452
11305 -269452 -166159 -351417 3366 -663699 -498048 -501900 -63134 -123542 -300919 -418241
11295 -418241 -395396 -485765 -374105 160703 646286 -762052 -1254196 -1358406 217133 420691
11285 420691 -284901 46650 -32878 -8516 -134397 -301522 340360 -636551 -1067377 -486514
11275 -486514 -37802 -715503 -103638 -579167 -81070 560111 512334 724629 -283448 -353288
11265 -353288 242889 -184615 -698405 -340972 -382477 -126522 -171075 -351403 294329 -146895
11255a46895r02215P31090J72194L97661P70154l18075k29532p41690J65134M02084
11245B99910J2298j31546k0331L35546j49084L25919j178873R1134o9075L7726
11235d46376L38656m6070L76081k10983j02713L27697P9245l69666r149p39943
11225h03221J99834N61145N9282j0822n55634M47176L70126k88389p88762K68419
11215e40846Q97376m25242o11771k53839P64931K47000j85423p77413O59240Q28647
11205F02660K77196l85175o41977k03666k1672j83372j92321Q09285k87751J32799
11195i3994m87795N365L92452P61710L78791o21284j83100k00978M4008K01158
11185A96333n59957M6644O12602K54800M3965L49517q64727K7885l55492j78849
$$ plain form
11255 -146895 -1049110 -318020 -145826 251835 1021989 703914 474382 -267308 -102174 299910
11245 299910 312208 180662 160331 495877 346793 672712 -506161 -415027 -484102 -446376
11235 -446376 -107720 -153790 222291 11308 -91405 236292 315537 -54129 -63278 -803221
11225 -803221 -603387 -42242 17040 6218 -549416 -102240 267886 -20503 -809265 -540846
11215 -540846 356530 -68712 -680483 -934322 -169391 77609 -107814 -885227 -225987 602660
11205 602660 879856 494681 -147296 -350962 -372634 -556006 -748327 60958 -226793 -93994
11195 -93994 -581789 -576424 -183972 577738 956529 335245 152145 -48833 -4825 196333
11185 196333 -363624 -316980 295622 550422 594387 943904 79177 107062 -248430 -427279
11175d27279r9092K88671j96797L21352l7320M68970P18828N08081m27390o16600
11165E01424k74025r46291L56079n4380K14664m28933q287J28652n92454K74306
11155h29245m71330O12201o2409L79488J178543j020602l02004K76270p973L18265
11145G1204p7580j37581M0538Q16625K61059p44131L9458J26164m79109n14385
11135e97738M89955L43713n17028n33508m1881K92486m1878J19839P46507K42095
11125E02562p61878Q6733P9544j98779P58419K16627p80210N59464J43013J43217
11115G48712l0137j379598J00255M30783M02360l7789k71319k675R2278P9758
11105A32628J92693r70610N80652P16220j066643p24645Q07396M49600k80785
$$ plain form
11175 -427279 -526371 -237700 -434497 -113145 -150465 318505 1037333 1545414 1118024 501424
11165 501424 227399 -718892 -362813 -417193 -202529 -631462 -639749 -511097 -1103551 -829245
11155 -829245 -1300575 -688374 -750783 -371295 807248 -213354 -515358 -239088 -247061 71204
11145 71204 -6376 -143957 -103419 713206 974265 230134 269592 395756 -83353 -597738
11135 -597738 -107783 235930 -281098 -814606 -856487 -564001 -605879 -486040 260467 502562
11125 502562 -259316 -172583 -93039 -291818 466601 683228 -96982 462482 605495 748712
11115 748712 718575 -661023 -560768 -129985 272375 234586 -36733 -39408 52870 132628
11105 132628 325321 -645289 -64637 651583 -415060 -1139705 -332309 117291 -163494
11096a63494l97554M42028L95071l65779r0309L30762N1159j10135m65485J79184
11086a94552J05524L34167l91957N24939k62303q65975M34582J74033J6706O02815
11076D77979M2087q95984Q8986L97552k56506P3541l32698O88008K54683m85744
11066E1904n99803J119419J93469j80q56325m02339L66719m51656L96689q72290
11056a054393P7528L96975N53826P80002O73766n82856o97710Q59826J30881o36551
11046E01294K8885M91233j136505l62172M36583K5078L0615l88295J22899J35392
11036a14993R225Q0773K22983k74060O12872M99700j450337m22412O8160q7776
11026h55865j43003J11161k98103m07282J337979R60640k63099k2932K10557k81637
$$ plain form
11096 -163494 -561048 -119020 276051 -89728 -180037 150725 201884 91749 -373736 -194552
11086 -194552 -89028 245139 -146818 378121 115818 -750157 -315575 -141542 -124836 477979
11076 477979 520066 -375918 -286932 110620 -145886 -72345 -405043 282965 537648 51904
11066 51904 -547899 571520 764989 764809 -91516 -493855 -127136 -578792 -182103 -1054393
11056 -1054393 -976865 -579890 -26064 753938 1427704 844848 147138 1006964 1137845 501294
11046 501294 530179 1021412 -115093 -477265 -40682 -15604 15011 -373284 -250385 -114993
11036 -114993 -105768 -24995 197988 -76072 536800 1036500 -413837 -836249 -768089 -855865
11026 -855865 -998868 -887707 -1185810 -1593092 -255113 705527 442428 419496 630053 348416
11016C48416l05236r32896J406553K14693k98047k64155M14278k50615n72583
11007b39592n25964o1993L39956P19581j85289K72863m10038p7616j04439k78530
10997e51061L7006K23939k17921N04585J02751j16226j58195n5674o69957k08348
10987a109101q117q8426M94807Q94154Q62586l55428j107154L8131j67089K2219
10977e23418L05551M50375J44043j022135k4973P10712j5176m85649K77001o15616
10967g99285R14875l46990N36956K80829l89375N31201l01722O180m71670q84233
10957i23234r9413O60659K12720J10267k95173L60349L27578m13523O01477k8322
10947E13385m32848Q31946j44341q05111K57792N06253l11994n39413J52618n08741
$$ plain form
11016 348416 43180 -889716 516837 731530 433483 169328 583606 332991 -239592
11007 -239592 -765556 -827549 -487593 231988 46699 319562 -90476 -168092 -272531 -551061
10997 -551061 -514055 -290116 -508037 -3452 99299 -16927 -175122 -230796 -900753 -1109101
10987 -1109101 -1117218 -1205644 -710837 183317 1045903 690475 -416679 -378548 -545637 -523418
10977 -523418 -217867 232508 376551 -645584 -670557 40155 24979 -460670 -183669 -799285
10967 -799285 115590 -231400 305556 586385 197010 728211 426489 432669 -39001 -923234
10957 -923234 -1022647 -361988 -149268 -39001 -334174 26175 353753 -59770 541707 513385
10947 513385 80537 912483 768142 -36969 220823 727076 415082 -124331 28287 -480454
10937d80454M54285O67587Q40354j106009o81025j43663M26261j24556L35022
10928A87802J45688K56388m76245j56348J0379J43197n70191L14372L07959p64778
10918f01777J90537K888r5991O28481m13109M64397M76036J38157r45164l88885
10908e44430P39554M02390q19513j98849K97950L49266L54988k30798r1168n98854
10898c39464m79108l13051P12707j29067L51873J95564m5856M90704j25195l59534
10888d0427p84320o5376J207181k11682K67570o88833M8660R8005r9970k4858
10878b94050K02537n23539o27486L18895L57580O84663M2466K81825l2464j158497
10868g48070n00843N57571O77845j80639K87661m40900m19131L43827M00339l00511
$$ plain form
10937 -480454 -26169 641418 1481772 375763 -305262 -448925 -22664 -147220 187802
10928 187802 333490 589878 113633 -42715 -32336 110861 -459330 -144958 163001 -601777
10918 -601777 -411240 -408352 -504343 124138 -288971 175426 651462 789619 -155545 -544430
10908 -544430 195124 597514 -221999 -420848 -122898 226368 581356 350558 259390 -339464
10898 -339464 -818572 -1131623 -418916 -547983 -196110 -546 -46402 444302 319107 -40427
10888 -40427 -824747 -890123 317058 105376 372946 -315887 -267227 -169222 -269192 -294050
10878 -294050 -91513 -615052 -1242538 -923643 -566063 118600 161066 442891 410427 -748070
10868 -748070 -1248913 -691342 -13497 -194136 93525 -347375 -766506 -422679 -22340 -322851
10858c22851K68500L82918J40710k06450k58810J35548l91686J85326Q96007K71830
10848A101042o9521o53152j50115q73448K40498n96299Q4524K195171J03507r87023
10838C95184r1622l33412o95881Q53164j24412k68757j536m4371M68204J83615
10828C40176J18503L33853p16084o56680m21117R7273L05468P60164N41327q18634
10818a15751N89155l12729P62928k07127o34012O44743k91530n11813k46011P68919
10808D46772m99294m61758P73992n13524j48780j67910J64562l45998j097509
10799a849447P63890L33204O47116K3354M58817k23363n86312O21686N12589O40859
10789A342393p76012p21197j09222m27193N28535q87410m10332L85555L36706
$$ plain form
10858 -322851 -54351 328567 469277 262827 4017 139565 -252121 -66795 829212 1101042
10848 1101042 1031521 378369 228254 -645194 -404696 -1000995 -916471 1278700 1382207 395184
10838 395184 303562 -29850 -725731 127433 3021 -265736 -267272 -311643 156561 340176
10828 340176 458679 792532 76448 -580232 -1001349 -904076 -598608 161556 702883 -115751
10818 -115751 473404 160675 923603 716476 82464 727207 435677 -76136 -322147 446772
10808 446772 -52522 -514280 259712 -253812 -402592 -570502 -405940 -751938 -1849447
10799 -1849447 -1085557 -752353 -105237 -81883 376934 153571 -432741 188945 701534 1342393
10789 1342393 566381 -154816 -264038 -691231 -162696 -1050106 -1460438 -1074883 -738177
10780g38177L0608K42140o2335q9337M14014M10370m61902j91518P89293K04295
10770E47451l43730o81556o16176L83059L27057N99136M34748n33530l58555M90102
10760B48006J87650k93044K92913O7571M465O9883k08395k42022J49295m89456
10750b13134J82969p10774J90028J220601n01901p56447O6007k41435l4648O15364
10740a83370M74915j4276n39043M57390J89206J13291L64532o95370j87242M53837
10730D33870m79297j89451l45862m63427P08850P6945n20111N70093L62132R1665
10720B45407m95784p39206Q27273K22808L68494Q666n81691l61805P42125k0113
10710B16174m4588r64565j94818O12619o54347K16251J61366J270936l48132J32382
$$ plain form
10780 -738177 -707569 -465429 -527764 -617101 -203087 207283 -254619 -446137 343156 547451
10770 547451 203721 -477835 -1094011 -710952 -383895 215241 649989 116459 -242096 248006
10760 248006 435656 142612 435525 503096 507561 577444 369049 127027 276322 -213134
10750 -213134 -30165 -740939 -550911 669690 167789 -588658 -522651 -764086 -798734 -183370
10740 -183370 291545 277269 -261774 195616 384822 498113 862645 167275 -19967 433870
10730 433870 -45427 -234878 -580740 -1044167 -335317 -258372 -778483 -208390 153742 245407
10720 245407 -250377 -989583 -162310 60498 428992 437658 -144033 -505838 236287 216174
10710 216174 171586 -792979 -987797 -375178 -1029525 -813274 -651908 619028 270896 403278
10700D03278J06146l37720l79772M60101r58899r2611N62390L68306j59311m15609
10690d43701o76688O73846O58482j51581k22808M50920j42691l27734K03740N0581
10680G2366j92050m96776N7565l2089P52180n37241L76684k45851J172548o02251
10670C25085o81628P48218l66499n12224J12773M61923j38591k45171m53709O60652
10660h9171R6371j78041j46063K0111N909n60064K19682m64493P05295O2595K89214
10649c8655L7846l843N72670n91316k29732O1304m50213P75227l44671j59704
10639c71087p8141J57027J018303L66712k10623O8970k09599n05315p73776J51839
10629c85690O00251L39315p1873n30057K67772m28110J32362k35790Q02133O56726
$$ plain form
10700 403278 509424 171704 -208068 252033 -706866 -799477 -237087 131219 -28092 -443701
10690 -443701 -1120389 -446543 211939 60358 -162450 288470 145779 -181955 21785 72366
10680 72366 -119684 -616460 -558895 -590984 161196 -376045 639 -245212 927336 325085
10670 325085 -356543 391675 25176 -487048 -374275 87648 -50943 -296114 -749823 -89171
10660 -89171 7200 -170841 -316904 -296793 -290884 -850948 -631266 -1095759 -390464 -327869 -38655
10649 -38655 -809 -4652 568018 -23298 -253030 -191726 -641939 133288 -211383 -371087
10639 -371087 -449228 -292201 726102 1092814 882191 951161 741562 236247 -537529 -385690
10629 -385690 214561 553876 482003 -48054 219718 -208392 -76030 -311820 490313 1147039
10619A147039j145233j78731N17606m81059M62753J64340l06615o03665R0825
10610c32740N85148j79212N0527k51189n14520K78429K40893m7276l45581L36682
10600a78839l85586K08238M86066k37685L11542k23687K56513p68503p5426M11756
10590a95611K4708M16318j36956K90489j07072j19417L00706n72500j22875L15400
10580I3190J034012j69269p61525K6200n42880l93696l67285R43211P39981p10149
10570a08210m32928P38017P3922o59136J43495l14276K72602p15877Q6211N02323
10560d13857l71588L8201L85749M4272N50131N45901o72185j08495j06140k22844
10550c30855k72846P46841J85591n27772l1739O975L96112J40633Q6932N7131
$$ plain form
10619 1147039 1806 -176925 340681 -140378 322375 486715 180100 -423565 -332740
10610 -332740 252408 73196 123723 -127466 -641986 -363557 -122664 -169940 -515521 -178839
10600 -178839 -564425 -356187 129879 -107806 203736 -19951 236562 -531941 -607367 -195611
10590 -195611 -170903 245415 108459 398948 291876 172459 473165 -99335 -222210 93190
10580 93190 1127202 957933 196408 222608 -320272 -713968 -1081253 -138042 601939 -108210
10570 -108210 -541138 196879 270801 -388335 -244840 -559116 -286514 -1002391 -916180 -413857
10560 -413857 -785445 -747244 -361495 -317223 232908 778809 106624 -1871 -108011 -330855
10550 -330855 -603701 143140 328731 -199041 -230780 -223805 172307 312940 399872 457003
10540D57003o77415m8864O60512J36054k39526L67864J68667n51539k44314n0390
10530b1948L45620K90224M3405M18383o70979K63288k83605k78267n35299M86907
10520E7729K26881K98391k42930M98326p0106q76809n81201J82939L16251p8524
10510b69053L34933q2296J78096K50910M45545K29938P9171p02919o40510L1510
10500a44675L69424k12134K49984o41655K99892L76678N7997N61381m06978p46451
10490b36537J454588J89593J6652k82465l79998K05133o77110o3199o1967j99406
10480c4716K39029n24709M55564n7530O19448K11450k10517o5722j012884m61486
10470h42073j32621J39269K02699O3942q52344N01455N60959J53648j09659K27578
$$ plain form
10540 457003 -220412 -269276 391236 527290 287764 655628 824295 272756 28442 -21948
10530 -21948 323672 613896 657301 1075684 404705 667993 384388 106121 -429178 57729
10520 57729 284610 583001 340071 838397 768291 -108518 -689719 -506780 -190529 -269053
10510 -269053 65880 -16416 161680 412590 858135 1088073 1167244 464325 -176185 -144675
10500 -144675 224749 12615 262599 -379056 -79164 297514 355511 916892 509914 -236537
10490 -236537 1218051 1407644 1424296 1141831 761833 966966 289856 226657 164690 -34716
10480 -34716 204313 -320396 135168 77638 697086 908536 698019 632297 -380587 -842073
10470 -842073 -974694 -835425 -632726 -568784 -1421128 -919673 -358714 -205066 -314725 -87147
10460h7147l70738k71152L22913Q91179k80942o63140j43913j9438N33782j33162
10450b21758J96311k26455O87770J50050k80491j15092O7451O51616l45751l01213
10440B62438n79370O56206K8211l30668N49034M1092k22860p820n26566j61283
10430b91586J1005j101847M47814J384708k44733n45669J99642Q8159j41923n90312
10420g84742J57823J70399M19745M12496l4636J6617r46329j08727J156383P57503
10410A216532m10475p13545n0747m70947K73759o0323m89718L29489O64754J42880
10400D31659l64052j40494p20384L48403m570L01767J00343q91501K68440R516
10390f60873p9949L11148m60150Q14600K51008m52870k309m69082K68542l42216
$$ plain form
10460 -87147 -457885 -729037 -406124 485055 204113 -459027 -602940 -622378 -88596 -221758
10450 -221758 -25447 -251902 435868 585918 305427 190335 257786 909402 563651 262438
10440 262438 -316932 339274 367485 36817 585851 626943 404083 396263 -130303 -291586
10430 -291586 -280581 -1382428 -934614 450094 205361 -340308 -140666 -52507 -194430 -784742
10420 -784742 -626919 -456520 -36775 375721 341085 357702 -588627 -697354 459029 1216532
10410 1216532 806057 92512 41765 -429182 -155423 -215746 -705464 -375975 288779 431659
10400 431659 67607 -72887 -793271 -444868 -449438 -147671 -47328 -938829 -670389 -660873
10390 -660873 -740822 -429674 -889824 -75224 175784 -277086 -279395 -748477 -479935 -822151
10380h22151K51462P17399m7137M56383M47492p71821m55126L1046P91529J15968
10370G15044O9279J94185j102611p08886o86616Q5282J070906j3608m14055L83555
10360d07525m82418P3794J129467k455o74201p6184R42763k11788J60535n34438
10350h2450J62035k16432k92751m2699J70711M47584J56780K27552q30280j84606
10340d84556L32364k74030J27938p1614K58595q756m25886n30250M04931R86962
10330C15698K31025j87247o47547O28338j17017N19124k27542n91744N1756m70872
10320d96028Q9787L25727l18444L19647J18567O90783j93335p37517J55147M67118
10310D21452k37526Q91631N54029l15796k26261r23110P61090l29777p29310K94051
$$ plain form
10380 -822151 -570689 146710 99573 555956 1003448 231627 -223499 -192453 599076 715044
10370 715044 784323 978508 -124103 -832989 -1519605 -1434323 -363417 -377025 -791080 -407525
10360 -407525 -889943 -816149 313318 310863 -363338 -439522 503241 291453 451988 -82450
10350 -82450 79585 -136847 -429598 -472297 -301586 145998 302778 530330 -299950 -484556
10340 -484556 -152192 -426222 -298284 -369898 -111303 -120059 -545945 -1076195 -671264 315698
10330 315698 546723 359476 -288071 340267 223250 742374 514832 -76912 -25156 -496028
10320 -496028 -406241 -80514 -398958 -79311 39256 730039 536704 -200813 -45666 421452
10310 421452 183926 1075557 1629586 1313790 1087529 164419 925509 595732 -133578 160473
10300A60473n82806J98228R12067k69630p80912k29266R98654o2922o47531m24824
10290g28469L54894P36366n52378q3106j53424M26874j32434M54509k33344l78288
10280b88800L5379p07004J74721p4523M73186Q05829L81912n64731L50024P80393
10270A366386q37135j93152l92198M3858N33253M4128l38021m002p10627L91692
10260i5818M59591m33740K84345O07814q44101k76509L07329m94007N1421q50501
10250a284176j81669K84715l8156J34035P54863L08331L25115Q763m38175m949
10240a31303n7963m50855J57869K01493J00429n03101J50706J340380j5457J05883
10230H98081m26212L264r8472k31875L99919J34122j83786p39197K86925N2066
$$ plain form
10300 160473 -422333 -224105 687962 418332 -362580 -591846 406808 343886 -303645 -728469
10290 -728469 -373575 362791 -189587 -272693 -426117 757 -131677 322832 89488 -288800
10280 -288800 -253421 -960425 -785704 -860227 -387041 418788 800700 235969 585993 1366386
10270 1366386 529251 336099 -56099 -12241 521012 565140 227119 223117 -487510 -95818
10260 -95818 363773 -69967 214378 822192 -21909 -298418 8911 -485096 -433675 -1284176
10250 -1284176 -1465845 -1181130 -1219286 -1085251 -330388 -22057 303058 311821 -126354 -131303
10240 -131303 -189266 -640121 -482252 -280759 -180330 -683431 -532725 807655 792198 898081
10230 898081 471869 475133 376661 144786 544705 678827 495041 -244156 42769 94835
10220I4835N15666L65130o65137k13099O90524m15783j38450m54758r8020j68833
10210d87925L17630M71601n07274l6399J69813r3812q32444M56598L61320k98924
10200d79816q0533M4806o3366L45080K84581p0791N30092L19130l16423l80082
10190A32678q07538k99795N10805L32758J81102M5151M46350l15497J60251m08627
10180b2362L75796J443746j104185q84483O78862j16259j77339l23627p27727
10171h57578J5213R06655l06818k75724N9589p42828M24125l8415j15918P62415
10161a69284L36159k65824r4555N14039o75179o8706L9783m42958q3489O71252
10151b38762N23276R75455q99495j128145J20582N64425l19198O98794k10916
$$ plain form
10220 94835 610501 975631 310494 97395 787919 372136 233686 -221072 -319092 -487925
10210 -487925 -170295 301306 -205968 -242367 -72554 -166366 -998810 -542212 -180892 -479816
10200 -479816 -560349 -515543 -578909 -233829 50752 -20039 510053 829183 512760 132678
10190 132678 -674860 -974655 -463850 -131092 50010 95161 541511 226014 386265 -22362
10180 -22362 353434 1797180 692995 -191488 487374 371115 193776 -129851 -857578
10171 -857578 -842365 64290 -242528 -518252 -458663 -1201491 -777366 -815781 -931699 -169284
10161 -169284 166875 -98949 -193504 320535 -354644 -423350 -383567 -826525 -910014 -238762
10151 -238762 284514 1259969 360474 -767671 -647089 -82664 -401862 296932 86016
10142H6016m74446L13570k05623n43108j03838O29930j7079J79082Q09672n9240
10132F14936j19559O27953j147933q46170P58947o22374P00R4742j80148J056362
10122B37456N56020n93020o71262Q26278n83041K31316L75532K46146r17067J35186
10112a56456J85490j2492p47132N25817K12566Q1745n84321p5549L91217p05760
10102h84875J205140Q91426o88549m83552N86427K21616q56378J84348M67242
10093F42845m39298N44093J078279p82441k53473m92096k99910k05276M28363
10084B21086j46944L36554k22524J73990j7585Q06600r91139j233130M60856L25833
10074b86403L22962Q93943Q5552l18841l83900j57545l74892j37995M37569n49893
$$ plain form
10142 86016 -388430 -74860 -280483 -823591 -927429 -297499 -314578 -135496 674176 614936
10132 614936 495377 1123330 -24603 -870773 -111826 -734200 -733500 -638758 -818906 237456
10122 237456 793476 200456 -470806 355472 -227569 3747 379279 625425 -291642 -156456
10112 -156456 29034 16542 -730590 -204773 7793 89538 -494783 -570332 -179115 -884875
10102 -884875 320265 1211691 523142 39590 626017 847633 -8745 175603 642845
10093 642845 203547 747640 1825919 1043478 790005 297909 -2001 -207277 221086
10084 221086 74142 410696 188172 362162 344577 1151177 160038 -1073092 -612236 -286403
10074 -286403 36559 930502 1016054 697213 313313 155768 -219124 -357119 80450 -469443
10064d69443m1842m87372R40277L56360j22948r47554Q55182K07495p62629R25952
10054D53478k13549l14907M29316m82526n15783J34007P34990j53172j24830M15145
10044C62169j11179J98011K87007o00026j09221R22330J8338q51538K42614J66264
10034E24769k78870o16246L3330k16312Q24610q72221n20308J96502L41793o2501
10024f45454R72595j70788j98250N1791j53336K68306K22755J72304m56940N32305
10014E95288n26153p10530L45152k35602J7979M8869K76715L48247L23351o10266
10004a26950p58921j91123N30289J106001k0985o60868O7249k51666M51961N1156
9994A96143M29325K61828l74156k67705n589n64960J58550Q6638m41239L01463
$$ plain form
10064 -469443 -511285 -998657 -58380 297980 175032 -772522 82660 290155 -472474 453478
10054 453478 239929 -74978 354338 -128188 -643971 -509964 225026 71854 -52976 362169
10044 362169 250990 449001 736008 135982 26761 949091 967429 115891 358505 524769
10034 524769 245899 -370347 -337017 -553329 271281 -600940 -1121248 -924746 -582953 -645454
10024 -645454 327141 156353 -41897 9894 -143442 124864 347619 519923 62983 595288
10014 595288 69135 -641395 -296243 -531845 -513866 -464997 -188282 159965 483316 -126950
10004 -126950 -885871 -1076994 -546705 559296 538311 -122557 -55308 -306974 144987 196143
9994 196143 625468 887296 513140 245435 239846 -325114 -166564 -79926 -521165 -219702
9984b19702o38871J05958K94017M68937M97398L88117Q7481j048260l3806k30779
9974c29510k78854L85266M35721N38568l30561L37484m24907n18224J81248P86522
9964G82753m96570k98184j45179L513j47327n980J02461O84701p42257n53426
9954h15495J151541l3136J81990l87791k8662l18372m41961M30418L23697r1085
9944b8856m57263P75416o95843j24512P26549N02890j09444j02428k22548j70018
9934I3943l52940k13855J76460j47258N87482K93950k15157k57998j067250R5136
9924a007487R50737j82226J80797l32203L66307J033523o71264k92828m38781
9915c93425O5885P21675l53251m4440k94361M54341j85599q43741J125067m5603
$$ plain form
9984 -219702 -858573 -752615 -458598 10339 507737 895854 983335 -64925 -98731 -329510
9974 -329510 -608364 -223098 212623 751191 420630 758114 333207 -185017 -3769 782753
9964 782753 286183 -12001 -157180 -153667 -300994 -306974 -204513 480188 -262069 -815495
9954 -815495 336046 302910 484900 97109 68447 -249925 -691886 -261468 62229 -28856
9944 -28856 -486119 289297 -406546 -531058 195491 698381 588937 486509 263961 93943
9934 93943 -258997 -472852 -296392 -443650 143832 437782 222625 -35373 -1102623 -1007487
9924 -1007487 -56750 -238976 -58179 -390382 -24075 1009448 338184 45356 -393425
9915 -393425 -327540 394135 40884 -3556 -297917 156424 -29175 -872916 252151 206548
9905B06548n1460m31174L61254j35417p4945r2294J5624N22566j41240K92630
9895D72092j17200k96477J80604j24350O36607K5321r71514N9561N69006m7488
9885C86162l07486L13227J49026M9830k24200O11712k49221m75640n4306l06661
9875a07557K2405o02935P7151M62415O34257n13904j58088L00205m9781k77p38102
9864f74211k26120J037422j01206R830j97012Q5556O58201j20953N84848r85902
9854G0453l50616L92905Q30200o5872p04822l83250P4090M6679L80211J5103L74067
9843F79148m9080k10563o52768J28245j4528j7070K00097N02074n9974l23225
9833A82356l25654K86083M29698p28030j88222Q7400N37069j54608r78036K63429
$$ plain form
9905 206548 155088 -276086 85168 -50249 -125194 -217488 -201864 320702 179462 472092
9895 472092 354892 58415 239019 114669 751276 776597 -194917 -135356 433650 386162
9885 386162 78676 391903 540929 590759 366559 978271 729050 253410 199104 -107557
9875 -107557 -85152 -688087 -610936 -148521 485736 -28168 -186256 113949 64168 63891 -674211
9864 -674211 -900331 137091 35885 45715 -151297 -65741 592460 471507 1056355 70453
9854 70453 -280163 112742 942942 877070 172248 -211002 -136912 -90233 289978 305081 679148
9843 679148 630068 419505 -233263 -105018 -119546 -136616 63481 565555 505581 182356
9833 182356 -143298 142785 572483 -155547 -343769 -256369 280700 126092 -851944 -588515
9823e88515M78753J264400J25788j113581N6255M05617n40726p48812L36344m7624
9813c72101N96867r6033j18391N52599l55780j92778o51705R66036N94673l76002
9803E47385L84416k08147l89209j46556K60050K97025m51059n44839J04555K74154
9793A27775K10878K0296m67115M01454K72667j59053J22794k92994Q09260M65908
9783A511870j053994m91756K8190L3265M76255k62308k01526m19908M30040N43550
9773E93678n5006J29232J09733q12397m37415r2297N01288K21477Q84090Q4547
9763A126930j156344k03653J3077j2787L16085P05257j02449L53024p4048l13586
9753F51506o38352J59701J94969L81458l43023J18216n18688q7802N76656l76079
$$ plain form
9823 -588515 -109762 1154638 1280426 166845 223100 628717 87991 -660821 -324477 -372101
9813 -372101 224766 128733 10342 562941 207161 14383 -637322 328714 923387 547385
9803 547385 931801 723654 334445 187889 447939 744964 293905 -250934 -146379 127775
9793 127775 338653 358949 -108166 293288 565955 406902 529696 236702 1045962 1511870
9783 1511870 457876 -33880 -5690 27575 503830 241522 39996 -379912 50128 593678
9773 593678 538672 667904 777637 -34760 -472175 -564472 -63184 158293 1042383 1126930
9763 1126930 -29414 -233067 -219990 -232777 83308 788565 686116 1039140 965092 651506
9753 651506 13154 172855 367824 749282 406259 524475 5787 -82015 494641 118562
9743A18562K48186K10678j113190m11050J802224j037631k55414O17467K56934
9734D36766j97342K40796J87214r6044K33651n27778n08392P47621L0471k47753
9724B99210n76708L40228R23158Q33894m64908j038364j00835l27443O94731M58626
9714A041589M53342n41279r4011N1602o46370j70031L10059k51187j85718L2463
9704D59j13268J69034N42443N45356q69513m3430P310J27632p05896m49219O44529
9693a44563J019008M2037p88895Q07983o06865j001919K20745P08740o8103K79643
9683D67811O4388k5739j34504o6742N09876q14545J83155j15958m12352O57561
9673C12951N19349j18314J61887j77899J13520l99281o58182l5604P35940R2033
$$ plain form
9743 118562 366748 577426 -535764 -946814 855410 -182221 -437635 179832 436766
9734 436766 239424 480220 667434 571390 805041 277263 -231129 516492 546963 299210
9724 299210 -277498 62730 985888 1819782 1354874 316510 215675 -111768 582963 1041589
9714 1041589 1494931 953652 859641 911243 264873 94842 404901 153714 -32004 459
9704 459 -112809 56225 598668 1144024 274511 231081 238391 366023 -339873 -789092 -144563
9693 -144563 874445 916482 127587 935570 328705 -673214 -452469 256271 188168 467811
9683 467811 532199 506460 371956 305214 815090 545 183700 67742 -344610 312951
9673 312951 832300 713986 875873 697974 811494 412213 -245969 -281573 454367 546400
9663E46400m80619k7763L02513k22197R0629p7532N65778K29456j031758M20394
9653C15301j36865P08875l03479j40112j19970M17099J60978N3595k5466j065436
9643a35480J022241Q1835p85416N79396j260226k19567O93593k8317J77174j48732
9633b3499r296J1939Q2399q29786l82692K14127N47447o89323K43126J91800l26728
9622i70486K91655J016115n239o23823L09620q4477K02280r13942K29007N99473
9612E0183p0144l6795M32184r8182L6625R3205Q27156m15058j026817M30280L91524
9601F14161k59049j72420q4634M47477Q6171K83297J29002p00158j03090m60045
9591b19288O65871N75048l90954L56966O4108n3436n15929j81665n54945l010
$$ plain form
9663 546400 65781 38018 340531 118334 208963 131431 697209 926665 -105093 315301
9653 315301 178436 887311 583832 443720 323750 740849 901827 955422 929956 -135480
9643 -135480 886761 968596 183180 762576 -497650 -717217 -23624 -51941 125233 -23499
9633 -23499 -32795 -20856 61543 -768243 -1150935 -936808 -389361 -1078684 -835558 -643758 -970486
9622 -970486 -678831 337284 332045 -291778 17842 -66635 135645 -778297 -549290 50183
9612 50183 -19961 -56756 375428 277246 313871 407076 1234232 819174 -207643 222637 614161
9601 614161 355112 182692 98058 545535 631706 915003 1044005 343847 240757 -219288
9591 -219288 446583 1021631 630677 987643 1051751 998315 482386 300721 -254224 -257234
9581b57234j35699P67251k27352L31714O24363l95604l94035o08811O95559k1478
9571C78674m69657N4092J09963J74041K68949J89636j09586M96640J39121k10459
9561A021414Q0939o63856p83617k60244K42429K06268j22245o33795k48992K16162
9551i45537R64988Q53822J82582L36669J5450q93629n38954N45041O04335j145118
9541b0351j39505M12565k21507J81371o9819m38129K62503k30798n5267l4605
9531c53542N95186j377506R53750Q96899o7435J46550m66689O69183j11680r61334
9521g6618M10614l41463M26862O13349K25155p1238p3489n96229r51554K62247
9511a72364l46335M50372R75195o30900J1166L38635r48630M68138O00241K45014
$$ plain form
9581 -257234 -392933 374318 146966 478680 1103043 707439 313404 -295407 400152 378674
9571 378674 -90983 -36891 73072 247113 516062 705698 596112 1092752 1231873 1021414
9561 1021414 1102353 438497 -345120 -605364 -362935 -156667 -278912 -912707 -1161699 -945537
9551 -945537 19451 873273 1055855 1392524 1407974 514345 -24609 520432 1124767 -20351
9541 -20351 -159856 252709 31202 212573 142754 -295375 -32872 -263670 -318937 -353542
9531 -353542 241644 -1135862 -182112 714787 647352 793902 327213 996396 884716 -76618
9521 -76618 333996 -7467 419395 1032744 1257899 1186661 1113172 516943 -434611 -172364
9511 -172364 -518699 -68327 906868 275968 287134 625769 -322861 145277 745518 990532
9501I90532m18452p77944Q29003k91748J57109Q19945k61950l19614l2326j53953
9491E40602m26074P554j11484M81214k22469n43890k03426K77956N29496j57829
9481A71650k96887J97478k206L62843K23495L48567j291664N16285K4722p09430
9471d55147l10476J115030J23433m06084R6231j40523J54155N96309p23790n80512
9461e31374O92958M02998j25082q4822K10295k80226j86357r4585J326764r8392
9451A232177n78556n83368l11421J89156m12760M88812L96272m83785N85614L54443
9441H76584p72741L10927M15838j67432j50533J76029J24798r64301M94092J3181
9431C56442J11261O16524o57160M848Q89500k78718p00529J045413o52310j33297
$$ plain form
9501 990532 572080 -205864 623139 331391 488500 1308445 1046495 726881 694555 540602
9491 540602 114528 122082 10598 491812 269343 -274547 -477973 -200017 329479 171650
9481 171650 -125237 72241 70035 432878 656373 1004940 -286724 229561 254283 -455147
9471 -455147 -765623 349407 472840 66756 162987 22464 176619 772928 49138 -531374
9461 -531374 161584 564582 439500 354678 564973 284747 98390 3805 1330569 1232177
9451 1232177 653621 70253 -241168 -52012 -464772 24040 420312 -63473 522141 876584
9441 876584 103843 414770 830608 663176 512643 688672 813470 -150831 343261 356442
9431 356442 467703 1084227 427067 431915 1321415 1042697 342168 1387581 735271 601974
9421F01974K54346L95297r08201j75592Q68231r07163K05762L97335K80129j290098
9411b77980N34361L64053r31822P1076J098411j99390n30534M32542L53119l10848
9401F02988N40416o00685o5879J209924n15028k56978o50348K49107K37374J54777
9391I05668n86407J24653R71442l68874o62897L42016l87973O94861K87208m25528
9381H94169n76491p01087J69346L31619L84631k04081q5108K31719J140827n50087
9371A035457j68948m90703q28175N22650q5912K4067J373917L12427j065675j055885
9361d26780j4165Q15485j45250J375354m40983m54971j00083j70139M98695P1440
9351A008603J51169o68713K99863K39658n46148N80298K99859n01681K29214k26122
$$ plain form
9421 601974 856320 1251617 343416 167824 1036055 128892 334654 731989 1012118 -277980
9411 -277980 256381 620434 -311388 -240312 858099 658709 128175 560717 913836 602988
9401 602988 1143404 542719 476840 1686764 1171736 914758 264410 513517 750891 905668
9391 905668 319261 443914 1415356 1046482 383585 725601 337628 1032489 1319697 894169
9381 894169 317678 -383409 -214063 117556 502187 298106 212998 444717 1585544 1035457
9371 1035457 866509 375806 -452369 70281 -15631 8436 1382353 1694780 629105 -426780
9361 -426780 -440945 374540 229290 1604644 1163661 708690 608607 438468 937163 1008603
9351 1008603 1159772 491059 790922 1030580 484432 1064730 1364589 862908 1092122 866000
9341H66000O5758n16323k22273J100571O06044k90552n29627j02150L19989K69926
9331A567363l97640k85495R52247O23888n84896j094617N38356j96712q69030
9322B53464o51044M40459O56273M4837l6646j67072Q79L74477K13953K59260j72399
9311A216441M71429l06726o03377M36220j06457k42239J79718M36705L70586m86927
9301A365373o15731k3600n09557J57501j11399M59135j02861r76800J258055L05615
9291A205731l79361j48711Q69524n8331n64621K25478o85941N61920O02727n0676
9281A577739j33160K2220q21983K90626m36903M78686j05623p7873l37912k42359
9271B13458j71079Q43812p0521n35637O29566K94535l56011o10781J8644J67086
$$ plain form
9341 866000 931758 415435 193162 1293733 1899777 1609225 1079598 977448 1297437 1567363
9331 1567363 1169723 884228 1836475 2460363 1875467 780850 1319206 1122494 253464
9322 253464 -397580 42879 699152 743989 707343 540271 541150 915627 1129580 1388840 1216441
9311 1216441 1687870 1381144 777767 1213987 1107530 865291 1045009 1481714 1852300 1365373
9301 1365373 749642 726042 216485 373986 262587 721722 618861 -357939 900116 1205731
9291 1205731 826370 677659 1547183 1488852 924231 1149709 463768 1025688 1628415 1577739
9281 1577739 1444579 1466799 644816 935442 498539 977225 871602 793729 455817 213458
9271 213458 42379 886191 815670 280033 909599 1204134 848123 237342 255986 423072
9261D23072L79904N34971j72203q91026k52358Q7229K66759K387O65033K40529
9251A284297j25904k40408O47605k00584j11478j85275p98119k56407M58107K13874
9241F85708o17335O19284O63539k70372j87231j59491p03485l81392J05164P51888
9231E06277j8420k32835P529P32766j71498N32490q65359K36953Q62927n07765
9221A083065J44690j03614K65307L24697L49200q79050r58786R57154k95180q57378
9211C0105R53177K39741j0139k30306N91554p61357Q87917j34576j51437O3527
9201A478206N605N72839L70692o69520k21870k71027n75690J41816P04985m89018
9191A047018o91881L62610N74723J06751j13240p1609j01439J45198m47870O20464
$$ plain form
9261 423072 802976 1337947 1165744 274718 22360 109589 376348 378735 1043768 1284297
9251 1284297 1158393 917985 1565590 1365006 1253528 1068253 270134 13727 471834 685708
9241 685708 68373 687657 1351196 1080824 893593 734102 30617 -350775 -245611 506277
9231 506277 487857 255022 262551 995317 823819 1356309 490950 727903 1590830 1083065
9221 1083065 1227755 1124141 1389448 1714145 2063345 1184295 225509 1182663 887483 30105
9211 30105 983282 1223023 1212884 982578 1574132 812775 1700692 1566116 1414679 1478206
9201 1478206 1483811 2056650 2427342 1757822 1535952 1264925 689235 831051 1536036 1047018
9191 1047018 355137 717747 1292470 1399221 1285981 1214372 1112933 1258131 810261 1430725
9181A430725O99852K12092p22179J34984l31242l49058M76064L74360K79762l43996
9171A861364r00374M38251N5954o76390k38269P27797n95891n31088N60905k20544
9161D81715O45207Q71570k37569m87029J42310R8143N2422R84284R1240l58675
9151B283618q7836j92101k2562o99809J40764l3042M1865o35317J6628j07595
9141G04613N71664J34402j08490L89633m89339K56970o56011J46184N04790r74659
9131D79757K28637J50532K20673o0352m0813L04973l43877L52973r9811L10192
9121A502884J14890M71464N04068l95571M94784m09994J10812o65939l46774L71445
9111A752069l97830k24226K23700j9917l45701m6108L30913R39337q33648J55309
$$ plain form
9181 1430725 2130577 2342669 1620490 1755474 1424232 1075174 1551238 1925598 2205360 1861364
9171 1861364 960990 1399241 1455195 778805 540536 1268333 672442 141354 702259 481715
9161 481715 1126922 1998492 1760923 1273894 1416204 1514347 1566769 2551053 2642293 2283618
9151 2283618 2195782 2003681 1981119 1281310 1422074 1389032 1430897 795580 812208 704613
9141 704613 1276277 1410679 1302189 1691822 1202483 1459453 803442 949626 1454416 479757
9131 479757 708394 858926 1079599 1019247 978434 1283407 939530 1292503 1192692 1502884
9121 1502884 1617774 2089238 2593306 2197735 2692519 2282525 2393337 1727398 1380624 1752069
9111 1752069 1354239 1130013 1353713 1333796 988095 941987 1272900 2212237 1378589 1533898
9101A533898k29207k27051J82959N8675L59563m0566L7214n26365j91208N20731
9091A478643j59318J27059L99475n53162K24191J05497k80645j3208L14718l62313
9081A280937M71731O21454p85644M36386K97521K28m07436N75026p1817O4887
9071B483273J111K85165l73465L94018n31492J57266k13180q35746k83971M92097
9061A575076n43897n07025J343564J9800q2236p09336K84206M4042k70786N25198
9051A678606L95212j30346J88986j09284Q77733J02878l32856j57227j373817
9042A139885J58687J385321J236738K20090p39642q24244P92663n29850j40214
9033B699434Q04772l83127j3478j066456P58329K44554j108922M72520N89702
$$ plain form
9101 1533898 1304691 1077640 1260599 1319274 1678837 1638271 1675485 1149120 957912 1478643
9091 1478643 1319325 1446384 1845859 1292697 1516888 1622385 1341740 1328532 1643250 1280937
9081 1280937 1752668 2374122 1588478 2024864 2322385 2322613 1915177 2490203 2418386 2483273
9071 2483273 2484384 2769549 2396084 2790102 2258610 2415876 2202696 1366950 1082979 1575076
9061 1575076 1031179 524154 1867718 1887518 1805282 1095946 1380152 1424194 1153408 1678606
9051 1678606 2073818 1943472 2132458 2023174 2900907 3003785 2670929 2513702 1139885
9042 1139885 1298572 2683893 3920631 4140721 3401079 2576835 3369498 2839648 2699434
9033 2699434 3504206 3121079 3107601 2041145 2799474 3044028 1935106 2407626 2997328
9024B997328n57967N69725R71680R10911m64504m77405J97288j91521R3146j22961
9014C925720l42603j7800O34611K45523n84424L33720P03892j17916p92817m55963
9004C531943L16532j58262K90672L85376j23504k6953M95228q16616k32860L60865
8994D022421j45640m1326k09135P574m79074M9225L42816R1075j84506P63131
8984D216561r26501p65402N93085J240544M05934J38025L31336o0777K31779K92075
8974E696659j97404K56302o57580q49529K39790P26194k72900N78822k09142m62702
8964D848510r68633J15665K76904J89265k22959m46050m8630n76584K15216k29802
8954C152902L62498n03668j47479N08030j00472p2215m89168m8700M19119R42913
$$ plain form
9024 2997328 2439361 3009086 3980766 4891677 4427173 3949768 4147056 3955535 4048681 3925720
9014 3925720 3583117 3565317 4199928 4445451 3861027 4194747 4898639 4780723 3987906 3531943
9004 3531943 3848475 3690213 3980885 4366261 4242757 4215804 4711032 3894416 3661556 4022421
8994 4022421 3876781 3835455 3626320 3633894 3154820 3204045 3546861 3637936 3453430 4216561
8984 4216561 3290060 2524658 3117743 4358287 4764221 4902246 5233582 5172805 5404584 5696659
8974 5696659 5499255 5755557 5097977 4248448 4488238 5214432 4941532 5520354 5311212 4848510
8964 4848510 3879877 3995542 4272446 4461711 4238752 3792702 3744072 3167488 3382704 3152902
8954 3152902 3515400 3011732 2864253 3372283 3271811 3199596 2710428 2661728 3080847 4023760
8944D023760j21462l90273L32140Q2041M12713j194692L7139l50340R8130j02979
8934B826177P59273Q69011o58496j87254j44477M48244J93439L40473n82050m12043
8924C452297N59349K86772M88462m99222K670L50552O29154o91056K23236j85298
8914D616916j44788R7062R83617m11674o25012J100332Q40423o55690K81289l76255
8904E706220K54576O29925L19247L84180l14047Q26372q8409j080489k53657P91118
8894G175036o35034m92981R32901j33746k07370p29553o8078N64833O4132n06168
8884E963972n23552J53955J34156K61785M60026L05715k83017L05448k0138K75858
8874G034208M28804M28732o15798n9929M71219J192771k36980k20110K2265M90445
$$ plain form
8944 4023760 3902298 3512025 3844165 3926206 4338919 3144227 3181366 2831026 2929156 2826177
8934 2826177 3585450 4454461 3795965 3608711 3464234 3912478 4105917 4446390 3864340 3452297
8924 3452297 4011646 4298418 4786880 4287658 4290328 4640880 5270034 4578978 4802214 4616916
8914 4616916 4472128 4569190 5552807 5141133 4516121 5616453 6456876 5801186 6082475 5706220
8904 5706220 5960796 6590721 6909968 7294148 6980101 7806473 7718064 6637575 6383918 7175036
8894 7175036 6540002 6047021 6979922 6846176 6638806 5909253 5841175 6406008 6470140 5963972
8884 5963972 5440420 5594375 5728531 5990316 6450342 6756057 6473040 6778488 6758350 7034208
8874 7034208 7463012 7891744 7275946 7216017 7687236 8880007 8643027 8422917 8445182 8935627
8864H935627J050631o06961m24987N18260m4198M41006J77419j46413m11594n00702
8854H988088j113869M17425O31122m25226r04603p45670R18096K55001R6906k58529
8844G858741K70677p08742L20543P76010Q7403K67618K9423l280m21293N22557
8834H999657l20521q15313O06660p347J902P55542l50862K84776m15162L01832
8824I041164m62390r76663N59932K33008m34585L20953P75172N75375J53313P7708
8814I862987o37575q47806Q99470J97417m35962M16280M78393M04478O07958j156365
8804I789275q29932q62p3174J74156j51074n49528l52695J05991L39936L40111
8794H792204K96718o75964Q5436J211271Q69384K510q32234K63202R15027j38676
$$ plain form
8864 8935627 9986258 9379297 8954310 9472570 9428372 9869378 10046797 9900384 9488790 8988088
8854 8988088 7874219 8291644 8922766 8497540 7592937 6847267 7765363 8020364 8117270 7858741
8844 7858741 8129418 7420676 7741219 8517229 8604632 8872250 8901673 8898393 8477100 8999657
8834 8999657 8679136 7863823 8470483 8463136 8465038 9220580 8869718 9154494 8739332 9041164
8824 9041164 8578774 7602111 8162043 8395051 7960466 8281419 9056591 9631966 9785279 9862987
8814 9862987 9225412 8377606 9277076 9474493 9038531 9454811 9933204 10337682 10945640 9789275
8804 9789275 8959343 8958481 8885307 9059463 8908389 8358861 8006166 8112157 8452093 8792204
8794 8792204 9088922 8412958 8498394 9709665 10579049 10581559 9749325 10012527 10927554 10788878
8784A0788878L59604N35589N23903J541L26947l35152q60548N44704N91612M94977
8774A2972055K85407l45034l60131K7295l41337J48727o54536q7444m18281K06948
8764A1433669j7679L93752J100885p0352J56461j012442L99170O52010j86023
8755A2849451J37026K53736P56069M66711N35479J176615O60347q43850o55983
8746A5335601P24278P39299L73459p9022N79499M33763p54720R73202J250959
8737A9576318L12120M9126J065143M71847L63566P26163L59326J001873J027020
8728B4952502Q94104R93554K109511K014632J809669K574178L492654L726508
8720D2567312M024596N079426M586979P093291Q972283J0145394J3546431J4938038
$$ plain form
8784 10788878 11148482 11684071 12207974 12209515 12536462 12201310 11340762 11885466 12477078 12972055
8774 12972055 13257462 12912428 12552297 12579592 12238255 12386982 11732446 11645002 11226721 11433669
8764 11433669 11415990 11809742 12910627 12840275 12996736 11984294 12383464 13035474 12849451
8755 12849451 12986477 13240213 13996282 14462993 14998472 16175087 16835434 15991584 15335601
8746 15335601 16059879 16799178 17172637 17093615 17673114 18106877 17352157 18325359 19576318
8737 19576318 19888438 19937564 21002707 21474554 21838120 22564283 22923609 23925482 24952502
8728 24952502 25846606 26840160 28949671 30964303 32773972 35348150 38840804 42567312
8720 42567312 46591908 51671334 56258313 63351604 72323887 82469281 96015712 110953750
8712A10953750J2732401N474421p600142j8382827j7899419j3886230j0240460
8705F1151494p209322o388009m471310l788769k394701k310167p11869l04575
8697C3572772j981336j322018r49671p31593j078633K09090l04339o07760l28978
8688B6477534m06050r71449m5361o42653p96980k70378q0025m16608q70620M27975
8678B2405385J70811n82545m64320P94039o76981k74916K40493l28670K18252
8669B1501548r82262l04995J99466P82303l25177K52822N28111m30430o54594
8660B0566792J403371K47482o85073m90052n11547K27559J68161L13061N88124
8651B1827878O0901O83739n60884k54935k6456M66765K74833j011025K63527o01640
$$ plain form
8712 110953750 123686151 129160572 121560430 103177603 85278184 71391954 61151494
8705 61151494 53942172 47554163 43082853 39294084 36899383 34589216 33877347 33572772
8697 33572772 31591436 30269418 29319747 28588154 27509521 27718611 27414272 26806512 26477534
8688 26477534 26071484 25100035 25054674 24412021 23615041 23344663 23264638 22848030 21977410 22405385
8678 22405385 22576196 21993651 21529331 22323370 21646389 21371473 21611966 21283296 21501548
8669 21501548 20519286 20214291 20413757 21196060 20870883 21123705 21651816 21221386 20566792
8660 20566792 21970163 22217645 21532572 21042520 20530973 20758532 20926693 21239754 21827878
8651 21827878 21888779 22572518 22011634 21756699 21730243 22197008 22471841 21460816 21724343 21122703
8641B1122703R79726P36639l54359K25579Q36608m37207o73835J80039k49987
8632B2365906r37665P88500Q37311j026n4222R41685M45271k2610N42277l12909
8622B4592518j14513L76326j67397M41009J138744J43045j86661N86233J065680
8613B7874984j81005n80432Q4608J106025R86688j9529r591P16481N54418R32680
8603C1465327J80620K91171r0001J53637O65551N10166K99877O10564R30225L72710
8593C5389847k00566L94612J363451N16090R15710M95869Q3321K34662K9230m56211
8583C8766015K380990J341244N74531j28148J733728J014208Q00530P20244J283812
8574D8487154P33817J051841J415447M01321J319990J138596R60075R47413J083871
$$ plain form
8641 21122703 22102429 22839068 22484709 22710288 23546896 23109689 22435854 22615893 22365906
8632 22365906 21428241 22216741 23054052 23053026 22998804 23940489 24385760 24363150 24905427 24592518
8622 24592518 24478005 24854331 24686934 25127943 26266687 26409732 26223071 26809304 27874984
8613 27874984 27693979 27113547 27198155 28304180 29290868 29271339 29261748 29978229 30532647 31465327
8603 31465327 31645947 31937118 31847117 32000754 32666305 33176471 33476348 34086912 35017137 35389847
8593 35389847 35189281 35583893 36947344 37463434 38379144 38875013 38958334 39192996 39222226 38766015
8583 38766015 41147005 42488249 43062780 42934632 44668360 45682568 46483098 47203342 48487154
8574 48487154 49220971 50272812 51688259 52089580 53409570 54548166 55508241 56455654 57539525
8565E7539525P32724J288926Q30981J784891J065784R48143K514197J630185J256871
8556F9592227J232203Q14163J543966K212017J931287J665554J637575J437813
8548H2066805L171363J878959J247731J438601K210652K976996L178749L400082
8540A01569938K686087K461159K745817L140016L874563K388259K603050L974647
8532A25443536M269803M591637L544166M689755M002419L918951M980954N961725
8524A61402946N314296N059762O193920N317367O461937O080526O984971P389646
8516B10205371O614941P326422P602495P120769Q409010Q392812P270857P773099
8508B70715776Q274671P628760P225133P092187R032739P368711P851611Q003599
$$ plain form
8565 57539525 58272249 59561175 60392156 62177047 63242831 64190974 66705171 68335356 69592227
8556 69592227 70824430 71638593 73182559 75394576 77325863 78991417 80628992 82066805
8548 82066805 85238168 87117127 88364858 89803459 92014111 94991107 98169856 101569938
8540 101569938 104256025 106717184 109463001 112603017 116477580 118865839 121468889 125443536
8532 125443536 129713339 134304976 137849142 142538897 146541316 150460267 155441221 161402946
8524 161402946 166717242 171777004 177970924 183288291 189750228 195830754 202815725 210205371
8516 210205371 216820312 224146734 231749229 238869998 247279008 255671820 262942677 270715776
8508 270715776 278990447 286619207 293844340 300936527 309969266 317337977 325189588 333193187
8500C33193187O838031P606639P980653P640627P155866P562776O652418O459923
8492C91090120O609446O524764O212667N682282N807678N772928N614627M891515
8484D38206027N417266N306195N515183N620134M970351N160823M502354M564723
8476D79263056M484030M761764L920245L583395L198773L337993K527646J889218
8468E06966120K418500J580805K14957Q81647P85172M3356j86981p83662j612402
8459E10307512j839509k641748k667083l696743l800836m707280n206372n550559
8451D80197382n461164o496465o902575n964622p153314q855124p207146p108957
8443D25048015q063095q300026q151330q589911r110087r487389r626560q741267
$$ plain form
8500 333193187 340031218 347637857 355618510 363259137 370415003 377977779 384630197 391090120
8492 391090120 397699566 404224330 410436997 416119279 421926957 427699885 433314512 438206027
8484 438206027 443623293 448929488 454444671 460064805 465035156 470195979 474698333 479263056
8476 479263056 483747086 488508850 492429095 496012490 499211263 502549256 505076902 506966120
8468 506966120 509384620 510965425 511180382 512062029 512847201 512890557 512703576 511919914 510307512
8459 510307512 508468003 505826255 503159172 499462429 495661593 490954313 485747941 480197382
8451 480197382 474736218 468239753 461337178 455372556 448219242 439364118 432156972 425048015
8443 425048015 416984920 408684894 400533564 391943653 382833566 373346177 363719617 354978350
8435C54978350r424186r409961r371969r010950q891010r330520r382975r293102
8427B80863677p382572p505370p680768p918731p159676o425460o497433n873104
8419B24420563o295711n432121n386935m236934m186833l770269l778347l486255
8411A87847158m134167l568528l397480k434465k131410k034572k365536k178181
8403A65602819k921664k216993j385919j006470j8001k471257j066004k40829
8395A54275682j131566j030521j39552J097826K26228L34788p90918K44645N33010
8386A53619622M31794M92530O87304J511659J559794R12483Q24436J699983K444666
8377A64184271K403592J844643J100578K615636K489928J790374K823702L621000
$$ plain form
8435 354978350 345554164 336144203 326772234 317761284 308870274 299539754 290156779 280863677
8427 280863677 273481105 265975735 258294967 250376236 243216560 236791100 230293667 224420563
8419 224420563 218124852 212692731 207305796 203068862 198882029 195111760 191333413 187847158
8411 187847158 183712991 180144463 176746983 174312518 172181108 170146536 167781000 165602819
8403 165602819 162681155 160464162 159078243 158071773 158053772 155582515 154516511 154275682
8395 154275682 153144116 152113595 151974043 153071869 153298097 153632885 152841967 153086612 153619622
8386 153619622 154051416 154543946 155231250 156742909 158302703 159215186 160039622 161739605 164184271
8377 164184271 166587863 168432506 169533084 172148720 174638648 176429022 179252724 182873724
8369A82873724L855906K458686K787167L383001L967234L586544L095805K101083
8361B08109150L179183L311827K242507K314840K572143K400478J518254Q81588
8353B26529970O41238J434839J526226L08145M69984m74342j55253N15766m65529
8344B30331044J37895M02910j14027n08270m79784O42858J194505r69873K33272
8335B30870530J215489P64539P32788N50595Q39444N72789J86132J169912J695436
8326B38597654q40977R97112J14803j84820n13414j166351j220286j252543j804829
8317B32726349j242310k389798l631597l054801j932992l490487l030734l003209
8309B10950421l565429m108911l325892l272346l553083k621632l014286k727686
$$ plain form
8369 182873724 186729630 189188316 191975483 195358484 199325718 202912262 206008067 208109150
8361 208109150 211288333 214600160 216842667 219157507 221729650 224130128 225648382 226529970
8353 226529970 227171208 228606047 230132273 230440418 230910402 230436060 230280807 230796573 230331044
8344 230331044 230468939 230871849 230757822 230249552 229769768 230412626 231607131 230637258 230870530
8335 230870530 232086019 232850558 233583346 234133941 234973385 235546174 235732306 236902218 238597654
8326 238597654 237756677 238753789 238868592 238683772 238170358 237004007 235783721 234531178 232726349
8317 232726349 231484039 229094241 225462644 222407843 220474851 216984364 213953630 210950421
8309 210950421 207384992 203276081 199950189 196677843 193124760 190503128 187488842 184761156
8301A84761156l682485l141473k977262k009720k136175k609671j742932k505122
8293A63956316k391770k628784k612008j476919k038180j747497k327706k324368
8285A46409084k395678k134978l378604k570857l582087l297070k155175k095408
8277A24799227k728647k787443l375379k411423k525090k651155l038492k879486
8269A02402112k165043k192891j709870k407141k221648k591695j718358r74716
8261H6420750k590195j573233r40001j943970k700096j440676n69750j553856
8253G3108973j708417j550478j359846k001316o14284r94213j376454r79651j239544
8244F1284770j834339j076967L69352r6582o79083r41666j427698q14004l39881
$$ plain form
8301 184761156 181078671 177937198 174959936 172950216 170814041 168204370 166461438 163956316
8293 163956316 161564546 158935762 156323754 154846835 152808655 151061158 148733452 146409084
8285 146409084 144013406 141878428 138499824 135928967 132346880 129049810 126894635 124799227
8277 124799227 122070580 119283137 115907758 113496335 110971245 108320090 105281598 102402112
8269 102402112 100237069 98044178 96334308 93927167 91705519 89113824 87395466 86420750
8261 86420750 83830555 82257322 81317321 79373351 76673255 75232579 74662829 73108973
8253 73108973 71400556 69850078 68490232 66488916 65874632 64880419 63503965 62524314 61284770
8244 61284770 59450431 58373464 58742816 58646234 57967151 57025485 55597787 54783783 54443902
8235E4443902j27266p94007j266083j322420K40767m69256j206739l55261j39985
8226D9003652k34382j022744q21408n18875r29295o48909q12306k01048k55652
8217D3559033M08289n69572o96874k27141J21140k05861P0476k0822j571166O5877
8207D0933379j52409j9553J27812K35115q4277o37020q77105n74817J191315j02313
8197D0040127k63834k97818r12561L24846j067377K707018J000749j122599L17775
8188D0726326j35873p72957J37065K06047k54319k57502K11835M26838m94958
8179C9792502R32702J030143p12409k42987Q7776m70915K263N40325J079024P65190
8169D2803614j12791M91347P93947L85557R31311J164190n93351P88702J220297
$$ plain form
8235 54443902 54316636 53522629 52256546 50934126 51174893 50705637 49498898 49143637 49003652
8226 49003652 48769270 47746526 46925118 46406243 45476948 44828039 44015733 43814685 43559033
8217 43559033 43967322 43397750 42700876 42473735 42594875 42389014 42459490 42438668 40867502 40933379
8207 40933379 40780970 40761417 40889229 41124344 41040067 40403047 39525942 38951125 40142440 40040127
8197 40040127 39776293 39478475 38565914 38890760 37823383 40530401 41531150 40408551 40726326
8188 40726326 40590453 39817496 39954561 40160608 39906289 39648787 39860622 40287460 39792502
8179 39792502 40725204 41755347 41042938 40799951 40887727 40416812 40419075 40959400 42038424 42803614
8169 42803614 42690823 43182170 43976117 44361674 45292985 46457175 45863824 46652526 47872823
8160D7872823j93460J46423N01341O75517M14726J083001M49136L93967L79065
8151E1722539J410234O80641N36301R06962O73651J181821P88748M21619J470187
8142E9792703J561414J393898J082352J108334J406633J129751J819044J429573
8134G0723702J229198J338180J351651J859333K064713K475397K058722K438089
8126H5538985J591341J244685K816776L092677K218653L315089K940556K051323
8118A04810085K942522K870213K905690M379988L775665K902627L931665M160773
8110A32679228M480660M121135M524043M559980M893770N099426M182631N942773
8102A70483646N419313N042473N821084N341437N478556N740377N614427N541631
$$ plain form
8160 47872823 47679363 47825786 48327127 49002644 49417370 50500371 50949507 51343474 51722539
8151 51722539 53132773 53813414 54349715 55256677 55930328 57112149 57900897 58322516 59792703
8142 59792703 61354117 62748015 63830367 64938701 66345334 67475085 69294129 70723702
8134 70723702 71952900 73291080 74642731 76502064 78566777 81042174 83100896 85538985
8126 85538985 87130326 88375011 91191787 94284464 96503117 99818206 102758762 104810085
8118 104810085 107752607 110622820 113528510 117908498 121684163 124586790 128518455 132679228
8110 132679228 137159888 141281023 145805066 150365046 155258816 160358242 164540873 170483646
8102 170483646 175902959 180945432 186766516 192107953 197586509 203326886 208941313 214482944
8094B14482944M913370M668471M902425L357167M062412L022496K793799J393507
8086B43596591R07532J705678o61149m70915j25055n25717q21909j120657j223539
8077B41260860j559900j258175n44282j064747j680891j046085p11510l98131
8069B32997139l20728m14291K19800n50640L4386l18018L54931m32230j070830
8060B30499519K06850j24961q89466N51131N49140j205911j235398k005762j735448
8051B24609694k528852l490712k798937l044684l503529l612953m002917m890499
8043A96736611n117626m332805n366127n402231n415654n099372n166146n910909
8035A54925741m818116m365669n099642m468980l800620m374559m524064l412411
$$ plain form
8094 214482944 219396314 224064785 228967210 232324377 236386789 239409285 242203084 243596591
8086 243596591 244504123 246209801 245548652 245077737 244952682 244426965 243605056 242484399 241260860
8077 241260860 239700960 238442785 237898503 236833756 235152865 234106780 233395270 232997139
8069 232997139 232676411 232262120 232481920 231931280 231965666 231647648 232002579 231570349 230499519
8060 230499519 230706369 230581408 229691942 230243073 230792213 229586302 228350904 226345142 224609694
8051 224609694 222080842 218590130 215791193 212746509 209242980 205630027 201627110 196736611
8043 196736611 191618985 187286180 181920053 176517822 171102168 166002796 160836650 154925741
8035 154925741 150107625 145741956 140642314 136173334 132372714 127998155 123474091 120061680
8027A20061680l382783l601181l247223l746151k704401l105528l922906j486148
8019I4865359k644488k607178k778009k780542j293805k603470k563307j351858
8011G6242702k053639j753185k196627j542326j205077j250951j669899l036839
8003F1534159k185172p33546j256771j729548M53901j024020j019787k150775
7995E1888441r88175r85919j672191q89507n29930o08312j107648j564217p29376
7986D2813166m36925j091446r22281l41072j04844n67355o59157j132810n20944
7977C7036332q00809p75795k09861n93965J79880n38789j101201k8682m39152
7968C2727958j060439j104876K34237j65165p53854r68004k40845n21048m95618
$$ plain form
8027 120061680 116678897 113077716 109830493 106084342 103379941 100274413 96351507 94865359
8019 94865359 92220871 89613693 86835684 84055142 82761337 80157867 77594560 76242702
8011 76242702 74189063 72435878 70239251 68696925 67491848 66240897 64570998 61534159
8003 61534159 59348987 58615441 57358670 55629122 56083023 55059003 54039216 51888441
7995 51888441 50900266 49914347 48242156 47352649 46822719 46214407 45106759 43542542 42813166
7986 42813166 42376241 41284795 40362514 40021442 39916598 39349243 38690086 37557276 37036332
7977 37036332 36235523 35459728 35249867 34655902 34835782 34296993 33195792 33167110 32727958
7968 32727958 31667519 30562643 30796880 30631715 29877861 28909857 28669012 28147964 27652346
7959B7652346n82077P4588l54275p38312n25383l65760k0735l86154o01494m89892
7949B3662852o38612N1372j032483M1380J91363n82913O5815K1054p97172l04250
7939B0678406k2650L6030n27317n83787o11516l60704N62655l24871l71530r6673
7929A8378043m92198l60976M3911K96771l39138j000874M98652O2781n64153K26944
7919A6749763L58803n31864k56574m81383j58139Q9004k26933j013658q59538
7910A3669481J20436L5245P61938O10035N1295N3616m28233K2756j182324o02786
7900A3111459L39592O28293m69665j368614R4375j87657m06208l2332R6890K06661
7890A2012794K04037j24569m08360K83611q2796P0756q43921n02642k87602j84814
$$ plain form
7959 27652346 27070269 27144857 26790582 26052270 25526887 25161127 25140392 24754238 24152744 23662852
7949 23662852 23024240 23075612 22043129 22084509 22275872 21692959 21758774 21779828 20982656 20678406
7939 20678406 20655756 20691786 20164469 19580682 18969166 18608462 19171117 18846246 18474716 18378043
7929 18378043 17885845 17524869 17568780 17865551 17526413 16525539 17024191 17086972 16522819 16749763
7919 16749763 17108566 16576702 16320128 15838745 15680606 15769610 15542677 14529019 13669481
7910 13669481 13789917 13825162 14587100 15197135 15248430 15302046 14873813 14896569 13714245 13111459
7900 13111459 13451051 14079344 13609679 12241065 12335440 12147783 11741575 11709243 11806133 12012794
7890 12012794 12216831 12092262 11683902 11967513 11884717 11955473 11111552 10608910 10321308 10136494
7880A0136494N11059j4868K09356n91862l0514M24562M67621k9823q00097r3643
7870A0188285k52476m21462j31763p8514k83419K0421M49871J07065m71514L9961
7860I166455n08480l12761K33952l04381j09565P6944Q29391J048847j302263
7851H818139l40396K3259L84617O14020j29799l79308p2343n69880N15365O37437
7841I501111j015536k60662k53482Q3613J44759m66772k53178m60064M02224J42403
7831G564416q94628o5734J29189p2645J01858Q57722N7811p25021l8439Q32279
7821G746808l48316j542587L64583P00513l49414m5854O5839p3388J92919M69554
7811G180657R13669m37790R3985j200200m49166J554765m16666L26551k98876
$$ plain form
7880 10136494 10647553 10632685 10842041 10250179 10219665 10644227 11111848 11082025 10281928 10188285
7870 10188285 9935809 9514347 9382584 9304070 9020651 9041072 9490943 9598008 9126494 9166455
7860 9166455 8657975 8345214 8579166 8274785 8165220 8242164 9071555 10120402 8818139
7851 8818139 8477743 8501002 8885619 9499639 9369840 8990532 8918189 8348309 8863674 9501111
7841 9501111 8485575 8224913 7971431 8055044 8199803 7733031 7479853 7019789 7422013 7564416
7831 7564416 6669788 6604054 6733243 6660598 6762456 7620178 7677989 6952968 6914529 7746808
7821 7746808 7398492 5855905 6220488 6921001 6571587 6525733 6591572 6518184 6711103 7180657
7811 7180657 8094326 7656536 7750521 6550321 6101155 7655920 7239254 7565805 7266929
7802G266929m53544O91107M65845j979684L25923p7112l08569O1092P7524O2378
7792F131889l83576j22401l76875j80782J166111l74947n03855O59957n58686
7783E456835L57024J87625l72514q82194l85690N42566J16745k35252M81504N66496
7773E833145l89418j136155Q06340Q23691o24967M7917k57625l32347L50594R83831
7763F105006k23775p52506K00564K24863m26845M53186l53159m77329N50019m90616
7753D809408K27560P38858j76724N8743K19472k45379j86312R87786q73106p75293
7743D785013J81166l36766L80566L78506k22502L04962n43696j77408M69951l6094
7733E183698K62113k10468m43066P0426O62199k02927K62191K14333r49960N689
$$ plain form
7802 7266929 6813385 7504492 7970337 5990653 6316576 6239464 5930895 5991987 6069511 6131889
7792 6131889 5748313 5625912 5249037 5068255 6234366 5859419 5355564 6015521 5456835
7783 5456835 5813859 6001484 5628970 4746776 4361086 4903652 5020397 4785145 5266649 5833145
7773 5833145 5443727 4307572 5113912 5937603 5312636 5360553 5102928 4770581 5121175 6105006
7763 6105006 5881231 5128725 5329289 5554152 5127307 5580493 5227334 4750005 5300024 4809408
7753 4809408 5036968 5775826 5599102 5657845 5877317 5631938 5445626 6433412 5560306 4785013
7743 4785013 4966179 4629413 5009979 5388485 5165983 5470945 4927249 4749841 5219792 5183698
7733 5183698 5445811 5235343 4792277 4862703 5524902 5321975 5584166 5798499 4848539 4854228
7723D854228L63194p00233N68235J83331k78836n45320k46206K11160j342O65376
7713E073587l5826P76488M44898j253619l00955R4620l83771p0260K42976O60721
7703E248859L30149l3737o86509j55158M74494n4725P33559p69293n3060R51880
7693E986459J49297j09093r39143j67959N07532k24058P6519M12545j19459r0043
7683E482597o96237m46130P70144M35988M04500j094957J31797n38694O49603
7674E098611O42216j022079J55437J15660M45882N31913j92357l71710k32370
7665E171203J19492k28944l59934J054569o28105l61415N8538m97120k0584k31465
7655D076235L53223j94459m68827k84790O02183R68944p89133K7643q7297L05803
$$ plain form
7723 4854228 5217422 4517189 5085424 5268755 4989919 4444599 4198393 4409553 4408211 5073587
7713 5073587 5037761 5814249 6259147 5005528 4704573 4799193 4415422 4345162 4588138 5248859
7703 5248859 5579008 5545271 4858762 4703604 5178098 5123373 5856932 5087639 5034579 5986459
7693 5986459 6135756 6026663 5087520 4919561 5427093 5203035 5279554 5692099 5572640 5482597
7683 5482597 4786360 4340230 5110374 5546362 5950862 4855905 4987702 4449008 5098611
7674 5098611 5740827 4718748 4874185 4989845 5435727 5967640 5775283 5403573 5171203
7665 5171203 5290695 5061751 4701817 5756386 5128281 4766866 4825404 4328284 4307700 4076235
7655 4076235 4429458 4234999 3766172 3481382 4083565 5052509 4263376 4291019 4203722 4509525
7645D509525P60317o31811m05619k99501L29304L88469O90378K45914j3632n28284
7635E045060j63961N26993m20259n03624K42912j32891j19802p6534k11671p88699
7625C397524R88247N78416l49236k88466k63657J403293N01811P4584m36808k68622
7615E337086J74766k46984Q4914N17534M12194J77825k55190K21546r17807j476413
7605D029471N25024J21897J336559j33926p10974L2562J01706M070M41693l14727
7595E433355L03790L93423m79266Q87715L47371m67728k94239Q61481M2258k57374
7585F770786l63582l26268L14777N54500n5122O66270j224237N82964J72304j50019
7575F942373n35506O75208Q43064K57546o75509n78628K1022l51260O07735J80504
$$ plain form
7645 4509525 5269842 4638031 4232412 3932911 4262215 4650684 5341062 5586976 5573344 5045060
7635 5045060 4881099 5408092 4987833 4484209 4727121 4594230 4474428 4397894 4186223 3397524
7625 3397524 4385771 4964187 4614951 4326485 4062828 5466121 5967932 6042516 5605708 5337086
7615 5337086 5511852 5264868 5349782 5867316 6279510 6457335 6202145 6423691 5505884 4029471
7605 4029471 4554495 4676392 6012951 5879025 5168051 5200613 5302319 5306389 5748082 5433355
7595 5433355 5737145 6130568 5651302 6539017 6886388 6418660 6124421 6985902 7028160 6770786
7585 6770786 6407204 6080936 6395713 6950213 6895091 7561361 6337124 6920088 7092392 6942373
7575 6942373 6406867 7082075 7925139 8182685 7507176 6928548 6949570 6598310 7206045 7386549
7565G386549j91083j48003j23791J134707M7432j57591n48993J30833J109783
7556H639843l26696L75016Q4183o86646q80J41687K99625O59327K55710q43793
7546H597376k20430N97928O00214m59253k77182n8728l76450J74575m17159Q11197
7536H972088J104775J86100k29560K42100L65513P24984p29669P1504M15604J36245
7526A1259684j71376M22498N05099j04322m15627O07274O08129L4940l48707N61824
7516A2959416q32984n91420J457363R46817K36409k29607m15556J94322K18716
7507A3943476K31691M85089m53412L37325P31734m61739K16460O89682m48862
7498A5271444J013000R46132L88438J077860J57438p03143P44937K98187L21141
$$ plain form
7565 7386549 7195466 7047463 6923672 8058379 8105811 7948220 7399227 7530060 8639843
7556 8639843 8313147 8688163 8772346 8085700 8084820 8226507 8526132 9185459 9441169 8597376
7546 8597376 8376946 8974874 9575088 9115835 8838653 8779925 8403475 8578050 8160891 8972088
7536 8972088 10076863 10262963 10033403 10275503 10641016 11366000 10636331 10707835 11123439 11259684
7526 11259684 11088308 11510806 12015905 11911583 11495956 12103230 12711359 12746299 12397592 12959416
7516 12959416 12126432 11535012 12992375 13939192 14175601 13945994 13530438 13724760 13943476
7507 13943476 14175167 14660256 14206844 14544169 15275903 14814164 15030624 15720306 15271444
7498 15271444 16284444 17230576 17619014 18696874 18854312 18151169 18896106 19194293 19515434
7489A9515434k90729M34387K49176L03870J322968Q99222L31600m64293J71681
7480B2473316O96409O43983k9823L28961L19482Q47719L4160N13111Q20116J486871
7470B8134305K89220j87281Q00409J266338R08675M22248O75398Q88168M49376
7461C3646856J5077Q27829P78017R45054N91745R79859J231887P79056J271730
7452D1067110Q99929J596432O65419J08499R91835J908027R69991J552955K432663
7443E2192860J089053J317488J251520J235963J373713J650758J883532J815153
7435F3810040J008048J682431K410652Q79785J778654K775629J556732J302894
7427G7204865K085140L086930K891667J633429K202680K444749J700751K714654
$$ plain form
7489 19515434 19224705 19659092 19908268 20212138 21535106 22434328 22765928 22301635 22473316
7480 22473316 23169725 23813708 23783885 24112846 24432328 25280047 25314207 25827318 26647434 28134305
7470 28134305 28423525 28236244 29036653 30302991 31211666 31633914 32309312 33197480 33646856
7461 33646856 33661933 34489762 35267779 36212833 36804578 37784437 39016324 39795380 41067110
7452 41067110 41967039 43563471 44228890 44337389 45329224 47237251 48207242 49760197 52192860
7443 52192860 53281913 54599401 55850921 57086884 58460597 60111355 61994887 63810040
7435 63810040 64818088 66500519 68911171 69790956 71569610 74345239 75901971 77204865
7427 77204865 79290005 82376935 85268602 86902031 89104711 91549460 93250211 95964865
7419I5964865K508199K033414K502181K416346J979593K002820J642674K560964
7411A13611056J029886K087419J458626J383777J714576J296180J008201Q71623
7403A24461344J102627J64787p25617m23864J59900j79475q75852j065144j158971
7394A21459735k239692j159499j801481j455926o38895k791923k953730j913177
7386A06505412j332371j985709k522916l023655j977549k385640l295962j694800
7378H8286810j213462j484900k193419k879682k858199j702484j575549j492089
7370G2887026k088664k543547k719044o60180r20672j654053j277095j164128
7362E9859643j338970j708729j309029k159463j086166j804509j196147m80388
$$ plain form
7419 95964865 98473064 100506478 103008659 105425005 107404598 109407418 111050092 113611056
7411 113611056 114640942 116728361 118186987 119570764 121285340 122581520 123589721 124461344
7403 124461344 125563971 125728758 125003141 124579277 124739177 124559702 123683850 122618706 121459735
7394 121459735 119220043 118060544 116259063 114803137 114164242 111372319 108418589 106505412
7386 106505412 105173041 103187332 100664416 97640761 95663212 93277572 89981610 88286810
7378 88286810 87073348 85588448 83395029 80515347 77657148 75954664 74379115 72887026
7370 72887026 70798362 68254815 65535771 64875591 63954919 62300866 61023771 59859643
7362 59859643 58520673 56811944 55502915 53343452 52257286 50452777 49256630 48776242
7354D8776242j268701n06690n67158j360650o28704k007117j531732m57387j020835
7345C9427268j186453k70729l47404j115557p65427j624518l12817j155988P8828
7336C2727203o17286q13901p53828r55949r06292l24591j066506k04846p97349
7327B6286655k30173o90206M3523q48983M2498o45372r53337N65531p41973l76897
7317B2451266j116077O57129o91081l31362o73369l29077n7606N02504p78754
7308A9633573p81662L42708r91861o87270m17872J6385R0916j033646N07896p29293
7298A5949874q68474J38180K18024p70510p41035n64749O36395j1263r91332K19384
7288A3214494L9204l30498J40387l07983J07170j0535j091608l30718K41717n19114
$$ plain form
7354 48776242 47507541 47000851 46433693 45073043 44444339 42437222 40905490 40448103 39427268
7345 39427268 38240815 37970086 37622682 36507125 35741698 34117180 33804363 32648375 32727203
7336 32727203 32109917 31296016 30542188 29586239 28679947 28355356 27288850 27084004 26286655
7327 26286655 26056482 25366276 25409799 24560816 24603314 23957942 23004605 23570136 22828163 22451266
7317 22451266 21335189 21992318 21301237 20969875 20296506 19967429 19909823 20412327 19633573
7308 19633573 18851911 19194619 18202758 17515488 17097616 17114001 17204917 16171271 16679167 15949874
7298 15949874 15081400 15219580 15437604 14667094 13926059 13361310 13997705 13986442 12995110 13214494
7288 13214494 13253698 12923200 13063587 12755604 12862774 12852239 11760631 11429913 11671630 11152516
7278A1152516R8562j36624r4716N57346o83786m84980m81099l76208Q3354l18341
7268I316024N52509m64333J45496m8317k32820J89248o22460Q97630p24234q90479
7258H118264K75342l48849n39212P83216P45536l65507r95773o7929j78380J29298
7248G556006l36569J03524k8331j90362j60120j90500O40979l7625l3903j99385
7238G123714l25471O2456j91037j63321l29428l6465o0649j69655N17338r1552
7228F335930n48252n96859L33144L16595P78094p61233q85322J24113j16367k50217
7218D729626o94604J294916l01750r1724n23510N86422M39133j91302k28224j41064
7208D877919j07515L04670O98862j173841k48165l98022L66332L02110P09205
$$ plain form
7278 11152516 11251078 11114454 11019738 11577084 10893298 10408318 9927219 9551011 9634365 9316024
7268 9316024 9868533 9404200 9549696 9501379 9268559 9457807 8835347 9732977 9008743 8118264
7258 8118264 8393606 8044757 7505545 8288761 9034297 8668790 7673017 7605088 7426708 7556006
7248 7556006 7219437 7322961 7294630 7104268 6944148 6753648 7394627 7357002 7323099 7123714
7238 7123714 6798243 6860699 6669662 6506341 6176913 6140448 6079799 5910144 6427482 6335930
7228 6335930 5787678 5190819 5523963 5840558 6618652 5857419 4972097 5096210 4979843 4729626
7218 4729626 4035022 5329938 5028188 4936464 4412954 4999376 5438509 5247207 5018983 4877919
7208 4877919 4770404 5075074 5773936 4600095 4351930 3953908 4320240 4622350 5331555
7199E331555j61377o79434L72081N35667Q3809n41726r58731P8188l75935j25527
7189C558570L54611J34471k66192R9597N13209o78545k70076m32423L21963K46063
7179C581248M43823O3120k98525L27625j007160K02421J85282R89825M48622j333305
7169C602976j005652q77829R78120M06080l1231J86869o01977J13986P01609m61157
7159C011794L90243l68933r55397M47625K89527J79320m96803n40993k98504K72885
7149A930764O81222K8404O93483p01411j15655l6155p9310K13020k77020l60848
7139A976494J095186k46042L2201Q2685M07170j06953m79746p719N1921K27648
7129C032845L9265j32192M1794L15936l2920L68509j141832q54858o51588Q90885
$$ plain form
7199 5331555 5170178 4490744 4862825 5398492 5482301 4940575 3981844 4060032 3684097 3558570
7189 3558570 3913181 4047652 3781460 3881057 4394266 3715721 3445645 3013222 3335185 3581248
7179 3581248 4025071 4088191 3789666 4117291 3110131 3312552 3497834 4487659 4936281 3602976
7169 3602976 2597324 1719495 2697615 3103695 3072464 3259333 2657356 2771342 3472951 3011794
7159 3011794 3402037 3033104 2077707 2525332 2814859 2994179 2497376 1956383 1657879 1930764
7149 1930764 2611986 2640390 3333873 2632462 2516807 2480652 2401342 2614362 2337342 1976494
7139 1976494 3071680 2825638 2857839 2940524 3347694 3240741 2760995 2753276 2805197 3032845
7129 3032845 3072110 2939918 2981712 3297648 3264728 3633237 2491405 1636547 984959 1875844
7119A875844j79852n53525k73261O74253N94086M10647K6502l37306m17983N01046
7109B320451j69720n31710m78680Q34326j39333m29932J48450O22697R01068o41250
7099B436367N15376o72378l1381L59048m59770j19570R2706j1383P0243K88626
7089B467884K5383j092606m69132O26879J212179l45786j97610j55622n66952
7080A504617M44100j00244l16117j4945L58277l000J03029m81153k19172o31512
7070F43880m81071K88124J14399J50599L00953J06743k29172j141194M73831L98977
7060F26069J52994Q45564J046264n35032o32476L2260J61224r1549J41392k96534
7050A450176n21401P0853L89199o18813l33323R55101K15745n2731l11076j114189
$$ plain form
7119 1875844 1695992 1142467 869206 1543459 2137545 2548192 2574694 2237388 1819405 2320451
7109 2320451 2150731 1619021 1140341 1974667 1835334 1405402 1553852 2176549 3077617 2436367
7099 2436367 2951743 2279365 2247984 2607032 2147262 2027692 2120398 2109015 2179258 2467884
7089 2467884 2493267 1400661 931529 1558408 2770587 2424801 2227191 2071569 1504617
7080 1504617 1948717 1848473 1532356 1517411 1875688 1872688 1975717 1494564 1275392 643880
7070 643880 162809 450933 565332 715931 1016884 1123627 894455 -246739 227092 626069
7060 626069 779063 1624627 2670891 2135859 1503383 1535643 1696867 1605318 1746710 1450176
7050 1450176 928775 999628 1388827 770014 436691 1391792 1607537 1554806 1243730 129541
7040A29541M20701O98483o37222j8324j96638J188084K28406p74928L73466R938
7030A421507L13531K63300p04456p91300N1868Q34867K47621m17903m7902P25272
7020A896405q1264l67204m07907R34560J29233j52432k09657L09916l83838l99582
7010A268230j62787M27044K70632o6841j39022J78047l45448p89596K31063K54288
7000A125610m1177N37167L74870J5734l45466J3897j74440j09649l83967J022286
6990B034865j79438q8092M51466o15176j062279J58939r7965k44557J250298l05013
6980A303048L44460p21697j01017p4143k3465R00040k964p31095O94178j06290
6970A481055j21387M28430j1980l84356k24290l91010k56604N1239k07469L78075
$$ plain form
7040 129541 550242 1248725 611503 593179 396541 1584625 1813031 1038103 1411569 1421507
7030 1421507 1735038 1998338 1293882 502582 554450 1389317 1636938 1219035 1171133 1896405
7020 1896405 1815141 1447937 1040030 1974590 2103823 1951391 1741734 2051650 1667812 1268230
7010 1268230 1105443 1532487 1803119 1736278 1597256 1775303 1429855 640259 871322 1125610
7000 1125610 1084433 1621600 1996470 2012204 1666738 1680635 1506195 1396546 1012579 2034865
6990 2034865 1855427 1767335 2218801 1603625 541346 700285 602320 357763 1608061 1303048
6980 1303048 1647508 925811 824794 750651 727186 1627226 1624262 893167 1587345 1481055
6970 1481055 1359668 1788098 1776118 1391762 1167472 776462 519858 571097 363628 741703
6960G41703M75328J58745n00909N8569L24549J81328N61723J22617p6707k03165
6950A843781N1953J63921L54664J99204N374n36129N72279J157007q77548n91027
6940B343479J679516Q54553M98623K30722J356253J306676P20022J139559L42777
6931A0472180j391098j477906j035772j898135o60997m26891p14131n24263p08431
6922A634556j75104M42128l7439k02815n12593J95643P50701m38747l214j00274
6912A552842K36977o95189k31506O35101J20148J72350r6153m1895k28715j80457
6902A243503p04100M55502k35958l06896M7400l76350Q14075K64434q801n48982
6892F43827k01621O01425k28686O85452P87236p36653q52788R6968n43790l44736
$$ plain form
6960 741703 1217031 1375776 874867 933436 1257985 1439313 2001036 2123653 2046946 1843781
6950 1843781 1895734 2059655 2414319 2613523 2618897 2082768 2655047 3812054 2934506 2343479
6940 2343479 4022995 4877548 5376171 5606893 6963146 8269822 8989844 10129403 10472180
6931 10472180 9081082 7603176 6567404 4669269 4008272 3581381 2867250 2342987 1634556
6922 1634556 1459452 1901580 1864141 1661326 1148733 1344376 2095077 1656330 1653116 1552842
6912 1552842 1789819 1094630 863124 1498225 1618373 1790723 1694570 1652675 1423960 1243503
6902 1243503 539403 994905 758947 452051 499451 123101 937176 1201610 1192809 643827
6892 643827 442206 1043631 814945 1500397 2287633 1550980 698192 795160 251370 -93366
6882i3366K46775q108J51256P0326k24461M37727k59228R46816O36979k70017
6872A634699m74518l0439J65992p04819n35920k50283L26095P73120J64812l33237
6862G35502J66351l36409o14325N09414M2489j54826O83108l05738k33652r35063
6852d43149o0766K58293J01164N33125n29347L67834n55129P87140N45115o60486
6842C43794N11783J04739N19700j07174p38182j36948J78586J19591M2309k06806
6832F31392n96456R043M51910m6431n68645n60017l1566O00763P15783n81241
6822B4535j281394R54694k15810J56141J135933N54375o82743J3805j13800p03894
6812a58158J180297P35902J66493j347881n72261O84580j7670m36706m4644m85032
$$ plain form
6882 -93366 153409 145301 296557 366883 142422 580149 320921 1267737 1904716 1634699
6872 1634699 1160181 1129742 1295734 590915 54995 -195288 130807 903927 1068739 735502
6862 735502 901853 565444 -48881 460533 503022 348196 1031304 725566 491914 -443149
6852 -443149 -503915 -245622 -144458 388667 -140680 227154 -327975 459165 1004280 343794
6842 343794 855577 960316 1480016 1372842 634660 497712 676298 795889 838198 631392
6832 631392 34936 43979 495889 449458 -119187 -679204 -710770 -110007 605776 24535
6822 24535 -1256859 -302165 -517975 -361834 774099 1328474 645731 659536 545736 -158158
6812 -158158 1022139 1758041 1924534 576653 4392 688972 671302 234596 189952 -295080
6802b95080k16642K20983L4986j33547M90378n0625O82278m41990P20842m36792
6792E74791l21557K08239r21317R8039O07834l3057j77539R0318k99336J50139
6782b3446M85012l21935j38976n09617L86097L00739R8478k68715R7677J65389
6772B70703k37968q4060L81416j06338j41304N3083n1523r77756n1042K39742
6762g05047J31055N71520L13752k61782n58897L77346m86159M35436l9551k02150
6752d24477N61487L44746l11119m56871M31842R77445j872430L91744l28445k76132
6742i62210N22318L72362K39905J39208o3805l92221m02064o73544J150704k38810
6732c08157O95961J44060m52902L66123o74844k96033M7705l49018m68327J490932
$$ plain form
6802 -295080 -511722 -290739 -255753 -389300 101078 50453 732731 290741 1011583 574791
6792 574791 253234 461473 -459844 -361805 246029 212972 35433 125751 -173585 -23446
6782 -23446 461566 139631 655 -508962 -122865 177874 276352 7637 105314 270703
6772 270703 32735 -51325 330091 223753 82449 135532 84009 -893747 -944789 -705047
6762 -705047 -573992 -2472 311280 49498 -509399 -132053 -618212 -182776 -222327 -424477
6752 -424477 137010 481756 170637 -286234 145608 1123053 -749377 -357633 -686078 -962210
6742 -962210 -439892 -67530 172375 311583 247778 -144443 -546507 -1220051 -69347 -308157
6732 -308157 387804 531864 78962 445085 -229759 -525792 -478087 -827105 -1295432 195500
6722A95500J290590n58746o12554R2609r11786p47933N15896P06318n18387N37278
6712a1215k09270k96865l83915L95932L39277l74713j67907Q65323l84822l43442
6702e71617J84421Q39727k02478p18114J2173M89961j64031o13735R94893O70370
6692I21570m99279K09339o19433o28580j50267N95721m94913N57532o1920q21037
6682i91267J270734j94575O49430q31889j01395o6686j49909O24306Q15257o18897
6672D05109l65769j59444L57479j07253J52233r07168O989P58008M79401n69548
6662E0037l21405k5830Q25300K5985k97044K60405j64869j61176k76607k24067
6652c09271j03614j31085l3013Q20290k82284p44186L96503K01423J109583J54763
$$ plain form
6722 195500 1486090 927344 314790 407399 -504387 -1252320 -736424 -30106 -548493 -11215
6712 -11215 -220485 -517350 -901265 -505333 -166056 -540769 -708676 156647 -228175 -571617
6702 -571617 -387196 452531 250053 -468061 -455888 34073 -129958 -743693 251200 921570
6692 921570 422291 631630 12197 -616383 -766650 -170929 -665842 -108310 -170230 -991267
6682 -991267 279467 84892 734322 -97567 -198962 -265648 -415557 208749 1024006 405109
6672 405109 39340 -120104 237375 130122 282355 -624813 -617824 140184 619585 50037
6662 50037 -271368 -297198 528102 554087 257043 517448 352579 191403 -85204 -309271
6652 -309271 -412885 -543970 -576983 243307 -38977 -783163 -386660 -185237 924346 1079109
6642A079109j006314J7921l50248K19523L77230M50923J38746n1735o04853k73724
6632c422K27375K73020n1823j54398n05313N11893j64520m03080K30708m45307
6622d84867J14875P3071J86485l37171j94157O18621l46735j65373L3965k13464
6612g14750O36600n16292Q88909L15338m31545q8341Q660J30248m42712n88352
6602h02237M42633O32396L8353o40010O8594M85226p15529M55856J37632J029989
6592A132903j049464l20252Q30528M52269j000526l03155N08005k07631j79800
6583a37123l06458M64543r66757j45271m498j81385O8948O61758j39105J31838
6573e53510j39127N94436j51123o45885j62922L37054O93043o8066l58207r8088
$$ plain form
6642 1079109 72795 90716 -259532 -40009 337221 788144 926890 875155 270302 -3422
6632 -3422 223953 496973 445150 290752 -214561 297332 132812 -270268 -39560 -484867
6622 -484867 -369992 -296921 -110436 -447607 -641764 -23143 -369878 -535251 -501286 -714750
6612 -714750 -78150 -594442 294467 609805 178260 89919 98579 228827 -213885 -802237
6602 -802237 -359604 272792 311145 -328865 -260271 224955 -490574 -34718 102914 1132903
6592 1132903 83439 -236813 593715 1045984 45458 -257697 250308 42677 -137123
6583 -137123 -443581 20962 -945795 -1091066 -1095564 -1276949 -1208001 -546243 -685348 -553510
6573 -553510 -692637 -98201 -249324 -895209 -1058131 -721077 -28034 -96100 -454307 -552395
6563e52395Q26778K30126L60941Q4258o10255p27760p99461O76095P4392Q60254
6553D22973K47471p52252n89146J20477N75146l56047r5525k61454M16658m94735
6543g66434L00591J49514K89902K52030j78386k85218L3100l6566J78908M5151
6533a7408o72499N74707N82487j04510m70553o15185N11399L75535l31308p96948
6523i64283M11553K65216j20893Q4611N89122l1688m90571m78640n70927K3388
6513a283112P14373K23637M16204P2602P38275l68795m29625K0044l57435L82147
6503A28315n16878m32599r570Q32532J07077k00507l27756m4384j39319N63194
6493c9895j77588P368j02152p5321K53475k90116n26291j39986K77751k49832
$$ plain form
6563 -552395 274383 504509 865450 949708 339453 -388307 -1187768 -511673 -437281 422973
6553 422973 670444 -81808 -670954 -550477 24669 -331378 -426903 -688357 -271699 -766434
6543 -766434 -465843 -316329 -26427 225603 47217 -238001 -204901 -241467 -62559 -17408
6533 -17408 -689907 -115200 467287 362777 -107776 -722961 -211562 163973 -167335 -964283
6523 -964283 -552730 -287514 -408407 -323796 265326 233638 -256933 -735573 -1306500 -1283112
6513 -1283112 -568739 -345102 71102 143704 881979 513184 83559 103603 -253832 128315
6503 128315 -388563 -821162 -830732 1800 108877 -91630 -419386 -463770 -603089 -39895
6493 -39895 -217483 -210115 -312267 -387588 -134113 -424229 -950520 -1090506 -812755 -1062587
6483a062587N75491L1268m14946j14249M93680J1532M370m14714K00456O13454
6473g6245q2788P03703J69335r98207N53061p7684l90758l68537n83406K92472
6463h59054M08048N77903j0507j31902k22628R8364J53472m75300J058120L9624
6453F36140r24284L92996l38690l96355M29923m41068N51119L55390m24773j65881
6443c25483k89234m16144K91592R55501N7747l81516J86068m59864J08569O66603
6433C93839n45556l83112k0020J150952n45202P2795R013r63446K96377J47112
6423c87248j5197M03458j41172k65947l37808N05145R5582k52966l91911M46096
6413c41968q2763N18992l74906L72149j46691K78047l58966q28650O02208K36302
$$ plain form
6483 -1062587 -487096 -455828 -870774 -985023 -491343 -479811 -475441 -890155 -689699 -76245
6473 -76245 -159033 544670 714005 -284202 268859 191175 -199583 -568120 -1151526 -859054
6463 -859054 -451006 126897 116390 -15512 -238140 -139776 13696 -461604 596516 636140
6453 636140 -288144 104852 -233838 -630193 -200270 -641338 -90219 265171 -159602 -325483
6443 -325483 -614717 -1030861 -739269 216232 273979 -107537 78531 -381333 -272764 393839
6433 393839 -151717 -534829 -554849 596103 50901 123696 132709 -830737 -534360 -387248
6423 -387248 -402445 1013 -140159 -406106 -743914 -238769 -143187 -396153 -788064 -341968
6413 -341968 -424731 94261 -280645 91504 -55187 222860 -136106 -964756 -362548 -126246
6403a26246K06098M13172j219421K62189N62979j95632K9829o72865J32023k54489
6393h62363K88845m48977J98344J017653L93908n64455l5072l0742j51712K01621
6383G050O1196O39958m22385o58295r6648j14192j30403J23122L33397j10825
6373c68025o63950l15371m8360K98680O27396J11743k3325p41639K67789J29766
6363g25296M71708l94776O2848n03662j38112l9388K05859J18848J17768R80413
6353A56210N33927m48642n1283M2755k66906p2959L18456M51566n88611j10139
6343c5626K23582n74467m41233M19322j23590J97105m37363j64637k61053L96644
6333h01316K36051n5961J114175m37926o42461Q5545J64236L00826O6930l55302
$$ plain form
6403 -126246 79852 493024 -726397 -464208 98771 -96861 -67032 -739897 -607874 -862363
6393 -862363 -573518 -1022495 -824151 193502 587410 22955 -12117 -42859 -194571 7050
6383 7050 68246 708204 285819 -372476 -469124 -583316 -713719 -590597 -257200 -368025
6373 -368025 -1031975 -1347346 -1395706 -1097026 -469630 -357887 -381212 -1122851 -855062 -725296
6363 -725296 -253588 -648364 -585516 -1089178 -1227290 -1266678 -1060819 -941971 -824203 156210
6353 156210 690137 241495 190212 232967 -33939 -106898 211558 663124 74513 -35626
6343 -35626 187956 -386511 -827744 -408422 -532012 -334907 -772270 -936907 -1197960 -801316
6333 -801316 -565265 -621226 492949 55023 -587438 -501893 -337657 -36831 30099 -325203
6323c25203P9682o5538p29070L38099J276004j065283m87608Q6874J470585N61282
6313A139824j188385j83815l23795n50257J61621j8327O22693p7672n87948N57878
6303d48183Q44786r9806k99433j42896J21208j8546l32797m06807J43382N98583
6293d0509r26083L57669k89150J41467m4347L02800O28225J86200n68186N98459
6283C46545J456j04061m60782K16421n1233k70069l2411j094343P6134L30013
6273a042330M98726K80628J66332J74984n60921n59998J035983J084328p61950
6264C15782p45148M27469l65078m38349K46142k27128k1355N26259m12580j80026
6254h74012j12436k99239P98911m69738m51256J60869N04639M69728Q28348m0669
$$ plain form
6323 -325203 -245521 -311059 -1040129 -702030 573974 -491309 -978917 -892043 578542 1139824
6313 1139824 -48561 -232376 -556171 -1106428 -944807 -963134 -340441 -418113 -1006061 -448183
6303 -448183 396603 296797 -2636 -145532 -24324 -42870 -375667 -782474 -639092 -40509
6293 -40509 -966592 -608923 -898073 -756606 -800953 -498153 130072 316272 -251914 346545
6283 346545 348001 243940 -216842 -421 -51654 -321723 -354134 -1448477 -1372343 -1042330
6273 -1042330 -543604 -262976 -96644 78340 -482581 -1042579 -6596 1077732 315782
6264 315782 -429366 -1897 -366975 -805324 -559182 -786310 -807665 -281406 -693986 -874012
6254 -874012 -986448 -1285687 -486776 -956514 -1407770 -1246901 -742262 -272534 555814 515145
6244E15145m74838K39662q2713n47532r04589M32001K73831K45561m65949R90195
6234B20774m98997k5321J42019l39259j85905o06596M84464L72963k08860J187323
6224E42605q16846j33005J214997p89180j00477L4317K18226j81034o11877L84901
6214b37373j04226n17839K13141J33808J80475L1588L75877m37537m31493J80617
6204f12962l12691j5702m30112q1004N37700K14934N72058l15735j25465L74320
6194a94659n9877J6179K31826o08302p94760K17648K69999l23872O17218J77495
6184d51105J13885j65590m20215M01002k55601n194M67461p79927n82904L84222
6174a293966R97152J081181R5571n82311j022603l5399L50393L88805J29274o54667
$$ plain form
6244 515145 40307 279969 197256 -350276 -1254865 -822864 -549033 -303472 -769421 220774
6234 220774 -278223 -303544 -161525 -500784 -686689 -1293285 -808821 -435858 -644718 542605
6224 542605 -274241 -407246 807751 18571 -81906 -47589 170637 -10397 -622274 -237373
6214 -237373 -341599 -859438 -646297 -512489 -332014 -300426 75451 -362086 -793579 -612962
6204 -612962 -925653 -941355 -1371467 -1452471 -914771 -699837 -127779 -443514 -568979 -194659
6194 -194659 -254536 -238357 -6531 -614833 -1409593 -1191945 -921946 -1245818 -628600 -451105
6184 -451105 -337220 -502810 -923025 -522023 -777624 -782818 -315357 -1095284 -1678188 -1293966
6174 -1293966 -296814 784367 879938 297627 -724976 -760375 -409982 -21177 108097 -546570
6164e46570M78805P54543o80036J80508L05488k47519O44366n32489n09887n62662
6154g15453k79535K87908J18443j68313j62515O2810J124515P9058J8709J8150
6144C83777k43376J05270k33754Q6709q28943n82982O42941O23009J40878j173013
6134a079484R9346M59201m4494r4116K03869K59346m16253m54576J32669k57687
6124a192179J26553j14310N02177N13617L98677M31005j068895L22064j23242
6115b04533J76005j261133j83946M20716L01208k50122m3974N89538J86268J077039
6105H07066p28394j406587J70093N32671L2833k88865j20134P8540j52692L93633
6095f81836K83971J29280j23758o43811M23582N09613r9124n03688l6698k3840
$$ plain form
6164 -546570 -67765 686778 6742 187250 492738 245219 889585 357096 -152791 -715453
6154 -715453 -994988 -707080 -588637 -756950 -919465 -856655 267860 346918 365627 383777
6144 383777 140401 245671 11917 98626 -730317 -1313299 -670358 -47349 93529 -1079484
6134 -1079484 -980138 -520937 -565431 -659547 -455678 -196332 -612585 -1067161 -934492 -1192179
6124 -1192179 -1065626 -1179936 -677759 -164142 234535 665540 -403355 -81291 -204533
6115 -204533 -28528 -1289661 -1473607 -1052891 -751683 -1001805 -1045779 -456241 -269973 807066
6105 807066 78672 -1327915 -1157822 -625151 -592318 -881183 -1001317 -922777 -1075469 -681836
6095 -681836 -397865 -268585 -392343 -1036154 -612572 -102959 -202083 -705771 -742469 -766309
6085g66309J45554n95955N10596R4059o01100O04740L7340l3239J61456M63653
6075B0795P21734m76255j131501m80473K21601P42975L32159K85988m25499o30872
6065h19348J0616L33847N48333q5477R4160p68412n72322j84345L44308J145116
6055D6476l84341P11945j291408k11032O43525j73466q68752J47272N65118o6575
6045h81238P10020n18436l52695O06531j17972M50460q17219n47873K93822R91802
6035a82798j70978P4765l01444p3659R70536o60482R23522m85877K95028K06693
6025E95306M05578j513567m54048L23080L77250L99735J40101q87731l52480L90382
6015e76394O9569P49873M93747q13820M985J91002l56251j11457O89983N64693
$$ plain form
6085 -766309 -620755 -1216710 -706114 -612055 -1213155 -608415 -571075 -604314 -442858 20795
6075 20795 742529 266274 -865227 -1345700 -1124099 -381124 -48965 237023 -188476 -819348
6065 -819348 -808732 -474885 73448 -12029 82131 -686281 -1258603 -1442948 -1098640 46476
6055 46476 -337865 374080 -917328 -1128360 -484835 -658301 -1527053 -1379781 -814663 -881238
6045 -881238 -171218 -689654 -1042349 -435818 -553790 -103330 -920549 -1468422 -1174600 -182798
6035 -182798 -353776 -279011 -580455 -654114 316422 -344060 579462 93585 388613 595306
6025 595306 1000884 -512683 -966731 -643651 -266401 133334 273435 -614296 -966776 -576394
6015 -576394 -506825 243048 736795 -77025 -72040 118962 -237289 -348746 341237 905930
6005I05930k81622o11224k90240O01836P1123k37050K11583q99511m01227Q12946
5995a17456J87097K30337L42691K78132k01905j56640l04124n14742k24601m65827
5985i47038p85877K88785J151859P10956l00966k80308m31906l34169k6131R91287
5975C6492M27034k21258m81192k26931m82019j93765k44278P57477M40165Q32918
5965F44643M12816l38000J31908m57753k60255n87746N52324k06498j51908M83049
5955B22580o71031J44194O16116r8730l03973N31719n57437n63973J66713J046110
5945E32288k77517o54078N42949q1337M75129m02646L4806O1786N37955m27555
5935C41780L9441J03323q27636J41659L73996O85573m14860k68628p94406L55305
$$ plain form
6005 905930 624308 13084 -277156 324680 395803 158753 370336 -529175 -930402 -117456
5995 -117456 69641 299978 642669 920801 718896 562256 258132 -256610 -481211 -947038
5985 -947038 -1732915 -1444130 -292271 418685 117719 -162589 -594495 -928664 -954795 36492
5975 36492 463526 242268 -238924 -465855 -947874 -1141639 -1385917 -628440 -188275 644643
5965 644643 1057459 719459 851367 393614 133359 -454387 97937 -108561 -260469 222580
5955 222580 -448451 -304257 311859 213129 -90844 440875 -116562 -680535 -513822 532288
5945 532288 254771 -399307 143642 62305 537434 134788 169594 231380 769335 341780
5935 341780 381221 484544 -343092 -201433 172563 858136 443276 174648 -619758 -264453
5925b64453L9295k90456m993K71846P03468k64907L59039j018618Q6080Q14504
5915D30805n18492l07337m94074L02059K46831j28696N0235K34364q48099L80869
5905f51535J69051l36796M86698M69702o5643l58418n99272m49874j97203O54504
5895h78786L1788l4758R7710j28000J13876o99430M20455J047443l10526R6838
5885b43390o55154k60174J134679Q33006q24241o05553M35341J10314O4417n29094
5875e39849M18850R8766l3908k02878j34563J5132j0638M79335L23458o59181
5865b45476j05209O54243j08769M50272m60920m71481k04990o7015N67543k92413
5855b84215q02404k33793R08660j58814l6686l41964J97394l80210j05388R47340
$$ plain form
5925 -264453 -225158 -515614 -520607 -248761 454707 189800 548839 -469779 -383699 430805
5915 430805 -87687 -395024 -889098 -587039 -340208 -468904 -418669 -184305 -1032404 -651535
5905 -651535 -482484 -819280 -332582 137120 71477 -286941 -886213 -1336087 -1533290 -878786
5895 -878786 -846998 -881756 -784046 -912046 -798170 -1497600 -1077145 -29702 -340228 -243390
5885 -243390 -898544 -1158718 -24039 808967 -15274 -620827 -185486 -75172 -10755 -539849
5875 -539849 -120999 -22233 -56141 -259019 -393582 -378450 -389088 90247 413705 -245476
5865 -245476 -350685 303558 194789 645061 184141 -287340 -492330 -559345 8198 -284215
5855 -284215 -1086619 -1320412 -411752 -570566 -607252 -949216 -751822 -1132032 -1237420 -290080
5845b90080O3740M18905O72123j29047l79298n13306J07096l57289l00587Q66303
5835A58560K08296p93591Q9422q4762k73106L47534P47792m91491l08510P14213
5825C14357O35493j183l60001n2384j59420r44658O59064M55113J33008m55257
5815B24132K87713O28761k58444q67093n87754J052809J68658j75404j281450
5806h08072J18403L77862n0899Q4201k62249J135446L32695n04816j0713L45046
5796G56904m99217j98866m01332l40603K91749k22757N33087J094652p51522l14763
5786e2668J62215k61060q18592l10878R09336J18494L52599k91858M93043o39648
5776c39017l88261Q00782m2937n10755M09625N75909n45003p73899m6585R30611
$$ plain form
5845 -290080 -226340 192565 864688 735641 356343 -156963 -49867 -407156 -707743 158560
5835 158560 366856 -426735 -337313 -422075 -695181 -347647 400145 -91346 -399856 314357
5825 314357 949850 948667 588666 536282 376862 -567796 91268 546381 679389 224132
5815 224132 511845 1140606 882162 15069 -572685 480124 648782 473378 -808072
5806 -808072 -689669 -311807 -362706 -278505 -540754 594692 927387 422571 411858 756904
5796 756904 257687 58821 -342511 -683114 -391365 -614122 -81035 1013617 262095 -52668
5786 -52668 109547 -151513 -970105 -1280983 -371647 -253153 99446 -192412 300631 -339017
5776 -339017 -727278 73504 30567 -480188 -70563 505346 -39657 -813556 -860141 70470
5766G0470p9992o41727r1897j10038N13409m07319r7792Q5780L72982k12915n00456
5755a099495P48910o5140M93967p65694n05168M85519M62528j33659p27573J039723
5745f6082l38999o19799j63721K57831P35986M36797n92755o60052L93271j11666
5735g29189j69581K95832M2858j31610k40359M20549O0177j96627M84487k46390
5725d09853q3793M64046k00912k84197m91057J67362Q92173K24858j144039l25064
5715a190476P61793o27881N1707L34117o35245L61117J58607J27582O53360k90859
5705b96178K44085j91037M23086J334J01335M20175l08238m8221m33338n5088
5695a42085k88248n00659N05946Q27532l79017j04583K28356n4952J85316N83553
$$ plain form
5766 70470 -9522 -651249 -743146 -853184 -339775 -747094 -844886 -759106 -386124 -599039 -1099495
5755 -1099495 -350585 -415725 78242 -687452 -1192620 -707101 -244573 -378232 -1105805 -66082
5745 -66082 -405081 -1024880 -1188601 -930770 -194784 242013 -350742 -1010794 -617523 -729189
5735 -729189 -898770 -602938 -560080 -691690 -932049 -511500 -451323 -647950 -163463 -409853
5725 -409853 -493646 -29600 -230512 -514709 -1005766 -838404 53769 278627 -865412 -1190476
5715 -1190476 -428683 -1056564 -1004857 -670740 -1305985 -944868 -786261 -658679 -5319 -296178
5705 -296178 -52093 -243130 179956 181290 282625 702800 394562 346341 -86997 -142085
5695 -142085 -430333 -930992 -425046 402486 23469 -81114 147242 92290 277606 861159
5685H61159n48290M71956j96338K07331j81335k0120p92384M2434M30586p24138
5675d49139K7217o27917K44710k9090o03153P40970l5714K66934n3368k5889l28196
5664h72635J72502P11445k25158j13149L49246J45837n66169M72223O63056m960
5654G32238j036748R9804M13213m93617l09410N95581k17902n74998K41725M78785
$$ plain form
5685 861159 312869 784825 588487 795818 614483 594363 -198021 -155587 274999 -449139
5675 -449139 -421922 -1049839 -805129 -834219 -1437372 -696402 -732116 -465182 -518550 -544439 -872635
5664 -872635 -700133 11312 -213846 -326995 22251 168088 -398081 74142 737198 732238
5654 732238 -304510 -204706 208507 -285110 -594520 1061 -216841 -791839 -550114 -71329
$$ [...]
##END NTUPLES=NMR SPECTRUM
##END=
