##TITLE=1H_CG-1156-p
 CDCl3,8 sc, 
 26.10.2021
##JCAMPDX= 6.0         $$ Bruker NMR JCAMP-DX V2.0
##DATA TYPE= NMR SPECTRUM
##DATA CLASS= NTUPLES
##ORIGIN= UXNMR, Bruker Analytische Messtechnik GmbH
##OWNER= root
$$ XWIN-NMR		Version 3.5
$$ Tue Oct 26 11:58:19 2021 Russian Standard Time (UT+4h)  she@DPX200
##.OBSERVE FREQUENCY= 200.1313468511
##.OBSERVE NUCLEUS= ^1H
##.ACQUISITION MODE= SIMULTANEOUS
##.ACQUISITION SCHEME= undefined
##.AVERAGES= 8
##.DIGITISER RES= 18
##SPECTROMETER/DATA SYSTEM= spect
##.PULSE SEQUENCE= zg30
##.SOLVENT NAME= D2O
##.SHIFT REFERENCE= (INTERNAL, D2O, 0, 15.6819)
##AUDIT TRAIL= $$ (NUMBER, WHEN, WHO, WHERE, WHAT)
$$ ##TITLE= Audit trail, XWIN-NMR		Version 3.5
$$ ##JCAMPDX= 5.01
$$ ##ORIGIN= Bruker BioSpin GmbH
$$ ##OWNER= she
$$ F:/spectra/data/she/nmr/H-F/1/pdata/1/auditp.txt
$$ ##AUDIT TRAIL=  $$ (NUMBER, WHEN, WHO, WHERE, WHAT)
(   1,<2021-10-26 11:57:13.32 +0400>,<she>,<DPX200>,
      <created by zg, POWCHK disabled, PULCHK disabled
       configuration hash MD5:
       00 E9 B6 7A A2 85 ED C7 34 08 36 98 17 FE 4E 26
       data hash MD5: 16K
       6F 09 44 B9 21 2D A3 2D FE 09 2D 3F 55 04 87 D9>)
(   2,<2021-10-26 11:57:16.23 +0400>,<she>,<DPX200>,
      <Start of raw data processing
       efp BC_mod = 2 LB = 0.24 FT_mod = 6 PKNL = 1 PHC0 = -15151.99 PHC1 = 10.80083 SI = 16K 
       data hash MD5: 16K
       91 3C B3 32 51 25 5A 21 9E 3C E8 8F 50 BB 9A D7>)
(   3,<2021-10-26 11:57:37.71 +0400>,<she>,<DPX200>,
      <pk PHC0 = -164.8547 PHC1 = 10.2 
       data hash MD5: 16K
       3F 96 A2 70 F9 65 72 B9 75 AC 35 78 D7 0A 7A ED>)
(   4,<2021-10-26 11:57:40.76 +0400>,<she>,<DPX200>,
      <abs ABSG = 5 
       data hash MD5: 16K
       17 2A FF 86 92 2A 10 5C A3 2C 5A A4 AE 84 96 37>)
$$ ##END=
$$ 
$$ hash MD5
$$ 82 31 A6 7D 75 AF DD BE 0E C4 28 3C CD 03 66 09
##$RELAX= 
##$RELAX= 
##$RELAX= 
##$RELAX= 
##$RELAX= 
##$RELAX= 
$$ Bruker specific parameters
$$ --------------------------
##$DU= <F:/spectra>
##$EXPNO= 1
##$NAME= <H-F>
##$PROCNO= 1
##$TYPE= <nmr>
##$USER= <she>
##$AMP= (0..31)
100 100 100 100 100 100 100 100 100 100 100 100 100 100 100 100 100 100 
100 100 100 100 100 100 100 100 100 100 100 100 100 100 
##$AQSEQ= 0
##$AQ_mod= 1
##$AUNM= <au_zg>
##$AUTOPOS= <>
##$BF1= 200.13
##$BF2= 200.13
##$BF3= 200.13
##$BF4= 200.13
##$BF5= 200.13
##$BF6= 200.13
##$BF7= 200.13
##$BF8= 200.13
##$BYTORDA= 1
##$CFDGTYP= 0
##$CFRGTYP= 5
##$CHEMSTR= <none>
##$CNST= (0..31)
1 1 145 1 1 1 1 1 1 1 1 1 1 1 1 1 1 1 1 1 1 1 1 1 1 1 1 1 1 1 1 1 
##$CPDPRG= <>
##$CPDPRG1= <>
##$CPDPRG2= <>
##$CPDPRG3= <>
##$CPDPRG4= <mlev>
##$CPDPRG5= <mlev>
##$CPDPRG6= <mlev>
##$CPDPRG7= <mlev>
##$CPDPRG8= <mlev>
##$CPDPRGB= <>
##$CPDPRGT= <>
##$D= (0..31)
0 1.2 0 0 0 0 0 0 0 0.06 0 0.03 0 0 0 0 0.0002 0 0 0 0 0 0 0 0 0 0 0 0 
0 0 0 
##$DATE= 1635235032
##$DBL= (0..7)
120 120 120 120 120 120 120 120 
##$DBP= (0..7)
150 150 150 150 150 150 150 150 
##$DBP07= 0
##$DBPNAM0= <>
##$DBPNAM1= <>
##$DBPNAM2= <>
##$DBPNAM3= <>
##$DBPNAM4= <>
$$ [...]
##$SUBNAM2= <"">
##$SUBNAM3= <"">
##$SUBNAM4= <"">
##$SUBNAM5= <"">
##$SUBNAM6= <"">
##$SUBNAM7= <"">
##$SUBNAM8= <"">
##$SUBNAM9= <"">
##$SW= 18.0517286264689
##$SWIBOX= (0..15)
0 0 2 0 0 0 0 0 0 0 0 0 0 0 0 0 
##$SW_h= 3612.71676300578
##$TD= 16384
##$TD0= 1
##$TE= 0
##$TE2= 300
##$TE3= 300
##$TEG= 300
##$TL= (0..7)
0 120 120 120 120 120 120 120 
##$TP= (0..7)
150 150 150 150 150 150 150 150 
##$TP07= 0
##$TPNAME0= <>
##$TPNAME1= <>
##$TPNAME2= <>
##$TPNAME3= <>
##$TPNAME4= <>
##$TPNAME5= <>
##$TPNAME6= <>
##$TPNAME7= <>
##$TPOAL= (0..7)
0.5 0.5 0.5 0.5 0.5 0.5 0.5 0.5 
##$TPOFFS= (0..7)
0 0 0 0 0 0 0 0 
##$TUNHIN= 0
##$TUNHOUT= 0
##$TUNXOUT= 0
##$USERA1= <user>
##$USERA2= <user>
##$USERA3= <user>
##$USERA4= <user>
##$USERA5= <user>
##$V9= 5
##$VALIST= <valist>
##$VCLIST= <CCCCCCCCCCCCCCC>
##$VD= 0
##$VDLIST= <DDDDDDDDDDDDDDD>
##$VPLIST= <PPPPPPPPPPPPPPP>
##$VTLIST= <TTTTTTTTTTTTTTT>
##$WBST= 1024
##$WBSW= 4
##$XGAIN= (0..3)
0 0 0 0 
##$XL= 0
##$YL= 0
##$YMAX_a= 73383
##$YMIN_a= -315567
##$ZGOPTNS= <>
##$ZL1= 120
##$ZL2= 120
##$ZL3= 120
##$ZL4= 120
##$ABSF1= 15.70061
##$ABSF2= -2.351239
##$ABSG= 5
##$ABSL= 3
##$ALPHA= 0
##$AQORDER= 0
##$ASSFAC= 0
##$ASSFACI= 0
##$ASSFACX= 0
##$ASSWID= 0
##$AUNMP= <proc_1d>
##$AZFE= 0.1
##$AZFW= 0.1
##$BCFW= 0
##$BC_mod= 2
##$BYTORDP= 0
##$COROFFS= 0
##$CY= -3
##$DATMOD= 1
##$DC= 0
##$DFILT= <>
##$DTYPP= 0
##$F1P= 0
##$F2P= 0
##$FCOR= 1
##$FTSIZE= 16384
##$FT_mod= 6
##$GAMMA= 0
##$GB= 0
##$INTBC= 1
##$INTSCL= 0
##$ISEN= 128
##$LB= 0.24
##$LEV0= 0
##$LPBIN= 0
##$MAXI= 10000
##$MC2= 0
##$MEAN= 0
##$ME_mod= 0
##$MI= 1.114404
##$NCOEF= 0
##$NC_proc= -8
##$NLEV= 6
##$NOISF1= 3.799351
##$NOISF2= 2.8
##$NSP= 0
##$NTH_PI= 0
##$NZP= 0
##$OFFSET= 15.68188
##$PC= 1
##$PHC0= -15316.84
##$PHC1= 21.00083
##$PH_mod= 1
##$PKNL= yes
##$PPARMOD= 0
##$PSCAL= 0
##$PSIGN= 0
##$REVERSE= no
##$SF= 200.13001479323
##$SI= 16384
##$SIGF1= 3
##$SIGF2= 2
##$SINO= 5.538805
##$SIOLD= 16384
##$SREGLST= <1H.CDCl3>
##$SSB= 0
##$STSI= 16384
##$STSR= 0
##$SW_p= 3612.71676300578
##$SYMM= 0
##$S_DEV= 0
##$TDeff= 16384
##$TDoff= 0
##$TI= <>
##$TILT= no
##$TM1= 0
##$TM2= 0
##$TOPLEV= 0
##$USERP1= <user>
##$USERP2= <user>
##$USERP3= <user>
##$USERP4= <user>
##$USERP5= <user>
##$WDW= 1
##$XDIM= 16384
##$YMAX_p= 360191223
##$YMIN_p= -1467235
$$ End of Bruker specific parameters
$$ ---------------------------------
##NTUPLES= NMR SPECTRUM
##VAR_NAME=  FREQUENCY,     SPECTRUM/REAL,   SPECTRUM/IMAG
##SYMBOL=    X,             R,               I
##VAR_TYPE=  INDEPENDENT,   DEPENDENT,       DEPENDENT
##VAR_FORM=  AFFN,          ASDF,            ASDF
##VAR_DIM=   16384,         16384,           16384
##UNITS=     HZ,            ARBITRARY UNITS, ARBITRARY UNITS
##FACTOR=    0.220516191357247, 1,           1
##FIRST=     3138.41487583598, 0,            0
##LAST=      -474.301887169796, 0,           0
##MIN=       -474.301887169796, -1467235,    0
##MAX=       3138.41487583598, 360191223,    0
$$ Real data points
##PAGE= N=1
##DATA TABLE= (X++(R..R)), XYDATA
$$ [...]
$$ plain form
11658 -17349 86199 -27113 19351 -67351 -166092 -102509 17037 47500 -28299 -94933 -113677
11647 -113677 244129 -114806 -463772 -347514 -111343 58368 -116550 -190888 -88463 121940
11637 121940 -166992 -328173 -340210 -435621 -308385 -232058 -219980 -333939 -352396 -48343
11627 -48343 -5005 -378727 -152805 156909 -10762 -445378 -281202 -177353 -218602 -247797
11617 -247797 -258136 -305209 -302501 -214058 -285443 -313385 -124295 -46911 -61277 -39008 -51106
11606 -51106 84088 67359 -46488 -79525 -236284 -34692 -65918 -119387 -19174 -125758
11596 -125758 -148127 -188335 -115359 -432235 -202222 9374 -76612 41275 -120558 -60105
11586 -60105 -152563 -97286 -37535 -39949 43809 -8118 -17606 -31551 -206554 -161077 -226996 -114330
$$ packed form
11658a7349J03548j13312M6464q6702r8741O3583J19546L0463p5799o6634j8744
11647a13677L57806l58935l48966J16258K36171J69711j74918p4338J02425K10403
11637A21940k88932j61181j2037r5411J27236P6327J2078j13959j8457L04053
11627d8343M3338l73722K25922L09714j67671m34616J64176J03849m1249k9195
11617b47797j0339m7073K708Q8443p1385k7942J89090P7384j4366K2269j2098
11606e1106J35194j6729j13847l3037j56759K01592l1226n3469J00213j06584
11596a25758k2369m0208P2976l16876K30013K11596q5986J17887j61833O0453
11586f0105r2458N5277N9751k414Q3758n1927r488j3945j75003M5477o5919J12666
$$ plain form
11574 -114330 126028 179760 33914 -133238 -325270 -185011 -235657 -521789 -369154 -285605
11564 -285605 -167891 -215759 -76889 31984 -5157 -285974 -195559 -180609 -115488 -88098 -38494
11553 -38494 107313 -4677 42193 -170843 -360419 -115330 21916 171353 -49458 -226535
11543 -226535 -98738 -71701 -176381 -32478 -120169 -84037 138672 71221 12026 -60093 -152000
11532 -152000 -49931 -173790 118419 -388123 -449094 -289616 -411716 -80395 -148390 -146150
11522 -146150 -215475 -138241 -365987 -361916 -26609 57347 49201 102559 -43446 114383 -84972
11511 -84972 -200527 -92336 -12435 -51714 -148958 -226980 -175488 -110706 -141090 -168230 -414081
11500 -414081 -353327 -218740 95591 -39817 4668 147288 368117 85100 -136875 -80220
$$ packed form
11574a14330K40358N3732j45846j67152j92032J40259n0646k86132J52635Q3549
11564b85605J17714m7868J38870J08873l7141k80817R0415J4950O5121K7390M9604
11553c8494J45807j11990M6870k13036j89576K45089J37246J49437k20811j77077
11543b26535J27797K7037j04680J43903q7691L6132K22709o7451n9195p2119r1907
11532a52000J02069j23859K92209n06542o0971J59478j22100L31321o7995K240
11522a46150o9325P7234k27746M071L35307Q3956q146N3358j46005J57829j99355
11511h4972j15555J08191P9901l9279r7244p8022N1492O4782l0384k7140k45851
11500d14081O0754J34587L14331j35408M4485J42620K20829k83017k21975N6655
$$ plain form
11490 -80220 49883 -96187 27496 37118 -110269 -220336 -354440 -348590 -240572 -179909 -349402
11479 -349402 -269750 24586 109398 48068 -8508 -295566 -67328 -52201 50278 -31944 -130602
11468 -130602 -50198 91956 1344 -151955 -94690 120382 44497 68953 20567 -120535 95028
11457 95028 -3921 -200074 49960 22136 178975 -85641 -187779 -421297 -250446 18352
11447 18352 -66323 -176201 -176793 -24981 -30146 -71607 -113399 -66795 -105607 -67155 -103631 -235494
11435 -235494 -113637 -172139 -158182 -88904 -77545 -131616 -120215 -30947 -165922 -52026 -151011
11424 -151011 -347934 -354032 -122886 165922 57447 -141665 -160304 -137138 28673 42126
11414 42126 -229706 -194154 -180480 -385927 -347335 -175542 -113339 -67488 -219230 -160525 -145595
$$ packed form
11490h0220J30103j46070J23683R622j47387j10067j34104N850J08018O0663j69493
11479c49402P9652K94336Q4812o1330n6576k87058K28238J5127J02479q2222r8658
11468a30602Q0404J42154r0612j53299N7265K15072p5885K4456m8386j41102K15563
11457I5028r8949j96153K50034k7824J56839k64616j02138k33518J70851K68798
11447A8352q4675j09878n92J51812n165m1461m1792M6604l8812L8452l6476j31863
11435b35494J21857n8502J3957O9278J1359n4071J1401Q9268j34975J13896r8985
11424a51011j96923o098K31146K88808j08475j99112j8639K3166J65811J3453
11414D2126k71832L5552J3674k05447L8592J71793O2203M5851j51742N8705J4930
$$ plain form
11403 -145595 -391409 -348899 -363558 -266179 -275235 -287314 -210333 -194834 -174343 23714 5894
11392 5894 -104007 -281926 -373436 -351369 -418655 -257769 -126371 -228482 -280493 -73866 129671
11381 129671 -108933 34113 -12918 -100960 -211524 -14694 -4025 -44297 -239935 7346
11371 7346 -206466 -304156 -60128 -306335 -301758 -316215 -279297 -267126 -192677 -222660 -323712
11360 -323712 -471510 -109211 -29202 -35469 -121280 -145331 -215857 -325922 -310150 -155583 -95365
11349 -95365 -124704 -201795 -147759 -147354 -244571 -147682 -122066 -161944 8564 218212 9647
11338 9647 -162819 -353255 -472022 -229399 87772 -31823 -324660 -465600 -569794 -332270
11328 -332270 -121178 -141059 -207675 -163439 -181977 -174288 -88412 94699 -24925 -22829 4175
$$ packed form
11403a45595k45814M2510j4659R7379r056j2079P6981J5499K0491J98057j7820
11392E894j09901j77919r1510K2067o7286J60886J31398j02111n2011K06627K03537
11381A29671k38604J43046m7031q8042j10564J96830J0669m0272j95638K47281
11371G346k13812r7690K44028k46207M577j4457L6918J2171P4449k9983j01052
11360c23712j47798L62299Q0009o267q5811k4051p0526j10065J5772J54567O0218
11349i5365k9339p7091N4036M05r7217R6889K5616l9878J70508K09648k08565
11338I647j72466j90436j18767K42623L17171j19595k92837j40940j04194K37524
11328c32270K11092j9881o6616M4236j8538P689Q5876J83111j19624K096K7004
$$ plain form
11317 4175 -123273 -116761 -191256 -158219 -172696 -236232 -327480 -323825 -251656 -196211 -45449 86530
11305 86530 23989 -126793 -142774 -176489 -394840 -137292 -366514 -150747 166552 122780
11295 122780 -137574 -374353 -285103 -156006 41657 -269103 -349568 -444044 -229654 24697
11285 24697 57723 -115141 -219326 -251810 -573911 -505861 -188364 -99531 -297249 -374529 -259172
11274 -259172 -264575 -372311 -271742 -57970 -73665 -261762 -63667 -11826 108294 163841
11264 163841 -128558 -23352 -28819 40851 30011 23308 -26155 -74142 -81808 -40848 -1102 -314770
11252 -314770 -194121 -7517 -170068 -117863 -22105 -150838 -120869 -93736 22097 -10098
11242 -10098 -309449 -290121 -144949 -81187 -107626 -69386 33723 32562 82990 -67165 -206211
$$ packed form
11317D175j27448O512p4495L3037j4477o3536r1248L655P2169N5445J50762J31979
11305H6530o2541j50782j5981l3715k18351K57548k29222K15767L17299m3772
11295A22780k60354k36779Q9250J29097J97663l10760q0465r4476K14390K54351
11285B4697L3026j72864j04185l2484l22101O8050L17497Q8833j97718p7280J15357
11274b59172n403j07736J00569K13772j5695j88097J98095N1841J20120N5547
11264A63841k92399J05206n467O9670j0840o703m9463m7987p666M0960L9746l13668
11252c14770J20649J86604j62551N2205R5758j28733K9969K7133J15833l2195
11242a0098k99351J9328J45172O3762k6439L8240J03109j161N0428j50155j39046
$$ plain form
11231 -206211 -179328 -107947 -9657 -325436 -553373 -376688 -148838 -186257 -32813 66978
11221 66978 -204116 -118043 -26466 -192586 -244218 -240031 -63854 -254148 -224779 -199213 -66282
11210 -66282 -147098 -66928 -159627 -92314 -119480 -270665 -97821 99141 -80253 -379253 -275107
11199 -275107 -110958 -40525 37545 109696 47890 -12012 -37392 -21958 -153361 -16699 -46387
11188 -46387 -60180 -161206 -290492 -374843 -31773 -128004 -55725 -171790 -198400 -225516 -296773
11177 -296773 -227702 128 -32065 608 -273343 -203084 100252 -172420 -224337 -85405
11167 -85405 -172124 -314767 -138 61224 -213340 -363263 -179120 -226320 -377269 -656704
11157 -656704 -363905 -214979 -5616 -18687 -107031 -225827 -158817 -121622 9918 -36865
$$ packed form
11231b06211K6883P1381R8290l15779k27937J76685K27850l7419J53444R9791
11221F6978k71094Q6073R1577j66120n1632M187J76177j90294K9369K5566J32931
11210f6282q0816Q0170r2699O7313k7166j51185J72844J96962j79394k99000J04146
11199b75107J64149P0433P8070P2151o1806n9902k5380J5434j31403J36662k9688
11188d6387j3793j01026j29286q4351L43070r6231P2279j16065k6610k7116p1257
11177b96773O9071K27830l2193L2673k73951P0259L03336k72672n1917J38932
11167h5405q6719j42643L14629O1362k74564j49923J84143m7200j50949k79435
11157f56704K92799J48926K09363j3071q8344j18796O7010L7195J31540m6783
$$ plain form
11147 -36865 -33145 -7390 -132084 -285409 -140069 -45500 -316600 -195315 -81661 10195 -224175
11136 -224175 -300209 -305302 -335547 -434969 -583623 -416159 -219679 -311965 -328166 -191560 9913
11125 9913 -134365 -328295 -316426 -59581 123868 -93350 -27578 -115850 -323790 -388092 -320405
11114 -320405 -81154 -309565 -403547 -249876 -213211 -260062 -251944 -259182 -211050 -136074 87018
11103 87018 -114897 -173473 7244 75498 -29627 -33913 -189168 66498 19654 -79112 5357
11092 5357 104219 202538 125591 -157243 -319268 -37006 -113497 -34895 180793 288544 96999
11081 96999 -114307 143767 50550 -107942 -129104 -349894 -212541 -171837 -127268 -115409 -47173
11070 -47173 -43529 -76437 -365803 -298729 -89694 35850 -215760 -426557 -465844 -221759 -3667
$$ packed form
11147c6865L720K5755j24694j53325J45340R4569k71100J21285J13654R1856k34370
11136b24175p6034n093l0245r9422j48654J67464J96480r2286j6201J36606K01473
11125I913j44278j93930J1869K56845J83449k17218O5772q8272k07940o4302O7687
11114c20405K39251k28411r3982J53671L6665m6851Q118p238M8132P4976K23092
11103H7018k01915n8576J80717O8254j05125m286j55255K55666m6844r8766Q4469
11092E357R8862R8319p6947k82834j62025K82262p6491P8602K15688J07751j91545
11081I6999k11306K58074r3217j58492k1162k20790J37353M0704M4569J1859O8236
11070d7173L644l2908k89366O7074K09035J25544k51610k10797l9287K44085K18092
$$ plain form
11059 -3667 -211653 -437498 -373011 -276889 -337437 -289512 -244277 -214918 -281171 -112250 90749
11048 90749 -202121 -224697 -347114 -408626 -199931 -115021 -120182 -188035 -141232 -160068 2121
11037 2121 -23430 -145939 -120997 -145328 -458617 -384884 -215686 -257764 -161136 -307889 24079
11026 24079 34406 -84937 -100518 -214916 236496 142784 92579 -184744 -55019 39953 -180156
11015 -180156 -72161 -208416 -13113 -28998 -163601 -377858 -298320 -181540 -303468 -303766
11005 -303766 -234389 23722 62123 71175 -25265 -76308 172435 -65093 41151 -72438 -118691
10994 -118691 -17655 153781 194272 -14492 -87009 -249545 -234896 -85757 -272640 -350364
10984 -350364 -80537 -79956 -238835 -202729 139665 -98481 56620 -56875 -216392 -240122
$$ packed form
11059c667k07986k25845O4487R6122o0548M7925M5235K9359o6253J68921K02999
11048I0749k92870k2576j22417o1512K08695Q4910n161o7853M6803j8836J62189
11037B121k5551j22509K4942k4331l13289P3733J69198m2078R6628j46753L31968
11026B4079J0327j19343j5581j14398M51412r3712n0205k77323J29725R4972k20109
11015a80156J07995j36255J95303j5885j34603k14257P9538J16780j21928k98
11005c03766O9377K58111L8401R052r6440n1043K48743k37528J06244j13589m6253
10994a18691J01036J71436M0491k08764p2517j62536J4649J49139j86883p7724
10984c50364K69827N81j58879L6106L42394k38146J55101j13495j59517k3730
$$ plain form
10974 -240122 -417284 -88314 9541 -164974 -317295 -241581 61659 7170 -103811 7958
10964 7958 60330 98857 122111 42005 -121276 -374918 -377511 -84458 -30461 -57563 -99804
10953 -99804 -94048 -117578 -255658 -92194 100277 -110253 -274546 -199828 63133 -32142 108178
10942 108178 144988 77278 66084 -98240 -287567 -183639 -133397 73817 136006 -70684
10932 -70684 -29534 -65829 -76016 -193601 -315478 -248991 30502 -58890 25948 -238990 -157834
10921 -157834 -353656 -349823 -115023 -202721 -241174 -237616 -186538 -100549 -128235 -164286 -295693
10910 -295693 -138815 -182950 -117822 47015 -45700 -84748 130595 168159 -123387 -25240 168232
10899 168232 40186 -207603 -256630 -169558 -49131 -36496 -148643 -284492 -182226 -298060
$$ packed form
10974b40122j77162L28970R7855j74515j52321P5714L03240n4489j10981J11769
10964G958N2372L8527K3254q0106j63281k53642k593K93053N3997k7102m2241
10953i9804N756k3530j38080J63464J92471k10530j64293P4718K62961r5275J40320
10942A08178L6810o7710j1194j64324j89327J03928N0242K07214O2189k06690
10932g0684M1150l6295j0187j17585j21877O6487K79493q9392Q4838k64938Q1156
10921a57834j95822L833K34800q7698l8453L558N1078Q5989k7686l6051j31407
10910b95693J56878m4135O5128J64837r2715l9048K15343L7564k91546R8147J93472
10899A68232j28046k47789m9027Q7072J20427J2635j12147j35849J02266j15834
$$ plain form
10889 -298060 -346230 -76010 -25867 -59833 -165061 -548231 -302773 -115068 3612 -12848
10879 -12848 -49509 74838 49217 93855 155380 277880 437099 139932 12193 -21349 34619
10868 34619 39375 -83833 -189660 -284441 -328765 -284748 -183478 -164794 -176542 -152008 -136223
10857 -136223 -170025 -119825 -9820 69262 -98779 -118028 -128778 -30386 56602 -18363 46973
10846 46973 -110335 -114426 -176558 -149749 -228607 -263484 -311718 -224208 -343375 -348412 -23387
10835 -23387 175553 139051 127703 97625 118899 131314 -199484 -3535 -125144 -297298 -336612
10824 -336612 112949 199665 -59376 -95000 -128457 -180433 -198065 -130229 -274664 -209092 -139748
10813 -139748 37074 118648 89737 -17789 -43882 7870 -143631 23657 33305 -42010 -140748
$$ packed form
10889b98060m8170K70220N0143l3966j05228l83170K45458J87705J18680j6460
10879a2848l6661J24347k5621M4638O1525J22500J59219k97167j27739l3542N5968
10868C4619M756j23208j05827r4781m4324M4017J01270J8684j1748K4534J5785
10857a36223l3802N0200J10005P9082j68041j9249j0750R8392Q6988p4965O5336
10846D6973j57308m091o2132K6809p8858l4877m8234Q7510j19167n037L25025
10835b3387J98940l6502j1348l0078K1274J2415l30798J95949j21609j72154l9314
10824c36612M49561Q6716k59041l5624l3457n1976j7632O7836j44435O5572O9344
10813a39748J76822Q1574k8911j07526k6093N1752j51501J67288R648p5315r8738
$$ plain form
10802 -140748 -350131 -518140 -470727 -333125 -87699 84175 288782 327371 118039 -3211
10792 -3211 43565 -40188 -68271 -151882 -386810 -249312 -62109 97248 193392 106976 -93875
10781 -93875 -118119 6640 38161 -112197 -301038 -427297 -345679 -357066 -126436 -139115 -159686
10770 -159686 -180999 -124768 -378277 -139952 -138254 -131142 -79391 -67195 50995 -99640 -169360
10759 -169360 88176 202210 9765 -17609 -200891 -228693 -432729 -83509 152339 34534
10749 34534 -150104 -403841 -274783 -76254 -100505 87571 -92534 -100903 -113473 -151794 -147633
10738 -147633 10419 136700 -158776 -365166 -116466 -103682 -321634 -129493 -83766 -288915
10728 -288915 -159267 -245139 -440601 -262786 -339752 -87440 -4350 -16424 -78557 -137034 126714
$$ packed form
10802a40748k09383j68009M7413J37602K45426J71874K04607L8589k09332j21250
10792c211M6776q3753k8083q3611k34928J37498J87203J59357R6144q6416k00851
10781i3875k4244J24759L1521j50358j88841j26259Q1618j1387K30630j2679k0571
10770a59686k1313N6231k53509K38325J698P112N1751J2196J18190j50635o9720
10759a69360K57536J14034j92445k7374j83282k7802k04036L49220K35848j17805
10749C4534j84638k53737J29058J98529k4251J88076j80105q369j2570l8321M161
10738a47633J58052J26281k95476k06390K48700J2784k17952J92141M5727k05149
10728b88915J29648q5872j95462J77815p6966K52312Q3090j2074o2133n8477K63748
$$ plain form
10717 126714 151040 33887 89680 -58748 -102398 65099 -116054 -3643 14007 128823
10707 128823 20825 -186222 -167786 -158955 -131942 149947 318537 147401 11354 66108
10697 66108 169344 296630 41977 -283476 -158584 90157 -48760 -109908 -309351 90215
10687 90215 170265 -199679 -58739 -129678 95357 -116340 -135306 -273410 -387638 -381327 -354784
10676 -354784 -256510 -122440 190903 195952 -15788 -24737 -144420 -139242 -208212 -442807 -368818
10665 -368818 -400112 -374926 -323367 -207528 -219527 -97243 -182097 -160785 -192146 -236170 -159142
10654 -159142 -124587 -77247 49905 133987 72746 -75388 -74020 102564 -210824 -265285 -330505
10643 -330505 -374848 -222818 -163721 -201401 48391 72858 -7369 16655 -109429 -86251 -22090
$$ packed form
10717A26714K4326j17153N5793j48428m3650J67497j81153J12411J7650J14816
10707A28823j07998k07047J8436Q831K7013K81889J68590j71136j36047N4754
10697F6108J03236J27286k54653l25453J24892K48741j38917o1148j99443L99566
10687I0215Q0050l69944J40940p0939K25035k11697j8966j38104j14228O311K6543
10676c54784R8274J34070L13343N049k11740q949j19683N178o8970k34595P3989
10665c68818l1294K5186N1559J15839j1999J22284q4854K1312l1361m4024P7028
10654a59142L4555M7340J27152Q4082o1241j48134J368J76584l13388n4461o5220
10643c30505m4343J52030N9097l7680K49792K4467q0227K4024j26084K3178O4161
$$ plain form
10632 -22090 -15486 41319 -27710 43463 112765 -43314 -200996 40797 211535 172309 36136
10621 36136 37898 29942 24579 -190237 -386177 -173523 -167706 -154837 20601 75359 -189117
10610 -189117 -71848 -122154 -83656 105944 -81641 -96665 81929 39952 -227034 -296141
10600 -296141 -53803 180906 -2827 -171313 -244651 -249752 -208005 -234333 -346345 -286947 -259360
10589 -259360 -27837 -88200 -199008 10269 2907 -30430 -67376 -216786 -223059 -261012 -25296
10578 -25296 -107245 33898 -23186 -173285 -41499 -198219 -287958 -127629 -344832 -469683
10568 -469683 -177783 -136849 65541 56746 -80257 108276 -1828 195543 144513 92140
10558 92140 190005 -16008 86279 22 16369 48760 49380 -14173 10072 -46212 -75135 -224475
$$ packed form
10632b2090O604N6805o9029P1173O9302j56079j57682K41793J70738l9226j36173
10621C6136J762p956n363k14816j95940K12654N817J2869J75438N4758k64476
10610a89117J17269n0306L8498J89600j87585j5024J78594m1977k66986o9107
10600b96141K42338K34709j83733j68486p3338n101M1747k6328j12012N9398K7587
10589b59360K31523o0363j10808K09277p362l3337l6946j49410o273l7953K35716
10578b5296q1949J41143n7084j50099J31786j56720q9739J60329k17203j24851
10568d69683K91900M0934K02390q795j37003J88533j10104J97371n1030n2373
10558I2140R7865k06013J02287q6257J6347L2391O20o3553K4245n6284k8923j49340
$$ plain form
10546 -224475 -130392 52806 39553 -201354 -219748 -336798 -156550 -219488 -437236 -441710 8441
10535 8441 35758 -167384 -185079 -123238 47666 151015 44200 133781 107544 -212382 -204393
10524 -204393 105943 193144 -99213 -90710 -7309 -79340 -228048 -82655 -263671 -166120 104387
10513 104387 -131547 -220251 -247122 230859 125726 -25469 38349 278936 279960 117829
10503 117829 66126 156431 250747 78922 -24242 45771 9777 145381 82410 -103626 -140975
10492 -140975 -12625 -1678 -67206 -40225 -232625 -116364 97738 -149895 -148705 -39515
10482 -39515 60714 121284 -73247 -128296 -406615 -42956 -91375 89638 -42946 -147278
10472 -147278 -205682 -335938 -66284 -14011 38169 29471 -96379 205497 125764 60608 326146
$$ packed form
10546b24475R4083J83198j3253k40907j8394j17050J80248o2938k17748m474M50151
10535H441K7317k03142j7695O1841J70904J03349j06815Q9581k6237l19926P989
10524b04393L10336Q7201k92357Q503Q3401p2031j48708J45393j81016R7551K70507
10513A04387k35934q8704k6871M77981j05133j51195O3818K40587J024j62131
10503A17829n1703R0305R4316j71825j03164P0013l5994J35604o2971j86036l7349
10492a40975J28350J0947o5528K6981j92400J16261K14102k47633J190J09190
10482c9515J00229O0570j94531n5049k78319L63659m8419J81013j32584j04332
10472a47278n8404j30256K69654N2273N2180q698j25850L01876p9733o5156K65538
$$ plain form
10461 326146 389403 96914 -52063 -109863 33138 -36217 -174710 -104442 47544 -14284
10451 -14284 -64755 28521 -270780 -127871 -187216 139636 100322 -196472 -94187 -174860 228639
10440 228639 268394 52847 193413 92054 -22880 91343 -96555 43468 61301 158293
10430 158293 131577 107101 -2614 25636 30600 -41952 -222590 -312348 -87453 114615 90
10419 90 167761 188013 21123 187160 88222 33965 -220044 8185 100778 -70440 -136743
10408 -136743 -139182 -1592 101185 -10749 35173 56245 157757 236337 -68867 -258660
10398 -258660 -267383 -196436 -144105 64151 -18237 127933 187534 101720 309010 176012 -30780
10387 -30780 -49772 135049 192337 495571 409574 42065 -228529 -202127 -18459 -77274 -35478
$$ packed form
10461C26146O3257k92489j48977n7800J43001o9355j38493P0268J51986o1828
10451a4284n0471R3276k99301J42909n9345L26852l9314k96794J02285q0673M03499
10440B28639L9755k15547J40566j01359j14934J14223j87898J40023J7833R6992
10430A58293k6716k4476j09715K8250M964p2552j80638q9758K24895K02068j14525
10419I0J67671K0252j66890J66037r8938n4257k54009K28229R2593j71218o6303
10408a36743k439J37590J02777j11934M5922K1072J01512P8580l05204j89793
10398b58660q723P0947N2331K08256q2388J46170N9601q5814K07290j32998k06792
10387c0780j8992J84821N7288L03234q5997l67509k70594K6402J83668n8815M1796
$$ plain form
10376 -35478 230940 164535 -46002 23731 17892 -89961 -156438 -104005 105880 11676 10710
10365 10710 -5853 90685 120805 106596 -57 -309614 -184472 -133245 -205599 37339 163519
10354 163519 247754 -127920 -88536 79044 103898 183555 75129 -112328 -92576 66628
10344 66628 108179 -80117 49860 139976 17778 13746 -79888 -54491 -155543 -78048 99516
10333 99516 88589 50952 116967 177448 -54988 166312 215845 126515 111786 214800 361794
10322 361794 262897 160232 128290 136799 -44097 187858 66545 -148688 -123167 117014
10312 117014 -21125 34519 -50370 -129173 273827 202134 101567 -85317 -179198 -14904
10302 -14904 29340 -202702 -305708 -215188 -147964 -14103 -91889 -26748 118905 -120787 -56126
$$ packed form
10376c5478K66418o6405k10537O9733n839j07853o6477N2433K09885r4204r66
10365A0710j6563R6538L0120j4209j06653l09557J25142N1227p2354K42938J26180
10354A63519Q4235l75674L9384J67580K4854P9657j08426j87457J9752J59204
10344F6628M1551j88296J29977R0116j22198m032r3634K5397j01052P7495J77564
10333I9516j0927l7637O6015O0481k32436K21300M9533q9330j4729J03014J46994
10322C61794r8897j02665l1942Q509j80896K31955j21313k15233K5521K40181
10312A17014j38139N5644q4889p8803M03000p1693j00567j86884r3881J64294
10302a4904M4244k32042j03006R0520O7224J33861p7786O5141J45653k39692O4661
$$ plain form
10291 -56126 342947 288537 319477 107941 -318967 -82957 381724 91834 -37852 109174
10281 109174 168311 212231 251270 63473 10598 74476 183658 212523 146655 -8785 -33126
10270 -33126 -89272 -94162 -224477 -66578 212258 37291 -46752 -15906 -80715 -96395 -74104
10259 -74104 -228413 82386 26133 -31565 100791 311581 330727 101502 72951 35100 17815
10248 17815 70194 149450 -102936 -14753 243006 158644 24470 220272 -115585 -163938 55047
10237 55047 169037 26168 46178 98780 116769 268906 351417 274640 52479 226852 611891
10226 611891 722658 670455 568474 120142 63300 142706 291401 174108 336206 431961
10216 431961 230535 167127 137561 95049 7840 95065 -23639 7812 94201 159957 190313
$$ packed form
10291e6126L99073n4410L0940k11536m26908K36010M64681k89890j29686J47026
10281A09174N9137M3920L9039j87797n2875O3878J09182K8865o5868j55440k4341
10270c3126n6146m890j30315J57899K78836j74967q4043L0846o4809j5680K2291
10259g4104j54309L10799n6253n7698J32356K10790J9146k29225k8551l7851j7285
10248A7815N2379P9256k52386Q8183K57759q4362j34174J95802l35857m8353K18985
10237E5047J13990j42869K0010N2602J7989J52137Q2511p6777k22161J74373L85039
10226F11891J10767n2203j01981m48332n6842P9406J48695j17293J62098R5755
10216D31961k01426o3408k9566m2512q7209Q7225j18704L1451Q6389O5756L0356
$$ plain form
10205 190313 159809 -29043 -507448 -105455 21665 28054 -10928 153483 145175 253755 141310
10194 141310 274495 190074 198332 194369 230043 536061 418938 215818 13432 50097 -78613
10183 -78613 -63642 -13437 -62150 -146216 9901 161424 252097 257298 313858 95683 -100821
10172 -100821 89742 226500 541497 389145 393830 462422 585234 467577 355087 153265
10162 153265 256814 261871 231271 156396 141591 51072 -89599 190980 344936 531268 85008
10151 85008 23546 45324 87390 122121 334403 163463 217342 153881 172060 145044 414493
10140 414493 391934 408535 557724 640134 590806 437501 419780 700017 568045 82561
10130 82561 -290530 -173692 167442 163933 108133 289621 293145 186420 448558 356236 210094
$$ packed form
10205A90313l0504j88852m78405M01993J27120O389l8982J64411q308J08580j12445
10194A41310J33185q4421Q258l963L5674L06018j17123k03120k02386L6665j28710
10183g8613J4971N0205m8713q4066J56117J51523R0673N201N6560k18175j96504
10172a00821J90563J36758L14997j52352M685O8592J22812j17657j12490k01822
10162A53265J03549N057l0600p4875j4805r0519j40671K80579J53956J86332m46260
10151H5008o1462K1778M2066L4731K12282j70940N3879o3461J8179k7016K69449
10140D14493k2559J6601J49189Q2410m9328j53305j7721K80237j31972m85484
10130H2561l73091J16838L41134l509n5800J81488L524j06725K62138r2322j46142
$$ plain form
10119 210094 100894 260130 236839 -167555 48181 126301 179781 252728 95197 163020
10109 163020 33019 99088 218677 413798 400454 438883 346007 246545 308310 531984 295039
10098 295039 266487 224034 152957 13822 26427 23651 -36941 -36227 -97132 54832 198984
10087 198984 291395 236329 189490 177824 144683 162670 296287 251350 406848 327147 370883
10076 370883 90513 45493 265132 258687 223956 439757 362415 -22219 137969 317863
10066 317863 150827 192886 372702 263354 183341 52667 -89991 1985 246013 254698
10056 254698 271602 449406 157582 193446 87789 -37715 172848 205860 109783 -75798
10046 -75798 28359 35504 20742 189355 420729 256396 36038 67129 311416 291456 166258
$$ packed form
10119B10094j09200J59236k3291m04394K15736P8120N3480P2947j57531O7823
10109A63020j30001O6069J19589J95121j3344L8429r2876r9462O1765K23674k36945
10098B95039k8552m2453p1077j39135J2605k776o0592P14o0905J51964J44152
10087A98984R2411n5066m6839j1666l3141J7987J33617m4937J55498p9701M3736
10076C70883k80370m5020K19639o445l4731K15801p7342l84634J60188J79894
10066C17863j67036M2059J79816j09348q0013j30674j42658R1976K44028Q685
10056B54698J6904J77804k91824L5864j05657j25504K10563L3012r6077j85581
10046g5798J04157P145j4762J68613K31374j64333k20358L1091K44287j9960j25198
$$ plain form
10035 166258 295766 376319 140502 354389 276005 414386 442423 404975 260948 453809
10025 453809 525559 145914 257671 205746 226744 21443 -17771 39747 96414 217750 224769
10014 224769 247832 406034 425426 267417 285596 566617 409055 427601 578141 701279
10004 701279 436392 399685 713524 389581 409121 322358 616523 604739 511490 578366 580953
9993 580953 596875 619210 392904 422598 417258 518085 535583 447044 638739 596057 536113
9982 536113 447777 527937 409396 289997 220115 298176 410874 426524 421784 589982 457269
9971 457269 459076 634896 539924 340845 475931 453048 349761 367304 515818 554788 710666
9960 710666 794791 451308 317207 324190 626468 514897 288053 630673 685652 623865 461975
$$ packed form
10035A66258J29508Q0553k35817K13887p8384J38381K8037l7448j44027J92861
10025D53809P1750l79645J11757n1925K0998k05301l9214N7518N6667J21336P019
10014B24769K3063J58202J9392j58009J8179K81021j57562J8546J50540J23138
10004G01279k64887l6707L13839l23943J9540q6763K94165j1784r3249O6876K587
9993E80953J5922K2335k26306K9694n340J00827J7498q8539J91695m2682n9944
9982E36113q8336Q0160j18541j19399o9882P8061J12698J5650m740J68198j32713
9971D57269J807J75820r4972j99079J35086k2883j03287J7543J48514L8970J55878
9960G10666Q4125l43483j34101O983L02278j11571k26844L42620N4979o1787j61890
$$ plain form
9949 461975 568692 582472 225546 82108 332420 369613 541378 426464 662033 681769
9939 681769 503222 497301 620764 661208 653795 784304 781209 926768 630809 344584 376804
9928 376804 414216 594497 635514 607630 433904 427369 711344 698582 531558 457217 569308
9917 569308 368623 629886 572754 625487 546113 434935 454560 511144 683128 528175 556180
9906 556180 506815 509581 426185 427404 590825 645766 750522 574942 637263 757311 509396
9895 509396 245389 398968 563641 715525 693788 483765 501897 385038 382440 461568 560260
9884 560260 705494 503546 479819 513567 438776 694351 553990 498645 696530 507225
9874 507225 673960 605830 325276 434479 527700 465507 576689 457112 285104 528881
$$ packed form
9949D61975J06717J3780l56926j43438K50312L7193J71765j14914K35569J9736
9939F81769j78547n921J23463M0444p413J30509l095J45559k95959k86225L2220
9928C76804L7412J80281M1017k7884j73726o535K83975j2762j67024p4341J12091
9917E69308k00685K61263n7132N2733p9374j11178J9625N6584J71984j54953K8005
9906E56180m9365K766q3396J219J63421N4941J04756j75580O2321J20048k47915
9895E09396k64007J53579J64673J51884k1737k10023J8132j16859k598P9128R8692
9884E60260J45234k01948k3727L3748p4791K55575j40361n5345J97885j89305
9874E07225J66735o8130k80554J09203R3221o2193J11182j19577j72008K43777
$$ plain form
9864 528881 758773 570905 534025 630020 522465 616120 472662 424414 282967 340139 423979
9853 423979 577593 854524 729691 715257 533317 491767 518521 617700 770923 713634 620727
9842 620727 493313 649217 486736 514331 715822 582636 471569 547994 415087 481047
9832 481047 724617 671597 563259 586857 543774 466733 627486 787384 420258 405986 532902
9821 532902 442982 457796 480266 644066 730257 645676 906898 942720 677060 659056 445106
9810 445106 438005 480810 712067 734113 693334 604216 599123 456763 581993 764716 657652
9799 657652 525610 392187 431926 437430 711169 882807 857653 858283 813928 771106 830398
9788 830398 944444 922126 894116 917259 759532 617539 680416 736873 868448 859163 882857
$$ packed form
9864E28881K29892j87868l6880R5995j07555R3655j43458m8248j41447N7172Q3840
9853D23979J53614K76931j24833j4434j81940m1550K6754R9179J53223n7289r2907
9842F20727j27414J55904j62481K7595K01491j33186j11067P6425j32907O5960
9832D81047K43570n3020j08338K3598m3083p7041J60753J59898l67126j4272J26916
9821E32902q9920J4814K2470J63800Q6191q4581K61222L5822k65660j8004k13950
9810D45106p101M2805K31257K2046m0779q9118n093j42360J25230J82723j07064
9799F57652j32042j33423L9739N504K73739J71638k5154O30m4355m2822N9292
9788H30398J14046k2318k8010K3143j57727j41993O2877N6457J31575r285K3694
$$ plain form
9777 882857 836235 836112 954500 1031179 1171393 1110590 881089 901884 872650 826670 814633
9766 814633 734515 747295 843330 879191 851991 711598 641866 584226 464178 524530 479884
9755 479884 756349 791828 604696 744454 722741 757652 653466 462316 687293 916258
9745 916258 1002713 945892 641105 679724 724360 918005 752037 631351 768539 825726 760766
9734 760766 830956 919398 712795 720653 708698 879984 895471 796982 718761 698519 798588
9723 798588 1025960 905895 935847 998653 709797 469045 640288 888837 1194680 1099184
9713 1099184 988549 971153 855857 746712 851619 986677 1135845 1221461 1067284 1065972
9703 1065972 1186591 811659 520413 504226 698015 806737 939503 1007707 854082 759202
$$ packed form
9777H82857m6622j23J18388P6679J40214o0803k29501K0795k9234m5980j2037
9766H14633q0118J2780R6035L5861k7200j40393o9732n7640j20048O0352m4646
9755D79884K76465L5479j87132J39758k1713L4911j04186j91150K24977K28965
9745I16258Q6455n6821l04787L8619M4636J93645j65968j20686J37188N7187o4960
9734G60766P0190Q8442k06603P858j1955J71286J5487r8489p8221k0242J00069
9723G98588K27372j20065K9952O2806k88856k40752J71243K48549L05843r5496
9713A099184j10635j7396j15296j09145J04907J35058J49168Q5616j54177j312
9703A065972J20619l74932k91246j6187J93789J08722J32766O8204j53625r4880
$$ plain form
9693 759202 874464 843460 748146 814615 816683 699533 703791 969421 1032790 984571 1028137
9682 1028137 1100557 1010682 1109946 1187232 1120072 1026951 1091319 1258846 1126722 1004573 1131692
9671 1131692 985401 909731 907926 960201 974352 794426 954452 943085 1165565 1061874 1171189
9660 1171189 992746 891464 955867 1017323 1137529 1101313 1136457 1083697 1211304 960084
9650 960084 1123253 1269484 1326812 1249937 1127963 1167062 1251625 1111149 1044814 1093558 1100892
9639 1100892 1023988 1007198 1139224 1378686 1220482 1264210 1288151 1469818 1289990 1178331
9629 1178331 1376048 1389261 1118213 1222207 1160294 970536 1233259 1576749 1414118 1219298
9619 1219298 1115365 1129380 1161017 1266352 1224397 1106099 1131553 1313731 1448413 1311482
$$ packed form
9693G59202J15262l1004r5314O6469K068j17150M258K65630O3369m8219M3566
9682A028137P2420q9875R9264P7286o7160r3121O4368J67527j32124j22149J27119
9671A131692j46291p5670j805N2275J4151j79926J60026j1367K22480j03691J09315
9660A171189j78443j01282O4403O1456J20206l6216L5144n2760J27607k51220
9650I60084J63169J46231N7328p6875j21974L9099Q4563j40476o6335M8744P334
9639A100892p6904j6790J32026K39462j58204M3728K3941J81667j79828j11659
9629A178331J97717J3213k71048J03994o1913j89758K62723L43490j62631j94820
9619A219298j03933J4015L1637J05335m1955j18298K5454J82178J34682j36931
$$ plain form
9609 1311482 1137886 1335811 1468202 1320548 1240581 1014120 1238761 1319072 1176545 1293162
9599 1293162 1245364 1259627 1283860 1314729 1263688 1156251 1147007 1442091 1594139 1601925 1384779
9588 1384779 1244628 1356092 1279157 1585069 1604983 1431270 1570817 1419119 1372912 1320566
9578 1320566 1152256 1144924 1105583 1345149 1454243 1405848 1121279 1182690 1074053 1281704
9568 1281704 1266549 1303048 1436186 1431397 1699144 1668686 1531447 1604394 1700967 1791456 1534765
9557 1534765 1552722 1472509 1548020 1325503 1290054 1296887 1368702 1488501 1516642 1357482 1499724
9546 1499724 1479320 1412315 1556489 1328823 1451587 1631579 1360102 1130416 1353769 1380995
9536 1380995 1452494 1506643 1545435 1564905 1627307 1920029 1748878 1847614 1817544 1443764 1626473
$$ packed form
9609A311482j73596J97925J32391j47654p9967k26461K24641Q0311j42527J16617
9599A293162m7798J4263K4233L0869n1041j07437r244K95084J52048P786k17146
9588A384779j40151J11464p6935L05912J9914j73713J39547j51698m6207n2346
9578A320566j68310p332l9341K39566J09094m8395k84569O1411j08637K07651
9568A281704j5155L6499J33138m789K67747l0458j37239P2947R6573R0489k56691
9557A534765J7957q0213P5511k22517l5449O833P1815J19799K8141j59160J42242
9546A499724k0404o7005J44174k27666J22764J79992k71477k29686K23353K7226
9536A380995P1499N4149L8792J9470O2402K92722j71151R8736l0070l73780J82709
$$ plain form
9525 1626473 1824674 1740567 1989367 1828740 1661310 1652318 1662792 1706793 1619465 1667416 1768853
9514 1768853 1776178 1667541 1727806 1336955 1298637 1622876 1971548 1794492 1965805 1954622
9504 1954622 1707057 1750085 1601617 1843768 1968063 2005111 1926813 1891408 2021115 1918441
9494 1918441 1942672 2058988 2171668 2101526 2160301 2039674 1909487 2085716 1874423 1906559
9484 1906559 2125516 2036863 2156103 2107317 2199466 2148544 2365909 2116576 2222885 2311260
9474 2311260 2255455 1953920 1829497 2110818 2325675 1999186 1900869 1978997 2032854 2186944
9464 2186944 2072414 2172548 2442023 2460579 2250840 2314437 2158612 2409730 2362875 2188917
9454 2188917 2140517 2273380 2373392 2436493 2378259 2467016 2555668 2247703 2503176 2513975 2566735
$$ packed form
9525A626473J98201q4107K48800j60627j67430q992J0474M4001q7328M7951J01437
9514A768853P325j08637O0265l90851l8318L24239L48672j77056J71313j1183
9504A954622k47565M3028j48468K42151J24295L7048p8298l5405J29707j02674
9494A918441K4231J16316J12680p0142N8775j20627j30187J76229k11293L2136
9484A906559K18957q8653J19240m8786R2149n0922K17365k49333J06309Q8375
9474B311260n5805l01535j24423K81321K14857l26489r8317P8128N3857J54090
9464B186944j14530J00134K69475J8556k09739O3597j55825K51118m6855j73958
9454B188917m8400J32863J00012O3101n8234Q8757Q8652l07965K55473J0799N2760
$$ plain form
9443 2566735 2581037 2337815 2271854 2061726 2234417 2182145 2346119 2517494 2552623 2538988
9433 2538988 2609667 2542238 2428026 2200116 2250883 2481933 2466657 2490875 2654391 2493802
9423 2493802 2250800 2331694 2606339 2667963 2680953 2877309 2732199 2594308 2571041 2436648
9413 2436648 2452038 2754620 2654963 2518964 2525018 2389473 2466220 2742044 2728788 2732310 2654195
9402 2654195 2651774 2779799 2971728 3065394 3112251 3162220 3089978 2958025 3140988 3222367 3387540
9391 3387540 3583258 3625666 3495981 3550052 3596863 3655089 3775257 3585933 3582430 3477580 3547345
9380 3547345 3539341 3473972 3451687 3495514 3365373 3326755 3516455 3505917 3570965 3418028 3178395
9369 3178395 3328502 3406158 3647558 3566027 3428520 3560513 3655227 3555703 3351193 3685560
$$ packed form
9443B566735J4302k43222o5961k10128J72691n2272J63974J71375L5129j3635
9433B538988P0679o7429j14212k27910N0767K31050j5276K4218J63516j60589
9423B493802k43002Q0894K74645O1624J2990J96356j45110j37891k3267j34393
9413B436648J5390L02582r9657j35999O054j35545P6747K75824j3256L522p8115
9402B654195k421J28025J91929R3666M6857M9969p2242j31953J82963Q1379J65173
9391C387540J95718M2408j29685N4071M6811N8226J20168j89324l503j04850O9765
9380C547345q004o5369k2285M3827j30141l8618J89700j0538O5048j52937k39633
9369C178395J50107P7656K41400q1531j37507J31993R4714r9524k04510L34367
$$ plain form
9359 3685560 3722968 3628361 3626164 3725812 3744590 3994799 4111323 4138881 4470353 4344967 4196314
9348 4196314 4126680 4224685 4121070 4080476 4002143 4013020 4097609 4084369 3927763 3678963 3816222
9337 3816222 3882416 3627521 3768479 4019898 3991481 3726739 3510412 3670272 3993207 4420640
9327 4420640 4258374 4002824 3995427 3839153 3828295 3940519 4151164 4350742 4264360 4254557 4324343
9316 4324343 4346630 4158492 3959462 3979931 3948976 4001364 3936329 4095033 4028371 4163507 4239782
9305 4239782 4230396 4225888 4291801 4468117 4374801 4323196 4274250 4362141 4477747 4415100 4533840
9294 4533840 4527980 4281637 4448011 4553239 4727742 4685824 4525595 4519853 4691669 4721144 4545311
9283 4545311 4707610 4760634 4798378 4791073 4855223 4850848 5011076 5102376 4982395 5057298 5012343
$$ packed form
9359C685560L7408r4607k197R9648J8778K50209J16524K7558L31472j25386j48653
9348D196314o9634R8005j03615m0594p8333J0877Q4589j3240j56606k48800J37259
9337C816222O6194k54895J40958K51419k8417k64742k16327J59860L22935M27433
9327D420640j62266k55550p397j56274j0858J12224K10645J99578q6382r803O9786
9316D324343K2287j88138j99030K0469l0955N2388o5035J58704o6662J35136P6275
9305D239782r386m508O5913J76316r3316n1605m8946Q7891J15606o2647J18740
9294D533840n860k46343J66374J05228J74503m1918j60229n742J71816K9475j75833
9283D545311J62299N3024L7744p305O4150m375J60228R1300j19981P4903m4955
$$ plain form
9272 5012343 5059141 5376963 5546067 5657901 5558323 5444212 5792671 5931431 5857899 5815318
9262 5815318 5713661 5895879 5855351 5900706 5999914 5736443 5824570 5836743 5921756 5978921 5825639
9251 5825639 5771202 5682584 5832270 5809691 5869952 5995568 5954928 6014428 5987996 5924207 6042992
9240 6042992 6142378 6140911 6386593 6411225 6654397 6821975 6863538 7070259 7063290 7026562 7292599
9229 7292599 7349612 6915663 7233944 7583472 7259933 7352958 7059566 7158445 7062313 7094015
9219 7094015 7080212 7111380 7129740 7070759 7017658 7067074 6949245 7130723 7534279 7317530 7153361
9208 7153361 7488095 7720935 7839306 7665071 7397505 7360813 7349513 7601453 7666234 7637246
9198 7637246 7731650 7834520 7779124 7945240 8164098 7985431 8154649 8564146 8566766 8482999
$$ packed form
9272E012343M6798L17822J69104J11834r9578j14111L48459J38760p3532m2581
9262E815318j01657J82218m0528M5355R9208k63471Q8127J2173Q5013N7165j53282
9251E825639n4437q8618J49686k2579O0261J25616m0640N9500k6432o3789J18785
9240F042992R9386j467K45682K4632K43172J67578M1563K06721o969l6728K66037
9229G292599N7013m33949L18281L49528l23539R3025k93392R8879r6132L1702
9219G094015j3803L1168J8360n8981n3101M9416j17829J81478M03556k16749j64169
9208G153361L34734K32840J18371j74235k67566l6692j1300K51940O4781k8988
9198G637246R4404J02870n5396J66116K18858j78667J69218M09497K620q3767
$$ plain form
9188 8482999 8840553 8930125 9119477 9226008 9398916 9552731 9492175 9543076 9483708 9240354
9178 9240354 9105188 9288590 9138674 9296306 9446935 9560403 9668302 9934217 9858257 9963070
9168 9963070 9883381 9642984 9686542 9944804 9723860 9897276 10015345 10107435 10074955 10209288
9158 10209288 10349927 10260412 10344686 10539967 10710259 10737009 10902289 11103600 11210472 11521035
9148 11521035 11440389 11538588 11442218 11542407 12129850 12355059 12306649 12324339 12479898 12752466
9138 12752466 12802923 12806779 12777122 12941842 12676402 12724334 13002470 13205015 13148369 13213410 13177382
9127 13177382 13218297 13549317 13348041 13619406 13619535 13730799 13764817 14126245 14172145 14381187
9117 14381187 14494852 14676818 14752183 14777289 14907833 15183864 15440274 15710452 15692036 15682322
$$ packed form
9188H482999L57554Q9572J89352J06531J72908J53815o0556N0901n9368k43354
9178I240354j35166J83402j49916J57632J50629J13468J07899K65915p5960J04813
9168I963070p9689k40397M3558K58262k20944J73416J18069R2090l2480J34333
9158A0209288J40639q9515Q4274J95281J70292K6750J65280K01311J06872L10563
9148A1521035q0646R8199r6370J00189N87443K25209m8410J7690J55559K72568
9138A2752466N0457L856k9657J64720k65440M7932K78136K02545n6646O5041l6028
9127A3177382M0915L31020k01276K71365J29J11264L4018L61428M5900K09042
9117A4381187J13665J81966P5365K5106J30544K76031K56410K70178j8416r714
$$ plain form
9107 15682322 15702892 16199166 16573059 16645470 16784284 16807513 16825471 17092760 17443393 17714087
9097 17714087 17929570 17808605 17883522 18293977 18480365 18509066 18696290 18988259 19318951 19341183
9087 19341183 19520703 19744643 19908934 20210021 20517635 20619562 20877991 21133236 21023836
9078 21023836 21335785 21780094 22110839 22283702 22372090 23124141 23283606 23354153 23630408 24018016
9068 24018016 24298837 24777902 25285995 25517703 25633319 26032816 26557905 26922077 27219855
9059 27219855 27745677 28124875 28457285 29042260 29575456 30061361 30514011 31185391 31642054
9050 31642054 32226516 32767601 33301371 34130512 34881223 35629005 36291928 37272764 38325443
9041 38325443 39608641 41005149 42083558 43576507 45323198 46638174 48533499 50596799
$$ packed form
9107A5682322K0570M96274L73893P2411J38814K3229J7958K67289L50633K70694
9097A7714087K15483j20965P4917M10455J86388K8701J87224K91969L30692K2232
9087A9341183J79520K23940J64291L01087L07614J01927K58429K55245j09400
9078B1023836L11949M44309L30745J72863Q8388P52051J59465P0547K76255L87608
9068B4018016K80821M79065N08093K31708J15616L99497N25089L64172K97778
9059B7219855N25822L79198L32410N84975N33196M85905M52650O71380M56663
9050C1642054N84462N41085N33770Q29141P50711P47782O62923R80836J052679
9041C8325443J283198J396508J078409J492949J746691J314976J895325K063300
$$ plain form
9033 50596799 52508635 54832198 57448280 60529812 63773081 67806928 71890780 76372209
9025 76372209 81622320 87746588 94233433 101260885 108535969 116058194 123444413 130285192
9017 130285192 135761304 139494047 141448003 142236677 141847796 141191143 140362528 138074260 133863324
9008 133863324 128288464 121557626 114518007 108067086 102701460 98291188 94675332 92246837
9000 92246837 90600324 89876506 89572272 89916644 90863676 92493013 94914657 97976385 102002270
8991 102002270 106432804 111698930 118142319 125319910 133068878 141529995 150646711 159329639
8983 159329639 167439901 173877509 178063307 180347202 180784989 179836171 178033192 174770841
8975 174770841 170082415 163425756 154685282 144280599 133219438 122547711 112618656 103884363
$$ packed form
9033E0596799J911836K323563K616082L081532L243269M033847M083852M481429
9025G6372209N250111O124268O486845P027452P275084P522225P386219O840779
9017A30285192N476112L732743J953956P88674l88881o56653q28615k288268m210936
9008A33863324n574860o730838p039619o450921n365626m410272l615856k428495
9000I2246837j646513p23818l04234L44372R47032J629337K421644L061728M025885
8991A02002270M430534N266126O443389P177591P748968Q461117R116716Q682928
8983A59329639Q110262O437608M185798K283895M37787r48818j802979l262351
8975A74770841m688426o656659q740474j0404683j1061161j0671727r929055q734293
$$ plain form
8967 103884363 96390356 89934476 84196124 79514421 75242760 71471876 68453136 65770423
8959 65770423 63489064 61167044 59248216 57148873 55441963 53904236 52381950 51053246
8951 51053246 50167851 49319750 48524844 47584319 46843466 46349977 45760187 45488074 44915459
8942 44915459 44670889 44612727 44623510 44647826 44569586 44449731 44823359 44861872 44674391 44826431
8932 44826431 44931117 45287590 45718195 45930583 46324172 46882132 47023552 47650720 48291559
8923 48291559 48925925 49615843 50425718 51305674 52283907 53368497 54480140 55800383 57103631
8914 57103631 58594602 60736368 63027573 65567757 68619510 71934630 75933858 80981311
8906 80981311 86817660 93355674 100667659 108822535 118250198 128632457 140055536 151628022
$$ packed form
8967A03884363p494007o455880n738352m681703m271661l770884l018740k682713
8959F5770423k281359k322020j918828k099343j706910j537727j522286j328704
8951E1053246q85395q48101p94906r40525p40853m93489n89790k72113n72615
8942D4915459k44570n8162J0783K4316p8240j19855L73628L8513j87481J52040
8932D4826431J04686L56473M30605K12388L93589N57960J41420O27168O40839
8923D8291559O34366O89918Q09875Q79956R78233J084590J111643J320243J303248
8914E7103631J490971K141766K291205K540184L051753L315120L999228N047453
8906H0981311N836349O538014P311985Q154876R427663J0382259J1423079J1572486
$$ plain form
8898 151628022 159318360 162225208 161305417 158126621 156377898 157183632 159843893 161549265
8890 161549265 158671313 153069611 146228660 135227140 123601509 114767329 108307762 103429425
8882 103429425 100027052 98339976 97516791 97148079 97780332 99278302 101608316 104934212
8874 104934212 109328748 114757115 121349329 129314375 138353209 148962792 160790964 173995153
8866 173995153 188634874 204090279 215721541 218457940 213779995 208087065 205745330 206685533
8858 206685533 209645078 213134390 210160761 199544847 183257478 162936728 144197976
8851 144197976 129557553 118085891 108799150 102017760 96243353 91553392 87637189 84269993
8843 84269993 81740223 79232497 77071220 75540165 74315051 72935376 71928854 71437205
$$ packed form
8898A51628022P690338K906848r19791l178796j748723Q05734K660261J705372
8890A61549265k877952n601702o840951j1001520j1625631q834180o459567m878337
8882A03429425l402373j687076q23185l68712O32253J497970K330014L325896
8874A04934212M394536N428367O592214P965046R038834J0609583J1828172J3204189
8866A73995153J4639721J5455405J1631262K736399m677945n692930k341735R40203
8858B06685533K959545L489312k973629j0615914j6287369k0320750j8738752
8851A44197976j4640423j1471662r286741o781390n774407m689961l916203l367196
8843H4269993k529770k507726k161277j531055j225114j379675j006522m91649
$$ plain form
8835 71437205 70589973 69914920 69049857 68881737 68885993 69037905 69099225 69649350 70166583 71010027
8825 71010027 71820608 72449134 73265616 74749736 76256865 78074101 80610583 83421206 86516441
8816 86516441 90231355 94475940 98881160 104024506 109835287 115903659 120820343 121618850
8808 121618850 119462570 118394819 118380761 119460069 121907029 124572846 124751289 119637850
8800 119637850 112457206 106896358 102646609 99639003 97792522 96809944 96238721 96417996
8792 96417996 97343029 99133097 101116982 103955471 107145147 110996014 116042635 121896712
8784 121896712 128738608 137081166 146489991 157016817 168497158 181240900 195371509
8777 195371509 209163331 217046376 213931800 205242826 198282347 194513488 193527660 194667849
$$ packed form
8835G1437205q47232o75053q65063j68120M256J51912O1320N50125N17233Q43444
8825G1010027Q10581O28526Q16482J484120J507129J817236K536482K810623L095235
8816H6516441L714914M244585M405220N143346N810781O068372M916684P98507
8808A21618850k156280j067751j4058J079308K446960K665817J78443n113439
8800A19637850p180644n560848m249749l007606j846481r82578n71223J79275
8792I6417996R25033J790068J983885K838489L189676L850867N046621N854077
8784A21896712O841896Q342558R408825J0526826J1480341J2743742J4130609
8777A95371509J3791822P883045l114576q688974o960479l768859r85828J140189
$$ plain form
8769 194667849 196573675 193836268 183952469 170973332 157246508 145487299 136351076 129595682
8761 129595682 124490262 120806228 117893763 116091914 115298547 115092491 115575471 116659394
8753 116659394 118393710 120875458 124233199 128598205 133590416 139461243 146713540 154216656
8745 154216656 162684153 172343337 182766180 192103696 195602508 190829457 185314600 182005151
8737 182005151 181475193 183051358 186418927 191308652 194982268 193153616 188235906 185032863
8729 185032863 184821778 187301265 192349837 199200484 208518631 219602958 233596896 249454812
8721 249454812 265181677 274789207 277479760 280915045 288808552 301016550 316313557 333240365
8713 333240365 349621730 357887850 360191223 346987924 306957293 266533538 236494794
$$ packed form
8769A94667849J905826k737407r883799j2979137j3726824j1759209r136223o755394
8761A29595682n105420l684034k912465j801849p93367k06056M82980J083923
8753A16659394J734316K481748L357741M365006M992211N870827P252297P503116
8745A54216656Q467497R659184J0422843R337516L498812m773051n514857l309449
8737A82005151n29958J576165L367569M889725L673616j828652m917710l203043
8729A85032863k11085K479487N048572O850647R318147J1084327J3993938J5857916
8721B49454812J5726865R607530K690553L435285P893507J2207998J5297007J6926808
8713C33240365J6381365Q266120K303373j3203299m0030631m0423755l0038744
$$ plain form
8706 236494794 213905895 196109128 182465216 172153296 164829403 159613978 155808890
8699 155808890 153181184 152254345 152858089 154723470 157611669 161697223 167101310 174271821
8691 174271821 181983597 191125145 201730778 213375942 223842887 226364892 219432754 210875840
8683 210875840 205350089 202842196 202715079 202635799 196319145 180426562 163593091 149863788
8675 149863788 138829686 130035919 123288004 118073325 113804510 110157934 107601686 105405897
8667 105405897 103697578 102611626 101685437 100992184 100433596 100524839 101042519 101892821 103285780
8658 103285780 104896058 107034942 109443015 112452775 115874513 119125030 119724087 116952569
8650 116952569 113694222 111755610 111067947 110546488 109771461 106593355 101116429 96309265
$$ packed form
8706B36494794k2588899j7796767j3643912j0311920p323893n215425l805088
8699A55808890k627706r26839O03744J865381K888199M085554N404087P170511
8691A74271821P711776R141548J0605633J1645164J0466945K522005o932138q556914
8683B10875840n525751k507893j27117p9280o316654j5892583j6833471j3729303
8675A49863788j1034102q793767o747915n214679m268815l646576k556248k195789
8667A05405897j708319j085952r26189o93253n58588R1243N17680Q50302J392959
8658A03285780J610278K138884K408073L009760L421738L250517N99057k771518
8650A16952569l258347j938612o87663n21459p75027l178106n476926m807164
$$ plain form
8642 96309265 92645421 89695698 87169989 85025050 83126849 81432030 80069037 79110466
8634 79110466 78100696 77374984 76868238 76337003 75786796 75126134 74881822 74302953 73693835
8625 73693835 73214994 72766752 72788576 72246593 71747769 71298072 71033647 70745193 70451899 70291119
8615 70291119 69962821 69814591 69853663 70023494 69855356 69782881 69989162 70201720 70328964 70432642
8605 70432642 71107715 71612018 71934212 72383461 72770977 72946816 73006217 73651507 73826221 74030347
8595 74030347 74671599 75197485 75223202 75299284 75815891 76101078 76048285 75795343 75597156 75125441
8585 75125441 74685819 74178387 73856866 73225298 72860100 72837594 72757980 72678135 72818246 73027403
8575 73027403 72667880 72963140 73156444 72969169 73123611 73195390 73608926 73995829 74264762 74744966
$$ packed form
8642I6309265l663844k949723k525709k144939j898201j694819j362993r58571
8634G9110466j009770p25712n06746n31235n50207o60662k44312n78869o09118
8625G3693835m78841m48242K1824n41983m98824m49697k64425k88454k93294j60780
8615G0291119l28298j48230L9072J69831j68138p2475K06281K12558J27244J03678
8605G0432642O75073N04303L22194M49249L87516J75839N9401O45290J74714K04126
8595G4030347O41252N25886K5717P6082N16607K85187n2793k52942j98187m71715
8585G5125441m39622n07432l21521o31568l65198k2506p9614p9845J40111K09157
8575G3027403l59523K95260J93304j87275J54442P1779M13536L86903K68933M80204
$$ plain form
8565 74744966 75063878 75632483 76227655 76969435 77551430 78405373 79637197 80683542 81772125
8556 81772125 82830041 83431315 83414098 83697858 84310415 84199796 84252506 84206893 84049837 84066730
8546 84066730 84109041 84422416 84740624 84885770 85288545 85853574 86403284 86615384 87303477 87748158
8536 87748158 88447079 89269086 89890470 90387360 91070269 91910291 92513729 93436647 94386514
8527 94386514 95171762 95974924 96984295 98057489 99102683 100154581 101350768 102284410 103407738
8518 103407738 104621498 105693698 106537716 107424793 108657363 110173349 111010784 112038732
8510 112038732 113079567 114212962 115286947 116251226 117493174 119009101 120388613 121578721
8502 121578721 122882002 124151766 125451878 126770879 128155935 129417583 130126444 131536724
$$ packed form
8565G4744966L18912N68605N95172P41780N81995Q53943J231824J046345J088583
8556H1772125J057916O01274j7217K83760O12557j10619N2710m5613j57056J6893
8546H4066730M2311L13375L18208J45146M02775N65029N49710K12100O88093M44681
8536H7748158O98921Q22007O21384M96890O82909Q40022O03438R22918R49867
8527I4386514P85248Q03162J009371J073194J045194J051898J196187R33642J123328
8518A03407738J213760J072200Q44018Q87077J232570J515986Q37435J027948
8510A12038732J040835J133395J073985R64279J241948J515927J379512J190108
8502A21578721J303281J269764J300112J319001J385056J261648P08861J410280
$$ plain form
8494 131536724 132875735 133704044 134660566 136104371 137541363 138639535 139634373 140714173
8486 140714173 141585838 142486883 143689556 144614712 145624613 146845253 147706802 148306691 149285955
8477 149285955 150391495 151627511 152791774 153638910 154610948 155711581 156712292 157852387
8469 157852387 158664541 159716230 160748330 161651638 162712198 163780294 164724508 165586823 166581441
8460 166581441 167126729 167631900 168210162 168536892 168987574 169272047 169255101 169168401 169376430 169584142
8450 169584142 169537824 169170421 168772978 168626798 168428442 168140058 167858751 167747910 167524962
8441 167524962 167130618 166667793 166571569 166437654 166444511 166216174 165831498 165656574 165236102 164696675
8431 164696675 164693583 164585118 164388293 164427870 164074164 164136067 164107798 163511586 162989502 162596212
$$ packed form
8494A31536724J339011Q28309R56522J443805J436992J098172R94838J079800
8486A40714173Q71665R01045J202673R25156J009901J220640Q61549N99889R79264
8477A49285955J105540J236016J164263Q47136R72038J100633J000711J140095
8469A57852387Q12154J051689J032100R03308J060560J068096R44214Q62315R94618
8460A66581441N45288N05171N78262L26730M50682K84473j6946q6700K08029K07712
8450A69584142m6318l67403l97443j46180j98356k88384k81307j10841k22948
8441A67524962l94344m62825r6224j33915O857k28337l84676j74924m20472n39427
8431A64696675l092j08465j96825L9577l53706O1903k8269n96212n22084l93290
$$ plain form
8421 162596212 162076667 161283953 160538959 159981315 159011284 158216557 157210906 156476550 155536766
8412 155536766 154456654 153543939 152406191 151456263 150543457 149669242 148707078 147904916 147259456
8403 147259456 146277708 145519651 144949757 144117754 143484605 142915974 142259413 141953329 141232310
8394 141232310 140655610 140406678 140422642 140226798 139784550 139185413 138623270 137792421 136974842
8385 136974842 135744736 134667234 133737396 132976153 132137789 130888621 129981394 128968495 128106788
8376 128106788 127424290 126717898 126163220 125755072 125017469 124200836 123695953 123323154 122611455
8367 122611455 122071077 121732330 121275759 120567598 120061407 119688330 119453251 119082244 118906683
8358 118906683 118881265 118645396 118504116 118298860 118069248 117394478 116663803 116053887 115086538
$$ packed form
8421A62596212n19545p92714p44994n57644r70031p94727j005651p34356r39784
8412A55536766j080112r12715j137748r49928r12806q74215r62164q02162o45460
8403A47259456r81748p58057n69894q32003o33149n68631o56561l06084p21019
8394A41232310n76700k48932J5964j95844m42248n99137n62143q30849q17579
8385A36974842j230106j077502r29838p61243q38364j249168r07227j012899q61707
8376A28106788o82498p06392n54678m08148p37603q16633n04883l72799p11699
8367A22611455n40378l38747m56571p08161n06191l73077k35079l71007j75561
8358A18906683k5418k35869j41280k05256k29612o74770p30675o09916r67349
$$ plain form
8349 115086538 114601764 113595283 112912536 112169240 111416757 110667407 110017949 109469390 108678852
8340 108678852 108260593 107789203 107140761 106713642 106328421 105804323 105585293 105297155 104858356
8331 104858356 104395382 104178743 103523347 103112582 103054698 102653872 102475633 101993696 101706095
8322 101706095 101374358 100943990 100727831 100316193 99828731 99427342 98859430 97757552 97089613
8313 97089613 96268535 95378136 94516309 93830686 92845328 91807328 91350059 90687232 90078998
8304 90078998 89176041 88867993 88590653 88203404 87722625 86993743 86541091 86314851 85939755
8295 85939755 85789009 85372511 84991455 84528188 84259896 84101429 83725057 83240939 82554105
8286 82554105 81897370 81487911 80755523 79771855 79134822 78489019 78002006 77551796 76857079
$$ packed form
8349A15086538m84774j006481o82747p43296p52483p49350o49458n48559p90538
8340A08678852m18259m71390o48442m27119l85221n24098k19030k88138m38799
8331A04858356m62974k16639o55396m10765n7884m00826j78239m81937k87601
8322A01706095l31737m30368k16159m11638m87462m01389n67912j101878o67939
8313I7089613q21078q90399q61827o85623r85358j038000m57269o62827o08234
8304I0078998r02957l08048k77340l87249m80779p28882m52652k26240l75096
8295H5939755j50746m16498l81056m63267k68292j58467l76372m84118o86834
8286H2554105o56735m09459p32388r83668o37033o45803m87013m50210o94717
$$ plain form
8277 76857079 76193696 75799273 75317012 74780555 74151786 73771998 73417169 72845655 72057386
8268 72057386 71791364 71531864 71091024 70769544 70479019 69828009 69385054 69209802 68658798
8259 68658798 68376949 68389826 67998387 67528353 66847071 66606021 66361882 65782063 65485304 65341242
8249 65341242 64838628 64201404 63853857 63509379 62908205 62849091 62695592 62666405 62149990 61728089
8239 61728089 61978759 62105251 61831684 61432891 61222594 61274522 61124444 60865683 60418428 59709782
8229 59709782 59432622 58934814 58651534 58375202 58075076 57871710 57230240 56913405 56660576
8220 56660576 56083445 55939483 55690026 55357176 54861795 54773295 54683457 54723278 54546290 54355378
8210 54355378 54239260 54394494 53942266 53426880 53350579 53236068 52971137 53027061 52785099 52672267
$$ packed form
8277G6857079o63383l94423m82261n36457o28769l79788l54829n71514p88269
8268G2057386k66022k59500m40840l21480k90525o51010m42955j75252n51004
8259F8658798k81849J2877l91439m70034o81282k41050k44139n79819k96759j44062
8249F5341242n02614o37224l47547l44478o01174n9114j53499k9187n16415m21901
8239F1728089K50670J26492k73567l98793k10297N1928j50078k58761m47255p08646
8229E9709782k77160m97808k83280k76332l00126k03366o41470l16835k52829
8220E6660576n77131j43962k49457l32850m95381q8500q9838L9821j76988j90912
8210E4355378j16118J55234m52228n15386p6301j14511k64931N5924k41962j12832
$$ plain form
8200 52672267 52528804 52709615 52581455 52528474 52407147 52925722 53089508 54232819 55547840
8191 55547840 52619022 51870744 51956267 51886248 51974132 51981192 52216338 52097840 51938705 51742253
8181 51742253 52053237 52119113 52112747 52216924 52334439 52322258 52456545 52414768 52376336 52707916
8171 52707916 52638366 52864119 53050176 53580964 54142089 54513873 54609805 54957872 55544300 55929648
8161 55929648 56306606 56921754 57342170 58111156 58581377 59208284 60152901 60903549 61754172
8152 61754172 62340388 63150915 63800698 64664169 65760342 66762073 67929078 69651720 71601070
8143 71601070 73505424 75248799 77486421 79887759 81876892 81847015 80283810 79184856
8135 79184856 78565247 78860140 79763729 80653130 82069197 83997454 85999082 87961777 88408936
$$ packed form
8200E2672267j43463J80811j28160n2981j21327N18575J63786J143311J315021
8191E5547840k928818p48278Q5523p0019Q7884P060K35146j18498j59135j96452
8181E1742253L10984O5876o366J04177J17515j2181J34287m1777l8432L31580
8171E2707916o9550K25753J86057N30788N61125L71784R5932L48067N86428L85348
8161E5929648L76958O15148M20416P68986M70221O26907R44617P50648Q50623
8152F1754172N86216Q10527O49783Q63471J096173J001731J167005J722642J949350
8143G1601070J904354J743375K237622K401338J989133k9877j563205j098954
8135G9184856o19609K94893R03589Q89401J416067J928257K001628J962695M47159
$$ plain form
8126 88408936 85457995 81503828 78234238 75565275 73453912 72241713 71204344 70345329
8118 70345329 69774589 69150775 68896962 68836427 68423091 68659675 69037743 69468283 69589265 69781308
8108 69781308 70182749 70500576 71018497 71266397 71272818 71260695 71552355 71688945 71931914 72227497
8098 72227497 72468306 72852439 73478022 74003733 74525466 74898962 76009729 76733114 77523617
8089 77523617 78174801 79174988 80575077 81415289 82211863 83351373 84936509 86635244 88093028
8080 88093028 89737161 91755766 94031892 96715941 99341763 102303202 105365008 108889226
8072 108889226 112996401 118216995 124447818 131487591 139181099 147157257 156249791 166415974
8064 166415974 176499060 182881113 179542986 170329366 163146461 159019384 157046312 157479643
$$ packed form
8126H8408936k950941l954167l269590k668963k111363j212199j037369q59015
8118G0345329n70740o23814k53813o0535m13336K36584L78068M30540J20982J92043
8108F9781308M01441L17827N17921K47900O421j2123K91660J36590K42969K95583
8098G2227497K40809L84133O25583N25711N21733L73496J110767P23385P90503
8089G7523617O51184J000187J400089Q40212P96574J139510J585136J698735J457784
8080H8093028J644133K018605K276126K684049K625822K961439L061806L524218
8072A08889226M107175N220594O230823P039773P693508P976158R092534J0166183
8064A66415974J0083086O382053l338127r213620p182905m127077j973072M33331
$$ plain form
8056 157479643 159484445 162723490 167491070 172997951 177752335 176533285 166437868 153618715
8048 153618715 142976299 133960925 126876233 121465708 117228248 113975343 111213431 109269873
8040 109269873 108044927 106990369 106521116 106953987 107604710 108768587 110283028 112001762
8032 112001762 114858897 118469543 122718689 126998285 131758444 136850405 142646106 149288161
8024 149288161 155841934 159890637 155453353 143532845 131389618 121356160 113606168 107043992
8016 107043992 101785851 97802439 94671196 92190123 89997328 88126642 86591876 85359942
8008 85359942 84304182 83573135 83027401 82658348 82294687 81553066 80980007 80659520 80467434
7999 80467434 80520745 80593622 80896248 81229442 81393845 81353445 82270553 83738869 85455828 87895024
$$ packed form
8056A57479643K004802L239045M767580N506881M754384j219050j0095417j2819153
8048A53618715j0642416r015374p084692n410525m237460l252905k761912j943558
8040A09269873j224946j054558m69253M32871O50723J163877J514441J718734
8032A12001762K857135L610646M249146M279596M760159N091961N795701O642055
8024A49288161O553773M048703m437284j1920508j2143227j0033458p749992o562176
8016A07043992n258141l983412l131243k481073k192795j870686j534766j231934
8008H5359942j055760p31047n45734l69053l63661p41621n73059l20487j92086
7999H0467434N3311P2877L02626L33194J64403m0400R17108J468316J716959K439196
$$ plain form
7989 87895024 90707731 94147456 98497725 103395984 109216288 115609163 122386289 130062237
7981 130062237 138377989 145724561 145924451 135649166 122360967 111221596 102235466 95092980
7973 95092980 89558597 85152876 81089057 77684030 75342212 73145332 71284698 69242370
7965 69242370 67573520 66153436 64867894 63994925 63149712 62808668 62649609 62587103 62771164
7956 62771164 63270654 64130051 64755705 65493857 66159051 66572888 67418275 68559169 69980288
7947 69980288 70550328 69390564 66703332 64173681 62169433 60527942 58649617 56754870
7939 56754870 55175674 54231019 53044987 52066985 51404448 51235528 50947378 51009741 51151045
7930 51151045 51177049 51209726 51057821 50904310 51271341 50995664 50446453 49831968 49564837 49600538
$$ packed form
7989H7895024K812707L439725M350269M898259N820304O392875O777126P675948
7981A30062237Q315752P346572J99890j0275285j3288199j1139371q986130p142486
7973I5092980n534383m405721m063819l405027k341818k196880j860634k042328
7965F9242370j668850j420084j285542q72969q45213l41044j59059o2506J84061
7956F2771164M99490Q59397O25654P38152O65194M13837Q45387J140894J421119
7947F9980288N70040j159764k687232k529651k004248j641491j878325j894747
7939E6754870j579196r44655j186032r78002o62537j68920k88150O2363J41304
7930E1151045K6004L2677j51905j53511L67031k75677n49211o14485k67131L5701
$$ plain form
7920 49600538 49788651 50236127 49913519 49319377 48807577 48443299 48662434 49385935 49992954
7911 49992954 51188211 52393050 54093503 55752106 57935595 60340356 62651108 64550497
7903 64550497 64107981 60673322 56479747 52701659 49809724 47030691 44882080 43252652
7895 43252652 41974813 40649966 39412949 38646652 37971002 37400422 36755667 36074700 35742205
7886 35742205 35227121 34996762 34505941 34164634 33919745 33614821 33081995 33035511 33069654 33004874
7876 33004874 32760419 32041503 31670608 31340735 30955599 30756822 30970673 31135788 31342320
7867 31342320 30935178 30554677 30179573 30127496 29834817 29437567 29387493 29203393 28974882 28881472
7857 28881472 28450213 28260501 27917781 27716496 27617088 27285928 27028247 26702185 26396964 26087065
$$ packed form
7920D9600538J88113M47476l22608n94142n11800l64278K19135P23501O07019
7911D9992954J195257J204839J700453J658603K183489K404761K310752J899389
7903F4550497m42516l434659m193575l778088k891935k779033k148611j629428
7895D3252652j277839j324847j237017p66297o75650n70580o44755o80967l32495
7886C5742205n15084k30359m90821l41307k44889l04924n32826m6484L4143o4780
7876C3004874k44455p18916l70895l29873l85136j98777K13851J65115K06532
7867C1342320m07142l80501l75104n2077k92679l97250n0074j84100k28511r3410
7857B8881472m31259j89712l42720k01285r9408l31160k57681l26062l05221l09899
$$ plain form
7847 26087065 25666019 25164587 24818018 24721850 24629473 24308402 24350011 24363572 24279409 24331154
7837 24331154 24343343 24265341 24183421 24123251 24045932 24380488 24495838 24494256 24485301 24733751 25026776
7826 25026776 24979246 25334083 25746495 25912478 25916727 26018639 25851057 25245555 25194129 24955184
7816 24955184 24648381 24164064 23964549 23710896 23527848 23374303 23221746 23004540 23027192 23113180
7806 23113180 23080065 23177447 23124703 22942360 22967805 22800751 22824873 22712718 23695304 25251459
7796 25251459 24892615 24899053 25210183 25468178 25147448 24893299 24946393 24930035 24796338 24563225
7786 24563225 24333420 24144560 24087980 24269211 24158181 23987115 24081490 24056265 24229921 24065781
7776 24065781 24006117 24245648 24140272 24246291 24539790 24638753 24678830 24810349 25147928 25575084
$$ packed form
7847B6087065m21046n01432l46569r6168r2377l21071M1609J3561q4163N1745
7837B4331154J2189p8002q1920o0170p7319L34556J15350j582q955K48450K93025
7826B5026776m7530L54837M12412J65983M249J01912j67582o05502n1426k38945
7816B4955184l06803m84317j99515k53653j83048j53545j52557k17206K2652Q5988
7806B3113180l3115R7382n2744j82343K5445j67054K4122j12155R82586J556155
7796B5251459l58844O438L11130K57995l20730k54149N3094j6358j33697k33113
7786B4563225k29805j88860n6580J81231j11030j71066R4375k5225J73656j64140
7776B4065781n9664K39531j05376J06019K93499R8963M0077J31519L37579M27156
$$ plain form
7766 25575084 25777310 26199082 26553122 26987136 27693392 28012506 28666863 29197278 29751168
7757 29751168 29752274 29377097 29257844 29042612 28842302 28689315 28798297 29001018 29389361 29745529
7747 29745529 29540112 29467949 29925292 29677238 29485541 29287074 28968029 28735910 28535217 28522524
7737 28522524 28652314 28546449 28399170 28275563 28475777 28510842 28623619 29263860 29249447 29397683
7727 29397683 29901487 29947874 29915793 30325797 30627364 31134812 31534733 31948519 32632205 33175975
7717 33175975 33904691 34269348 34766936 35242057 35818902 36338319 36112161 35297288 34423812
7708 34423812 33428347 33158367 33142214 32672877 32335667 32270071 31968627 31732558 31826386 31724513
7698 31724513 31621290 31839843 32057651 32152355 32023855 32120814 32358502 32570822 32521255 32625861
$$ packed form
7766B5575084K02226M21772L54040M34014P06256L19114O54357N30415N53890
7757B9751168J106l75177j19253k15232k00310j52987J08982K02721L88343L56168
7747B9745529k05417p2163M57343k48054j91697j98467l19045k32119k00693j2693
7737B8522524J29790j05865j47279j23607K00214L5065J12777O40241j4413J48236
7727B9397683N03804M6387l2081M10004L01567N07448L99921M13786O83686N43770
7717C3175975P28716L64657M97588M75121N76845N19417k26158q14873q73476
7708C4423812r95465k69980j6153m69337l37210o5596l01444k36069R3828j01873
7698C1724513j03223K18553K17808R4704j28500R6959K37688K12320m9567J04606
$$ plain form
7688 32625861 32749733 32855832 33029070 33362442 33718175 33831407 34125642 34540145 34930684
7679 34930684 34764861 34573671 34739185 34695683 34544227 34742139 34981356 35133989 35264246 35438455
7669 35438455 35375329 35440245 34991299 34670521 34295045 33943885 33556273 32818338 32625790 32242669
7659 32242669 31466012 31312076 31078056 30915584 30574159 30479275 30278902 30188167 30015554 29893980
7649 29893980 29710111 29408766 29577042 29332831 28823058 28564347 28539874 28515916 28634779 28846728
7639 28846728 29300901 29425128 29122828 29169899 29363894 29598141 29574529 29083813 28550697 28163682
7629 28163682 27961282 27452908 27154554 26876169 26895053 26909549 26773831 26962990 26805512 26794120
7619 26794120 26372780 26028702 25713985 25307886 24848099 24222501 23862124 23566730 23266812
$$ packed form
7688C2625861J23872J06099J73238L33372L55733J13232K94235M14503L90539
7679C4930684j65823j91190J65514m3502j51456J97912K39217J52633J30257J74209
7669C5438455o3126O4916m48946l20778l75476l51160l87612p37935j92548l83121
7659C2242669p76657j53936k34020j62472l41425r4884k00373r0735j72613j21574
7649B9893980j83869l01345J68276k44211n09773k58711k4473k3958J18863K11949
7639B8846728M54173J24227l02300M7071J93995K34247k3612m90716n33116l87015
7629B8163682k02400n08374k98354k78385J8884J4496j35718J89159j57478j1392
7619B6794120m21340l44078l14717m06099m59787o25598l60377k95394k99918
$$ plain form
7610 23266812 22898346 22638169 22405997 22013866 21902638 21762948 21586860 21195853 20817328
7601 20817328 20330929 20220117 20413616 20131830 20284963 20325487 19919109 19588908 19538542 19278949
7591 19278949 19201036 19011626 19000041 18894841 18549474 18393228 18506265 18584635 18335585 18269133
7581 18269133 18161081 17995462 17866836 17989589 17614721 17524435 17639350 17569546 17393517 17273166
7571 17273166 17216946 17226950 17514073 17269415 17361771 17245442 17103257 17113901 17295501 17219786
7561 17219786 17087264 17181841 17257218 17303030 17349365 17413645 17796739 18069923 18289135 18469507
7551 18469507 18503267 18213491 18005680 18037287 17928045 17578571 17449567 17118712 16715028 16404045
7541 16404045 15930713 15664928 15322712 15181559 15008950 14828731 14352540 14018443 14028545 13858536
$$ packed form
7610B3266812l68466k60177k32172l92131j11228j39690j76088l91007l78525
7601B0817328m86399j10812J93499k81786J53133M0524m06378l30201n0366k59593
7591A9278949p7913j89410j1585j05200l45367j56246J13037P8370k49050o6452
7581A8269133j08052j65619j28626J22753l74868r0286J14915o9804j76029j20351
7571A7273166n6220J0004K87123k44658R2356j16329j42185J0644J81600p5715
7561A7219786j32522R4577P5377M5812M6335O4280L83094K73184K19212J80372
7551A8469507L3760k89776k07811L1607j09242l49474j29004l30855m03684l10983
7541A6404045m73332k65785l42216j41153j72609j80219m76191l34097J0102j70009
$$ plain form
7531 13858536 13721101 13428376 13291952 13193637 13064828 12896388 12705262 12897104 13013803 12806322
7521 12806322 12827098 12906233 12653662 12613965 12410311 12342033 12274078 12380161 12616229 12768931
7511 12768931 12914710 12808294 12974805 12963044 13516762 13688809 13458964 13446128 13451454 13453320
7501 13453320 13421106 13493105 13575279 13513016 13107568 12999111 12614890 12252390 12009577 11767278
7491 11767278 11680764 11356260 11325122 11162373 11128413 10909038 10789214 10815181 10616962 10536453
7481 10536453 10238558 10270451 10341785 10493161 10465674 10334290 10400407 10554466 10491171 10439821
7471 10439821 10498318 10624591 10430740 10346639 10179455 10195720 9996319 9850733 9831033 10139938
7461 10139938 10198469 10219249 10464025 10428650 10550298 10573570 10460803 10857765 11021196 11040959
$$ packed form
7531A3858536j37435k92725j36424r8315j28809j68440j91126J91842J16699k07481
7521A2806322K0776P9135k52571l9697k03654o8278o7955J06083K36068J52702
7511A2768931J45779j06416J66511j1761N53718J72047k29845j2836N326J866
7501A3453320l2214P1999Q2174o2263m05448j08457l84221l62500k42813k42299
7491A1767278q6514l24504l1138j62749l3960k19375j19824K5967j98219q0509
7481A0536453k97895L1893P1334J51376k7487j31384O6117J54059o3295n1350
7471A0439821N8497J26273j93851q4101j67184J6265j99401j45586j9700L08905
7461A0139938N8531K0780K44776l5375J21648K3272j12767L96962J63431J9763
$$ plain form
7451 11040959 11287060 11441505 11800484 12164246 12581818 12870792 13306435 13851242 14360875
7442 14360875 14828696 15446756 16211892 16312500 15963677 15740194 15428317 15250746 15375204
7433 15375204 15719819 15835062 15484387 14467285 13786786 13674099 13264061 12842070 12734646
7424 12734646 12593067 12172971 12085022 12041111 12078594 12001749 12027672 12062095 11734083 11628990
7414 11628990 11686558 11686992 11878249 12147556 12172274 12425450 12749164 12963995 12795346 12946381
7404 12946381 13538576 14013785 14560347 14790013 15232516 15725178 16430451 16793200 17315435
7395 17315435 18408754 19135449 19661211 19905752 20212037 20320403 20643662 20964203 21685905
7386 21685905 22293192 23045725 23326526 23527245 23604361 24252050 25165844 26192284 27438636
$$ packed form
7451A1040959K46101J54445L58979L63762M17572K88974M35643N44807N09633
7442A4360875M67821O18060P65136J00608l48823k23483l11877j77571J24458
7433A5375204L44615J15243l50675j017102o80499j12687m10038m21991j07424
7424A2734646j41579m20096q7949m3911L7483p6845K5923L4423l28012j05093
7414A1628990N7568M34J91257K69307K4718K53176L23714K14831j68649J51035
7404A2946381N92195M75209N46562K29666M42503M92662P05273L62749N22235
7395A7315435J093319P26695N25762K44541L06285J08366L23259L20541P21702
7386B1685905O07287P52533K80801K00719P7116O47689R13794J026440J246352
$$ plain form
7377 27438636 29072889 31139154 33444162 35959595 38961130 42361390 46480015 51461607
7369 51461607 56674030 62292305 68387801 75484050 82829385 86694136 83215401 76726401
7361 76726401 71925312 68961887 67712969 68033435 69400173 71446493 74641717 78588724
7353 78588724 81309576 79621642 72158241 63523573 56054382 50188912 45467970 41533578
7345 41533578 38723240 36676929 34929219 33631546 32812525 32006079 31485739 31267919 31076887
7336 31076887 31447399 31880453 32777860 33946757 35246845 36860980 39045056 41441569 44661236
7327 44661236 48533783 52589598 57154004 62248468 67687828 73710048 78419997 78140403
7319 78140403 73548091 68783648 65941785 64478201 64448298 65493860 66952739 68726667
$$ packed form
7377B7438636J634253K066265K305008K515433L001535L400260M118625M981592
7369E1461607N212423N618275O095496P096249P345335L864751l478735o489000
7361G6726401m801089k963425j248918L20466J366738K046320L195224L947007
7353G8588724K720852j687934p463401q634668p469191n865470m720942l934392
7345D1533578k810338k046311j747710j297673q19021q06446n20340k17820j91032
7336C1076887L70512M33054Q97407J168897J300088J614135K184076K396513L219667
7327D4661236L872547M055815M564406N094464N439360O022220M709949k79594
7319G8140403m592312m764443k841863j463584k9903J045562J458879J773928
$$ plain form
7311 68726667 71393837 74213365 74795116 69233842 60489231 53132763 47203589 42266318
7303 42266318 38093902 34703575 31529450 28951546 27075930 24897538 23195211 21859823
7295 21859823 20812801 19687779 18759018 18019400 17277489 16661336 16248200 15920920 15419483
7286 15419483 14956993 14478980 14130509 13875478 13710498 13596856 13325644 13148009 13187408 13153329
7276 13153329 12802178 12775322 12811345 12823626 12740595 12859541 12947617 13236237 12982362 12461085
7266 12461085 12084306 11491435 11213326 11129265 11030959 11017368 10866845 11020453 11024802 10453732
7256 10453732 10158616 9523268 8880834 8462250 8144343 7809599 7548925 7095834 6891161
7247 6891161 6623243 6509926 6413373 6684405 6439644 6299361 6273404 5903615 5863853 6069674
$$ packed form
7311F8726667K667170K819528N81751n561274q744611p356468n929174m937271
7303D2266318m172416l390327l174125k577904j875616k178392j702327j335388
7295B1859823j047022j125022r28761p39618p41911o16153m13136l27280n01437
7286A5419483m62490m78013l48471k55031j64980j13642k71212j77635L9399l4079
7276A3153329l51151k6856L6023J2281q3031J18946Q8076K88620k53875n21277
7266A2461085l76779n92871k78109q4061r8306j3591j50523J53608M349n71070
7256A0453732k95116o35348o42434m18584l17907l34744k60674m53091k04673
7247F891161k67918j13317r6553K71032k44761j40283k5957l69789l9762K05821
$$ plain form
7237 6069674 6120961 6015638 5824781 5799706 5768974 5609837 5524608 5348964 5167844 5028649
7227 5028649 5200474 4987598 4766610 4863315 5093058 4965427 4936709 4783826 4402457 4435465
7217 4435465 4323254 4340240 4538120 4373228 4405810 4555361 4564943 4397123 4282106 4646389
7207 4646389 4778655 4540681 4292655 4342382 4278306 4151099 4173961 4464152 4395527 4249142
7197 4249142 4204759 4166545 4083736 3655222 3741794 3971957 3891295 3863746 3875221 3961620 4091247
7186 4091247 4130599 4261990 4126498 4090661 4157101 4285812 4101012 4063814 4097173 4306485
7176 4306485 4761648 4414856 4395185 4767381 4875032 5107910 5281532 5336466 5583438 5620134
7166 5620134 5836369 5886402 5925624 6161825 6407549 6353240 6394857 6516860 6302069 5737744
$$ packed form
7237F069674N1287j05323j90857k5075l0732j59137q5229j75644j81120j39195
7227E028649J71825k12876k20988R6705K29743j27631k8718j52883l81369L3008
7217D435465j12211J6986J97880j64892L2582J49551R582j67820j15017L64283
7207D646389J32266k37974k48026M9727o4076j27207K2862K90191o8625j46385
7197D249142m4383l8214q2809m28514Q6572K30163q0662k7549J1475Q6399J29627
7186D091247L9352J31391j35492l5837O6440J28711j84800l7198L3359K09312
7176D306485M55163l46792j9671L72196J07651K32878J73622N4934K46972L6696
7166E620134K16235N0033L9222K36201K45724n4309M1617J22003k14791n64325
$$ plain form
7156 5737744 5775682 5891173 5560014 5546900 5323852 5240372 5550724 5375890 5378814 5464797 5447592
7145 5447592 5558750 5524620 5223167 5310687 5338065 5273518 5438152 5404789 5343646 5308884 5498286
7134 5498286 5496839 5499685 5452597 5411709 5109976 5077756 5159452 5218400 5174032 5065989 5057855 4996447
7122 4996447 5076721 4995600 4847736 4916360 4812412 4750774 4738741 4735718 4806126 4768033 4774755
7111 4774755 4710189 4498534 4673798 4519308 4453902 4365892 4507395 4575043 4541930 4712601
7101 4712601 4574075 4622580 4922985 4974974 5179616 5091373 5088974 5352372 5495303 5477173 5797849
7090 5797849 6230350 6284124 6523164 6722665 6954807 6966565 7114337 7257546 7143313 7458002
7080 7458002 7240012 6862945 6551957 6141346 6042706 5948668 5941167 5955262 5798354 5709602 5509160
$$ packed form
7156E737744L7938J15491l31159j3114k23048q3480L10352j74834K924Q5983j7205
7145E447592J11158l4130l01453Q7520K7378o4547J64634l3363o1143l4762J89402
7134E498286j447K846m7088m0888l01733l2220Q1696N8948m4368j08043q134o1408
7122D996447Q0274q1121j47864O8624j03948o1638j2033l023P0408l8093O722
7111D774755o4566k11655J75264j54490o5406q8010J41503O7648l3113J70671
7101D712601j38526M8505L00405N1989K04642q8243k399K63398J42931j8130L20676
7090E797849M32501N3774K39040J99501K32142J1758J47772J43209j14233L14689
7080G458002k17990l77067l10988m10611r8640r4038p501J4095j56908q8752k00442
$$ plain form
7069 5509160 5362864 5236086 5198121 4989550 4828398 4726725 4655783 4761541 4828631 4666756
7059 4666756 4455029 4336739 4358548 4282101 4288373 4445419 4330895 4280849 4061733 3893620
7049 3893620 3792410 3979323 4111142 4100048 4405900 4363753 4272083 4381824 4327275 4416146
7039 4416146 4408554 4659163 4717360 4519325 4313246 4227341 4065876 3822563 3587517 3460128
7029 3460128 3284691 3276912 3133949 3170285 3023549 2957854 2687355 2532350 2517578 2310120
7019 2310120 2475906 2557905 2380056 2493103 2517091 2271963 2313474 2525264 2585364 2816092
7009 2816092 2525513 2655558 2560762 2635771 2789938 2753268 2674035 2764513 3005092 2981412 3082896
6998 3082896 3140007 3327450 3511295 3687798 3739991 3632222 3909270 4082611 3832872 4014003
$$ packed form
7069E509160j46296j26778l7965k08571j61152j01673p0942J05758O7090j61875
7059D666756k11727j18290K1809p6447O272J57046j14524n0046k19116j68113
7049C893620j01210J86913J31819j1094L05852m2147r1670J09741n4549Q8871
7039D416146p592K50609N8197j98035k06079q5905j61465k43313k35046j27389
7029C460128j75437p779j42963L6336j46736o5695k70499j55005j4772k07458
7019B310120J65786Q1999j77849J13047K3988k45128M1511K11790O0100K30728
7009B816092k90579J30045r4796P5009J54167l6670p9233R0478K40579k3680J01484
6998C082896N7111J87443J83845J76503N2193j07769K77048J73341k49739J81131
$$ plain form
6988 4014003 4061190 3964565 4031302 3999052 3542628 3123118 3100630 3070305 2628460 2528199 2531943
6977 2531943 2327157 2226271 2223376 2348817 2152438 2019161 2154842 1988614 1953617 2082156
6967 2082156 2472050 2385029 2169173 2183462 2541120 2274376 2072476 2114733 2120703 2217170 2192479
6956 2192479 2098264 2036844 2131087 2190013 1968493 1904880 2097592 2441560 2605231 2161243
6946 2161243 2098542 2168813 2142125 2131862 2051868 2109105 2088306 2007620 2021783 1917449 1799364
6935 1799364 1771903 1656058 1710245 1945398 2094980 2004757 1988501 2236336 2605603 2772185
6925 2772185 2596021 2792721 2733093 3073537 3368059 3471792 3414221 3015961 2727391 2382873
6915 2382873 2341112 1964286 1736426 1704937 1767270 1669320 1551818 1403910 1452547 1303154
$$ packed form
6988D014003M7187r6625O6737l2250m56424m19510k2488l0325m41845j00261L744
6977B531943k04786j00886k895J25441j96379j33277J35681j66228l4997J28539
6967B082156L89894q7021k15856J4289L57658k66744k01900M2257N970R6467k4691
6956B192479r4215o1420R4243N8926k21520o3613J92712L43968J63671m43988
6946B161243o2701P0271k6688j0263p9994N7237k0799q0686J4163j04334j18085
6935A799364k7461j15845N4187K35153J49582r0223j6256K47835L69267J66582
6925B772185j76164J96700n9628L40444K94522J03733n7571l98260k88570l44518
6915B382873m1761l76826k27860l1489O2333r7950j17502j47908M8637j49393
$$ plain form
6905 1303154 1375592 1392920 1099724 1055723 991475 1120594 1020596 1106199 1404051 1497656 1288828
6894 1288828 970535 675273 683717 1132505 1213156 1302545 911409 924980 815890 870735 876966
6883 876966 919274 934483 894241 1133816 1054139 1153170 1336044 1217764 956041 1246153 1084722
6872 1084722 1171786 1327360 1330750 1346322 1324388 1280975 1335496 1138915 1118100 1105029 930409
6861 930409 1086729 1056089 1038532 1053276 910565 712213 646978 345150 323947 592663 719449
6850 719449 761031 866340 750373 613860 711841 669942 670659 427268 672482 518422 308885
6839 308885 486536 626223 517024 472893 396265 381453 461354 541632 692375 795383 802142
6828 802142 834493 799797 601592 492055 503753 417498 600118 712740 494258 596880
$$ packed form
6905A303154P2438J7328k93196m4001o4248J29119r9998Q5603K97852R3605k08828
6894A288828l18293k95262Q444M48788Q0651Q9389l91136J3571j09090N4845O231
6883H76966M2308J5209m0242K39575p9677R9031J82874j18280k61723K90112j61431
6872A084722Q7064J55574L390J5572k1934m3413N4521j96581k0815j3071j74620
6861I30409J56320l0640j7557J4744j42711j98352o5235l01828k1203K68716J26786
6850G19449M1582J05309j15967j36513R7981m1899P17k43391K45214j54060k09537
6839C08885J77651J39687j09199m4131p6628j4812P9901Q0278J50743J03008O759
6828H02142L2351l4696j98205j09537J1698q6255J82620J12622k18482J02622
$$ plain form
6818 596880 822081 938976 727726 624303 860729 657548 843352 840078 809747 894080
6808 894080 780185 810369 957369 1058780 1026511 1211321 1066845 1105705 1167929 1271170
6798 1271170 1113044 1193491 1331722 1235543 1296562 1072118 895829 757893 630192 388300
6788 388300 373306 393173 474988 462491 248834 306742 541707 587975 546970 473386 422827
6777 422827 352323 218785 381430 533145 382193 422424 291735 209907 204891 129726 194495
6766 194495 247999 101910 118994 331184 219901 341117 168177 114907 40417 175555
6756 175555 447719 339559 164120 397693 436717 590759 768647 662381 667776 546550
6746 546550 677608 631867 768803 927970 898821 802160 818100 650709 571881 706577 496364
$$ packed form
6818E96880K25201J16895k11250j03423K36426k03181J85804l274l0331Q4333
6808H94080j13895L0184J47000J01411l2269J84810j44476L8860O2224J03241
6798A271170j58126Q0447J38231r6179O1019k24444j76289j37936j27701k41892
6788C88300j4994J9867Q1815j2497k13657N7908K34965M6268m1005p3584n0559
6777D22827p0504j33538J62645J51715j50952M0231j30689q1828n016p5165O4769
6766A94495N3504j46089J7084K12190j11283J21216j72940n3270p4490J35138
6756A75555K72164j08160j75439K33573L9024J54042J77888j06266N395j21226
6746E46550J31058m5741J36936J59167k9149r6661J5940j67391p8828J34696k10213
$$ plain form
6735 496364 604379 334737 51091 167994 402029 316023 242995 182643 186160 233636 290131
6724 290131 303287 115684 209574 517003 452658 490592 483191 197022 69177 225133 55174
6713 55174 209839 295464 202498 305425 321796 76766 119196 205247 118399 193150 228287
6702 228287 164418 1505 80345 105237 290143 277050 176499 279733 249636 -6752 -64829
6691 -64829 24809 1160 -127896 -35984 -21919 -64726 223323 325376 90214 -12987 35768
6680 35768 -2 -25170 -156350 1136 308604 250855 125452 4694 -55515 -147955 -100198
6669 -100198 -333327 -91983 27835 -148563 -163923 -110513 -270 -14466 -49255 -138593 -4806
6658 -4806 265461 139823 149428 2057 -89645 33665 -2408 -90739 -8281 120238 -60707
$$ packed form
6735D96364J08015k69642k83646J16903K34035q6006p3028o0352L517M7476N6495
6724B90131J3156j87603R3890L07429o4345L7934p401k86169j27845J55956j69959
6713E5174J54665Q5625r2966J02927J6371k45030M2430Q6051q6848P4751L5137
6702B28287o3869j62913P8840K4892J84906j3093j00551J03234l0097k56388n8077
6691f4829Q9638k3649j29056R1912J4065m2807K88049J02053k35162j03201M8755
6680C5768l5770k5168j31180J57486L07468n7749j25403j20758o0209r2440M7757
6669a00198k33129K41344J19818j76398j5360N3410J10243j4196l4789q9338J33787
6658d806K70267j25638R605j47371r1702J23310l6073q8331Q2458J28519j80945
$$ plain form
6647 -60707 47409 308496 178613 136043 127177 171872 306692 113449 314074 197596 293633
6636 293633 304726 275280 328232 167470 240234 399686 525629 452031 572811 750431 928524
6625 928524 954591 1159972 1134554 1104657 1226591 1702618 1756446 1505747 1281896 1011535
6615 1011535 894824 744998 757589 775462 689577 556204 596424 602566 661945 558884 520901
6604 520901 641985 720223 554616 353527 184504 128604 210803 250777 175120 535733 696076
6593 696076 468262 649712 509301 470622 273378 417739 195917 266744 628911 365019
6583 365019 -100463 -152559 3567 215146 422156 224941 241727 374567 158494 -100734
6573 -100734 -107325 -85101 89369 88867 169590 305822 345040 137817 55191 111056 -27300
$$ packed form
6647f0707J08116K61087j29883m2570q866M4695J34820j93243K00625j16478R6037
6636B93633J1093k9446N2952j60762P2764J59452J25943p3598J20780J77620J78093
6625I28524K6067K05381k5418k9897J21934M76027N3828k50699k23851k70361
6615A011535j16711j49826J2591J7873q5885j33373M0220O142N9379j03061l7983
6604E20901J21084P8238j65607k01089j69023n5900Q2199L9974p5657L60613J60343
6593F96076k27814J81450j40411l8679j97244J44361k21822P0827L62167k63892
6583C65019m65482n2096J56126K11579K07010j97215J6786J32840k16073k59228
6573a00734o591K2224J74470n02Q0723J36232L9218k07223q2626N5865j38356
$$ plain form
6562 -27300 64501 -204152 59058 -37207 -323242 -184032 -142421 11741 -180409 -274292 -268840
6551 -268840 19409 136652 200383 -187356 -237412 -127065 -18850 -48640 -134709 -67237 68645
6540 68645 89303 129961 66896 -180933 -133345 131326 179233 -69286 -77878 -132173 -172127
6529 -172127 -12167 -89759 -50290 -7124 25348 -81142 152037 -21388 -172298 -254588 -25099
6518 -25099 167793 231510 338226 330944 287140 61264 51637 431148 256726 -422 123295
6507 123295 45070 -109774 -62569 -9160 -296594 -269596 6908 24286 163241 212531 575348
6496 575348 670726 327397 451225 353748 314904 411187 283025 208136 374859 397390 562743
6485 562743 407509 349134 357050 286840 241873 281843 310005 303477 164822 328740 523252
$$ packed form
6562b7300R1801k68653K63210r6265k86035J39210M1611J54162j92150r3883N452
6551b68840K88249J17243O3731l87739n0056J10347J08215k9790q6069O7472J35882
6540F8645K0658M0658o3065k47829M7588K64671M7907k48519q592n4295l9954
6529a72127J59960p7592L9469M3166L2472j06490K33179j73425j50910q2290K29489
6518b5099J92892O3717J06716p282m3804k25876r627L79511j74422k57148J23717
6507A23295p8225j54844M7205N3409k87434K6998K76504J7378J38955M9290L62817
6496E75348R5378l43329J23828r7477l8844R6283j28162p4889J66723K2531J65353
6485E62743j55234n8375P916p0210m4967L9970K8162o528j38655J63918J94512
$$ plain form
6474 523252 649642 742036 703843 620273 781521 652679 961326 1130356 1239870 1424307
6464 1424307 1387871 1528332 1366870 1614473 1594773 1824997 2261445 2368278 3026268 3283759
6454 3283759 3463715 3778410 4462592 4779681 4972193 5398506 5980652 6323437 6619579 6429529
6444 6429529 6444546 6075427 5517284 4730914 3909328 3582419 2971279 2705286 2545888 2401299
6434 2401299 1908081 1619291 1395665 1454569 1380477 1274742 1135462 1002623 723743 592461
6424 592461 854708 976263 689940 397846 299740 224839 129470 68186 5063 -49801 35052
6413 35052 464432 374515 160249 -8488 -252463 -73369 83410 73156 -34311 -6660
6403 -6660 74030 -12978 -143123 -218330 -334778 -266690 -281163 -267162 -435361 -454880 -281457
$$ packed form
6474E23252J26390R2394l8193q3570J61248j28842L08647J69030J09514J84437
6464A424307l6436J40461j61462K47603j9700K30224M36448J06833O57990K57491
6454C283759J79956L14695O84182L17089J92512M26313N82146L42785K96142j90050
6444F429529J5017l69119n58143p86370q21586l26909o11140k65993j59398j44589
6434B401299m93218k88790k23626N8904p4092j05735j39280j32839k78880j31282
6424E92461K62247J21555k86323k92094r8106p4901r5369o1284o3123n4864Q4853
6413C5052M29380q9917k14266j68737k43975J79094J56779j0254j07467K7651
6403f660Q0690q7008j30145p5207j16448O8088j4473J4001j68199j9519J73423
$$ plain form
6392 -281457 -187112 -343540 -393707 -400207 -432457 -317694 -167783 -169606 -365310 -663450 -628813
6381 -628813 -508973 -491124 -572916 -583252 -431642 -581442 -603672 -542209 -556743 -754366 -697900
6370 -697900 -728921 -540191 -517031 -450226 -590207 -944879 -899259 -858650 -784718 -518872 -492250
6359 -492250 -742139 -922763 -752851 -837158 -1004348 -1088172 -966216 -907164 -884868 -910918 -936368
6348 -936368 -910001 -929606 -742540 -542321 -738511 -924028 -729533 -903049 -851602 -577210
6338 -577210 -767147 -851005 -749086 -891206 -729931 -522399 -674817 -1035210 -1196969 -759414
6328 -759414 -563255 -572426 -965873 -822888 -713377 -618540 -573594 -630931 -707059 -676022 -758912
6317 -758912 -942863 -760290 -856253 -653794 -793054 -1100272 -890868 -830181 -907803 -878130
$$ packed form
6392b81457R4345j56428n0167o500l2250J14763J49911j823j95704k98140L4637
6381f28813J19840J7849q1792j0336J51610j49800k2230O1463j4534j97623N6466
6370f97900l1021J88730K3160O6805j39981l54672M5620M0609P3932K65846K6622
6359d92250k49889j80624J69912q4307j67190q3824J21956N9052K2296k6050k5450
6348i36368K6367j9605J87066K00219j96190j85517J94495j73516N1447K74392
6338e77210j89937q3858J01919j42120J61275K07532j52418l60393j61759M37555
6328g59414J96159r171l93447J42985J09511R4837M4946n7337p6128L1037q2890
6317g58912j83951J82573r5963K02459j39260l07218K09404O0687p7622K9673
$$ plain form
6307 -878130 -770996 -890573 -1038477 -1118872 -1081507 -931220 -1119953 -1088417 -1095454 -1166497 -1173658
6296 -1173658 -1192803 -877705 -972831 -998577 -769377 -988183 -968121 -1255329 -1176813 -1104826 -1086626
6285 -1086626 -971782 -1001526 -1027265 -1069342 -1011827 -822603 -771992 -1102499 -1467235 -1417857 -1276650
6274 -1276650 -1256395 -1317738 -1107631 -948778 -867537 -842338 -972239 -921017 -981518 -902255 -721277
6263 -721277 -817296 -721666 -834995 -1108482 -1079848 -882139 -788598 -772282 -893378 -960132 -907955
6252 -907955 -845762 -903968 -801982 -581127 -766429 -1002540 -1060801 -1143177 -1155729 -1385274 -1332904
6241 -1332904 -874505 -730390 -874440 -839506 -972257 -921987 -1034962 -979517 -1021823 -1057505
6231 -1057505 -1000933 -916286 -895860 -1103393 -917585 -1202870 -1312835 -1158027 -1204269 -1220426
$$ packed form
6307h78130J07134j19577j47904q0395L7365J50287j88733L1536p037p1043p161
6296a173658j9145L15098r5126k5746K29200k18806K0062k87208P8516P1987J8200
6285a086626J14844k9744k5739m2077N7515J89224N0611l30507l64736M9378J41207
6274a276650K0255o1343K10107J58853Q1241K5199j29901N1222o0501P9263J80978
6263g21277r6019R5630j13329k73487K8634J97709R3541J6316j21096o6754N2177
6252i07955O2193n8206J01986K20855j85302k36111n8261q2376j2552k29545N2370
6241a332904M58399J44115j44050L4934j32751N0270j12975N5445m2306l5682
6231a057505N6572Q4647K0426k07533J85808k85285j09965J54808m6242j6157
$$ plain form
6221 -1220426 -1027093 -922098 -932436 -612629 -655398 -788007 -741892 -820468 -780248 -633264
6211 -633264 -585386 -947708 -801032 -787388 -852546 -818266 -833739 -857142 -885131 -864346 -1020245
6200 -1020245 -897443 -809418 -1084774 -1147377 -704806 -778401 -845561 -767088 -823587 -928501 -927107
6189 -927107 -888764 -1084016 -1135335 -1186489 -1018730 -965003 -738387 -740590 -891996 -1065639 -913623
6178 -913623 -880568 -849662 -1041470 -1324142 -1142925 -799776 -633414 -882671 -1034528 -1063383
6168 -1063383 -1006615 -934918 -749972 -868560 -694856 -551653 -699083 -673651 -693862 -836447
6158 -836447 -868436 -936829 -784765 -822145 -788572 -894239 -642011 -493136 -852751 -891570 -765985
6147 -765985 -761072 -851364 -865364 -1070221 -1071250 -878916 -625817 -987059 -857391 -861193 -771315
$$ packed form
6221a220426J93333J04995j0338L19807m2769j32609M6115p8576M0220J46984
6211f33264M7878l62322J46676J3644o5158L4280j5473k3403k7989K0785j55899
6200a020245J22802Q8025k75356o2603M42571p3595o7160P8473n6499j04914J394
6189i27107L8343j95252n1319n1154J67759N3727K26616k203j51406j73643J52016
6178i13623L3055L0906j91808k82672J81217L43149J66362k49257j51857k8855
6168a063383N6768P1697J84946j18588J73704J43203j47430K5432k0211j42585
6158h36447l1989o8393J52064l7380L3573j05667K52228J48875l59615l8819J25585
6147g65985M913r0292j4000k04857j029J92334K53099l61242J29668l802Q9878
$$ plain form
6136 -771315 -951455 -773558 -669420 -828517 -671769 -682180 -732219 -680919 -545718 -501478
6126 -501478 -719011 -393041 -298962 -473882 -504985 -593010 -566535 -398952 -380981 -717148 -763524
6115 -763524 -407808 -641035 -462715 -297120 -439866 -355577 -642416 -543874 -708312 -699905
6105 -699905 -672739 -545353 -541239 -494579 -365920 -407212 -364964 -201854 54502 -54516 -355155
6094 -355155 -116791 -124107 -202728 8377 -59970 -68885 -106235 -61999 185213 429461 755852
6083 755852 535145 330932 469915 513009 414485 307278 405145 339789 239691 161647 192023
6072 192023 308491 487769 476263 495696 737484 603087 510612 436253 555473 736249
6062 736249 811203 576020 730452 993273 1123307 1224655 1227439 1361859 1490285 1346058
$$ packed form
6136g71315j80140J77897J04138j59097J56748j0411n0039N1300J35201M4240
6126e01478k17533L25970R4079j74920l1103q8025K6475J67583J7971l36167m6376
6115g63524L55716k33227J78320J65595j42746Q4289k86839R8542j64438Q407
6105f99905K7166J27386M114M6660J28659m1292M2248J63110K56356j09018l00639
6094c55155K38364p316p8621K11105o8347q915l7350M4236K47212K44248L26391
6083G55852k20707k04213J38983M3094r8524j07207R7867o5356j00098p8044L0376
6072A92023J16468J79278j1506J9433K41788j34397r2475p4359J19220J80776
6062G36249P4954k35183J54432K62821J30034J01348K784J34420J28426j44227
$$ plain form
6052 1346058 1485439 1446262 1470588 1625400 1763434 1939276 1980333 1772053 1605148 1657269
6042 1657269 1421007 1778614 1923839 1720371 1430328 1727787 1982892 1828155 2300405 2121547
6032 2121547 2480437 2621187 2808643 2933699 3086054 3509706 3521367 3708242 4175800 4619487
6022 4619487 5165654 5573424 5801266 5598130 5081877 4804782 4683381 4639307 4361784 4308571
6012 4308571 4264160 4465938 4657676 4347524 4340328 4546032 4771872 4701072 4640578 4892776
6002 4892776 5181874 5358507 5374215 5869170 6327574 6798692 7237324 7689267 8305194 9024239
5992 9024239 9830367 10913980 11956443 13050637 14126086 13857814 12336800 11032778 9855394
5983 9855394 9079536 8715515 8255859 8109581 7878688 7648666 7598995 7622017 8024133 7825888
$$ packed form
6052A346058J39381l9177K4326J54812J38034J75842M1057k08280j66905N2121
6042A657269k36262L57607J45225k03468k90043K97459K55105j54737M72250j78858
6032B121547L58890J40750J87456J25056J52355M23652J1661J86875M67558M43687
6022D619487N46167M07770K27842k03136n16253k77095j21401m4074k77523n3213
6012D308571m4411K01778J91738l10152p196K05704K25840p0800o0494K52198
6002D892776K89098J76633J5708M94955M58404M71118M38632M51943O15927P19045
5992I024239Q06128J083613J042463J094194J075449k68272j521014j304022j177384
5983I855394p75858l64021m59656j46278k30893k30022m9671K3022M02116j98245
$$ plain form
5973 7825888 7595396 7792222 7801802 7728761 7818510 7855017 8146675 8471768 8689323 8701074 9431713
5962 9431713 10218301 10721195 11493462 12386892 13285360 14169474 15250047 15403080 14245055
5953 14245055 12581770 11625208 10845343 9845299 9058001 8665039 8655048 8652831 8590032 8750768
5943 8750768 8431686 8352750 8305621 8115793 8106921 8009896 8095364 8109780 8079681 7803596 7821256
5932 7821256 7894346 7628872 7765274 8111592 8198413 8303504 8627469 9033762 9107131 9163887
5922 9163887 9000751 8516023 7966587 7730521 7607631 7400754 7403815 7421419 7637525 7482695
5912 7482695 7435652 7532934 7507236 7731809 7734306 7823987 7810588 8154418 8084209 8266551 8141799
$$ packed form
5973G825888k30492J96826R580p3041Q9749L6507K91658L25093K17555J1751P30639
5962I431713P86588N02894P72267Q93430Q98468Q84114J080573J53033j158025
5953A4245055j663285r56562p79865j000044p87298l92962r991k217o2799J60736
5943H750768l19082p8936m7129j89828q872r7025Q5468J4416l0099k76085J7660
5932G821256P3090k65474J36402L46318Q6821J05091L23965M06293P3369N6756
5922I163887j63136m84728n49436k36066j22890k06877L061J7604K16106j54830
5912G482695m7043R7282k5698K24573K497Q9681j3399L43830p0209J82342j24752
$$ [...]
##END NTUPLES=NMR SPECTRUM
##END=
