##TITLE=1H_CG-1155
 CDCl3,8 sc, 
 30.9.2021
##JCAMPDX= 6.0         $$ Bruker NMR JCAMP-DX V2.0
##DATA TYPE= NMR SPECTRUM
##DATA CLASS= NTUPLES
##ORIGIN= UXNMR, Bruker Analytische Messtechnik GmbH
##OWNER= root
$$ XWIN-NMR		Version 3.5
$$ Thu Sep 30 11:15:21 2021 Russian Standard Time (UT+4h)  she@DPX200
##.OBSERVE FREQUENCY= 200.1313468511
##.OBSERVE NUCLEUS= ^1H
##.ACQUISITION MODE= SIMULTANEOUS
##.ACQUISITION SCHEME= undefined
##.AVERAGES= 8
##.DIGITISER RES= 18
##SPECTROMETER/DATA SYSTEM= spect
##.PULSE SEQUENCE= zg30
##.SOLVENT NAME= CDCl3
##.SHIFT REFERENCE= (INTERNAL, CDCl3, 0, 15.7006)
##AUDIT TRAIL= $$ (NUMBER, WHEN, WHO, WHERE, WHAT)
$$ ##TITLE= Audit trail, XWIN-NMR		Version 3.5
$$ ##JCAMPDX= 5.01
$$ ##ORIGIN= Bruker BioSpin GmbH
$$ ##OWNER= she
$$ F:/spectra/data/she/nmr/H-F/1/pdata/1/auditp.txt
$$ ##AUDIT TRAIL=  $$ (NUMBER, WHEN, WHO, WHERE, WHAT)
(   1,<2021-09-30 11:13:27.45 +0400>,<she>,<DPX200>,
      <created by zg, POWCHK disabled, PULCHK disabled
       configuration hash MD5:
       00 E9 B6 7A A2 85 ED C7 34 08 36 98 17 FE 4E 26
       data hash MD5: 16K
       5E F4 51 E2 F7 7B 06 54 7F 94 80 11 53 B6 83 73>)
(   2,<2021-09-30 11:14:21.87 +0400>,<she>,<DPX200>,
      <Start of raw data processing
       efp BC_mod = 2 LB = 0.24 FT_mod = 6 PKNL = 1 PHC0 = -14228.9 PHC1 = 5.80085 SI = 16K 
       data hash MD5: 16K
       44 29 74 82 91 3C 43 52 49 87 01 13 48 34 55 B4>)
(   3,<2021-09-30 11:14:42.82 +0400>,<she>,<DPX200>,
      <pk PHC0 = 3.829631 PHC1 = -7.399999 
       data hash MD5: 16K
       6D 1F E5 50 BD 91 34 F1 F6 40 0F CE 87 83 00 A2>)
$$ ##END=
$$ 
$$ hash MD5
$$ E4 2A 95 9F 1B C9 3A D1 11 6A 80 78 3C 77 CD D9
##$RELAX= 
##$RELAX= 
##$RELAX= 
##$RELAX= 
##$RELAX= 
##$RELAX= 
$$ Bruker specific parameters
$$ --------------------------
##$DU= <F:/spectra>
##$EXPNO= 1
##$NAME= <H-F>
##$PROCNO= 1
##$TYPE= <nmr>
##$USER= <she>
##$AMP= (0..31)
100 100 100 100 100 100 100 100 100 100 100 100 100 100 100 100 100 100 
100 100 100 100 100 100 100 100 100 100 100 100 100 100 
##$AQSEQ= 0
##$AQ_mod= 1
##$AUNM= <au_zg>
##$AUTOPOS= <>
##$BF1= 200.13
##$BF2= 200.13
##$BF3= 200.13
##$BF4= 200.13
##$BF5= 200.13
##$BF6= 200.13
##$BF7= 200.13
##$BF8= 200.13
##$BYTORDA= 1
##$CFDGTYP= 0
##$CFRGTYP= 5
##$CHEMSTR= <none>
##$CNST= (0..31)
1 1 145 1 1 1 1 1 1 1 1 1 1 1 1 1 1 1 1 1 1 1 1 1 1 1 1 1 1 1 1 1 
##$CPDPRG= <>
##$CPDPRG1= <>
##$CPDPRG2= <>
##$CPDPRG3= <>
##$CPDPRG4= <mlev>
##$CPDPRG5= <mlev>
##$CPDPRG6= <mlev>
##$CPDPRG7= <mlev>
##$CPDPRG8= <mlev>
##$CPDPRGB= <>
##$CPDPRGT= <>
##$D= (0..31)
0 1.2 0 0 0 0 0 0 0 0.06 0 0.03 0 0 0 0 0.0002 0 0 0 0 0 0 0 0 0 0 0 0 
0 0 0 
##$DATE= 1632986006
##$DBL= (0..7)
120 120 120 120 120 120 120 120 
##$DBP= (0..7)
150 150 150 150 150 150 150 150 
##$DBP07= 0
##$DBPNAM0= <>
##$DBPNAM1= <>
##$DBPNAM2= <>
##$DBPNAM3= <>
##$DBPNAM4= <>
##$DBPNAM5= <>
##$DBPNAM6= <>
##$DBPNAM7= <>
##$DBPOAL= (0..7)
0.5 0.5 0.5 0.5 0.5 0.5 0.5 0.5 
##$DBPOFFS= (0..7)
0 0 0 0 0 0 0 0 
##$DE= 6
##$DECBNUC= <off>
$$ [...]
##$SUBNAM2= <"">
##$SUBNAM3= <"">
##$SUBNAM4= <"">
##$SUBNAM5= <"">
##$SUBNAM6= <"">
##$SUBNAM7= <"">
##$SUBNAM8= <"">
##$SUBNAM9= <"">
##$SW= 18.0517286264689
##$SWIBOX= (0..15)
0 0 2 0 0 0 0 0 0 0 0 0 0 0 0 0 
##$SW_h= 3612.71676300578
##$TD= 16384
##$TD0= 1
##$TE= 0
##$TE2= 300
##$TE3= 300
##$TEG= 300
##$TL= (0..7)
0 120 120 120 120 120 120 120 
##$TP= (0..7)
150 150 150 150 150 150 150 150 
##$TP07= 0
##$TPNAME0= <>
##$TPNAME1= <>
##$TPNAME2= <>
##$TPNAME3= <>
##$TPNAME4= <>
##$TPNAME5= <>
##$TPNAME6= <>
##$TPNAME7= <>
##$TPOAL= (0..7)
0.5 0.5 0.5 0.5 0.5 0.5 0.5 0.5 
##$TPOFFS= (0..7)
0 0 0 0 0 0 0 0 
##$TUNHIN= 0
##$TUNHOUT= 0
##$TUNXOUT= 0
##$USERA1= <user>
##$USERA2= <user>
##$USERA3= <user>
##$USERA4= <user>
##$USERA5= <user>
##$V9= 5
##$VALIST= <valist>
##$VCLIST= <CCCCCCCCCCCCCCC>
##$VD= 0
##$VDLIST= <DDDDDDDDDDDDDDD>
##$VPLIST= <PPPPPPPPPPPPPPP>
##$VTLIST= <TTTTTTTTTTTTTTT>
##$WBST= 1024
##$WBSW= 4
##$XGAIN= (0..3)
0 0 0 0 
##$XL= 0
##$YL= 0
##$YMAX_a= 17776
##$YMIN_a= -40256
##$ZGOPTNS= <>
##$ZL1= 120
##$ZL2= 120
##$ZL3= 120
##$ZL4= 120
##$ABSF1= 0
##$ABSF2= 0
##$ABSG= 0
##$ABSL= 0
##$ALPHA= 0
##$AQORDER= 0
##$ASSFAC= 0
##$ASSFACI= 0
##$ASSFACX= 0
##$ASSWID= 0
##$AUNMP= <proc_1d>
##$AZFE= 0.1
##$AZFW= 0.1
##$BCFW= 0
##$BC_mod= 2
##$BYTORDP= 0
##$COROFFS= 0
##$CY= -3
##$DATMOD= 1
##$DC= 0
##$DFILT= <>
##$DTYPP= 0
##$F1P= 0
##$F2P= 0
##$FCOR= 1
##$FTSIZE= 16384
##$FT_mod= 6
##$GAMMA= 0
##$GB= 0
##$INTBC= 1
##$INTSCL= 0
##$ISEN= 128
##$LB= 0.24
##$LEV0= 0
##$LPBIN= 0
##$MAXI= 10000
##$MC2= 0
##$MEAN= 0
##$ME_mod= 0
##$MI= 1.114404
##$NCOEF= 0
##$NC_proc= -10
##$NLEV= 6
##$NOISF1= 3.799351
##$NOISF2= 2.8
##$NSP= 0
##$NTH_PI= 0
##$NZP= 0
##$OFFSET= 15.70061
##$PC= 1
##$PHC0= -14225.07
##$PHC1= -1.599149
##$PH_mod= 1
##$PKNL= yes
##$PPARMOD= 0
##$PSCAL= 0
##$PSIGN= 0
##$REVERSE= no
##$SF= 200.130011044992
##$SI= 16384
##$SIGF1= 3
##$SIGF2= 2
##$SINO= 5.538805
##$SIOLD= 16384
##$SREGLST= <1H.CDCl3>
##$SSB= 0
##$STSI= 16384
##$STSR= 0
##$SW_p= 3612.71676300578
##$SYMM= 0
##$S_DEV= 0
##$TDeff= 16384
##$TDoff= 0
##$TI= <>
##$TILT= no
##$TM1= 0
##$TM2= 0
##$TOPLEV= 0
##$USERP1= <user>
##$USERP2= <user>
##$USERP3= <user>
##$USERP4= <user>
##$USERP5= <user>
##$WDW= 1
##$XDIM= 16384
##$YMAX_p= 331998493
##$YMIN_p= -1589766
$$ End of Bruker specific parameters
$$ ---------------------------------
##NTUPLES= NMR SPECTRUM
##VAR_NAME=  FREQUENCY,     SPECTRUM/REAL,   SPECTRUM/IMAG
##SYMBOL=    X,             R,               I
##VAR_TYPE=  INDEPENDENT,   DEPENDENT,       DEPENDENT
##VAR_FORM=  AFFN,          ASDF,            ASDF
##VAR_DIM=   16384,         16384,           16384
##UNITS=     HZ,            ARBITRARY UNITS, ARBITRARY UNITS
##FACTOR=    0.220516191357247, 1,           1
##FIRST=     3142.16328489955, 0,            0
##LAST=      -470.553478106232, 0,           0
##MIN=       -470.553478106232, -1589766,    0
##MAX=       3142.16328489955, 331998493,    0
$$ Real data points
##PAGE= N=1
##DATA TABLE= (X++(R..R)), XYDATA
$$ [...]
11670b85026J55319J99256p478l24883R1502j12456J50493J46676j04742j28542
11660b19881J18820J39820m36991l28322M78576K56267M44928j42229l43320p927
11650d0259K38134K2735l76535J14667K22209N30110j41430n78651L32138j42102
11640A81016l21479p331J29124r0300j31855n52639K21149P13286J21723k5964
11630B36730m45493j42192P0529K109l57899j21366L19423q5761n04139J27934
11620i00125L84145j85150m42033L27557L48912L64844l73117K07728k15610N31946
11610D9097L35697n49236m84030K57399l17816L71389N5371K36031j06606K47773
11600I5069l49494l35774L05449K19379J4140n46476m0302L50195L59694M1171
$$ plain form
11670 -285026 -129707 69549 62071 -262812 -171310 -283766 -133273 13403 -91339 -219881
11660 -219881 -101061 38759 -398232 -726554 -247978 8289 453217 310988 -32332 -40259
11650 -40259 197875 220610 -155925 -41258 180951 711061 569631 -9020 323118 181016
11640 181016 -140463 -147794 -18670 -108970 -240825 -793464 -572315 140971 262694 236730
11630 236730 -208763 -350955 -280426 -278317 -636216 -757582 -438159 -523920 -1028059 -900125
11620 -900125 -515980 -701130 -1143163 -815606 -466694 -101850 -474967 -267239 -482849 49097
11610 49097 384794 -164442 -648472 -391073 -708889 -337500 -282129 -46098 -152704 95069
11600 95069 -254425 -590199 -284750 -65371 -51231 -597707 -638009 -287814 71880 113051
11590A13051N4734J77452r12098J43258O6284m4215L319m3142J87035O0791K44751
11579E1220k81364k680J22702j78941m27376L50292m18363L59156L26565Q8712
11569a0077l21120l39695l47481J96760L9346O75510j62218l15877J75784P4543
11559c34525L31968O8610r6587J6423j61017J71328J86218n1963k81687j85468
11549c36700J93384J35525K2322j88885K7300k33276k21651P1843L6543k29537
11539g23132R9920J98159L50448N65663m34207n59768k2322J84094j84469M4112
11529d81502J81909O67536l10922J43140q5869K37624J23222m29442L10827o9703
11519B86820k33054j3163j83932K73392K21747j77306o0676j51514l63450M55452
$$ plain form
11590 113051 167785 345237 -566861 -423603 -357319 -401534 -398215 -441357 -254322 -193531 51220
11579 51220 -230144 -232824 -110122 -289063 -716439 -366147 -784510 -425354 -98789 -10077
11569 -10077 -331197 -670892 -1018373 -821613 -782267 -106757 -268975 -584852 -409068 -334525
11559 -334525 -2557 66053 -30534 -14111 -175128 -3800 182418 130455 -151232 -336700
11549 -336700 -143316 -7791 14531 -174354 -147054 -380330 -601981 -530138 -493595 -723132
11539 -723132 -623212 -425053 -74605 491058 56851 -502917 -525239 -341145 -525614 -481502
11529 -481502 -299593 367943 57021 200161 114292 351916 475138 45696 356523 286820
11519 286820 53766 40603 -143329 130063 351810 174504 113828 -37686 -401136 54316
11509E4316L70388m7273l08319n53335L94367M45280l99071m30143L33149K6831
11499a13810j63020L6764L45001k8482l15383N29139K78939o51167L2296M74497
11489D24774m9363j16559n5353n77711M32824q8978j80628k8620j08026N5486
11479b92154K57394l62204J1132j46375j48611r2997r8185N5718J16639L18781
11469c80862R1690L53664L62616J65975m24722k02265j97636k08258K79261j17982
11459b78519k6266j06512k96177J43958K50336J01422K43055k65774j55591K16634
11449a73434j50763K23242j45958K99999P0786j32076L38624N7387j96357J70484
11439C61934j0441k22040m1289j66168M63137k14401J63586r3537P8418n0302
$$ plain form
11509 54316 424704 377431 69112 -484223 -89856 355424 -43647 -473790 -140641 -113810
11499 -113810 -276830 -240066 104935 76453 -238930 290209 569148 -82019 -49723 424774
11489 424774 375411 258852 203499 -374212 58612 -30366 -210994 -239614 -347640 -292154
11479 -292154 -34760 -396964 -385832 -532207 -680818 -773815 -872000 -816282 -699643 -380862
11469 -380862 -289172 64492 427108 593083 168361 -33904 -231540 -439798 -160537 -278519
11459 -278519 -304785 -411297 -707474 -563516 -313180 -211758 31297 -234477 -390068 -173434
11449 -173434 -324197 -100955 -246913 53086 123872 -8204 330420 387807 191450 361934
11439 361934 351493 129453 88164 -78004 385133 170732 334318 240781 319199 268897
11429B68897N63766n43141o94654N46086k65435R0558p39217Q0588Q65672k78795
11419a05675P8061j62391l58183q7251N50656L5903R597Q5817J08043K08700k44158
11408A19119k05789n57170J84758K58429L06471Q6240K49990l41372l48404o667
11398b54395J51360K02319m86804J51155j07975J81023j28460K15635L66140K5065
11388C15063L71829p50582J1062J12479j45063j98635j21712l97252O53607K10588
11378F1384K8491l80977k3965K38794l85697q6771L02749L28210k04575n13309
11368f35666K81241K95660j73771j7419L12850P6126l06824K2103K45110l87933
11358b88523J86179N12952J21732k10486j41939p01271n6084M46695L8770N90037
$$ plain form
11429 268897 832663 289522 -405132 140954 -124481 -33923 -773140 -692552 173120 -105675
11419 -105675 -27614 -190005 -548188 -635439 -84783 -48880 -39283 46534 154577 363277 119119
11408 119119 -86670 -643840 -459082 -200653 105818 192058 442048 100676 -247728 -254395
11398 -254395 -103035 99284 -387520 -236365 -344340 -163317 -291777 -76142 289998 315063
11388 315063 686892 -63690 -52628 59851 -85212 -283847 -405559 -802811 -149204 61384
11378 61384 89875 -291102 -315067 -76273 -461970 -548741 -245992 82218 -122357 -635666
11368 -635666 -354425 -58765 -232536 -249955 62895 139021 -167803 -145700 99410 -288523
11358 -288523 -102344 410608 532340 321854 179915 -521356 -577440 -130745 -91975 498062
11348D98062m78504m42310j22765k28190O72090M15903O81766m53546p72382j57736
11338c87612L57251P875m09756J76069J47573N9923K19661l53899k20851l38677
11328g42443P018K90840l9224K39746m44277M36546K72700O4999j63889L57904
11318B79920o18782K13346n06605q1042N85195j48322j95416J39044R2313o4077
11308c04426J63536j00321l2639M965q1661J62790j48558k25469K14340M41807
11298I4364n10328J58951m82465Q2832k5472l3047L58364j02271M04646k88613
11288c43039O4018P26019R3252p5926m76975l05594R0640O8239m31971j97781
11278g89118N38561m8687J14425l33509j81482N68017o7608l34299M87753l7718
$$ plain form
11348 498062 19558 -422752 -545517 -773707 -101617 314286 996052 542506 -229876 -387612
11338 -387612 -30361 -22486 -432242 -256173 -108600 -48677 170984 -182915 -403766 -742443
11328 -742443 -735425 -444585 -483809 -244063 -688340 -251794 20906 85905 -77984 279920
11318 279920 -338862 -125516 -632121 -713163 -127968 -276290 -471706 -332662 -240349 -304426
11308 -304426 -140890 -241211 -273850 -268885 -350546 -187756 -336314 -561783 -347443 94364
11298 94364 -415964 -257013 -739478 -656646 -682118 -715165 -356801 -459072 -54426 -343039
11288 -343039 -279021 446998 540250 464324 -12651 -318245 -227605 -159366 -591337 -789118
11278 -789118 -250557 -299244 -184819 -518328 -699810 -131793 -199401 -533700 -45947 -83665
11268h3665m76227R00503K31857m68110j9137L56951j78146m07921P2841k44184
11258c15238k6862j25703j9420K89437K77177O8933j21620J17992J45947r9338
11248A91305R3452l42922j79929l9509L4359K7525j31174J93095L43378K25752
11238D15332k60410J40238k09785o21968J72372k789J50033n33745l1213L23358
11228d58577L43670M54707j66021k71291k138m73590O60435k48759p3294l1159
11218b66017k401j84834J09480P6237J08893N99011j26260m18163o33554K72858
11208d64750N5684r2023L49764q5103K38005m5396N4154K83032J00599r23585
11198e29619K09366J79503m56691l17898N08730N97981l95410k24929j70577J76964
$$ plain form
11268 -83665 -559892 340611 572468 104358 85221 442172 264026 -143895 -71054 -315238
11258 -315238 -342100 -467803 -487223 -197786 79391 148324 26704 144696 290643 191305
11248 191305 284757 -58165 -238094 -277603 -243244 -215719 -346893 -153798 189580 415332
11238 415332 154922 295160 85375 -536593 -364221 -367010 -216977 -750722 -781935 -458577
11228 -458577 -114907 339800 173779 -97512 -99650 -573240 87195 -161564 -234858 -266017
11218 -266017 -268418 -453252 -343772 -267535 -158642 440369 314109 -104054 -737608 -464750
11208 -464750 -409066 -501089 -151325 -236428 1577 -43819 10335 293367 393966 -529619
11198 -529619 -320253 -140750 -597441 -915339 -406609 191372 -204038 -428967 -599544 -422580
11188d22580j35934m90410M10932j33183J50758M43814n8838J26954j19560m85838
11178g13885j00214P42918l17159K25626l17713J17145M24105j60135J13115k92260
11168b78457K13511r9183r3636K4775l27867M42396j52005k05322o9156M60208
11158h4736m256L46061L4793j96220J51941k02175k76083P2387j5012m02038K54712
11147c20626L92453J55414n70196k93491Q43141l64819o6847m3756n29473M62653
11137c35547L83482m92478J99908M53403l83052k94736L86169m96264k77170O78542
11127a77743K41213k06286J24694M32754o00213j22049m14659P47774K20552l56401
11117a10364J82500j25848L05525k52997o4187J65229J16502j47532L52572K12832
$$ plain form
11188 -422580 -558514 -1048924 -637992 -771175 -620417 -176603 -235441 -108487 -228047 -713885
11178 -713885 -814099 -71181 -388340 -162714 -480427 -363282 60823 -99312 13803 -278457
11168 -278457 -64946 -164129 -257765 -232990 -560857 -118461 -270466 -475788 -544944 -84736
11158 -84736 -88992 257069 291862 95642 247583 45408 -230675 -158288 -173300 -575338 -320626
11147 -320626 71827 227241 -342955 -636446 206695 -158124 -224971 -268727 -798200 -335547
11137 -335547 47935 -444543 -244635 208768 -174284 -469020 -82851 -579115 -856285 -177743
11127 -177743 63470 -142816 -18122 414632 -185581 -307630 -722289 25485 246037 -110364
11117 -110364 72136 -53712 251813 -1184 -65371 99858 216360 68828 421400 634232
11107F34232m85310J26716K72043m4198k66655j64416j08396n61232K95526R3284
11097b08406j20645p3155P9611M31012r6404M1548k6499k97351K63496n8928K25704
11086A59983l79012R0789J64598j44968L28187j29954j68522j14344p6458j9916
11076b89617k21986K89254K9430L18810j90141l37358J44429l7717K70943q49246
11066h73199j11407Q73804L90996L30353o63537k32421j90384J34229O2028j45909
11056d25447L14054p9545k10039R2088J43787k60316K58273m7657L18457k7527
11046G6128o07186K6624M5516K11407j73959M76869J9865o4121k02665m91772
11036f83294K43895J32915K91603J69673K84035K05957o10735j03987L72095m7575
$$ plain form
11107 634232 148922 275638 547681 503483 236828 72412 -35984 -597216 -301690 -208406
11097 -208406 -329051 -402206 -322595 108417 12013 53561 27062 -270289 -6793 -65721 159983
11086 159983 -219029 -128240 36358 -108610 219577 89623 -78899 -193243 -269701 -289617
11076 -289617 -511603 -222349 -192919 125891 -64250 -401608 -257179 -294896 -23953 -873199
11066 -873199 -984606 -110802 280194 610547 -52990 -285411 -475795 -341566 -279538 -425447
11056 -425447 -111393 -190938 -400977 -308889 -165102 -425418 -167145 -214802 103655 76128
11046 76128 -531058 -504434 -458918 -247511 -421470 55399 75264 11143 -191522 -683294
11036 -683294 -439399 -306484 -14881 154792 438827 644784 34049 -69938 302157 254582
11026B54582r4895k54072j20625j64943o1998j13962L98143o588J3787j04713
11016b55284J57032Q508k8779j42327L99906k63835N8181Q828l09678m49643J72448
11005f44643o3598J33707p4545j210O7869M76275q9353j04938n12590K64058M01355
10994a47613M08613R4624q59686L87513K8806o89912J36586M85301k48271K01499
10984b02540K30449j95376K0603M76718p05732K1669L59817r4153j33684j15698
10974c37927n4840m24822k15952L59585M97993k68786q6595J42722O54612M39737
10964G05727l78966k76181j37259k16409L70630k30187J65517p9043J55574j7735
10954F1668j9985n02624J8859J58673k1886K07477k27315N06788k16282O1753
$$ plain form
11026 254582 159687 -94385 -215010 -379953 -441951 -555913 -157770 -164358 -150571 -255284
11016 -255284 -98252 -89744 -118523 -260850 139056 -124779 -66598 -57770 -367448 -817091 -644643
11005 -644643 -708241 -574534 -649079 -650289 -582420 -106145 -195498 -300436 -813026 -548968 -147613
10994 -147613 261000 355624 -504062 -116549 -87743 -777655 -641069 -155768 -404039 -202540
10984 -202540 27909 -167467 -146864 329854 -375878 -354209 5608 -88545 -222229 -337927
10974 -337927 -392767 -817589 -1033541 -673956 -175963 -444749 -531344 -388622 265990 705727
10964 705727 326761 50580 -86679 -303088 67542 -162645 2872 -76171 79403 61668
10954 61668 41683 -460941 -442082 -283409 -305295 -97818 -325133 181655 -34627 27126
10944B7126j01664k39038K80020J84307r0025M2832K80004l95514k82200J93851
10934a00301J13596J24463k23406R913k6794K90943L501j85715j13527K1314m21039
10923e07052M58680L1987m30117k28051J03618L22111K62008k07762M50986p18044
10913d61636J70408l00903J55350J90349J29481r7652K78565L8618M6197k12761
10903f3984J86454l16560M01894K24521n8064m61787l93228J30719j19629l24572
10893g94236N31154L88742K13249o26201m75453J50530K60533M87094l89227O1192
10883a92623o425P22771K09370m38996n14368K02273j87131O86690j33993m15022
10873f7454n2878r494L04905o8409k40697o9790p9478m36796R4753M03813j20703
$$ plain form
10944 27126 -74538 -313576 -33556 150751 60726 103558 383562 -11952 -294152 -100301
10934 -100301 13295 137758 -85648 -75735 -102529 188414 191915 6200 -107327 -86013 -507052
10923 -507052 -48372 -16385 -446502 -674553 -570935 -248824 13184 -194578 256408 -461636
10913 -461636 -291228 -592131 -436781 -246432 -116951 -214603 63962 102580 148777 -63984
10903 -63984 122470 -194090 207804 432325 374261 -87526 -480754 -350035 -469664 -794236
10893 -794236 -263082 125660 338909 -287292 -762745 -612215 -351682 135412 -253815 -192623
10883 -192623 -199048 523723 733093 294097 -220271 -17998 -205129 481561 347568 -67454
10873 -67454 -120332 -129826 175079 106670 -134027 -203817 -283295 -720091 -625338 -221525 -342228
10862c42228N23981m6801n2835p04923k04979O39222m80674K17289J66725J42453
10852a42770L75759l27463O44963K5206o45644q0442J46925J88289K26336l69515
10842D1644K67613k6616j5756n41516k32869J21629M40400l32022k47100O0563
10832d64030N67455j37025n63038q5822N75455Q09470n44595k92790L81854Q8049
10822C34983k0322p34700l5943r4372J730N70926J61051k16462J54232K01861
10812C22984j19287j59617k70469k1961n05430j95417N02684j35612L65730j63394
10802c79789K22839N12219J0867M8469R9933j92626K15263K94473j03713m41291
10792B86644r04370J71355K71844J59477k69265m99905M3337K22513M54656J32313
$$ plain form
10862 -342228 181753 134952 82117 -622806 -827785 -188563 -669237 -451948 -285223 -142770
10852 -142770 232989 -94474 550489 575695 -69949 -150391 -3466 184823 411159 41644
10842 41644 309257 282641 266885 -274631 -507500 -385871 54529 -277493 -524593 -464030
10832 -464030 103425 -33600 -596638 -682460 -107005 702465 157870 -134920 246934 334983
10822 334983 314661 -420039 -455982 -550354 -548624 22302 183353 -33109 121123 322984
10812 322984 203697 44080 -226389 -248350 -753780 -949197 -446513 -582125 -216395 -379789
10802 -379789 -156950 355269 366136 414605 514538 321912 537175 831648 727935 286644
10792 286644 -617726 -446371 -174527 -15050 -284315 -784220 -740883 -518370 -63714 68599
10782F8599m31684l63929K5558l05451N69223N1906j77626p8997p2572K83636
10772d31337J97800J47177m52833o2121L16199K79779m11202J96650K62700j47709
10762a04897J58250J0840J70568J78495k90811l5076o59962M64682J80434o1813
10752A0710j49792J92725r55726M45093J61683o1593K12945J09037k66925l13040
10742f14883L46846k19659k07382O40914l03560L84571K43614j81821l92689k5792
10732c29841k46402N64241J00275n01984j80296j09161N66703K79526o58622Q6174
10722d29387j19095l11945O09764K04804O0832l40757j7386m4320L57206m68461
10712d98745j88986k23529M01651K81829j41895j29124J60809l7292K01903J99653
$$ plain form
10782 68599 -363085 -727014 -701456 -1006907 -437684 -385778 -563404 -642401 -714973 -431337
10772 -431337 -233537 -86360 -539193 -601314 -285115 -5336 -416538 -219888 42812 -104897
10762 -104897 53353 64193 234761 413256 122445 87369 -572593 -107911 72523 10710
10752 10710 -139082 53643 -902083 -456990 -295307 -356900 -143955 -34918 -301843 -614883
10742 -614883 -268037 -487696 -695078 -54164 -357724 26847 270461 88640 -304049 -329841
10732 -329841 -576243 -12002 88273 -413711 -594007 -703168 -136465 143061 -515561 -429387
10722 -429387 -548482 -860427 -250663 -45859 14973 -325784 -343170 -387490 -30284 -498745
10712 -498745 -687731 -911260 -509609 -227780 -369675 -498799 -337990 -375282 -173379 26274
10702B6274J15246l3636K01696l0818m10584l21875N25267j09506P6655l11376
10692b72657j59660l54176r3946M95213J10414K50289l03306J21434l908M92106
10682B81803j94927k87056r9556n87172M50486q395M23339L71121n02236P1758
10672h0835l31866n44496j29823J28356P99694J82107j37890m36544Q0158L73701
10662i7438m80628j06377K44621l04674M41128K83877j41227j0544L24792j2046
10652A41484n91650m1864j39699M70292L44881j59390o68313M1687O6626k53044
10642g88990J27541N59465J42664l83466J70383j75119j46892M79674K13947K86998
10632D86205J14398n54499n81608n3531N8983o3417K02837K47600j2327k48351
$$ plain form
10702 26274 141520 107884 309580 278762 -131822 -453697 71570 -37936 38719 -272657
10692 -272657 -432317 -786493 -880439 -385226 -274812 -24523 -327829 -206395 -210303 281803
10682 281803 86876 -200180 -299736 -886908 -436422 -444817 -21478 349643 -152593 -80835
10672 -80835 -412701 -957197 -1087020 -958664 -158970 23137 -114753 -551297 -471139 -97438
10662 -97438 -578066 -684443 -439822 -744496 -303368 -19491 -160718 -171262 153530 141484
10652 141484 -450166 -492030 -631729 -161437 183444 24054 -644259 -602572 -535946 -788990
10642 -788990 -661449 -101984 40680 -342786 -172403 -347522 -494414 -14740 199207 486205
10632 486205 600603 46104 -535504 -589035 -530052 -593469 -390632 -143032 -155359 -403710
10622d03710n39672J17433N78136p0416k7681p40326n03530J186264L66884j50655
10612a87273j20711p3404O94495k94728J38417L65055q54667n31016J06595J89944
10602e67293M86468j94023o7164K57139K80169j44914n28278l1957N3761L22317
10592a33775L17296L6942l83712j77918L42932J46465m18295j18693J51904K18543
10582a8311l2460K28829m90633O6118K47696j74158J70452j83663o438R4059J19803
10571B1294l92832m12413J29569J06205N19638J55582K47342O4785k78849k52180
10561i1859r36227L21682O19648J94398j1468K52040k85565l66401N08619j05595
10551I9272l0398J88389j05756k56634j14160K14955n1758L7593k67785l9268
$$ plain form
10622 -403710 -943382 -825949 -247813 -318229 -345910 -1086236 -1589766 -403502 -36618 -187273
10612 -187273 -307984 -381388 313107 18379 156796 521851 -332816 -863832 -757237 -567293
10602 -567293 -80825 -274848 -342012 -84873 195296 50382 -477896 -509853 -456092 -133775
10592 -133775 183521 220463 -163249 -341167 1765 148230 -270065 -388758 -236854 -18311
10582 -18311 -50771 178058 -312575 -246457 1239 -172919 -2467 -186130 -192568 -98509 21294
10571 21294 -371538 -783951 -654382 -548177 -28539 127043 374385 439170 160321 -91859
10561 -91859 -1028086 -706404 -86756 107642 96174 348214 62649 -303752 204867 99272
10551 99272 68874 257263 151507 -105127 -219287 -4332 -56090 -18497 -286282 -325550
10541c25550n90291n2628M00996M93493j7263j56575q7954m08922j59777L37669
10531e66802M50047k2640K5057j35213K37239P9521M5960P2795m32245j50994
10521c97275M67816K44763n2255k22052j93319m33413J91289O99490K55311r19343
10511c58988o4074Q6690o48545K69084J68750j41050K61770N36209n7705M5238
10501I7379l86964k46685J14365L210L00242k55747R14k29024Q2425K42802M1890
10490b35193J24774K86723n0064l65852j47702L24195j71859K42574l79946n0182
10480d22532K06589p386J51361j51781j71597P90644r4622l60832l4069l3258
10470a27483Q5409j54717j05665K7517N06528j25672R6960j11455Q6718J42208
$$ plain form
10541 -325550 -915841 -968469 -567473 -73980 -91243 -247818 -335772 -744694 -904471 -566802
10531 -566802 -116755 -139395 -114338 -249551 -12312 67209 113169 185964 -246281 -397275
10521 -397275 70541 315304 263049 40997 -152322 -585735 -394446 305044 560355 -358988
10511 -358988 -423062 -336372 -984917 -715833 -547083 -688133 -426363 109846 52141 97379
10501 97379 -289585 -536270 -421905 -418695 -118453 -374200 -373286 -602310 -519885 -277083 -235193
10490 -235193 -110419 176304 126240 -239612 -387314 -63119 -234978 7596 -372350 -422532
10480 -422532 -215943 -223329 -71968 -223749 -395346 395298 300676 -60156 -94225 -127483
10470 -127483 -42074 -196791 -302456 -274939 231589 105917 202877 91422 178140 320348
10460C20348l4576l43695L85397j2955j97814j32968j59745N6623q5555j54120
10450c59060K78288J02000J95082j10519l49660K61275J2921j2413k27658l4481
10440b44225K04062j60372O0329O8642L05249R4771l14463q04656m50103J074162
10430a66604K08432M8184l77193j89373K3236k54586j25325j33174J84834M01068
10420c80501K89673k03231K88694j60109L15779l98770K72554j82730l12455K07241
10410b63855J84056J00989o61360k09320m6942k33227P11751o8564J47539K42086
10400i6847j21338J86151K20527q5420M7733m4592n53170m933J91361L91619k34750
10389a03659k30591J40108J7151R8960K5013n5121l70189L30176N77415o03849
$$ plain form
10460 320348 285772 -57923 327474 314519 116705 -16263 -176008 -119385 -204940 -359060
10450 -359060 -80772 21228 216310 105791 -243869 17406 30327 17914 -209744 -244225
10440 -244225 -40163 -200535 -140206 -71564 233685 328456 13993 -790663 -1240766 -166604
10430 -166604 41828 90012 -287181 -476554 -453318 -707904 -833229 -966403 -781569 -380501
10420 -380501 -90828 -294059 -5365 -165474 150305 -248465 24089 -158641 -471096 -263855
10410 -263855 -79799 21190 -640170 -849490 -896432 -1129659 -417908 -486472 -338933 -96847
10400 -96847 -218185 -32034 188493 103073 150806 106214 -446956 -451889 -260528 131091 -103659
10389 -103659 -334250 -194142 -176991 -78031 -53018 -108139 -478328 -148152 429263 -174586
10379a74586l81006j60881O07978n43104K62536N43050J4202j09490m05948R1942
10369b55307J47091L059j39766R5196q6333J57088k89045l52575L04516j63003
10359e79079j08006R3527M8735p4097M06126M9414J64719R8721K91321j75656
10349B15725k12708l04387J34764k24562k85454L65721n5710J29357J35945O4462
10339c6847r6617j60088J49630n04937P2099K23828j94316M89770j89523k15667
10329d62668P59991J91118n4073l29669k25115l6603P176N2473P9702L63813r22887
10318e76742q4212K94968L87500L957n10072J30298J42337L12708l39462l62342
10308f01062K81462L45824J83526k58881K09593j80171l70413j19825k74640j14353
$$ plain form
10379 -174586 -555592 -716473 -108495 -651599 -389063 153987 168189 58699 -347249 -255307
10369 -255307 -108216 -105157 -244923 -149727 -236060 -78972 -368017 -720592 -416076 -579079
10359 -579079 -687085 -593558 -544823 -618920 -212794 -163380 1339 100060 391381 215725
10349 215725 3017 -301370 -166606 -391168 -676622 -310901 -366611 -237254 -101309 -36847
10339 -36847 -133464 -293552 -143922 -648859 -576760 -352932 -547248 -57478 -247001 -462668
10329 -462668 297323 488441 434368 104699 -120416 -157019 -149843 -97370 -17668 346145 -576742
10318 -576742 -660954 -365986 21514 25471 -484601 -354303 -211966 100742 -238720 -601062
10308 -601062 -319600 26224 209750 -49131 160462 -19709 -390122 -509947 -784587 -898940
10298h98940M33343N5933o954l18285k9037J89423M50865k43674o8292p119K17173
10287b25564Q1814n697l08943J40198K26482l40834j39887R96558m58133o04111
10277f38117K25811j8461L72110j7066K54927k52620l05970K35716K81118k40829
10267a03381j38256k32019P6338m26392L62408P31969N04469l32269J0787m61955
10257h301m99274k06150n1473K93128K63868j96554k09760K52567m05240k67011
10247a034200Q44942J91762l30827J4503J3833Q3584j64039M1770j01586L2784
10237d07474J13048K44311o26325L0418L57503k84799M22667J41022m0085k39881
10227b89595m3548J87278j61728J7558j02660m77582K61957O45150k78061j03935
$$ plain form
10298 -898940 -465597 -409664 -416618 -734903 -763940 -574517 -123652 -367326 -435618 -442737 -225564
10287 -225564 -143750 -149447 -458390 -318192 -91710 -432544 -572431 424127 -34006 -638117
10277 -638117 -412306 -430767 -58657 -75723 179204 -73416 -379386 -143670 137448 -103381
10267 -103381 -241637 -473656 -397318 -823710 -461302 270667 775136 442867 453654 -8301
10257 -8301 -507575 -713725 -765198 -472070 -208202 -404756 -614516 -361949 -767189 -1034200
10247 -1034200 -189258 2504 -328323 -313820 -299987 -216403 -380442 -338672 -440258 -407474
10237 -407474 -294426 -50115 -676440 -646022 -288519 -573318 -150651 -9629 -49714 -289595
10227 -289595 -333143 -145865 -307593 -290035 -392695 -870277 -608320 36830 -241231 -345166
10217c45166N4749K42790J69529M75j40328j6232k70577k95074k87918J96679
10207f91073r2654P92403K81070p31084L36551l01924j54925O6335l48111N66054
10197b77358L58337j45441m5656L8568l3881l54077j00831j48189J1726m4527
10187g41329L17794m482j46073k56612j48617L52208L77271K69288J41149J46516
10177C07113j61574k81327Q2295L8298j09912L3922k45007m56520J3055p0759
10167h50416N16677j88852r0986O58964M1607J48052N5213j78968R829l09539
10157a88419J13893r8590J82718n00362r7836M8264J5554J66089k44688J9402
10147e83975Q04296Q6259o23898P3654k6301J63283j78388M72724K48866n20618
$$ plain form
10217 -345166 -290417 -47627 121902 122377 -17951 -34183 -304760 -599834 -887752 -691073
10207 -691073 -783727 8676 289746 -441338 -104787 -406711 -561636 -495301 -843412 -277358
10197 -277358 80979 -64462 -110118 -71550 -105431 -459508 -560339 -708528 -696802 -741329
10187 -741329 -423535 -428017 -574090 -830702 -979319 -627111 -249840 19448 160597 307113
10177 307113 145539 -135788 -53493 -15195 -125107 -91185 -336192 -792712 -779657 -850416
10167 -850416 -333739 -522591 -613577 45387 86994 235046 290259 111291 121120 -188419
10157 -188419 -74526 -173116 9602 -490760 -588596 -540332 -524778 -358689 -603377 -583975
10147 -583975 220321 306580 -317318 -243664 -269965 -106682 -285070 187654 436520 -84098
10137h4098K26633n3116M11149j75479O7239j27996m97358N7483L33683O0251
10127B18391m1620k10393O843K71952j88309J62499K15129j09416p03820p9396
10117d58140L5405J24484K30182K3247l30318Q6261k68024J52395J5451M80333
10107I1276K28070o6581m91239N4517M34774Q1803j77697n9275k2864K8532K73455
10096C74771k8448p6279J62339o13210l73456M69393L04067k40522k36902P7147
10086a81100K5037M17989j46089J91462M21511k95600K05138j94301j81525J0856
10076B73378k52474J95586N53532n01034k85179M66401J4247l59000L17744r1235
10066C31966r5582N30971l48799R6507J38586j81449r8825m6132j53642L22520
$$ plain form
10137 -84098 142535 89419 500568 325089 392328 264332 -233026 -175543 158140 218391
10127 218391 176771 -33622 -26779 245173 56864 219363 434492 325076 -378744 -458140
10117 -458140 -422735 -298251 -68069 -44822 -375140 -288879 -556903 -404508 -389057 91276
10107 91276 319346 252765 -238474 -183957 250817 332620 154923 95648 72784 101316 374771
10096 374771 346323 270044 432383 -180827 -554283 -84890 219177 -21345 -258247 -181100
10086 -181100 -156063 261926 115837 307299 728810 433210 638348 444047 262522 273378
10076 273378 20904 216490 770022 268988 -16191 450210 464457 105457 423201 331966
10066 331966 236384 767355 418556 515063 653649 472200 373375 327243 173601 496121
10056D96121J62235k32349n3468J56479j4800L83052J81732n22845J57473j33838
10046E79792k08373q0843k50106M03960M76764l23460k5416L0558J08211O5022
10036G76109K35147k3515J64384R1363l66178L092j47557m7377k03268M7224Q0361
10025F09785j63133J90219L58704n25880j28399K36935N34079m18224l48790j28086
10015B17210J39477O07013J93646q6882k83807K44979K32383J3621n32798M19668
10005A164510K5238l0776k42370L49122O39449n17934n41419j84326R01266j21245
9995A441515q3458n29020m55178K08950k85721k1280P36096l09866J87143m08921
9985D80260k10184M07760m8143j356L03359m76031j96882M94863R61078o73939
$$ plain form
10056 496121 658356 426007 372539 529018 514218 897270 1079002 556157 713630 579792
10046 579792 371419 290576 40470 444430 921194 597734 572318 602876 711087 776109
10036 776109 1011256 987741 1152125 1243488 877310 880402 732845 685468 482200 529424 609785
10025 609785 446652 636871 995575 469695 341296 578231 1112310 694086 345296 217210
10015 217210 356687 963700 1157346 1070464 786657 1031636 1264019 1277640 744842 1164510
10005 1164510 1189748 1158972 916602 1265724 1905173 1387239 845820 661494 1562760 1441515
9995 1441515 1358057 829037 373859 582809 297088 275808 1011904 702038 889181 480260
9985 480260 270076 677836 629693 628337 931696 455665 258783 753646 1714724 1040785
9975A040785r38927O04060N9796j43812J48260l54930M32478k31929l32954O30023
9965I12850J22037N9548l15638J986l76537q1162J18500O77788p9331m9880R1955
9954A082116O34615m15765k64075j31829k05826l05463q9347M62907O31351j2631
9944A386053m08436j55786Q1p9264l01812J74234j50541L52629J41880j86443
9934G72595K45645K46673p6101l77952k64663M8060m55429K67853M59452K96289
9924A162422L69351p7990l8252j09119m6191L52315j12714m99445m68829j8043
9914E13505K85916K30600J81046l6942k25563L99792J31330n9463J92541K93728
9904A906490k34285n0089M48928n74684J64300L7867k06517J34136j98423j21311
$$ plain form
9975 1040785 101858 705918 765714 621902 770162 415232 847710 615781 282827 912850
9965 912850 1034887 1094435 778797 780783 404246 323084 441584 1119372 1040041 990161 1082116
9954 1082116 1716731 1300966 1036891 905062 699236 393773 304426 767333 1398684 1386053
9944 1386053 977617 821831 821912 742648 440836 615070 464529 817158 959038 772595
9934 772595 1018240 1264913 1188812 810860 546197 594257 138828 406681 866133 1162422
9924 1162422 1531773 1453783 1415531 1306412 1260221 1612536 1499822 1000377 531548 513505
9914 513505 799421 1030021 1211067 1174125 948562 1348354 1479684 1420221 1612762 1906490
9904 1906490 1672205 1622116 2071044 1496360 1660660 1698527 1492010 1626146 1427723 1306412
9894A306412L46368K44359l71759j18783j80787L95318J1651j5312N0594j40165
9884A527896j48110M11203K90675p2305J26009j084640L59858J74632K91741l29608
9874A547351M10993J50195k90764L97990K71594j91718m7081N1250J01957K24206
9864B625973J67094K72788J28174K08062k69913K34197L45722l32777J53770n0374
9854C482716j49766j24158j56257K88234J29181j02068M67770j50274L5907K64546
9844C985831j2635L41773M76543n27671m02593M28341K97996M47313J26914J3628
9834E175440k17927n62456M76560P19326J32070Q62626j09507N3769K30851L179
9824F763931K03952l6084q4499K63030J01697r5381N05317J36162l92315O74802
$$ plain form
9894 1306412 1652780 1897139 1525380 1406597 1225810 1621128 1632779 1617467 1668061 1527896
9884 1527896 1379786 1790989 2081664 2009359 2135368 1050728 1410586 1585218 1876959 1547351
9874 1547351 1958344 2108539 1817775 2215765 2487359 2295641 2248560 2299810 2401767 2625973
9864 2625973 2793067 3065855 3194029 3402091 3132178 3366375 3712097 3379320 3533090 3482716
9854 3482716 3332950 3208792 3052535 3340769 3469950 3367882 3835652 3685378 3721285 3985831
9844 3985831 3973196 4314969 4791512 4263841 3861248 4289589 4587585 5034898 5161812 5175440
9834 5175440 4957513 4395057 4871617 5590943 5723013 6585639 6476132 6529901 6760752 6763931
9824 6763931 6967883 6931799 6847300 7110330 7212027 7116646 7621963 7758125 7365810 8040612
9814H040612o4607j44533K97920N31871l56828J97122L52768L46371k85286j87063
9804H728347P44629R31229L46670k9941L02309O97944q9957K79840Q64548R03710
9794A3679328J76979L30930O16149J640331R62968N26006P60593O19234Q32903
9785B0145421O12616J268855J280633J131990J041029J632906J502493Q24072
9777B9440015J518573J497569J645471J561851J332212J706778J809450J409681
9769D1921600J050890K062110J310706J563659J084060J338414J040358J112020
9761E2483817P48365Q70490M08644j482p7921l34751l92426j152836j728899o49643
9751E0173358j502556j688765j606162j172851j196829j833353j251065j432991
$$ plain form
9814 8040612 7976005 7831472 8129392 8661263 8304435 8501557 8854325 9200696 8915410 8728347
9804 8728347 9472976 10404205 10750875 10720934 11023243 11721187 11631230 11911070 12775618 13679328
9794 13679328 13856307 14187237 14803386 16443717 17406685 17932691 18693284 19312518 20145421
9785 20145421 20758037 22026892 23307525 24439515 25480544 27113450 28615943 29440015
9777 29440015 30958588 32456157 34101628 35663479 36995691 38702469 40511919 41921600
9769 41921600 42972490 45034600 46345306 47908965 48993025 50331439 51371797 52483817
9761 52483817 53232182 54102672 54511316 54509834 54431913 54097162 53704736 52551900 50823001 50173358
9751 50173358 48670802 46982037 45375875 44203024 43006195 41172842 39921777 38488786
9743C8488786k154132j561496j648179j759596q86759j111478j750056j293054
9735B6324036o88071o96791p65202j306113j833475m03684n9718o55192n93336
9726A9322454q98012n78047r34160p44156n62498p7290m81301m20485k08971o16151
9716A3801383P063m31135j071966n7034k63748N5370m08851p72831L79485J51927
9706A1389663k36174n83974J04391K50322l431l67258K02185l25384q48179K89701
9696I871862q92738J48421n32741m2677K75903l00342J69863J78188m35360k80430
9686H159949R7648R4255q2743k74255j96241k89496j50855J61624j9114K86094
9676G786866k29836n63379l61647n95101K10437Q51984l53401k64933L66320l24291
$$ plain form
9743 38488786 36334654 34773158 33124979 31365383 30478624 29367146 27617090 26324036
9735 26324036 25635965 24939174 24173972 22867859 21034384 20630700 20570982 19915790 19322454
9726 19322454 18424442 17846395 16912235 16168079 15605581 15528291 15046990 14626505 14417534 13801383
9716 13801383 13808446 13377311 12305345 12248311 11984563 12039933 11631082 10858251 11237736 11389663
9706 11389663 11153489 10569515 10673906 10924228 10920797 10553539 10755724 10430340 9582161 9871862
9696 9871862 8979124 9127545 8594804 8552127 8828030 8527688 8697551 8875739 8440379 8159949
9686 8159949 8257597 8351852 8269109 7994854 7798613 7509117 7358262 7519886 7500772 7786866
9676 7786866 7557030 6993651 6632004 6036903 6247340 7099324 6745923 6480990 6847310 6523019
9666F523019j33744m67024j6324l49264O01421K93947j89275N85488n29670k88154
9656F030420K88511j80495q6071k13945k05437N88193j21401j73777J24330m17496
9646E632832Q3109L2951M56770j89405l19570k76312l06659K19725P09153m44837
9636E597757q5687k529K00056K20240L1589n50090L5372K02586j03647K03624
9626E749271j38939R3425m94631j25264l8448k5338p1878P646M5085L11560j32011
9615E180478O8619j89733L63311k96398k32113L27853K77747M11770J51452l48409
9605E714577l22516M47810K09152k1339n54526j66810L44311Q2883J025J01125
9595E835692J73155k05203M67439k35857J52601L06921j59377j0345R5339O09479
$$ plain form
9666 6523019 6389275 5922251 5905927 5556663 6158084 6452031 6262756 6848244 6318574 6030420
9656 6030420 6318931 6138436 6052365 5838420 5632983 6221176 6099775 5925998 6050328 5632832
9646 5632832 5715941 5748892 6205662 6016257 5696687 5420375 5113716 5333441 6042594 5597757
9636 5597757 5512070 5509541 5709597 5929837 5961426 5411336 5446708 5649294 5545647 5749271
9626 5749271 5610332 5703757 5209126 5083862 5045414 5020076 4948198 4955844 5000929 5312489 5180478
9615 5180478 5249097 5059364 5422675 5126277 4894164 5222017 5499764 5911534 6062986 5714577
9605 5714577 5392061 5839871 6049023 6027684 5473158 5306348 5650659 5733542 5734567 5835692
9595 5835692 6008847 5803644 6271083 6035226 6187827 6494748 6335371 6325026 6420365 7029844
9585G029844l86673n34912m7273O90710J39032J05961M90398J29208l24769K1910
9575G313436O6098k49492K88355P89226J68048m12449j08878L81176j41692O63309
9565H757137j19437M78418m73095k30567J082797M52824M77147n28019J50893
9556A0048098N39602n1135L21440J80887L88915m2941K17194Q04386M22107N65973
9546A3394526J07437M57002P07999P63312O50192J151065Q95942R26006R19464
9537A9972945R77302J621185K057775J769353K448417K079153K123363J307657
9529C4357150R31389O38965K01121L31269l7152o08773j104848j850719j811435
9520C1046967j980215j329272j381746m78482K6952K16772m66258l96409K81945
$$ plain form
9585 7029844 6643171 6108259 6060986 6751696 6890728 6996689 7487087 7616295 7291526 7313436
9575 7313436 7379534 7130042 7418397 8207623 8375671 7963222 7854344 8235520 8093828 8757137
9565 8757137 8637700 9116118 8643023 8412456 9495253 9948077 10425224 9897205 10048098
9556 10048098 10587700 10536565 10858005 11038892 11427807 11384866 11602060 12406446 12828553 13394526
9546 13394526 13501963 13958965 14666964 15430276 16080468 17231533 18127475 19053481 19972945
9537 19972945 20950247 22571432 24629207 26398560 28846977 30926130 33049493 34357150
9529 34357150 35288539 35927504 36128625 36459894 36422742 35813969 34709121 32858402 31046967
9520 31046967 29066752 27737480 26355734 25877252 25904204 26120976 25654718 25258309 25540254
9511B5540254O60003L68475J48480Q05380J190598O95435N65516J503527J473789
9502C2951457K202341J745402J917044L222821L155719K710265L044516L253287
9494E4202852L112625L170282L028879K150642J925590J272176J76008o64033
9486F8375021p11694j300173n84486p99497J01237J070198J617924K203849L543405
9477G3515784M640516O124407O687515O954695Q091086P508658P165798O316220
9469A27004679L943388K127410R67912j287426l598454n047522o109424o242366
9461A11758197o403355o272244n124024n001865l709560k414027k534305j446355
9453G8852462j223385j103817q32121Q2435o27299K1296Q81626P73689K014359
$$ plain form
9511 25540254 26200257 26568732 26717212 27522592 28713190 29408625 29974141 31477668 32951457
9502 32951457 35153798 36899200 38816244 42039065 45194784 47905049 50949565 54202852
9494 54202852 57315477 60485759 63514638 65665280 67590870 68863046 69039054 68375021
9486 68375021 67663327 66363154 65778668 64979171 65080408 66150606 67768530 69972379 73515784
9477 73515784 78156300 84280707 90968222 97922917 106014003 113522661 120688459 127004679
9469 127004679 130948067 133075477 134043389 132755963 129157509 124109987 118000563 111758197
9461 111758197 105354842 99082598 93958574 88956709 85247149 82833122 80298817 78852462
9453 78852462 77629077 76525260 75693139 75775574 75148275 75169571 76051197 76824886 78839245
9444G8839245K599769L436229M784475N730918O892319P316408Q272548P909706
9436A25781617P950955N941460M776343K634399l32146j304678l518949o077006
9428A35851995p497403q100366q277821p959573p813883o389758n392266l168201
9420H1252724k514681j516852j415903j219848p28919j130531j696460j770466
9412F9259064j877375j558255j894945k155172j702220j265518j832033k318522
9404E4655024k166706j815645j518295j470396j528704j496611n47891j096702
9396D3014074p91623K25786K69046m54809j34418Q89752P71222O51508P49160
9387D5189698K016429R71907J471001K003675J530160J083427K37289j43040q14565
$$ plain form
9444 78839245 81439014 84875243 89659718 95390636 102282955 109599363 117871911 125781617
9436 125781617 133732572 139674032 144450375 147084774 146752628 145447950 141929001 135851995
9428 135851995 128354592 120254226 111976405 104016832 96202949 89813191 84420925 81252724
9420 81252724 78738043 77221191 75805288 74585440 73856521 72725990 71029530 69259064
9412 69259064 67381689 65823434 63928489 61773317 60071097 58805579 56973546 54655024
9404 54655024 52488318 50672673 49154378 47683982 46155278 44658667 44110776 43014074
9396 43014074 42222451 42448237 42717283 42262474 42128056 43017808 43789030 44440538 45189698
9387 45189698 47206127 48178034 49649035 51652710 53182870 54266297 54503586 54360546 53545981
9378E3545981j142847o87020m42832q15157j504244j191951k270601k457539k615543
9369D0418247k206500j703458j462724j454788j200802o83990l21434q69952q38218
9360B9676381o39823l76610k39183k47754m46743p58598o32342j107337l69191
9351B4858800k21015j10829k53966j26273j93799m27539n55583j57701o2740l57178
9341B2392177O7927N6606p37539j31733k68755k80012j37396L13643l42933j23585
9331B0808400l51784j05924p3711o04222L45839j25402n5614j79769o77352K03521
9321A9183982k01073K5939m0363j42708n95591N40095m57496m13771J24266M0103
9311A8063383j79117l08210N33139J96825P9203o98259J88488r7559j01036p168
$$ plain form
9378 53545981 52403134 51716114 51273282 50458125 48953881 47761930 45491329 43033790 40418247
9369 40418247 38211747 36508289 35045565 33590777 32389975 31705985 31384551 30514599 29676381
9360 29676381 29036558 28659948 28420765 28173011 27726268 26967670 26335328 25227991 24858800
9351 24858800 24637785 24526956 24272990 24146717 23952918 23525379 22969796 22812095 22749355 22392177
9341 22392177 22460104 22516710 21779171 21647438 21378683 21098671 20961275 21274918 20931985 20808400
9331 20808400 20456616 20350692 20276981 19672759 20018598 19893196 19837582 19657813 18980461 19183982
9321 19183982 18982909 19008848 18968485 18825777 18230186 18770281 18312785 17899014 18023280 18063383
9311 18063383 17884266 17576056 18109195 18306020 18385223 17686964 17875452 17777893 17676857 17669689
9301A7669689m54600m75858K20743l30266j45985j03437m41222O52285L95727
9292A6987076n3766J96917J99775j54487N6376n3298K27327l391L95914k36888
9282A7561555o05092M53704J78095j6629k19682N34521L93442m73737q8459J61674
9272A7879392o09444k66985k8086r7910n15010j57055K26315n9435k23289n4116
9262A6094377M06817m31964J62379j47585n19647j62886O938j74777J27451l01992
9252A5059111J12177j22053r9258J20696N92325m41172n50423J73710k053l91692
9242A4451368j24366j6890j16273N92676k24859l35038o18890O26107k66982r7814
9232A3869039j26867k48699k45382m09260k50722N18502K95464P7941K67557J08039
$$ plain form
9301 17669689 17215089 16739231 16959974 16629708 16483723 16380286 15939064 16591349 16987076
9292 16987076 16933310 17130227 17330002 17175515 17231891 17178593 17405920 17402529 17798443 17561555
9282 17561555 16956463 17410167 17588262 17571633 17351951 17886472 18279914 17806177 17717718 17879392
9272 17879392 17269948 17002963 16974877 16876967 16361957 16204902 16431217 16371782 16148493 16094377
9262 16094377 16501194 16069230 16231609 16084024 15564377 15401491 15408429 15233652 15361103 15059111
9252 15059111 15171288 15049235 14949977 15070673 15662998 15221826 14671403 14845113 14843060 14451368
9242 14451368 14327002 14310112 14193839 14786515 14561656 14226618 13607728 14233835 13966853 13869039
9232 13869039 13742172 13493473 13248091 12838831 12588109 13106611 13402075 13480016 13747573 13855612
9222A3855612j1539j97148M24225l34412o95767n8519r07825k83072N58546J45595
9212A2495696p66740J54812O8777J92348J5745K26156J12612m93689J98989n2855
9202A2151851n58783K76765n3629J00146j04335J76505K69194l26540j46069J14741
9192A1899846K50603m57122l86646o275L88046j59535O3164j3525L99313l36253
9182A1641616R5556L19485m57168l12876l11793l95688j72370J96218K63221l40603
9172A0525598j15217M15959j47232j25091j12631m48582K77921J27855j11267
9163A0287313J26117K81935K55452k8237K7799L6519j47551k07754K84831J06588
9153A1023012m01288J33739k55802q21788l85478n4450O40569k11256m40667J65987
$$ plain form
9222 13855612 13844073 13646925 14071150 13736738 13040971 12982452 12074627 11791555 12350101 12495696
9212 12495696 11728956 11883768 11952545 12144893 12160638 12386794 12499406 12005717 12204706 12151851
9202 12151851 11593068 11869833 11816204 11916350 11812015 11988520 12257714 11931174 11785105 11899846
9192 11899846 12150449 11693327 11306681 11300406 11688452 11528917 11592081 11578556 11977869 11641616
9182 11641616 11737172 12056657 11599489 11286613 10974820 10579132 10406762 10602980 10866201 10525598
9172 10525598 10410381 10826340 10679108 10554017 10441386 9992804 10270725 10398580 10287313
9163 10287313 10413430 10695365 10950817 10922580 10950379 10986898 10839347 10631593 10916424 11023012
9153 11023012 10621724 10755463 10499661 9677873 9292395 9237945 9878514 9667258 9226591 9392578
9143I392578k96208K30401l2703M25719J49900q8646m60212J36595k17305n10178
9133H729941j13795L10277Q5978M04357r15672P03727N52909m81764J26228l02553
9123I099633M0224k67478O24282M64509L1703o49671Q4615M17441j36468n7801
9113I650989O88217r9174k94675J40043M4414q05023k65970J47568M33642j190
9103I638841P2075J49637p39151J59548K13222j41210M9429J88304K1616j9334
9093I592977n12210l4562O80557k71834k7182Q4169L74056n1700j54968L51589
9083A0030892J59388j18000J7J26765L70482L0015k57397l74598l01298O60N01155
9072A0168081j02814j3684k76818J34437P66364N91254j70463o44812L42273k18179
$$ plain form
9143 9392578 9096370 9326771 9294068 9719787 9869687 9781041 9320829 9457424 9240119 8729941
9133 8729941 8616146 8926423 9012401 9416758 8501086 9204813 9757722 9275958 9402186 9099633
9123 9099633 9139857 8872379 9496661 9961170 9992873 9343202 9427817 9845258 9708790 9650989
9113 9650989 10339206 10240032 9945357 10085400 10129814 9324791 9058821 9206389 9640031 9638841
9103 9638841 9710916 9860553 9121402 9280950 9494172 9352962 9402391 9590695 9612311 9592977
9093 9592977 9080767 9046205 9726762 9454928 9427746 9511915 9885971 9834271 9679303 10030892
9083 10030892 10190280 10072280 10072297 10199062 10569544 10599559 10342162 9967564 9666266 9666926 10168081
9072 10168081 10065267 10051583 9774765 9909202 10675566 11266820 11096357 10451545 10793818 10575639
9062A0575639m2570M86652K9657l00903P62K34071L75835J72368m74674l3494
9052A1023343J14351L21291J66661k00079k63164l17046R77972N1780k95024M97749
9042A2077834P945l84506j6704l10465K4223M59046k74834m57543N03792P3162
9032A1701950L94998O2716j41466L0861L92962j79062R6139O71344n49830J66019
9022A2646631L8094p1305K99375J78386J96990j40445k4973P0207j73006K98073
9012A3318027J56544j73714K59036k8143L1810M17440M69127k20006K6177J68953
9002A4425251N81938M62797L91360m07493L54922O36828j58046Q9736O4574L54169
8992A6796036l25254k13446M15956k95583l34208Q60404N54525L12853n28838
$$ plain form
9062 10575639 10533069 11019721 11049378 10748475 10749237 10983308 11359143 11531511 11056837 11023343
9052 11023343 11137694 11458985 11625646 11425567 11162403 10845357 11823329 11875109 11580085 12077834
9042 12077834 12085779 11701273 11684569 11374104 11398327 11857373 11582539 11124996 11628788 11701950
9032 11701950 12096948 12159664 12018198 12049059 12442021 12262959 12359098 13030442 12480612 12646631
9022 12646631 12684725 12613420 12912795 13091181 13288171 13147726 13122753 13192960 13019954 13318027
9012 13318027 13474571 13300857 13559893 13531750 13563560 13981000 14450127 14230121 14256298 14425251
9002 14425251 15007189 15469986 15861346 15453853 15808775 16445603 16287557 16377293 16441867 16796036
8992 16796036 16470782 16257336 16673292 16377709 16043501 16903905 17458430 17771283 17242445
8983A7242445L22692L86681N83933J58205j23180Q3524M72616L98315K11091P79893
8973B0516215k23730L20495J113970Q94857L4006N67188N16282O89979P75371
8964B5204633O69650M41620M45713J307570L93796Q44572O75845J374433J701695
8955C3059527N28978L37576M92091P40248P12135N66247N65693N52869M83160
8946C8038524l65717k18261k92967R24223n7675k22793J292590J202773P85180
8937D1085877J156626J101011J186685J401905J338904J375179J961119J925793
8929E2533099K327089J970174J944568K146555K536730K722311K597693K188018
8921G0966237O86988N44027j43898J66634R48890J087505J350423N05624P86509
$$ plain form
8983 17242445 17565137 17951818 18535751 18693956 18570776 18654300 19126916 19525231 19736322 20516215
8973 20516215 20292485 20612980 21726950 22621807 22655813 23223001 23739283 24429262 25204633
8964 25204633 25874283 26315903 26761616 28069186 28462982 29307554 29983399 31357832 33059527
8955 33059527 33588505 33926081 34418172 35158420 35870555 36436802 37002495 37555364 38038524
8946 38038524 37672807 37454546 37161579 38085802 38028127 37805334 39097924 40300697 41085877
8937 41085877 42242503 43343514 44530199 45932104 47271008 48646187 50607306 52533099
8929 52533099 54860188 56830362 58774930 60921485 63458215 66180526 68778219 70966237
8921 70966237 71653225 72197252 72053354 72219988 73168878 74256383 75606806 76112430 76898939
8912G6898939O34745J11779K33434M46723J503005R64867J403524J860703K039375
8903H6097094K888325L195392K910959L461994L567993L729549L216147K432395
8895A11499848J907928J427808J397070J435774J360125K197377K293779L043370
8887A26563079M195058M237692L244602L765442M392065N796544P773536R603026
8879A69571044J1189482J2193619J4378608J5653484J7941748J9795094K0274589
8872B80997668J9118499J5204659R922943N441194J313530j679172l382352n630245
8864C21306724p816103j0768483j1714328j3371543j3327522j3225238j3801967
8857B37281540j4074955j3402659j1419827r222586p594726m387177k799999r48654
$$ plain form
8912 76898939 77533684 77645463 77878897 78325620 79828625 80793492 82197016 84057719 86097094
8903 86097094 88985419 92180811 95091770 98553764 102121757 105851306 109067453 111499848
8895 111499848 113407776 114835584 116232654 117668428 119028553 121225930 123519709 126563079
8887 126563079 130758137 134995829 138240431 142005873 146397938 152194482 159968018 169571044
8879 169571044 180760526 192954145 207332753 222986237 240927985 260723079 280997668
8872 280997668 300116167 315320826 325243769 330684963 331998493 330319321 326936969 321306724
8864 321306724 313490621 302722138 291007810 277636267 264308745 251083507 237281540
8857 237281540 223206585 209803926 198384099 189161513 181566787 177179610 174379611 173430957
8849A73430957J374885K940306L940820O249211P184010P366454O609199L264766
8841B12360608L17710n85172j625569k550612m962958q555633j1243764j2553631
8833A70600979j1533739r279425q840876q074669p655296p143149n824309n296341
8825A06953175m607335l748435l149181l281395k293520j857752j807832k030460
8817H4177265m59064q56813m8020k78897p2013P96477J077517J333534K666593
8808H8336579K467933K074929J957189R66867N4342j87077q87469k083707k400795
8799I0298791l041493l293056m462799m094271l258754l335695k715664j625756
8791F4471303r72122k023306j027498n85983p39141j396998r74601k09968o34286
$$ plain form
8849 173430957 174805842 177746148 181686968 187936179 195120189 202486643 209095842 212360608
8841 212360608 212678318 212093146 210467577 207916965 202954007 194398374 183154610 170600979
8833 170600979 159067240 149787815 140946939 132872270 125216974 118073825 112249516 106953175
8825 106953175 102345840 98597405 95448224 92166829 89873309 88015557 86207725 84177265
8817 84177265 83718201 82861388 82813368 82534471 82462458 83258935 84336452 85669986 88336579
8808 88336579 90804512 92879441 94836630 95803497 95857839 95670762 94783293 92699586 90298791
8799 90298791 87257298 83964242 79501443 75407172 72148418 68812723 66097059 64471303
8791 64471303 63499181 61475875 60448377 59862394 59123253 57726255 56751654 56541686 55907400
8782E5907400m38283k47753j191860o3145l62007o69568l30409l43443k32966
8773E2027966J25592l37690m26019N4049j50236p03091L92694j33105m05387m5582
8763E0399191j90913Q3186O18128j39801O81487R10052P36035P08061Q5134Q36864
8753E4727424K08704Q84059R26112J052094N73902R05760O30861K89885n7349
8744F0141452M25332P69932K71128k81219q6284j43054p19310J67590L95217K77813
8734F1218597N3205O53478R64253J136011J509087J682341J453222K796089L642272
8725G5108555L555472L848222N070858N468399O266832Q282334Q371105J0411613
8717A26383390J0881232J0607793R132988Q501399Q094437M678150m48033n578232
$$ plain form
8782 55907400 55469117 55221364 54029504 53966359 53604352 52934784 52604375 52260932 52027966
8773 52027966 52153558 51815868 51389849 51443898 51293662 50590571 50983265 50850160 50444773 50399191
8763 50399191 50208278 50291464 50909592 50769791 51451278 52361330 53097365 53805426 53890560 54727424
8753 54727424 54936128 55820187 56746299 57798393 58372295 59278055 59908916 60198801 60141452
8744 60141452 60566784 61336716 61607844 61326625 61240341 61097287 60377977 60545567 60940784 61218597
8734 61218597 61271802 61925280 62889533 64025544 65534631 67216972 68670194 71466283 75108555
8725 75108555 78664027 82512249 87583107 93051506 99318338 107600672 115971777 126383390
8717 126383390 137264622 147872415 157005403 165506802 173601239 178279389 177831356 172253124
8709A72253124r149316r310393p683398o470780o459003o814794p548850p077686
8701A11738904n870564m507687l042000k139562j576286o34448N17642Q42043
8693I5328042J524622K684353K872513L962577M064466L232494K258540J390797
8685A17318404J354155K301263M301771M888279M909251L432713N08954j834686
8677A37180104m745981n693134n639670m010372j901614j823976j623170k203201
8669A09538986l297980m703656n881501n574929m661748l505734k854335k176593
8661G6882510j297758q17667P8734L47017J321307J342501J776789K338935L97677
8652H2370045L48668l18968j994177k306129j855369j030855J61668K15684R62084
$$ plain form
8709 172253124 163103808 153793415 146110017 139639237 133180234 126365440 118816590 111738904
8701 111738904 105868340 101360653 98318653 96179091 94602805 93968357 94485999 95328042
8693 95328042 96852664 99537017 102409530 106372107 110436573 113669067 115927607 117318404
8685 117318404 118672559 120973822 125275593 130163872 135073123 138505836 139014790 137180104
8677 137180104 132434123 126740989 121101319 117090947 115189333 113365357 111742187 109538986
8669 109538986 106241006 101537350 95655849 90080920 85419172 81913438 79059103 76882510
8661 76882510 75584752 74767085 74845819 75192836 76514143 77856644 79633433 81972368 82370045
8652 82370045 82718713 82399745 80405568 78099439 76244070 75213215 75374883 75590567 76552651
8643G6552651j189204k476023l644637m814960l704633l404619k919067k220062
8635E2179446j959493j278770r12202p47687q61738j146117j219837m97101p24907
8626D2831594q50688K87080k51845l75791J19735N79121O41842j116241j618037
8617D0246770j591192q96537q21173j007236o22096O5720J8103q92425r79103
8608C3520831o35535m93218k36419j35641l09613m06691m51912j02876N13933
8599C1262859O9037n31413O25900O56033k33396K83404O87897J043607O79870
8590C4543798l65198N5060p55879j353260j270257j284676r05576l63223o71670
8581B7629119o03272n21746k505631m764199M211356K079414n89818k28472k12454
$$ plain form
8643 76552651 75363447 72887424 69242787 64427827 60723194 57318575 54399508 52179446
8635 52179446 50219953 48941183 48028981 47281294 46419556 45273439 44053602 43556501 42831594
8626 42831594 41980906 42267986 42016141 41640350 41760085 42339206 42981048 41864807 40246770
8617 40246770 38655578 37759041 36937868 35930632 35308536 35374256 35392359 34499934 33520831
8608 33520831 32885296 32392078 32155659 32020018 31710405 31303714 30851802 30748926 31262859
8599 31262859 31331896 30800483 31426383 32082416 31849020 32132424 32820321 33863928 34543798
8590 34543798 34178600 34233660 33477781 32124521 30854264 29569588 28664012 28300789 27629119
8581 27629119 27025847 26504101 23998470 19234271 23445627 25525041 24935223 24706751 24494297
8572B4494297m6115j49887m32924l74237k38698l4458j42159l41063K74185L40205
8562B3349146j89377j80302J19734L71085M11245K58652M36197k2021M01498K36698
8552B5192555N52506M7509M68370L28742Q42850J357337Q11373M92643R00918
8543C0994803m2525l44365j082328k268687j581051j217020q18859m09584p81907
8534B2448477j79330o10548J00907n36128q11459j03127k81182k57443j00562
8525A9669605j39547M76773k4273n94297L7585J57638j1089l05121k0672p8112
8515A9168490l05298M3477J69169Q1884q50665k78826K57383L7939m32816j76396
8505A7714341m22372l8357o27248K69374k23746k70859P5867j35865k88872M3444
$$ plain form
8572 24494297 24448182 24298295 23865371 23491134 23252436 23217978 23075819 22734756 23008941 23349146
8562 23349146 23159769 22979467 23099201 23470286 23881531 24140183 24576380 24554359 24955857 25192555
8552 25192555 25745061 25792570 26260940 26589682 27432532 28789869 29601242 30093885 30994803
8543 30994803 30952278 30607913 29525585 27256898 25675847 24458827 23639968 23230384 22448477
8534 22448477 22269147 21658599 21759506 21223378 20411919 20308792 20027610 19770167 19669605
8525 19669605 19530058 20006831 19982558 19388261 19425846 19583484 19572395 19267274 19246602 19168490
8515 19168490 18863192 18906669 19075838 19157722 18307057 18028231 18285614 18323553 17890737 17714341
8505 17714341 17291969 17253612 16626364 16895738 16671992 16401133 16477000 16341135 16052263 16095707
8495A6095707r1591K96170J88017m0896l71433O11901l88225n65999J88178m86278
8485A5435551m32170Q63275J06161k49302K81343J20063m17695r8350M65260l66513
8475A5707623L47741k42336K53591J74520J4986l55385M6396m34240k76851K53083
8465A5489128K5581n93306k27625l63485j46051l80380l84156j20930l41340m69808
8455A2487628M30518J92182l8419K6570l12042n06589R8961O9118q92410J16302
8445A1671819J88687R917j86643k02201N5037N0937K88170j11205K30448j03953
8435A1891013k95614k22070M95988k82119O1536J13817r26092q6942J14587l43062
8425A0521042P4754N4778l70016J52906l95241n8036k56599J26778m32922J80990
$$ plain form
8495 16095707 16004116 16300286 16488303 16447407 16075974 16687875 16299650 15733651 15921829 15435551
8485 15435551 15003381 15866656 15972817 15723515 16004858 16124921 15707226 15608876 16074136 15707623
8475 15707623 16055364 15813028 16066619 16241139 16256125 15900740 15947136 15512896 15236045 15489128
8465 15489128 15514709 14921403 14693778 14330293 14184242 13803862 13419706 13298776 12957436 12487628
8455 12487628 12918146 13110328 13071909 13098479 12786437 12279848 12378809 12447927 11555517 11671819
8445 11671819 11860506 11870423 11683780 11481579 11536616 11587553 11875723 11764518 11994966 11891013
8435 11891013 11595399 11373329 11869317 11587198 11648734 11762551 10836459 10749517 10864104 10521042
8425 10521042 10595796 10650574 10280558 10433464 10038223 9980187 9723588 9850366 9417444 9598434
8415I598434m1253k78852n56145J44859q6374k64211L06404K62061J43986j55092
8405I073817k82836k29993J67042J8339r5817K85248L83620O168l27200L84436
8395I382824m92793n19017l3362m47702P21314K87242l32597l71897J4679J06560
8385H315251q6481L97896J97596n63436J41878l84925l34563N5555P17678l22014
8375H134435m48275L13557K12027Q6682L19384q26312k85858J76902J63713O5674
8365G911929k31230j33681J55187m51950L95982J2981k82124n2501K69627K32729
8355G826949J61070l60487j49287r5428l16756J50490J76384K171m1778K76628
8345G629956M25101o9956k92228l27711L22161J028243n33259j65789J31247k05500
$$ plain form
8415 9598434 9557181 9278329 8722184 8867043 8780669 8516458 8822862 9084923 9228909 9073817
8405 9073817 8790981 8560988 8728030 8746369 8650552 8935800 9319420 9325588 8998388 9382824
8395 9382824 8890031 8371014 8337652 7889950 8611264 8898506 8565909 8194012 8208691 8315251
8385 8315251 8228770 8626666 8824262 8260826 8402704 8017779 7683216 7738771 8456449 8134435
8375 8134435 7686160 7999717 8211744 8298426 8617810 7791498 7505640 7682542 7846255 7911929
8365 7911929 7680699 7547018 7702205 7250255 7646237 7659218 7377094 7324593 7594220 7826949
8355 7826949 7988019 7627532 7478245 7382817 7066061 7216551 7392935 7395106 7353328 7629956
8345 7629956 8055057 7985101 7692873 7365162 7687323 8715566 8182307 8016518 8147765 7942265
8335G942265J52578M3827q4447J79774n23597n0406J59782O1834j37372L7280
8325G781518l6797j19953K61010K47847n92158n5272J4107M51337L99619l87840
8315G963418j87286j98643k99886p1081L57060k30887M88772l08584j004610N35880
8305G044153k08767K76216k18181J13489P5361J59118K99614J27084n29705J14392
8295G252774K6679J5248j25650J54301J79857m44152k06810l3263P07048J11326
8285G637358k91641o0609L80871K74491K15421M52435m22803p4599N04636o54117
8275G961443j19594l61177M36297K24192k0581j38961M4292J45922n8450K69476
8265H382859Q56855K29450j98190r4753K06075L13882L73972M21456k1164j89097
$$ plain form
8335 7942265 8094843 8138670 8054223 8233997 7710400 7659994 7819776 7881610 7744238 7781518
8325 7781518 7744721 7624768 7885778 8133625 7541467 7486195 7500302 7951639 8351258 7963418
8315 7963418 7776132 7577489 7277603 7206522 7563582 7332695 7821467 7512883 6508273 7044153
8305 7044153 6835386 7111602 6893421 7006910 7082271 7241389 7541003 7668087 7138382 7252774
8295 7252774 7279453 7294701 7169051 7323352 7503209 7059057 6852247 6818984 7526032 7637358
8285 7637358 7345717 7285108 7665979 7940470 8155891 8608326 8185523 8110924 8615560 7961443
8275 7961443 7841849 7480672 7916969 8141161 8120580 7981619 8025911 8171833 8113383 8382859
8265 8382859 9239714 9469164 9270974 9176221 9382296 9696178 10070150 10491606 10470442 10281345
8255A0281345m1190N34524N55557K68926K59498O85125K71744M99589P99222J74234
8245A4288574N74154J732029J095821J678364J202120J252458K28413m69496m29747
8236B1152690j02429Q40207M66758p34125j239392j234425j729071j469783j216501
8227A4733929j168168r17144m29136j77953q2853o23630k25192j68968k03931
8218A0736954J18584k979j25165p84998o259J66602k20590Q81041j9512L09055
8208A1052733o39774p0415m28531Q7275l35156L46910M12918k50526n08337N96319
8198A0263416l02186P09558j04107Q24826N50895L356462j609149o491605J245913
8189H444023K23955J255801J35050J099342p92667K1540l24149N7031M48793O59840
$$ plain form
8255 10281345 10240155 10774679 11330236 11599162 11858660 12543785 12815529 13315118 14114340 14288574
8245 14288574 14862728 16594757 17690578 19368942 20571062 21823520 22051933 21582437 21152690
8236 21152690 21050261 21890468 22357226 21623101 20383709 19149284 17420213 15950430 14733929
8227 14733929 13565761 12648617 12219481 12041528 11958675 11335045 11109853 10940885 10736954
8218 10736954 10855538 10852559 10727394 9942396 9936137 10102739 9882149 10763190 10743678 11052733
8208 11052733 10412959 10342544 9914013 10001288 9666132 10013042 10425960 10175434 9667097 10263416
8198 10263416 9961230 10670788 10566681 11391507 11942402 15298864 13689715 7198110 8444023
8189 8444023 8667978 9923779 10058829 11158171 10365504 10387044 10062895 10119926 10568719 11228559
8179A1228559o2715K75507J26327k66677O56203J294318O74078O04392j83797
8170A4346195L40049O49481O05893J709045J266353J850516J716742J195974P69392
8161B4449640P41553K3964P22001R10953J352591r3497N28248m72874n68936J02660
8151B7696303n29752j039009q88433j537401j635716j429486j438190n07647j063372
8142A7627297l70275m36485m92418n48789o71209j8658J88459n65440l8405k14006
8132A4460071o45068j61830R6570l02772j57030P08024n94473n67391j0114N9921
8122A2885908l52135q92001n4082J94655l38252j66593J00533L27905K3489l34039
8112A1395388k47053J91295K3278P5202j09951k10185l14640k9578r7539O27276
$$ plain form
8179 11228559 11165844 11441351 11567678 11301001 11957204 13251522 13925600 14529992 14346195
8170 14346195 14686244 15335725 15941618 17650663 18917016 20767532 22484274 23680248 24449640
8161 24449640 25191193 25215157 25937158 26848111 28200702 28107205 28635453 28162579 27593643 27696303
8151 27696303 27166551 26127542 25239109 23701708 22065992 20636506 19198316 18690669 17627297
8142 17627297 17257022 16820537 16328119 15779330 15108121 15089463 15277922 14712482 14674077 14460071
8132 14460071 13815003 13653173 13749743 13446971 13289941 13997965 13403492 12836101 12825987 12885908
8122 12885908 12533773 11641772 11587690 11782345 11444093 11277500 11378033 11705938 11729427 11395388
8112 11395388 11148335 11339630 11362908 11438110 11328159 11117974 10803334 10773756 10676217 11303493
8102A1303493j9572N38070J97871K8835l7959O13848K60551k12292K18688M85444
8092A3376977j49436l12259J95703K24389L27172M34631K03087l58185M92657
8083A4434736o1355P9502M46859J68306k45561K44125k38850k61526O4612K20674
8073A4851522l80270k41536k18056K26808r1262K57043R9417J00755K29762J51523
8063A4985706q4348j72781l05058k05910j52040J50599k56063l19714j24033J33268
8053A3649626L21509k14870j45610o92945k78620J2050R7160m48972L54063n57767
8043A2095624R0888N69540O9401J16183o79429o67972m17950M25627O15592p72901
8033A1444603L10276M98613l93109r5809M13861n05582j1865M420n2517O17429
$$ plain form
8102 11303493 11283921 11821991 12019862 12048697 12010738 12624586 12885137 12672845 12891533 13376977
8092 13376977 13227541 12915282 13110985 13335374 13662546 14097177 14300264 13942079 14434736
8083 14434736 14373381 14452883 14899742 15068048 14822487 15066612 14827762 14566236 14630848 14851522
8073 14851522 14471252 14229716 14011660 14238468 14147206 14404249 14503666 14604421 14834183 14985706
8063 14985706 14901358 14728577 14423519 14217609 14065569 14216168 13960105 13640391 13516358 13649626
8053 13649626 13971135 13756265 13610655 12917710 12639090 12651140 12748300 12299328 12653391 12095624
8043 12095624 12186512 12756052 12825453 12941636 12262207 11594235 11176285 11601912 12217504 11444603
8033 11444603 11754879 12253492 11860383 11764574 12178435 11672853 11660988 11665408 11612891 12230320
8023A2230320J0353k87539l21651J92808K69020K21018K96985k85129n53474K35357
8013A2008068q05337J86525K68388N48480J8911O2573K93054O4693l94545k069
8003A2248741J55716J76261J4896k52382N14019m77358R7261O9700k41754p54493
7993A1550607M60243J63071m75248L1066J46236J91799k01878l62870K88847L34741
7983A2126614j36370J64819k62917l55989k25628j32611j95215J73960n96572
7974A0560091o55046L96609K67071K19111j22636J48843L84649k55360n28457
7965A0414875n3086J9049L3676k97232k39374R50406N7408N77982m7907n1935
7955A1363862l39534J40127k46410J63715j73411J03891j29838J17108K26821
$$ plain form
8023 12230320 12240673 11953134 11631483 11824291 12093311 12314329 12611314 12326185 11772711 12008068
8013 12008068 11202731 11389256 11657644 12206124 12225035 12287608 12580662 12645355 12250810 12248741
8003 12248741 12404457 12580718 12595614 12343232 12857251 12379893 12477154 12546854 12305100 11550607
7993 11550607 12010850 12173921 11698673 11729739 11875975 12067774 11865896 11503026 11791873 12126614
7983 12126614 11990244 12155063 11892146 11536157 11310529 11177918 10982703 11156663 10560091
7974 10560091 9905045 10301654 10568725 10787836 10665200 10814043 11198692 10943332 10414875
7965 10414875 10361789 10380838 10414514 10117282 9877908 10828314 10885722 11463704 11415797 11363862
7955 11363862 11024328 11164455 10918045 11081760 10908349 11012240 10882402 10999510 11226331
7946A1226331j18657Q7962L14900L82401o0069k47748O19902J65313l99858j11957
7936A1858520J92948P414j24261J69385N51334K73202p86374L34056P7465o05348
7926A1948341l63319L46726K92743l96062m23315K61079o78087L05860M74504
7917A1768470k09919k45847L69393j28722J61004J00203J62187K6038r5141l53174
7907A1554492j68834l22262j20355L78395k73084m16533J06559p7533j35543K18757
7897A0744059J49465n28321M09325j20086l51050j94737J22860k58224m7037K61644
7887A0187898J55599J63723j75387M5155L1713M99421j82293j13208p35324o7777
7877I809520M69797k96015q4611L4360M94494m68983J03846J78918L1709R949
$$ plain form
7946 11226331 11107674 11195636 11510536 11892937 11832868 11585120 12205022 12370335 11970477 11858520
7936 11858520 12051468 12058882 11934621 12104006 12655340 12928542 12142168 12476224 12553689 11948341
7926 11948341 11585022 11931748 12224491 11828429 11405114 11666193 10988106 11293966 11768470
7917 11768470 11558551 11312704 11682097 11553375 11714379 11814582 11976769 12002807 11907666 11554492
7907 11554492 11385658 11063396 10943041 11321436 11048352 10631819 10738378 10660845 10525302 10744059
7897 10744059 10893524 10365203 10774528 10654442 10303392 10108655 10231515 9973291 9926254 10187898
7887 10187898 10343497 10507220 10331833 10376988 10408701 10908122 10725829 10612621 9877297 9809520
7877 9809520 10279317 9983302 9898691 9933051 10427545 9958562 10062408 10241326 10273035 10282984
7867A0282984P19490N53368J37689m16539q25540j35673K18483l61403M41279
7858A0614138M23396l44618L13023N24348k99647p47344K40719K47947M15616
7849A1387578o76318j94970j17221J1805j85928J18017K41416k79136p56724P1327
7839I619846M70055k41343r1546O73007L68793n44794k63235J95021K09793J5602
7829A0411199o150m01872P39212m75799P6531Q7630K14341k15194K8708r3688
7819A0364918M67794J19578o7583L63103J01731j77769P2072J64757k03152J63225
7809A1368674N0767J97588j027121K165592j988190k30512J033564n72006N50955
7800A1549311L79111o5070m14366o40517N28159L43373k53648j04385L42509j83587
$$ plain form
7867 10282984 11002474 11555842 11693531 11276992 10451452 10315779 10534262 10172859 10614138
7858 10614138 11037534 10692916 11005939 11530287 11230640 10483296 10724015 10971962 11387578
7849 11387578 10711260 10516290 10399069 10410874 10224946 10342963 10584379 10305243 9548519 9619846
7839 9619846 10089901 9848558 9757012 10430019 10798812 10254018 9990783 10185804 10395597 10411199
7829 10411199 10405049 10003177 10742389 10266590 10343121 10430751 10645092 10429898 10458606 10364918
7819 10364918 10832712 10952290 10884707 11247810 11349541 11171772 11243844 11408601 11205449 11368674
7809 11368674 11419441 11617029 10589908 12755500 10767310 10536798 11570362 10998356 11549311
7800 11549311 11928422 11863352 11448986 10808469 11336628 11680001 11426353 11321968 11664477 11480890
7790A1480890q27154K31127M53315N8825j07088k5523J5412J13436M74210k7735
7780A1839715l87175j27443Q8448J2936K45048J38588Q1048N13554J56376M27179
7770A2988274p7706L40358J52464J40312q0808K73011L92231N24956k5352K40517
7760A4868257M4590M1949p42497m50544l53107q01186j9634J79666l93039j89443
7750A2185012l5905K1481M14278J21169n0117o0994l18114K6990N94670l1546
7740A2866924j63872k12685K07514O24346K28508l31939k60208J65861k84322
7731A2840127k30060N3028j58521M17604l47227K07709j87765j61545L84277K54881
7721A3072508M41623r3999j49043K62494n8660R0435k17996L36087n76966K00609
$$ plain form
7790 11480890 10653736 10884863 11338178 11397003 11289915 11264392 11279804 11393240 11867450 11839715
7780 11839715 11452540 11325097 11413545 11426481 11671529 11810117 11891165 12404719 12561095 12988274
7770 12988274 12910568 13250926 13403390 13543702 13462894 13735905 14128136 14653092 14627740 14868257
7760 14868257 14912847 14954796 14212299 13761755 13408648 12607462 12587828 12767494 12374455 12185012
7750 12185012 12149107 12170588 12584866 12706035 12655918 12594924 12276810 12303800 12898470 12866924
7740 12866924 12703052 12490367 12697881 13322227 13550735 13218796 12958588 13124449 12840127
7731 12840127 12610067 12663095 12504574 12922178 12574951 12782660 12594895 12433350 12817627 13072508
7721 13072508 13514131 13420132 13271089 13533583 13474923 13565358 13347362 13683449 13106483 13307092
7711A3307092n3774q2822R9997O5771M50313j70647J18387n19798j65659O47894
7701A3696754L36989J43277M01197N25972L13802k12635j8049K83900m2644Q1070
7691A5509633R27167l54992j83362K39402J196964N31611k8709P30353K9085L18157
7681A8915309q2510k73503J154393Q39497J012162J372879J494952R76165J094429
7672B6503773M34175n4112p96080M2383P99716O25919l48285r40934j415791j104535
7662B3746229r71198j185311k69739m62634m05680k49695o2971O666j440970o4166
7652A8640531m02903o25529m88193k97348p3914L41377j59500j85582o9616J14304
7642A6793627j04451M92911n11763l18735M11705k48780J37661P25010j39660
$$ plain form
7711 13307092 13253318 13170496 13270493 13336264 13786577 13615930 13734317 13214519 13048860 13696754
7701 13696754 14033743 14177020 14578217 15104189 15417991 15205356 15187307 15471207 15428563 15509633
7691 15509633 16436800 16081808 15898446 16137848 17334812 17866423 17837714 18568067 18597152 18915309
7681 18915309 18832799 18559296 19713689 20553186 21565348 22938227 24433179 25409344 26503773
7672 26503773 26937948 26883836 26087756 26130139 26929855 27555774 27207489 26266555 24850764 23746229
7662 23746229 22775031 21589720 21319981 20857347 20451667 20201972 20139001 20145667 18704697 18640531
7652 18640531 18237628 17612099 17123906 16826558 16752644 17094021 16934521 16748939 16679323 16793627
7642 16793627 16689176 17182087 16670324 16351589 16763294 16514514 16652175 17377185 17237525
7633A7237525O96976J355634O78682Q55204J225651J681200Q11417Q46235m9118
7624B5339406j84367p56769q5674j5234N65233k14257j067220j214242j171894
7615B1194982j153769o52642r78617l79648p57587p80593p35735L5364m71971
7606A5319784n4690m39921n2755j59762j83516k30644k90069l30993j42136L14500
7596A3749798j70478j25407j37585m82489o6754j62462m07484l14563j14743O21471
7586A2389304k1351Q6412K93042k4381l93651l33852P0022N13110j52992n15572
7576A1910091K35369j42599k70096m02285J44369P8594k19536j65500L40078j00716
7566A1407769m62722N8288k74657q7069j09739j87019k70835K14307J18865k44015
$$ plain form
7633 17237525 17934501 19290135 19968817 20824021 22049672 23730872 24542289 25388524 25339406
7624 25339406 25155039 24398270 24312596 24297362 24862595 24648338 23581118 22366876 21194982
7615 21194982 20041213 19388571 18409954 18030306 17272719 16492126 15756391 15791755 15319784
7606 15319784 15265094 14825173 14772418 14612656 14429140 14198496 13908427 13577434 13435298 13749798
7596 13749798 13579320 13453913 13316328 12833839 12767085 12604623 12197139 11882576 11767833 12389304
7586 12389304 12367953 12454365 12747407 12723026 12329375 11995523 12065545 12578655 12425663 11910091
7576 11910091 12145460 12002861 11732765 11330480 11474849 11553443 11333907 11168407 11508485 11407769
7566 11407769 10945047 11003335 10728678 10641609 10531870 10344851 10074016 10288323 10407188 10163173
7556A0163173N97605j57781j02369Q51573P6894m5414o77062m28776R50749k50383
7546A0978209q13802K79169l44339K89874j88516L15766J35728n19003O80384
7537A0813470K82157q4239o5704o70595J80519K16644k31245R7671l04765o8494
7527A0165419J23942Q63652J61969q68431M85952M15110m54079m12032L2220P29073
7517A1242795j33247J4847J19242k3043n35015m81870M47036J13571l75041K45479
7507A0634754n05897j64962L70186k3974L58414j59796K08297K64818j5594k96142
7497A0670104k15467L00830k75959K38523L73561m51060J22748k10023m17255
7488A0136002n08161K57439l71371J77645J63523J20893L76503P3832R5398k15591
$$ plain form
7556 10163173 10760778 10602997 10500628 11352201 11429095 11383681 10706619 10277843 11228592 10978209
7546 10978209 10164407 10443576 10099237 10389111 10200595 10516361 10652089 10133086 10813470
7537 10813470 11095627 11011388 10945684 10275089 10455608 10672252 10441007 10538678 10233913 10165419
7527 10165419 10289361 11153013 11314982 10446551 10932503 11347613 10893534 10481502 10513722 11242795
7517 11242795 11109548 11124395 11243637 11220594 10685579 10203709 10650745 10764316 10389275 10634754
7507 10634754 10128857 9963895 10334081 10310107 10668521 10508725 10717022 10981840 10966246 10670104
7497 10670104 10454637 10755467 10479508 10718031 11091592 10640532 10763280 10553257 10136002
7488 10136002 9627841 9885280 9513909 9691554 9855077 9975970 10352473 10426305 10521703 10306112
7478A0306112n31318L01373J40656k16930J94185j84634j4974K14908m32697J54601
7468I931282J32355K3193O31030K64364J24497K89411l11630L22887q289j47779
7458A1251321L73022J34195k87849p3204M8053K9023Q23879L14861m13191j92001
7448A2008109N68299Q10543P1766K47567L02553J97749j4578J86296K57062l31534
7438A4303832M63426m53424J25158k17077Q6621m13494j78146j79303m59568o48987
7428A2429038k58815M32088l23631J82697o85425n33717m04688L19153J75344
7419A1332044n9553J26813r70834k60070J53039n59545L79162L85843k81691o9003
7409A0176205o4344L71790J44880l50230J5585J10903O8887j47287O446j23487
$$ plain form
7478 10306112 9774794 10076167 10216823 9999893 10194078 10009444 9994470 10209378 9776681 9931282
7468 9931282 10063637 10086830 10717860 10982224 11106721 11396132 11084502 11407389 11399100 11251321
7458 11251321 11624343 11758538 11470689 11397485 11445538 11474561 12298440 12613301 12200110 12008109
7448 12008109 12576408 13386951 13458717 13706284 14008837 14206586 14192008 14378304 14635366 14303832
7438 14303832 14767258 14313834 14438992 14221915 14308536 13895042 13716896 13537593 13078025 12429038
7428 12429038 12170223 12602311 12278680 12461377 11775952 11242235 10837547 11156700 11332044
7419 11332044 11272491 11399304 10428470 10168400 10321439 9761894 10141056 10526899 10245208 10176205
7409 10176205 10111861 10483651 10628531 10278301 10293886 10404789 10473676 10326389 10332835 10209348
7399A0209348K64898K53676j52195L6325J85433Q9945k37267k41585P04253J57446
7389A1270277m69875O51048j04255q376j50236m06446L08666l61293m09970J40710
7379A0460250m54488L25836q0301j90860J36776k04982J93586J37492k18946N8241
7369A0162604K03006m12420K75462L47953m44332L99501j86862o4661M53721l39905
7359A0394067j82579M10184j91224m51333m2515K97384j14914M9630l5505l9357
7349A0093838J22977J4151k21391L35242J74022n2077l04296k79190P63741j71846
7339A0475171k00967K27449l25674k41072L02231m2434n52236K94930J81239l63815
7329I754822K95719l1345l80344l97885J33241O28056M16127K35274r3121n95871
$$ plain form
7399 10209348 10474246 10727922 10575727 10612052 10797485 10887430 10650163 10408578 11112831 11270277
7389 11270277 10800402 11451450 11347195 11338819 11188583 10782137 11090803 10729510 10319540 10460250
7379 10460250 10005762 10331598 10251297 10060437 10197213 9992231 10185817 10323309 10104363 10162604
7369 10162604 10365610 9953190 10228652 10576605 10132273 10531774 10344912 10280251 10733972 10394067
7359 10394067 10211488 10621672 10430448 9979115 9936600 10233984 10119070 10168700 10133195 10093838
7349 10093838 10216815 10230966 10009575 10344817 10518839 10466762 10162466 9883276 10647017 10475171
7339 10475171 10274204 10501653 10175979 9934907 10237138 10194704 9642468 9937398 10118637 9754822
7329 9754822 10050541 10019196 9638852 9240967 9374208 10002264 10418391 10653665 10560544 9964673
7319I964673R6480R8068K18267j67968K93m91790N9483R43707K72539p4782l28966
7308A0590004K09659j82285L4981J59330K00652Q56197k09850m95089M82147k61256
7298A1384490J9438j54054p88206l2502L73266P79179p0610m17424o5652r2285
7288A0935640l66220j89199P50545P0166m66286k47589l50969K55150J80828M87558
7278A1059624j04790K33213Q1053o86843q9281R29353j79786J56856M46522o47445
7268A1198476q4996k37601Q7359K56530k03693J17839J47578J11436N75915J67091
7258A2135934J00617l90698l55203o961M9562j69551O4453R821L31284J34244
7248A1903502m07570j42356K07914j05528l53548O9869j79814j600p7427n86396
$$ plain form
7319 9964673 10061153 10159221 10377488 10209520 10209813 9718023 9777506 10721213 10993752 10918970 10590004
7308 10590004 10799663 10617378 10652359 10811689 11012341 11868538 11658688 11163599 11645746 11384490
7298 11384490 11403928 11249874 10461668 10429166 10802432 11581611 11511001 11093577 11027925 10935640
7288 10935640 10569420 10380221 11130766 11200932 10734646 10487057 10136088 10391238 10572066 11059624
7278 11059624 10954834 11188047 11269100 10582257 10492976 11422329 11242543 11399399 11845921 11198476
7268 11198476 11113480 10875879 10963238 11219768 11016075 11133914 11281492 11392928 11968843 12135934
7258 12135934 12236551 11845853 11490650 11483689 11533251 11363700 11428153 11437974 11769258 11903502
7248 11903502 11495932 11353576 11561490 11455962 11102414 11172283 10992469 10990869 10913442 10327046
7238A0327046r4794N02757L91290k58340L26795n5804k3704M73464L5902J39459
7228A1764071m98658q9202N50710J82771k18859L71907L17983n62880q3430o29071
7218A1105342m41024k34103K26434n9887M82120l21956L50240J84715k75014l29134
7208A0687733K24370M44732j85807k38806m74278L86282k24638j00853p6833K07393
7198A0649295j58482l23632L10525m5444j2205J44706k58377r5932M70055J28341
7188A0808850l2690M9194Q6268j31300r39122O16954k29321l10762J44608J05328
7178A0168007o5185Q4406J7641J44185k16955m32236l8924N13815L76947K15585
7168A0767286l70200J66354K44527L6493L11776M6282m83683J86403j51741J17117
$$ plain form
7238 10327046 10232252 10735009 11126299 10867959 11194754 11138950 11115246 11588710 11624612 11764071
7228 11764071 11265413 11176211 11726921 11909692 11690833 12062740 12380723 11817843 11734413 11105342
7218 11105342 10664318 10430215 10656649 10596762 11078882 10756926 11107166 11291881 11016867 10687733
7208 10687733 10912103 11356835 11171028 10932222 10457944 10844226 10619588 10518735 10441902 10649295
7198 10649295 10490813 10167181 10477706 10432262 10420057 10564763 10306386 10210454 10680509 10808850
7188 10808850 10776160 10825354 10911622 10780322 9841200 10458154 10228833 9918071 10062679 10168007
7178 10168007 10102822 10187228 10204869 10349054 10132099 9699863 9660939 10174754 10551701 10767286
7168 10767286 10397086 10563440 10807967 10844460 11156236 11202518 10718835 10905238 10753497 10870614
7158A0870614K04038j22714p69570J83672N9553J77783K5143J41082L9628m42090
7148A0367139P55613k72691l60619r4062J14508L80981J85327j163822J33254
7139A0045628N76919l07865j35795j07530l44687j24238K37609M67037K30766
7130A0537844l03941j46563O28992k60560o88395K43993J48019r4429J03662L44468
7120A0513090K56311o09834k95422K25948j08278K95140n01999n80072N79475
7111I774359k4524J63296K75224n6159N0978J2967n23465k45810N50959k24619
7101I753206l42808k79095N6987Q98567n8267j88147m90760M59243K44213m42317
7091I610822n90987O87081m0881m82839K12851M8163J47685p0265m36821L91732
$$ plain form
7158 10870614 11074652 10951938 10182368 10366040 10425593 10603376 10628519 10769601 10809229 10367139
7148 10367139 11122752 10850061 10489442 10395380 10509888 10890869 11076196 9912374 10045628
7139 10045628 10622547 10314682 10178887 10071357 9726670 9602432 9840041 10307078 10537844
7130 10537844 10233903 10087340 10716332 10455772 9767377 10011370 10159389 10064960 10168622 10513090
7120 10513090 10769401 10159567 9864145 10090093 9981815 10276955 9774956 9194884 9774359
7111 9774359 9749835 9913131 10188355 10132196 10183174 10196141 9672676 9426866 9977825 9753206
7101 9753206 9410398 9131303 9188290 10086857 10028590 9840443 9349683 9808926 10053139 9610822
7091 9610822 9019835 9706916 9666035 9183196 9396047 9444210 9591895 9521630 9084809 9476541
7081I476541L08655q95284o39829O85054P88130q3093l12790K24269l59141p7172
7071I115340j4052L04298j13547l83757k06274J72167N3820M06085K5565j04473
7061I255172M20060m8787l73318n39316O9564J27626l8772K69129J16805M88769
7051I746932J74643l07737j46874k14704J03558j74435M8277l56295L83180M63522
7041I720067l61767k5293R216k89474Q9094J97314J74869M38137m6241l76244
7031I529678L1573l22357K19091k53955N17242M19894j14455m10359n02121q910
7021I105321N20403L82617l97863p791j09388R3110P0034J37898M13856m02929
7011I805268L38778m08205J08117p4797M40580j47566j52542k2519m9497m73816
$$ plain form
7081 9476541 9785196 8889912 8250083 8935137 9723267 9640174 9327384 9551653 9192512 9115340
7071 9115340 9101288 9405586 9292039 8908282 8702008 8874175 8927995 9334080 9359645 9255172
7061 9255172 9675232 9626445 9253127 8713811 8783375 8911001 8872229 9141358 9258163 9746932
7051 9746932 9921575 9613838 9466964 9252260 9355818 9181383 9229660 8873365 9256545 9720067
7041 9720067 9358300 9333007 9342223 9052749 9141843 9339157 9514026 9952163 9905922 9529678
7031 9529678 9561251 9238894 9457985 9204030 9721272 10141166 10026711 9616352 9114231 9105321
7021 9105321 9625724 10008341 9610478 9602687 9493299 9586409 9656443 9794341 10208197 9805268
7011 9805268 10144046 9735841 9843958 9769161 10209741 10062175 9909633 9887114 9837617 9363801
7001I363801J03656M05322j37362O9255m87705o50956O23532O70525K41175m0706
6991A0160537k5832L64887m1140R9279j045m46695r7226K48349K82679L88606
6981A0932399l4950n59481n29524l03184j6199N71484J53586l64182q77172J36456
6971I109233O77556l91769n4193N11885J62012m51977k18622K71529L28063j82247
6961I761470j67537M12623j17381l73962n14416L46410L47402K2015J08496K90338
6951A0115458k72961L51279n07395O1886M83159o4978J00809o18283M18225K09531
6941A0276730j72427K00840L74949K25191j47301J97089l34249J8002L05894o501
6931A0938217n54788N60846J63352K21065k84178J88623K2906q99829N50955L17783
$$ plain form
7001 9363801 9467457 9872779 9735417 9804672 9316967 8666011 9289543 9960068 10201243 10160537
6991 10160537 10134705 10499592 10458452 10557731 10556686 10109991 10012765 10261114 10543793 10932399
6981 10932399 10897449 10337968 9808444 9505260 9489061 10060545 10214131 9849949 8972777 9109233
6971 9109233 9786789 9395020 9340827 9852712 10014724 9562747 9344125 9615654 9943717 9761470
6961 9761470 9593933 10006556 9889175 9515213 9000797 9347207 9694609 9716624 9825120 10115458
6951 10115458 9842497 10193776 9686381 9748267 10231426 10166448 10267257 9648974 10067199 10276730
6941 10276730 10104303 10305143 10680092 10905283 10757982 10955071 10620822 10638824 10944718 10938217
6931 10938217 10383429 10944275 11107627 11328692 11044514 11233137 11256043 10356214 10907169 11224952
6921A1224952J60958K03028k06570K4002N86118R89m4106n0163O39527N52857
6911A3091592j14238k45961j90417J55042O1317L37643k46388K68793m44733k85219
6901A2387431p92007K9770m43753j092237J86032l35174P22667k72162j123578
6892I266989P50334J33234l28940k42316j05453K02407m29790q8241L12445K61436
6882I732105o75971L85572J9406J81590m48654k55043K18727l10715K25046k4637
6872I047426k73349R194J53930L23627l72895k68103j58761j08988j47549M05757
6862H610289L33253q6756k86674k01140k02189J77014J935k02769K46124J59678
6852H548765k06724M45160p04301k15005K91122J64727J74268o12859L08995n94638
$$ plain form
6921 11224952 11385910 11588938 11382368 11406370 11992488 11993477 11949371 11899208 12538735 13091592
6911 13091592 12977354 12731393 12540976 12696018 12757335 13094978 12848590 13117383 12672650 12387431
6901 12387431 11595424 11625194 11181441 10089204 10275236 9940062 10662729 10390567 9266989
6892 9266989 10017323 10150557 9821617 9579301 9473848 9676255 9246465 9158224 9470669 9732105
6882 9732105 9056134 9441706 9461112 9642702 9194048 8939005 9157732 8847017 9072063 9047426
6872 9047426 8774077 8783271 8937201 9260828 8887933 8619830 8461069 8352081 8204532 8610289
6862 8610289 8943542 8856786 8570112 8368972 8166783 8343797 8345732 8142963 8389087 8548765
6852 8548765 8342041 8787201 8082900 7867895 8159017 8323744 8498012 7885153 8194148 7599510
6842G599510m39458N5292L79179n2449L03613j74980M4708M90780j92026J55632
6832H169801j3155n12738m92598R8039K88828L5511K86708q1075L21387k80965
6822G819743K89067J17268j89176J61785q8209l72722l6161l13110J75499n8712
6812G505272k38444K66331Q2389k76047k82665L86439n5592k96634k8608l1575
6802G030866j07725R7677J58717J73539N4189k42742r0327O83155R9269l0254
6792G826364j8809j04619p46884K5713k69852K25712O08921o96469K31110N36750
6782G617937p715j50710K57894n96518P6274l08857l89884J76497K81240k5907
6772F930251j66132L50258J20426K1377Q5392o0537o00986l83528K0673L57608
$$ plain form
6842 7599510 7160052 7215344 7594523 7542074 7845687 7670707 7715415 8206195 8014169 8169801
6832 8169801 8156646 7643908 7151310 7249349 7538177 7573688 7860396 7779321 8100708 7819743
6822 7819743 8108810 8226078 8036902 8198687 8110478 7737756 7701595 7388485 7563984 7505272
6812 7505272 7266828 7533159 7615548 7339501 7056836 7443275 7387683 7091049 7062441 7030866
6802 7030866 6923141 7020818 7179535 7353074 7407263 7164521 7074194 7757349 7856618 7826364
6792 7826364 7807555 7702936 6956052 6981765 6711913 6937625 7546546 6850077 7081187 7617937
6782 7617937 7610222 7459512 7717406 7120888 7197162 6888305 6498421 6674918 6956158 6930251
6772 6930251 6764119 7114377 7234803 7256180 7341572 7281035 6680049 6296521 6317194 6674802
6762F674802k00834O07135L8918q6662L01454M70708J9587l02476j51203m02236
6752F969193k46690M2718n97770j97097L03336l14676j03049N9379N74578J83287
6742F673209K95405O5241n33549M42589K44558l89375p21831M88521K15631p23526
6732F056873L28181n08338m45473L91417K91530K95529K21982O6087n27147k69418
6722E901223J82250L30498l10160K58840K60106O6704k21214k18374K5314L31167
6712F606354L45744m49870o2095k18030M86050k28002p45024M17496k94365N13485
6702F371743j308n12861j36753L80730n99005o89349K04021O21618Q53881j160
6692F491557P0945o56132J89890k15190j06762N36992K25981m5733o45409O8800
$$ plain form
6762 6674802 6473968 7081103 7120021 7033359 7334813 7805521 7825108 7522632 7371429 6969193
6752 6969193 6722503 6765221 6167451 5970354 6273690 5959014 5855965 5915344 6489922 6673209
6742 6673209 6968614 7033855 6500306 6942895 7187453 6798078 6076247 6564768 6780399 6056873
6732 6056873 6385054 5876716 5431243 5822660 6114190 6409719 6631701 6697788 6170641 5901223
6722 5901223 6083473 6413971 6103811 6362651 6622757 6689461 6468247 6249873 6275187 6606354
6712 6606354 6952098 6502228 6440133 6222103 6708153 6480151 5735127 6152623 5858258 6371743
6702 6371743 6370435 5857574 5720821 6101551 5502546 4813197 5017218 5638836 6492717 6491557
6692 6491557 6562502 5906370 6096260 5881070 5774308 6311300 6537281 6491548 5846139 5914939
6682E914939J89082J5962l33384n6981k80780o25587L3576M35014j742N00963
6672E791062J72632j27513m9781k60215M28853J67095K49053l37256n9607l68991
6662E605332k2676N0040r679l05344M97723J05293K73740j69578q59135J99290
6652E365006L81276l47693L25256O18268n50053j58571J97452q4462J26038R4378
6642E966895J29382J7839l84569K70982J35345J78193k30747l73231K10267j65904
6632E754452r514J70591j65919l97054q6403J40381K57710N94977k19753p33170
6622E306298K8755M08383l83474n01270P22778J21231m27688l64521m40108M40846
6612D911230P08933n4009n84610K61670N4752j56623j11596j76325L56191K68516
$$ plain form
6682 5914939 6104021 6119983 5786599 5729618 5448838 4823251 4856827 5291841 5290099 5791062
6672 5791062 5963694 5836181 5786400 5526185 5955038 6122133 6371186 6033930 5974323 5605332
6662 5605332 5582656 5632696 5623017 5317673 5815396 5920689 6194429 6024851 5165716 5365006
6652 5365006 5746282 5398589 5723845 6342113 5792060 5633489 5830941 5746479 5872517 5966895
6642 5966895 6096277 6114116 5729547 6000529 6135874 6314067 6083320 5710089 5920356 5754452
6632 5754452 5744938 5915529 5749610 5352556 5266153 5406534 5664244 6259221 6039468 5306298
6622 5306298 5335053 5743436 5359962 4858692 5581470 5702701 5275013 4910492 4470384 4911230
6612 4911230 5620163 5566154 4981544 5243214 5297966 5141343 5029747 4853422 5209613 5478129
6602E478129L32807j68769k13508k00718K02506q0528n31262m55892O83152j12132
6592D933785p3985K46494L6388M43684O59006P5315j82387J02161p44619o51226
6582D844616L12488j92614l19837M96666L19408j00318k08597j10189m25790K33808
6572D849641j41770R5243j06997P6596K25714j57833L21482j5514l01921J49534
6562D994175q6359N1545m51850K75605M95587K36025m0577l66746m19868m45536
6552D242001K02496P87060j24502k29328L66699l46366n88551m7563M85045p9271
6542D667720k40841M08606K52230j7430l37344k86209l5628J06775J15694k11453
6532D422120j89486K45487m721K66788K56541R8584k62105n83390J77264L53002
$$ plain form
6602 5478129 5810936 5642167 5428659 5227941 5430447 5349919 4818657 4362765 5045917 4933785
6592 4933785 4859800 5106294 5142682 5586366 6245372 6320687 6138300 6240461 5495842 4844616
6582 4844616 5157104 4964490 4644653 5141319 5460727 5360409 5151812 5041623 4615833 4849641
6572 4849641 4707871 4803114 4696117 4772713 4998427 4840594 5162076 5146562 4844641 4994175
6562 4994175 4907816 4959361 4507511 4783116 5278703 5514728 5474151 5107405 4687537 4242001
6552 4242001 4444497 5231557 5107055 4877727 5244426 4898060 4309509 4261946 4746991 4667720
6542 4667720 4426879 4835485 5087715 5070285 4732941 4446732 4411104 4517879 4633573 4422120
6532 4422120 4232634 4478121 4473400 4740188 4996729 5095313 4833208 4249818 4427082 4780084
6522D780084K07970k8004k26663n43947j47236L95656L15146l05966m65748J3927
6512C995219K58703j28898K5902L26461O2634K46692J61425K62657K65394m21408
6502E054781k03494j93870K9827K06613Q1555K37885n19339N26465q8364l80867
6492D751192L28107J6529j45321n4102o1455k32008o70037L27975L13026J76435
6482D750341m24894J40780Q5783m8951L8946o69785J8014J65508J53358k7503
6472D181597J44534J94818l85687J89139L4148l16934M30599j34477m15487J41141
6462D063391K73855n07369M12217L5893p8731N79085p6397m11411K34667m52390
6452D072810k8257K15028L82712k47484j24513K53475K89456J2587l81033J98268
$$ plain form
6522 4780084 4988054 4960050 4733387 4189440 4042204 4437860 4753006 4447040 3981292 3995219
6512 3995219 4253922 4125024 4150926 4477387 4540021 4786713 4948138 5210795 5476189 5054781
6502 5054781 4851287 4657417 4687244 4893857 4975412 5213297 4693958 5220423 5132059 4751192
6492 4751192 5079299 5095828 4950507 4896405 4834950 4602942 3932905 4260880 4573906 4750341
6482 4750341 4325447 4466227 4552010 4503059 4542005 3872220 3890234 4055742 4209100 4181597
6472 4181597 4326131 4520949 4135262 4324401 4358549 4041615 4472214 4337737 3922250 4063391
6462 4063391 4337246 3829877 4242094 4277987 4199256 4778341 4701944 4290533 4525200 4072810
6452 4072810 4044553 4259581 4642293 4394809 4270296 4523771 4813227 4825814 4444781 4643049
6442D643049J07793j17119o90161M39154k67821l09395L83631j10772L61309K53085
6432D692753m68734p5868J68976M355J36679j05511p6840k74091P1533K77271
6422D350523Q2804N3090K37470r56879k43063N75459K41718l20245R64210P1735
6412E056822q02924m81380K70493J15750l82680L29868Q0739J58518L353P038
6402D355597M9699Q0764m28913J3870R4827K10243K27227k81414L08235K69436
6392D899571m4321m8798q3683J50978n53266n65847M31183K82417J13179j91785
6382D389628Q5665K16340m53997l8314q675l4003m34956K777N7999K23880K98022
6371D304366j26089J42266L8196j7564l36706o8780j4401K10187Q1256K09810
$$ plain form
6442 4643049 4750842 4633723 3943562 4382716 4114895 3805500 4189131 4078359 4439668 4692753
6432 4692753 4224019 4148151 4317127 4321482 4458161 4352650 4275810 4001719 4073252 4350523
6422 4350523 4433327 4486417 4723887 3767008 3523945 4099404 4341122 4020877 4985087 5056822
6412 5056822 4253898 3772518 4043011 4158761 3776081 4105949 4186688 4345206 4348559 4355597
6402 4355597 4405296 4486060 4057147 4071017 4165844 4376087 4603314 4321900 4630135 4899571
6392 4899571 4855250 4806452 4722769 4873747 4320481 3754634 4185817 4468234 4581413 4389628
6382 4389628 4475293 4691633 4237636 4199322 4190647 4156644 3721688 3724465 3782464 4006344 4304366
6371 4304366 4178277 4320543 4358739 4341175 4004469 3935689 3921288 4131475 4212731 4422541
6361D422541p91946M0181L79065L5158J39957K32861l41249K36381j25992m79461
6351C747496R6114J22808O26885o00770l55605J80380l2125j95456P45178M0741
6341D375646l73365J67414O8558m78219J78630K90081k66360P0811m79542M9998
6331C603652K31813j2355J1735n22796M69267l26222m5853o5728K2919M62054
6321C828486j11108J74602k34490n2127Q9399r4919K04768J67484l4370m15646
6311C522079M65127Q0249j85460l01056K05561N45074l96243K21838L85203J41319
6301D683691m77967p53065J30494O30651k0486n42886O54334k71561j73117k34272
6291C625816L52292k0306J9436M5677n9233p2042j11004L62963q2200j00110j13949
$$ plain form
6361 4422541 3630595 3670776 4049841 4084999 4224956 4457817 4116568 4352949 4226957 3747496
6351 3747496 3843610 3966418 4593303 3992533 3636928 3817308 3785183 3589727 4334905 4375646
6341 4375646 4002281 4169695 4238253 3760034 3938664 4228745 3962385 4033196 3553654 3603652
6331 3603652 3835465 3823110 3834845 3312049 3781316 3455094 3409241 3343513 3366432 3828486
6321 3828486 3717378 3891980 3657490 3605363 3694762 3599843 3804611 3972095 3937725 3522079
6311 3522079 3987206 4067455 3881995 3580939 3786500 4331574 3935331 4157169 4542372 4683691
6301 4683691 4205724 3452659 3583153 4213804 4193318 3650432 4304766 4033205 3860088 3625816
6291 3625816 3978108 3957802 3977238 4022915 3963682 3891640 3780636 4143599 4061399 3961289 3847340
6280C847340J30427k09013n70430m0071L21214k6216J64143l809r8619M23766
6270C938732r5674k87940j17040L0673L51649O0327P3911m01011k64234P08398
6260C997791l72287k76926M46464K63442l43114R3790k30067n36436l0085r8137
6250B914435J86766L36037K84634k25515k29139l76451J07571K5557L94814N2493
6240C471202R8186j4417m5073k54080N08369L07019o0064l19414K90662p0462
6230C911928L55301j85154m05401P2442l52207j74360K04084q6894K63863l46227
6220C257375n15282L66700P07197k93981K8787r4210o701L53052j93425M15148
6210D024660j12621l6327p55315k64861j94920O9162K40130m7925J62771O31686
$$ plain form
6280 3847340 3977767 3768754 3198324 3158253 3479467 3453251 3617394 3613585 3514966 3938732
6270 3938732 3843058 3555118 3438078 3468751 3820400 3880727 3954638 3553627 3289393 3997791
6260 3997791 3625504 3348578 3795042 4058484 3715370 3809160 3579093 3042657 3012572 2914435
6250 2914435 3101201 3437238 3721872 3496357 3267218 2890767 2998338 3023895 3418709 3471202
6240 3471202 3569388 3554971 3509898 3255818 3764187 4071206 4011142 3691728 3982390 3911928
6230 3911928 4267229 4082075 3676674 3749116 3396909 3222549 3426633 3339739 3603602 3257375
6220 3257375 2742093 3108793 3815990 3522009 3550796 3456586 3449885 3802937 3609512 4024660
6210 4024660 3912039 3875712 3120397 2855536 2660616 2729778 2969908 2921983 3084754 3716440
6200C716440l38347m07022j25439J69958L62252n01270K87711k09893l26290M67752
6190C095852N21248J87926j88792j0488l93485k03511L72934P8869K00676o1469
6180C599760k50605m98856K87589M1127k04029K75682J18679L57577j25268j72529
6170C429127o49432j14724N97955l23994j36318k64861K25311N11879K69131P40481
6160D284555m61417l33411l9849N6395K95537J9299m21676J91985o2399m48500
6150C080519L50998L22175J85827j0039m97458k17838m88098K65491O24403J89161
6140C805141o9466l98985N9234K62566l0696m92110M30084k15071k81077l81019
6130B688601j34406K86293J19592K08026J77138K95429k43550o6084j68466k95650
$$ plain form
6200 3716440 3378093 2971071 2845632 3015590 3377842 2876572 3164283 2954390 2628100 3095852
6190 3095852 3617100 3805026 3616234 3605746 3212261 3008750 3381684 3460553 3661229 3599760
6180 3599760 3349155 2850299 3137888 3179015 2974986 3250668 3369347 3726924 3601656 3429127
6170 3429127 2779695 2664971 3262926 2938932 2802614 2537753 2763064 3274943 3544074 4284555
6160 4284555 3823138 3489727 3449878 3506273 3801810 3821109 3399433 3591418 3529019 3080519
6150 3080519 3431517 3753692 3939519 3929480 3432022 3214184 2726086 2991577 3615980 3805141
6140 3805141 3735675 3336690 3395924 3658490 3627794 3135684 3565768 3350697 3069620 2688601
6130 2688601 2554195 2840488 2960080 3168106 3345244 3640673 3397123 3331039 3162573 2866923
6120B866923L34708j78452K75445K97510l12630l47751q4998l69003J20663L39112
6110B941527L28636K7215j40442k03362N2416L56125L6651m6526q21025L08071
6100B839286O10767m2841k287j78616j17813j23247J3170N8435n6579K43415k23244
6089C020446L31509j8373k71878o5404j63443M85053p1321o15131J257n7119M18436
6078B994032J28903L36561J61236r2198k03190n256l6765J17883M68783R927o89096
$$ plain form
6120 2866923 3201631 3023179 3298624 3596134 3283504 2935753 2850755 2481752 2602415 2941527
6110 2941527 3270163 3297378 3156936 2953574 3005990 3362115 3398766 3352240 2531215 2839286
6100 2839286 3450053 3407212 3404925 3226309 3108496 2985249 2998419 3056854 3000275 3243690 3020446
6089 3020446 3351955 3333582 3061704 2996300 2832857 3317910 3246589 2631458 2632715 2575596 2994032
6078 2994032 3122935 3459496 3620732 3528534 3325344 3320088 3283323 3401206 3869989 3879916 3190820
$$ [...]
##END NTUPLES=NMR SPECTRUM
##END=
