##TITLE=1H_CG-1155-0
 DMSO,8 sc, 
 30.9.2021
##JCAMPDX= 6.0         $$ Bruker NMR JCAMP-DX V2.0
##DATA TYPE= NMR SPECTRUM
##DATA CLASS= NTUPLES
##ORIGIN= UXNMR, Bruker Analytische Messtechnik GmbH
##OWNER= root
$$ XWIN-NMR		Version 3.5
$$ Thu Sep 30 12:46:08 2021 Russian Standard Time (UT+4h)  she@DPX200
##.OBSERVE FREQUENCY= 200.1313468511
##.OBSERVE NUCLEUS= ^1H
##.ACQUISITION MODE= SIMULTANEOUS
##.ACQUISITION SCHEME= undefined
##.AVERAGES= 8
##.DIGITISER RES= 18
##SPECTROMETER/DATA SYSTEM= spect
##.PULSE SEQUENCE= zg30
##.SOLVENT NAME= DMSO
##.SHIFT REFERENCE= (INTERNAL, DMSO, 0, 15.7304)
##AUDIT TRAIL= $$ (NUMBER, WHEN, WHO, WHERE, WHAT)
$$ ##TITLE= Audit trail, XWIN-NMR		Version 3.5
$$ ##JCAMPDX= 5.01
$$ ##ORIGIN= Bruker BioSpin GmbH
$$ ##OWNER= she
$$ F:/spectra/data/she/nmr/H-F/1/pdata/1/auditp.txt
$$ ##AUDIT TRAIL=  $$ (NUMBER, WHEN, WHO, WHERE, WHAT)
(   1,<2021-09-30 12:43:48.18 +0400>,<she>,<DPX200>,
      <created by zg, POWCHK disabled, PULCHK disabled
       configuration hash MD5:
       00 E9 B6 7A A2 85 ED C7 34 08 36 98 17 FE 4E 26
       data hash MD5: 16K
       CE 42 84 04 E9 03 1A 6A 7E 60 E6 F3 3E 2D 3A 1F>)
(   2,<2021-09-30 12:43:51.93 +0400>,<she>,<DPX200>,
      <Start of raw data processing
       efp BC_mod = 2 LB = 0.24 FT_mod = 6 PKNL = 1 PHC0 = -14794.52 PHC1 = 14.40082 SI = 16K 
       data hash MD5: 16K
       DB 95 79 06 45 3F 9D 82 71 03 6D F4 77 85 46 05>)
(   3,<2021-09-30 12:44:17.15 +0400>,<she>,<DPX200>,
      <pk PHC0 = -0.8351179 PHC1 = -6.4 
       data hash MD5: 16K
       91 AC 47 50 F7 96 4F 0F 4E 98 26 E6 E9 0A 5A AA>)
(   4,<2021-09-30 12:44:20.78 +0400>,<she>,<DPX200>,
      <abs ABSG = 5 
       data hash MD5: 16K
       6F E7 67 CE 30 C5 37 29 3E 9C CE F7 03 E5 65 60>)
$$ ##END=
$$ 
$$ hash MD5
$$ 70 A4 B7 FF AC 9C 23 C0 88 1F FE 3C EB CC DB 50
##$RELAX= 
##$RELAX= 
##$RELAX= 
##$RELAX= 
##$RELAX= 
##$RELAX= 
$$ Bruker specific parameters
$$ --------------------------
##$DU= <F:/spectra>
##$EXPNO= 1
##$NAME= <H-F>
##$PROCNO= 1
##$TYPE= <nmr>
##$USER= <she>
##$AMP= (0..31)
100 100 100 100 100 100 100 100 100 100 100 100 100 100 100 100 100 100 
100 100 100 100 100 100 100 100 100 100 100 100 100 100 
##$AQSEQ= 0
##$AQ_mod= 1
##$AUNM= <au_zg>
##$AUTOPOS= <>
##$BF1= 200.13
##$BF2= 200.13
##$BF3= 200.13
##$BF4= 200.13
##$BF5= 200.13
##$BF6= 200.13
##$BF7= 200.13
##$BF8= 200.13
##$BYTORDA= 1
##$CFDGTYP= 0
##$CFRGTYP= 5
##$CHEMSTR= <none>
##$CNST= (0..31)
1 1 145 1 1 1 1 1 1 1 1 1 1 1 1 1 1 1 1 1 1 1 1 1 1 1 1 1 1 1 1 1 
##$CPDPRG= <>
##$CPDPRG1= <>
##$CPDPRG2= <>
##$CPDPRG3= <>
##$CPDPRG4= <mlev>
##$CPDPRG5= <mlev>
##$CPDPRG6= <mlev>
##$CPDPRG7= <mlev>
##$CPDPRG8= <mlev>
##$CPDPRGB= <>
##$CPDPRGT= <>
##$D= (0..31)
0 1.2 0 0 0 0 0 0 0 0.06 0 0.03 0 0 0 0 0.0002 0 0 0 0 0 0 0 0 0 0 0 0 
0 0 0 
##$DATE= 1632991427
##$DBL= (0..7)
120 120 120 120 120 120 120 120 
##$DBP= (0..7)
150 150 150 150 150 150 150 150 
##$DBP07= 0
##$DBPNAM0= <>
##$DBPNAM1= <>
##$DBPNAM2= <>
##$DBPNAM3= <>
##$DBPNAM4= <>
$$ [...]
##$SUBNAM2= <"">
##$SUBNAM3= <"">
##$SUBNAM4= <"">
##$SUBNAM5= <"">
##$SUBNAM6= <"">
##$SUBNAM7= <"">
##$SUBNAM8= <"">
##$SUBNAM9= <"">
##$SW= 18.0517286264689
##$SWIBOX= (0..15)
0 0 2 0 0 0 0 0 0 0 0 0 0 0 0 0 
##$SW_h= 3612.71676300578
##$TD= 16384
##$TD0= 1
##$TE= 0
##$TE2= 300
##$TE3= 300
##$TEG= 300
##$TL= (0..7)
0 120 120 120 120 120 120 120 
##$TP= (0..7)
150 150 150 150 150 150 150 150 
##$TP07= 0
##$TPNAME0= <>
##$TPNAME1= <>
##$TPNAME2= <>
##$TPNAME3= <>
##$TPNAME4= <>
##$TPNAME5= <>
##$TPNAME6= <>
##$TPNAME7= <>
##$TPOAL= (0..7)
0.5 0.5 0.5 0.5 0.5 0.5 0.5 0.5 
##$TPOFFS= (0..7)
0 0 0 0 0 0 0 0 
##$TUNHIN= 0
##$TUNHOUT= 0
##$TUNXOUT= 0
##$USERA1= <user>
##$USERA2= <user>
##$USERA3= <user>
##$USERA4= <user>
##$USERA5= <user>
##$V9= 5
##$VALIST= <valist>
##$VCLIST= <CCCCCCCCCCCCCCC>
##$VD= 0
##$VDLIST= <DDDDDDDDDDDDDDD>
##$VPLIST= <PPPPPPPPPPPPPPP>
##$VTLIST= <TTTTTTTTTTTTTTT>
##$WBST= 1024
##$WBSW= 4
##$XGAIN= (0..3)
0 0 0 0 
##$XL= 0
##$YL= 0
##$YMAX_a= 164601
##$YMIN_a= -126192
##$ZGOPTNS= <>
##$ZL1= 120
##$ZL2= 120
##$ZL3= 120
##$ZL4= 120
##$ABSF1= 15.73037
##$ABSF2= -2.32148
##$ABSG= 5
##$ABSL= 3
##$ALPHA= 0
##$AQORDER= 0
##$ASSFAC= 0
##$ASSFACI= 0
##$ASSFACX= 0
##$ASSWID= 0
##$AUNMP= <proc_1d>
##$AZFE= 0.1
##$AZFW= 0.1
##$BCFW= 0
##$BC_mod= 2
##$BYTORDP= 0
##$COROFFS= 0
##$CY= -3
##$DATMOD= 1
##$DC= 0
##$DFILT= <>
##$DTYPP= 0
##$F1P= 0
##$F2P= 0
##$FCOR= 1
##$FTSIZE= 16384
##$FT_mod= 6
##$GAMMA= 0
##$GB= 0
##$INTBC= 1
##$INTSCL= 0
##$ISEN= 128
##$LB= 0.24
##$LEV0= 0
##$LPBIN= 0
##$MAXI= 10000
##$MC2= 0
##$MEAN= 0
##$ME_mod= 0
##$MI= 1.114404
##$NCOEF= 0
##$NC_proc= -8
##$NLEV= 6
##$NOISF1= 3.799351
##$NOISF2= 2.8
##$NSP= 0
##$NTH_PI= 0
##$NZP= 0
##$OFFSET= 15.73037
##$PC= 1
##$PHC0= -14795.35
##$PHC1= 8.00082
##$PH_mod= 1
##$PKNL= yes
##$PPARMOD= 0
##$PSCAL= 0
##$PSIGN= 0
##$REVERSE= no
##$SF= 200.130005091136
##$SI= 16384
##$SIGF1= 3
##$SIGF2= 2
##$SINO= 5.538805
##$SIOLD= 16384
##$SREGLST= <1H.CDCl3>
##$SSB= 0
##$STSI= 16384
##$STSR= 0
##$SW_p= 3612.71676300578
##$SYMM= 0
##$S_DEV= 0
##$TDeff= 16384
##$TDoff= 0
##$TI= <>
##$TILT= no
##$TM1= 0
##$TM2= 0
##$TOPLEV= 0
##$USERP1= <user>
##$USERP2= <user>
##$USERP3= <user>
##$USERP4= <user>
##$USERP5= <user>
##$WDW= 1
##$XDIM= 16384
##$YMAX_p= 413653408
##$YMIN_p= -1307399
$$ End of Bruker specific parameters
$$ ---------------------------------
##NTUPLES= NMR SPECTRUM
##VAR_NAME=  FREQUENCY,     SPECTRUM/REAL,   SPECTRUM/IMAG
##SYMBOL=    X,             R,               I
##VAR_TYPE=  INDEPENDENT,   DEPENDENT,       DEPENDENT
##VAR_FORM=  AFFN,          ASDF,            ASDF
##VAR_DIM=   16384,         16384,           16384
##UNITS=     HZ,            ARBITRARY UNITS, ARBITRARY UNITS
##FACTOR=    0.220516191357247, 1,           1
##FIRST=     3148.11894170349, 0,            0
##LAST=      -464.597821302287, 0,           0
##MIN=       -464.597821302287, -1307399,    0
##MAX=       3148.11894170349, 413653408,    0
$$ Real data points
##PAGE= N=1
##DATA TABLE= (X++(R..R)), XYDATA
$$ [...]
8272A493516k23576M113j68404j50204o9959L42838L8922K82318J12175j33424
8262A528315K3759j57163q3898J6215l01213J80545L2058L11281J45589J2107
8252A707595j63057P2496l57007J52908l56106l28731J85465J54365M76889k71163
8242A273654k99861K11543L08491j3025j94257L5981J06511j43825l48457M84671
8232A421426L62669m97886M0341L3094k55863N0765N25115n02472J652K10537
8222A389378j26599q9444j39034l32714M0420P4488k05225J42564K58690j81028
8212H31496k73080n2000K81043j11920K13567L87135j14179l40402L3372N71905
8202A426937n24151p90055N52465K48119m05038O1666K77299l87550o86036q43257
$$ plain form
8272 1493516 1269940 1274053 1105649 955445 885486 1228324 1267246 1549564 1661739 1528315
8262 1528315 1552074 1394911 1311013 1327228 1026015 1206560 1238618 1549899 1695488 1707595
8252 1707595 1544538 1617034 1260027 1412935 1056829 728098 913563 1067928 1544817 1273654
8242 1273654 973793 1185336 1493827 1480802 1286545 1322526 1429037 1285212 936755 1421426
8232 1421426 1784095 1286209 1326550 1359644 1103781 1154546 1679661 1177189 1178841 1389378
8222 1389378 1262779 1173335 1034301 701587 742007 816495 611270 753834 1012524 831496
8212 831496 558416 506416 787459 675539 889106 1276241 1162062 821660 855032 1426937
8202 1426937 902786 112731 665196 913315 508277 569943 847242 459692 -226344 -1069601
8192a069601K074631J583024j406715R1580o349l91367Q5103j73862J08793M5973
8182I41210o29100K32170N936m7981L30179K15957K2725j5322m33463L5189j90393
8171D67107m78349j57488J34590Q1447M31836m0043j98840J55632J48026q4044
8161D59874k97440K09453J50867j51676J56939N2061N4735j11528m6532J06183
8151E82936m94882m28290N07207K91302j33415p3073J72285j45368k40460J07607
8141A45849j88214K69569k18924k77023J41129J11149l1132l20946K06500K45354
8131H3311l22946J0153K57128K73161j22793j09121M05083Q8544j18297k02289
8121B41934L8135o9277q7527O8554p6043q9333P6823K86490j32705j34803m32141
$$ plain form
8192 -1069601 1005030 2588054 1181339 1272919 1266570 875203 960306 786444 895237 941210
8182 941210 312110 544280 550216 502235 832414 1048371 1071096 1055774 622311 657500 467107
8171 467107 -11242 -168730 -34140 47307 479143 439100 240260 395892 543918 459874
8161 459874 162434 371887 522754 371078 528017 580078 634813 523285 476753 582936
8151 582936 88054 -340236 166971 458273 324858 251785 424070 278702 38242 145849
8141 145849 -42365 227204 8280 -268743 -127614 -16465 -47597 -368543 -162043 83311
8131 83311 -239635 -229482 27646 300807 178014 68893 473976 562520 444223 241934
8121 241934 280069 210792 123265 191819 115776 26443 103266 389756 257051 122248 -309893
8110c09893J50065J20857k9219N1852K11702n5581O1665j09998k37581p412j46413
8099b99956M5461J35926L85500P6004l22423l21984J00577K88771K97145Q3780
8089D68801m56354k71522j67119M58613P5407m60674Q4646K70007M66610k24013
8079B44402o7918L21471k05525k31412Q3774L98480k27670n76055l6616L54521
8069E7452q5127J32973j68242m0107j8857j2938o9041P1323M63517J77450j36331
8058C72072K1763P3858K4920k63337k05201J41821k59548L95951J24432K9152
8048D55883L58120k88458n35321j16882l6739j95188K35659K45580l5561j91865
8038a04772k4065r8277J35874j52000J06487M10351l52070q263K45355K60960
$$ plain form
8110 -309893 -159828 -38971 -68190 -16338 195364 139783 201448 91450 -146131 -153543 -299956
8099 -299956 -254495 -118569 266931 342935 20512 -301472 -200895 87876 385021 468801
8089 468801 12447 -259075 -426194 32419 107826 -352848 -268202 1805 468415 244402
8079 244402 176484 497955 292430 61018 144792 543272 315602 -260453 -297069 57452
8069 57452 -27675 105298 -62944 -103051 -121908 -134846 -203887 -132564 330953 508403 372072
8058 372072 393835 467693 492613 229276 24075 165896 -93652 302299 426731 455883
8048 455883 814003 525545 -9776 -126658 -163397 -358585 -122926 122654 87093 -104772
8038 -104772 -128837 -227114 -91240 -243240 -136753 273598 -78472 -86735 158620 419580
8028D19580O2295l00150j27431Q3909k50030K19926J7721J1418j81932M1825L88156
8017C85287p6889j69579J69805j4821J21885j46838m48904J2283r3803K77105
8007A5531j54410k38033M312P0374K60994k69652M60513j64476k43302K72358
7997A4209K48168j178J10831m47564n4586j9522p7180L58421o6665O6494o02923
7986d71495o2397K93854M58355m9586j24267J10574N5492k26021k08183j360k11940
7975d36974k94898L20812J15711J10087J47967L3394K96039n28804r563j60236
7965d06465J47418R9360J75067J06005j6759j24440Q7538r1354m14076M53291
7955A5585K57549j42185K4907N5197L7138j04772j79045R605m73j49237n8765
$$ plain form
8028 419580 481875 181725 54294 138203 -111827 108099 125820 137238 -44694 -2869 385287
8017 385287 308398 138819 308624 293803 415688 268850 -180054 -167771 -261574 15531
8007 15531 -138879 -376912 -372600 -302226 -41232 -310884 149629 -14847 -258149 14209
7997 14209 262377 261199 372030 -75534 -130120 -149642 -226822 131599 64934 131428 -471495
7986 -471495 -533892 -240038 218317 168731 44464 155038 210530 -15491 -223674 -225034 -436974
7975 -436974 -731872 -411060 -295349 -185262 -37295 -3901 292138 -236666 -246229 -406465
7965 -406465 -259047 -159687 15380 121385 104626 -19814 67724 -23630 -437706 15585
7955 15585 273134 130949 155856 211053 248191 143419 -35626 -26021 -26494 -175731 -234496
7944b34496j25676M193l27436J38126N88975J71058j40641k10966J52862M17072
7934D33071K40164l28520k42118J11639k1427n23728N2314K55937N2236r3019
7924f3451j56322k54849J96988K29691r921j69496k08556L61302K54692K98215
7914D78293o1958o74034Q6512J25313M49636r5552k57553q4350j54883J73133
7904a5443M85370k38152k69413J97109J13934m53094J03732j81749K281J65828
7894h9597R3578j15734O4790p4747M97110j069k11160J1165k81546q6786j81380
7883c75376o8358K75303O59045o4304K83020l36024l47254n1663M01197j09298
7873B66288m43646l81019N42910L84305k01433J58453J62998l72214N7626N0512
$$ plain form
7944 -234496 -360172 -355979 -683415 -545289 43686 214744 74103 -136863 15999 433071
7934 433071 673235 344715 102597 214236 192809 -330919 -278605 -22668 29568 -63451
7924 -63451 -219773 -474622 -277634 -47943 -57864 -227360 -435916 -74614 180078 478293
7914 478293 416335 -257699 -171187 -45874 403762 308210 50657 -33693 -188576 -15443
7904 -15443 469927 231775 -37638 159471 273405 -179689 -75957 -257706 -255425 -89597
7894 -89597 3981 -111753 -46963 -121710 375400 374331 163171 174336 -107210 -193996 -375376
7883 -375376 -443734 -168431 490614 426310 709330 373306 26052 -25611 375586 266288
7873 266288 -177358 -558377 -15467 368838 167405 325858 488856 116642 174268 224780
7863B24780K13617l87375m44717O75345l28121k68769L46693p159J29291m23814
7853b70229J47672L34900k77839k79890J44827K22802m60707k0761M37528K8006
7843F309M7151N8185m14704J64431m7928k05292M45578N0952l41252p9628J70862
7832a45336N5758O29340l0747n32444o5880J25933K04228K11160j7289j08482
7822C26241q9085k79161l06364j5603m2936M81598q3276m67713L7223O6281M82
7811c72313L34744J99204k01889j85961M6249J49139j4370L56865L1992k81740
7801F1920k50676M11961k58062L5493K52064J50571j535k44434r6468J85995j59732
7790H7097l89095K75661k55798M091K19429k51397L45044j87951K2599q9369J03884
$$ plain form
7863 224780 438397 51022 -393695 281650 -46471 -315240 31453 24294 153585 -270229
7853 -270229 -122557 212343 -65496 -345386 -200559 22243 -438464 -459225 -21697 6309
7843 6309 53460 111645 -303059 -138628 -186556 -391848 53730 104682 -236570 -316198 -145336
7832 -145336 -89578 539762 509015 -23429 -89309 36624 240852 452012 434723 326241
7822 326241 237156 -42005 -348369 -363972 -406908 74690 -8586 -476299 -439076 -372795 -372313
7811 -372313 -37569 161635 -40254 -226215 -179966 -30827 -45197 311668 343660 61920
7801 61920 -188756 223205 -34857 636 252700 403271 401736 157302 60834 246829 87097
7790 87097 -301998 -26337 -282135 -278044 -58615 -310012 35032 -152919 -130320 -219689 -115805
7779a15805r8085K12040O4300j92209k69988L54924J27115j26279l80144k64267
7769f88398J85903M65872J27018K4957k80629m90838M64506L57795J05648m86951
7759b15117N545M2855m328l21166L07801K3407l47647l00295M59140L94424j37977
7748i3358j25057j3947j21357M19128p3492j18706J1117m6783m35313M41317J69843
7737A3392m44253L5622J52053p2651P4610q2302l58028L45450M5960j38989Q840
7726d20296J89017J0412M58929k18888k53666J68M2728j20675K9469K07305l12385
7715c87882P2093M5029K85618k56300L72166j30121k21688N28647j46234K19032
7705C80360k03017m43179J39989L28808m85482J90600K3752O9664J71050J2236
$$ plain form
7779 -115805 -213890 -1850 62450 -129759 -399747 -44823 82292 -43987 -424131 -688398
7769 -688398 -502495 -36623 90395 115352 -165277 -656115 -191609 166186 271834 -215117
7759 -215117 -209572 -166717 -171045 -492211 -184410 -161003 -508650 -808945 -349805 44619 -93358
7748 -93358 -218415 -232362 -353719 65409 -8083 -126789 -115672 -162455 -597768 -156451 13392
7737 13392 -430861 -395239 -243186 -315837 -241227 -323529 -681557 -336107 -290147 -429136 -420296
7726 -420296 -231279 -220867 238062 19174 -234492 -234324 -191596 -312271 -282802 -75497 -387882
7715 -387882 -315789 -270760 14858 -241442 130724 603 -221085 307562 161328 380360
7705 380360 177343 -265836 -125847 202961 -282521 -91921 -68169 1495 172545 184781
7695A84781l31564l42101M18709J83853k17813J8626K72089o4265m7056j0250
7685F5009R1098n53173L1511M29406K90904j44499k17412k5357k2719K7483L4976
7674G227J2690R1409m43260p0516J36915Q3197Q0243j08701K91628j2652M9048
7663A17228k55528p6512K54912L25459o7775k49436n9121m2728k46793J6633R6401
7652a87260J85301k16024n17156L22810M19872M6695K00116j99851M35292j89860
7642B99935l13721J51977J58123m28315j0559J69167L01226j34440L1438K81894
7632E06725l45252j41608r832N45419m98811K6447J50727j20117K46337o1883
7622B98152j31096k34875K91326k47688j5278j3025P1775J2621J9178L5516k84060
$$ plain form
7695 184781 -146783 -488884 -70175 113678 -104135 -85509 186580 122315 75259 65009
7685 65009 156107 -397066 -365555 63851 354755 210256 -7156 -32513 -55232 -27749 7227
7674 7227 19917 111326 -331934 -402450 -265535 -182338 -102095 -210796 80832 68180 117228
7663 117228 -138300 -214812 40100 365559 297784 48348 -10773 -53501 -300294 -283661 -187260
7652 -187260 -1959 -217983 -735139 -412329 7543 54238 254354 54503 489795 299935
7642 299935 -13786 138191 296314 -132001 -142560 26607 327833 193393 224831 506725
7632 506725 161473 19865 10033 555452 56641 83088 233815 113698 360035 298152
7622 298152 167056 -67819 223507 -24181 -39459 -52484 19291 31912 51090 86606 -197454
7611a97454K71910k82135J37187M03030m77693j58007l0636l6588N42007P7878
7601B49499K9076n2590k41229k51478J85945j48064r080K84697j01711j32478
7591a87413o5469j2378K53852k1527j70792K44101K94646R3298l23435j15156
7581a0273L40088m15500j88691l6741k64250m1724N61528M2939l08705L73366
7571E2037M8483r1881K01966P5943m91523J12314j047j11488k1799K04062L23369
7560C00436o6011k14980k23724K12821M889l56056J44449J94288L362K31122j02859
7549A27737k88150J1931q565K46596j37158K31510J28428k55132k56917m56904
7539f56624K36511j43036K43419J68572O21205k64484j67601j39170L59636q5442
$$ plain form
7611 -197454 74456 -207679 -70492 332538 -145155 -303162 -333798 -370386 171621 249499
7601 249499 278575 225985 -15244 -266722 -80777 -228841 -237921 46776 -54935 -187413
7591 -187413 -252882 -265260 -11408 -32935 -203727 40374 335020 428318 104883 -10273
7581 -10273 329815 -85685 -274376 -311117 -575367 -617091 -55563 -12624 -321329 52037
7571 52037 100520 8639 210605 286548 -204975 -92661 -93708 -205196 -226995 -22933 300436
7560 300436 234425 19445 -204279 8542 13431 -342625 -198176 -3888 -526 230596 127737
7549 127737 -160413 -148482 -157047 89549 -47609 183901 312329 57197 -199720 -656624
7539 -656624 -420113 -563149 -319730 -151158 470047 205563 37962 -101208 258428 172986
7529A72986O1140k01454K7965R6300q8065J69943k51192m4781P4889K92406k22946
7518H7191P1104k87638N032R8588M8350K61700j32763k26736J18117J76478j10498
7507A08925l38425R2453r2010J78775M26181m00546k82345k2215k89854O2712
7497e56349K50686K31661j30259l1570J31295M44294J29008m13874k75393J43016
7487g7485r2998J26674J15015J84000j01524k6156k7003L3376k1968n60126o4774
7476e12969Q24654k14983k06019m4567j03148J07537O0008J29090J70201k53742
7466d3938K5342j6352l565Q0942k9958k82774j85713q9020K66660L50354j60770
7455h8792Q6263O2547K16949o0502l77543L2291R5000j2952m44518j53069n9435
$$ plain form
7529 172986 234126 32672 60637 156937 68872 238815 -12377 -57158 17731 310137 87191
7518 87191 158295 -129343 -124311 -25723 22627 284327 151564 -75172 42945 219423 108925
7507 108925 -229500 -137047 -229057 -50282 375899 -24647 -306992 -329207 -619061 -556349
7497 -556349 -305663 -74002 -204261 -235831 -104536 339758 468766 54892 -220501 -77485
7487 -77485 -170483 -43809 71206 255206 153682 127526 100523 133899 111931 -448195 -512969
7476 -512969 311685 96702 -109317 -153884 -257032 -149495 -89487 39603 209804 -43938
7466 -43938 -18596 -34948 -38513 42429 12471 -270303 -456016 -545036 -278376 71978 -88792
7455 -88792 -2529 60018 276967 216465 -161078 -128787 -33787 -46739 -491257 -644326 -703761
7444g03761M21007K40177j39387J56643j15264P2923k08415j0423p4498L48125
7434a2873K72351l77300j00221K73464o0613J680j05867J7808j97066P5558m88896
7423g01975K43497L60025J16866N07612k8780m72928j45335l33735l12192K10873
7413e56072L26708j62609k55584N9769M3559Q6971J98705l9857j33307J82114
7403b49603J52436k12077M7121j6912n6802l9375J8741k27209K40877J83449j20134
7392b79488j52029j15538L41840J4607L88082j38887n7420m1458k32128k6334
7382b98753j80892J4319Q4031N08905L3565J11277j96796m32920l6446L76002
7372a7708j23937j29066M09707l5152j58959L2469j39435k32875J23271K06834
$$ plain form
7444 -703761 -282754 -42577 -181964 -25321 -140585 -67662 -276077 -286500 -360998 -12873
7434 -12873 259478 -117822 -218043 55421 -5192 -3512 -109379 -91571 -288637 -213079 -701975
7423 -701975 -458478 -98453 18413 526025 497245 24317 -121018 -454753 -766945 -556072
7413 -556072 -229364 -391973 -647557 -587788 -544229 -457258 -258553 -298410 -431717 -249603
7403 -249603 -97167 -309244 -262123 -279035 -335837 -375212 -356471 -583680 -342803 -159354 -279488
7392 -279488 -431517 -547055 -205215 -190608 197474 58587 1167 -40291 -272419 -298753
7382 -298753 -479645 -465326 -381295 127610 161175 272452 75656 -357264 -393710 -17708
7372 -17708 -141645 -270711 138996 103844 -55115 -22646 -162081 -394956 -271685 -64851
7362f4851J00131J05490k05407k0230K37660k42465o6907J42321K58423l46155
7352a01990k509L66278j13125m9219L38789m76594m46428l2436L54347l4789J31775
7341f5901m899r8216j16789J15146J12633l6601j64173M01658q229K9983k91653
7330a27041J76494n8153K7142j7257j02918K25719k46653J38756p7918J17424
7320E5595k08915J76059P583k44021L59890R6332o5230j30325o0642j44563l27443
7309d85680M38416J54662j50683L8611K3213O8469k85753q2863J06280l41327
7299e16655j52190L73419J56396K2819k67877j15934L05119J90469M0490n11154
7289d75098M46218p7778K4842l15480J97250l82226j12441N15517k3957L43003
$$ plain form
7362 -64851 35280 140770 -64637 -84867 152793 -89672 -156579 -14258 244165 -101990
7352 -101990 -104499 261779 148654 99435 438224 -38370 -484798 -517234 -162887 -197676 -65901
7341 -65901 -70800 -169016 -285805 -170659 -58026 -94627 -258800 142858 134629 164612 -127041
7330 -127041 49453 -8700 18442 1185 -101733 123986 -122667 16089 -61829 55595
7320 55595 -153320 22739 30322 -213699 146191 242523 177293 46968 -13674 -158237 -485680
7309 -485680 -47264 107398 -43285 -4674 18539 87008 -198745 -281608 -175328 -516655
7299 -516655 -668845 -295426 -139030 -116211 -384088 -500022 -194903 -4434 36056 -475098
7289 -475098 -28880 -106658 -81816 -397296 -200046 -582272 -694713 -179196 -203153 139850
7279A39850o1497K02813r7199k16288m3839K17046j62170k88221q0867j28192
7269e18564J05190J06970N52513q7835n06938J18010R6782O8595L73964l46729
7259c8042M67049j54824q6907O8226l08474J60583k0599q8813J85899j93565j08189
7248a17656L4863m4668K13484j80978J2850J57153k77665k8082J88647N399r2857
7237a29510J76622r8537j55549M70607j32577N1124j38919m11255L11850j54408
7227b10552j96144J8374j67838K82193j75141J22182k03818K7039K14779P69128
7217D80202j80659m95669K61970m2612k1544O8933q2208k24060J1420k32612K54612
7206b02227L06534k21908l6307j50310k9213J58445M1960l24122L21597j82798
$$ plain form
7279 139850 78353 281166 183967 -32321 -76160 140886 -21284 -309505 -390372 -518564
7269 -518564 -413374 -306404 246109 158274 -348664 -230654 -133872 -65277 308687 -38042
7259 -38042 429007 274183 187276 255502 -52972 107611 87012 -1801 184098 -9467 -117656
7248 -117656 -82793 -127461 86023 -94955 -82105 75048 -202617 -230699 -42052 -36653 -129510
7237 -129510 47112 -51425 -206974 263633 131056 182180 43261 -367994 -56144 -210552
7227 -210552 -406696 -388322 -556160 -273967 -449108 -326926 -530744 -503705 -288926 480202
7217 480202 299543 -196126 65844 23232 1688 70621 -11587 -235647 -224227 -456839 -202227
7206 -202227 104307 -117601 -153908 -304218 -333431 -174986 -133026 -457148 -135551 -318349
7196c18349r4250K29606K54894l20535j01080k0524J32073L98731J33048r9830
7186A93784K0473o4144p0033J62309l72950K19130K76999r4548l46671K20147
7176A44496J74499p38954J68931J68174k59003K38054Q1875k36725J70735J00885
7166A2967j89799j77401K96544K48294k44990j69430j28259K53375J07357k7263
7156a8605k52908o2309K24747K18552k3322L6341l71064j14912L30984O7200j37180
7145a02476K9783l5390p3255J69368n2059o6366K08280r7148K02653j83082j93472
7134a93164n4949L53754J44154J74518l3807j48331n9373l66774J56978k36401
7124b63395p9071K14047N7672j15125J79516j31248l68429Q7726K56182M67819
$$ plain form
7196 -318349 -412599 -182993 71901 -248634 -349714 -370238 -238165 160566 293614 193784
7186 193784 214257 150113 80080 242389 -130561 88569 365568 271020 -75651 144496
7176 144496 318995 -419959 -251028 -82854 -341857 -103803 -21928 -258653 -87918 12967
7166 12967 -176832 -354233 -57689 190605 -54385 -223815 -352074 -98699 8658 -18605
7156 -18605 -271513 -333822 -109075 109477 86155 122496 -248568 -363480 -32496 34704 -102476
7145 -102476 -72693 -108083 -181338 -11970 -64029 -130395 77885 -19263 183390 308 -193164
7134 -193164 -248113 105641 249795 424313 390506 242175 182802 -183972 -26994 -263395
7124 -263395 -342466 -128419 -70747 -185872 -6356 -137604 -506033 -418307 -162125 305694
7114C05694p4239J37635l40213j7884K62676m58230J51350J597q3703l3298J17497
7103c1118j7593k52514L63862q3811J10065N3729K77094J6165j49895j64520j66607
7092d5143J74599J34226j44955j64359J13911m31260l1913R6559N89462o27324
7082c36197k12585L71516K10589K21168l76333Q2565n4263K65123m1071j68623
7072c8111L22126l07963o6983j65941K9256J23254K13450k22335M54196J71493
7062E12442o78946Q061L05569j17068l85583j32950L71296J48181p2000j3576
7052e4574j20697m7806O207N84865j21534k61795j11498l17809J43865L02746
7042A970j32013l46969J63335N22274n5933o6064k89455M32363J14958j0068j76209
$$ plain form
7114 305694 231455 369090 28877 10993 273669 -184561 -33211 -31614 -115317 -148615 -31118
7103 -31118 -48711 -301225 62637 -21174 88891 142620 419714 435879 285984 121464 -45143
7092 -45143 129456 263682 118727 -45632 68279 -362981 -394894 -298335 291127 -336197
7082 -336197 -548782 -177266 33323 254491 -121842 -39277 -93540 171583 130512 -38111
7072 -38111 284015 -23948 -90931 -256872 -227616 -104362 109088 -113247 340949 512442
7062 512442 -166504 -158443 147126 30058 -355525 -488475 -117179 31002 -40998 -54574
7052 -54574 -175271 -223077 -216870 367995 246461 -15334 -126832 -444641 -300776 1970
7042 1970 -130043 -477012 -313677 208597 152664 86600 -202855 229508 344466 334398 158189
7031A58189j76299j16193J75469Q9693L97879J61332j67547j89216m35868P0684
7021c1877q2168j98693L08357k60286p3218J68679j7377J0100l9026j96181L75121
7010c6569L24981j05357p2911j33444J71111k96693j23512K2116j08870L90286
7000C1138K76231n73399J60182k58667m01179N9856N86477K75000J5347K5047
6990A96033m08647q8494r1040j80892J43395K48978N99146o6313l17486j48508
6980a13828n7231l27427M42299L37566k17266j5221L11161k5752m47120l8549
6970a51368l14249N1350K20216J28460J66617o3171m58206m4722K37973j79773
6960d06873L24019J85691k35384O0679m6150K75488l2798r1557n2980n74481L20521
$$ plain form
7031 158189 -18110 -134303 41166 130859 528738 690070 522523 333307 -102561 -31877
7021 -31877 -114045 -312738 -4381 -264667 -337885 -169206 -186583 -176483 -215509 -411690 -36569
7010 -36569 288412 183055 110144 -23300 147811 -148882 -272394 -250278 -359148 31138
7000 31138 307369 -266030 -105848 -364515 -765694 -705838 -119361 155639 170986 196033
6990 196033 -212614 -301108 -392148 -573040 -429645 -180667 418479 352166 34680 -113828
6980 -113828 -171059 -498486 -56187 281379 64113 48892 360053 334301 -112819 -151368
6970 -151368 -465617 -414267 -194051 -65591 101026 37855 -420351 -465073 -227100 -406873
6960 -406873 -82854 102837 -132547 -71868 -118018 157470 124672 33115 -19865 -594346 -273825
6949b73825J17247N2933j56259j85931q7042K90539J78440k4454j35379J93228
6939c0503L18839l68582j82247J80403q4647K67836K63097j9303n22019j94313
6929c71439K52741J6911N49050q9503o46305p7960q6676J92326J7761Q6245m0724
6918a97573k49460o1467m3965N76313k11664K1738Q0476m86639l20699O53544
6908b39396K41622k69367j94848L88199J59165M6685j09788l9845j17538k45968
6898c81079L88971l6386L83721q147k82564r575n19715N26495P13538o51685n60078
6887d36504P0832j80286k0035N8853M12271j19596n9221L08866L12246O7065n34607
6876a20116m8462r4766l001o4851N3977J18193m43889P6520L57636J33004J90163
$$ plain form
6949 -273825 -156578 -103645 -259904 -445835 -532877 -242338 -63898 -88352 -223731 -30503
6939 -30503 288336 -80246 -262493 -82090 -166737 101099 364196 344893 -177126 -371439
6929 -371439 -118698 -101787 447263 357760 -288545 -366505 -453181 -260855 -243094 -156849 -197573
6918 -197573 -447033 -508500 -552465 23848 -187816 -166078 -85602 -572241 -892940 -239396
6908 -239396 2226 -267141 -461989 -73790 85375 132060 22272 -17573 -135111 -381079
6898 -381079 7892 -28494 355227 347080 64516 54941 -464774 61721 775259 123574 -436504
6887 -436504 -365672 -545958 -565993 -507140 -94869 -214465 -273686 35180 347426 414491 -120116
6876 -120116 -168578 -263344 -266345 -331196 -277219 -159026 -602915 -526395 -168759 -35755 154408
6865A54408K28415p42260J12551K44554j04541O9142m31153J29728M54632N2113
6855A67589j57208M1389j89162M2411M3391l15924M05825j79262K95212q7597
6845F6664O2493o8337K00565k29973J21088k29427p2612k45951p46059Q43860
6835b97689K85157J73175k90935R7520j20143o3246l13346j19825L3506J17910
6825d97916L08338P0494l3638n1352J95359L74032k11839j57186j12355k50646
6815c66709K22603J76951N0168j76062J53893J31413l75197j96843J08627K86062
6805A4906k14753J4807j85331L2463M83178m566l36478r4289K16449K5239m06145
6794d54520q4649J83538j14634L77616M32216m61795n2936J72758J28897p8116
$$ plain form
6865 154408 382823 -359437 -246886 -2332 -106873 -37731 -468884 -339156 115476 167589
6855 167589 10381 51770 -137392 -94981 -51590 -367514 38311 -140951 154261 66664
6845 66664 129157 60820 261385 31412 152500 -76927 -149539 -395490 -1141549 -297689
6835 -297689 -12532 160643 -130292 -32772 -152915 -216161 -529507 -649332 -615826 -497916
6825 -497916 -189578 -119084 -152722 -204074 -8715 365317 153478 -3708 -116063 -366709
6815 -366709 -144106 32845 83013 -93049 60844 192257 -182940 -379783 -271156 14906
6805 14906 -199847 -185040 -370371 -337908 145270 140704 -195774 -290063 -73614 -48375 -454520
6794 -454520 -539169 -355631 -470265 -92649 339567 -122228 -175164 -2406 126491 48375
6784D8375J60158K56552k86585l5778j58077J14256N02058l07329J03109k87547
6774A09192l21967j17918j28363p0219N01790K48388l834j55880J26488m86056
6764b98379J0630J94473n90149K14614L45101j92095k18023J13487L45916L5534
6754c8891J155l69561R3830J12974K3003K52475L47744n4356l35293M20052J25757
6743E78889K42261n11125k58242J43187k16728l5805k58608p4055J77462p5116
6733b87880J78644J52521J570l9389p8237m3264R9856j77863l61521j26422J71711
6722e10274M98736k03663j89876L79208l74710J63783K02238L48121j40276j19065
6712E4222l97555J22190R9109J69621j71891j74439M04397K32050k13865j97420
$$ plain form
6784 48375 208533 465085 178500 142722 -15355 98901 600959 293630 396739 109192
6774 109192 -212775 -330693 -459056 -529275 -27485 220903 217069 61189 187677 -298379
6764 -298379 -287749 -93276 -683425 -468811 -123710 -315805 -533828 -420341 -74425 -38891
6754 -38891 -37736 -407297 -313467 -200493 -177490 74985 422729 368373 33080 453132 578889
6743 578889 821150 310025 51783 194970 -21758 -57563 -316171 -390226 -212764 -287880
6733 -287880 -109236 43285 44855 5466 -72771 -116035 -16179 -194042 -555563 -681985 -510274
6722 -510274 -11538 -215201 -405077 -25869 -400579 -236796 -34558 313563 173287 54222
6712 54222 -343333 -221143 -122034 47587 -124304 -298743 105654 337704 123839 -73581
6702g3581j99905l63021K75226j5379Q2964M12424J15779k58162J48447j899m10376
6691b87483J96744J12133j61525o1242j68542O84889J24420m00880n7928l06701
6681c26115j6065K4852K36758m26128K23486l5081O4212M43488j38853m63011
6671d12457k23804O8509L87750K53835K32759l56976j35202M11588l92076j90248
6661c56322k1413J74796n4859O1616L01230j46262k11375J03207j63196L7967
6651b74611k8059j28653J73203j10419l109K95355m1765j80539J76660L02681
6641A80744k84592k38672N68884j87836R9262j62855l01848J46453K41804j18285
6631e6941k99231m7389N4066P3046J23544O58742j62759j24521j56015L93184
$$ plain form
6702 -73581 -273486 -636507 -361281 -376660 -293696 118728 234507 -23655 124792 122893 -287483
6691 -287483 -90739 21394 -140131 -201373 -369915 314974 439394 38514 -19414 -326115
6681 -326115 -342180 -317328 -80570 -506698 -283212 -318293 -254081 189407 50554 -412457
6671 -412457 -636261 -567752 -180002 73833 306592 -50384 -185586 226002 -166074 -356322
6661 -356322 -377735 -202939 -257798 -196182 105048 -41214 -252589 -149382 -312578 -274611
6651 -274611 -302670 -431323 -258120 -368539 -371648 -76293 -118058 -298597 -121937 180744
6641 180744 -103848 -342520 226364 38528 137790 -25065 -326913 -180460 61344 -56941
6631 -56941 -356172 -403561 -349495 -276449 -152905 505837 343078 218557 62542 455726
6621D55726j95630n258k88976n22151L36502k116o5577K53092k24987n0779L74434
6610F4280K55698k74173N6027k53332J00579N08602O8997q3895k45010p0379k06280
6599g8886J50530k48235j35279K39571k57995L4234j28635O6577J37017L86944
6589A65843K95754k76126l37251O2801P3625L59178j67091j84251k04780n3277
6579b65575J47029n2889n74601M69225M22903k29502j7549j29625K98568k10906
6569a42922q3195R6405K76531K11206J04396j18775k05081k19588j26848L6952
6559a70919K67848P8171n6372n5764L93437k6397k31592Q2086l64717j06637L51126
6548A60270k25727m30867K12039L41834L54336j36710j3544k21872k50118N86074
$$ plain form
6621 455726 260096 254838 -34138 -556289 -219787 -221903 -287480 -34388 -259375 -310154 64280
6610 64280 319978 45805 101832 -151500 -50921 457681 526678 442783 197773 127394 -78886
6599 -78886 71644 -176591 -311870 -72299 -330294 -296060 -424695 -358118 -221101 165843
6589 165843 461597 185471 -151780 -88979 -15354 343824 176733 -7518 -212298 -265575
6579 -265575 -118546 -171435 -746036 -276811 146092 -83410 -100959 -230584 67984 -142922
6569 -142922 -226117 -129712 146819 358025 462421 343646 138565 -81023 -207871 -170919
6559 -170919 96929 175100 118728 62964 456401 430004 198412 280498 -84219 -190856 160270
6548 160270 -65457 -496324 -284285 57549 411885 275175 261631 39759 -210359 375715
6538C75715J65909m44166l10079M2003J54656j4368m9972K0573M919O92227J5420
6527F52837l42313l15661k01348k18137P8497k5807l4645J08163J69044l78425
6517e07795O404L84603R4576J79053J98724J396J44576j934l21274J02327J5558
6506B96214l46626K97012k91174n5201k6784K01355O068m71194l6546K13182O00685
6495C86991j40184n4808K28803l45242j12648Q0162O8055k3925O0953L83017J95181
6484G26355m48198n27393J71425j07633k09468L0214J17589K24280p7355K76344
6474A76160j345o9817J64681M8558k59661l92847Q1792k9324q9630j90981O05266
6463D2852O8m40974K21798K16552q7188K23545q0867J13783j42389L139q6274
$$ plain form
6538 375715 541624 97458 -212621 -170618 -15962 -30330 -80302 -59729 -54810 637417 652837
6527 652837 310524 -5137 -206485 -424622 -346125 -371932 -406577 -298414 -129370 -507795
6517 -507795 -501391 -116788 -22212 156841 355565 356961 501537 499603 178329 280656 296214
6506 296214 -50412 246600 -44574 -99775 -126559 74796 80864 -390330 -426876 -213694 386991
6495 386991 246807 191999 420802 75560 -37088 43074 111129 87204 148157 531174 726355
6484 726355 278157 -249236 -77811 -185444 -394912 -364698 -247109 -22829 -100184 176160
6474 176160 174815 104998 269679 318237 58576 -334271 -252479 -281803 -371433 -562414 42852
6463 42852 42920 -398054 -176256 40296 -46892 176653 95786 209569 67180 70319 -15955
6452a5955k27263R0712l59335p281K64919J37133J9346q603M061k68688L07828
6441f3126l9879K32350j68635O6923Q7911K753J32814m49567j26408Q4019k18271
6430d59116M25382k03068m48904k48547O10504K13121J45790M611n12390r5234
6420e67851j25104P13562L68400j43625k72156J73588k35768K196j84406p0464
6410c41628J81825J37351p147J22961j08943k09983j36087J08682K06923K34711
6400A88665j52440m005j23847k92167L4818J28458K23292J30577K12454p4018
6390B71787m54291q1307k2920K064L96192P6216n80817J37618K08283j85376J18212
6379a14339l0018J87452n1395j3937L59945j37872L30255l51199k40921R9643
$$ plain form
6452 -15955 -243218 -152506 -511841 -519122 -254203 -117070 -97724 -106327 -102266 -370954 -63126
6441 -63126 -103005 129345 -39290 27633 115544 118297 251111 -198456 -324864 -240845 -459116
6430 -459116 -33734 -236802 -685706 -934253 -323749 -110628 35162 39773 -472617 -567851
6420 -567851 -692955 20607 389007 245382 -26774 146814 -88954 -86758 -271164 -341628
6410 -341628 -159803 -22452 -29599 93362 -15581 -225564 -361651 -252969 -46046 188665
6400 188665 36225 32220 -91627 -383794 -348976 -220518 2774 133351 345805 271787
6390 271787 -182504 -263811 -286731 -284667 111525 187741 -393076 -255458 -47175 -232551 -114339
6379 -114339 -144357 43095 -8300 -22237 337708 199836 530091 178892 -62029 37614
6369C7614j17577l04159j58163L54938Q4226j24146j04634K97213K58131k19767
6359C676K61124m26936j07768q7855P1350M65987L2909J02142j24381j96241k77388
6348b83381K20243l9027J54774M11321n53445j42133L51733l61180j00003K03603
6338a37495j30357n50341L79311L63550K06223j10757k54379n51180R9258K49164
6328d37003J66993M30906J690k05232K101R0244m46310R0845N8817k53993K16787
6317b84155M39178O4248l49861R5814l69137k60935m975L83517N14518J44667
6307C72879l90972O7861P2589k43102O95504P6509o88017j29384K49627o7224
6297A6270j12671l17674N12879N40213l41063l02497K78733K68693k40274r5884
$$ plain form
6369 37614 -79963 -384122 -542285 -187347 -103121 -227267 -331901 -34688 223443 3676
6359 3676 264800 -162136 -269904 -357759 -286409 179578 212487 314629 190248 -5993 -283381
6348 -283381 -63138 -102165 52609 463930 -89515 -231648 120085 -241095 -341098 -137495
6338 -137495 -267852 -818193 -438882 -75332 130891 20134 -234245 -785425 -686167 -437003
6328 -437003 -270010 160896 162586 -42646 -40545 49699 -396611 -305766 -246949 -500942 -284155
6317 -284155 155023 219271 -130590 -34776 -403913 -664848 -669823 -286306 228212 372879
6307 372879 -18093 49768 122357 -120745 574759 651268 -36749 -166133 83494 16270
6297 16270 -96401 -414075 98804 639017 297954 -4543 274190 542883 302609 206725
6287B06725j53437N3079k90055k88028L11644Q7210L36344k1772j06624K60250
6277C95336j57756J17818k23688J25212m80868q4631K83190J03254K12718K03965
6267D94550k78819j90360n79147P3545L68945q3410M06118j10433J7668J60942
6257B79599J0897k65195J49930m1177m37777Q3496K89733l37761J53670p2091
6247a86676K55911J39716j87687k30229k09068J96016J89748o65974K71308M14582
6237a2353j68233Q2015Q5955R694K55252n9717n16757J961P8679J46211K39351
6226A42058l6861k41005j65524j31304K28347k75085M7072J23018m10838K07669
6216e12453P32934j13639J33211L29800m91798k29734r089M45221j75895j04207
$$ plain form
6287 206725 53288 106367 -183688 -471716 -160072 -72862 263482 241710 135086 395336
6277 395336 237580 355398 131710 256922 -223946 -308577 -25387 77867 290585 494550
6267 494550 215731 25371 -553776 -480231 -111286 -194696 211422 100989 118657 279599
6257 279599 290496 25301 175231 134054 -303723 -220227 69506 -268255 -114585 -186676
6247 -186676 69235 208951 21264 -208965 -418033 -222017 -32269 -698243 -426935 -12353
6237 -12353 -180586 -98571 -12616 -2922 252330 192613 -324144 -322183 -243504 -97293 142058
6226 142058 105197 -135808 -301332 -432636 -204289 -479374 -432302 -309284 -720122 -512453
6216 -512453 220481 106842 240053 569853 78055 -151679 -160768 284453 108558 4351
6206D351j84940K26750j96985M77261o6656J00490k37932p07907M36991L93468
6196B44891k43772k19925R715Q5822j42826j72221r7248J1812L19063j78539Q2671
6185c00557J92024O6400j9458L82950Q9684j94971j50323j84283L40327J42509
6175C64302l68681j48609k34638k4197K47868M63954l19239K14512j20648k92822
6165b18198J0618M3572Q3554L16470l02845R0274j1669k51965j69127K22649K17946
6154C1279J29625P2000k50807r7157k02605K61193K45338k3573n68263J76399
6144b26571K27634j41278o7375k08698J89503Q4973l7296k52040L83202N13045
6134D65099k90989k99727k46581k1466M17122K53822o1678J45407k70418O9703
$$ plain form
6206 4351 -180589 46161 -150824 326437 259781 360271 122339 -585568 -148577 244891
6196 244891 1119 -218806 -209091 -123269 -266095 -438316 -535564 -523752 -204689 -383228 -300557
6185 -300557 -108533 -42133 -61591 321359 411043 216072 65749 -118534 221793 364302
6175 364302 -4379 -152988 -387626 -411823 -163955 299999 -19240 195272 74624 -218198
6165 -218198 -207580 -164008 -80454 236016 -66829 23445 11776 -240189 -409316 -186667 31279
6154 31279 160904 232904 -17903 -115060 -317665 -56472 188866 165293 -402970 -226571
6144 -226571 1063 -140215 -207590 -416288 -226785 -141812 -179108 -431148 -47946 465099
6134 465099 174110 -125617 -372198 -393664 23458 277280 215602 361009 90591 160294
6124A60294L65656k27413l8782j05703J42129J06819M7851o691o9507j59566k99950
6113h4863J61759N4060K26710m6697O7661O2878L7478j85653r0639m1474j80242
6102a9022o3270O228L8373j79520K03188J3657L08578K27963m26317J20613M54789
6091F85260K32341k61869m73640N014q1531J7986J57715l12497j54651J05057
6081h0815J98456Q2831j37403j12320j82497K19781J4736M36494j44206K131j85372
6070A11816l09869M87317P3005k15722J33104n3097j24552K62407k00059l94193
6060b29843K79029Q1153j13064m08865j75866K95464J64275j11274m0466K46884
6050a2573k30615m2759J92773N6831L4774M4970j41585K26188l79296M01676K22722
$$ plain form
6124 160294 525950 298537 259755 154052 296181 403000 450851 444160 374653 215087 -84863
6113 -84863 76896 130956 357666 310969 378630 441508 478986 293333 202694 161220 -19022
6102 -19022 -82292 -76064 -37691 -217211 -14023 -366 308212 536175 109858 230471 685260
6091 685260 917601 655732 182092 187106 105575 123561 281276 -31221 -185872 -80815
6081 -80815 117641 200472 63069 -49251 -231748 -11967 2769 439263 295057 297188 111816
6070 111816 -198053 289264 362269 146547 279651 226554 102002 364409 164350 -229843
6060 -229843 49186 130339 17275 -391590 -567456 -271992 -107717 -218991 -259457 -12573
6050 -12573 -243188 -285947 -93174 -36343 -1569 43401 -98184 128004 -251292 150384 373106
6039C73106k57112J79366J35664k90931O1043p2078J8457k70j46145j32779J17535
6028a4144J45895M2848Q508J93505k7457r7625j16007j67867K38077j81920J3570
6017C7383M33673N8379m16234J55715J54322l53691p0298J00703l98813k47557
6007e46418K21010M35391P0367k05215J20205j21252J73820L09496p2089J77919
5997E63234j00455n02232k34141K24384L01782l08269J65386p1771m12508q3412
5987d58002N67153P4896k00432L23445l39590m35820K62496J68297l222k997L34863
5976B91087N7818j13246J60562p4199M6674l20281j74403K99616k4378M0121k56559
5965f7188J39357N03621j80108k82684M31217L57215l27530j82896j60365j07491
$$ plain form
6039 373106 115994 295360 431024 140093 201136 129058 147515 147245 1100 -131679 -14144
6028 -14144 131751 174599 183107 376612 349155 251530 135523 -32344 205733 23813 37383
6017 37383 471056 529435 113201 268916 423238 69547 -751 99952 -298861 -546418
6007 -546418 -325408 109983 180350 -24865 95340 -25912 147908 457404 385315 563234
5997 563234 462779 -39453 -273594 -49210 252572 -55697 109689 37918 -374590 -458002
5987 -458002 109151 184047 -16385 307060 -32530 -468350 -205854 -37557 -40779 -43776 291087
5976 291087 348905 235659 396221 322022 368696 48415 -125988 173628 149250 189371 -67188
5965 -67188 72169 575790 395682 112998 544215 901430 573900 391004 230639 123148
5955A23148J5639O28752j05707k77570k21457k80972L09952L24072q9422k04019
5945B22416n22212M13146J57882j07570j49325L06266L92230k08012J41596J25527
5935G71944m13929j32797J54393j54417n6123J03272j95648j89295P2465J32566
5925I2431l0061N5803J39218K72529j18766m12912Q7990J66890j39283L30352
5915D44191L775q0932l9846Q0627J99182K74550K4226j70222m6498l28001q6864
5904B74188r4106k54523N3538J88995K4225k69193N1489J75154N1954M2646J77398
5893D21765j9936Q6030k10352o8172p6841K11805K48108k56175m30376k1186K37732
5882A22402J6223J67370K02077m0586j48387K71859m38473J45976j22596k17126
$$ plain form
5955 123148 138787 767539 661832 384262 162805 -118167 191785 515857 426435 222416
5945 222416 -299796 113350 271232 163662 14337 320603 712833 504821 646417 771944
5935 771944 358015 225218 379611 225194 169071 272343 76695 -112600 -40135 92431
5925 92431 62370 118173 257391 529920 411154 -1758 86232 253122 113839 444191
5915 444191 447966 367034 327188 407815 606997 881547 905773 735551 689053 361052 274188
5904 274188 180082 -74441 -20903 168092 192317 -76876 -25387 149767 201721 244367 421765
5893 421765 401829 487859 277507 209335 132494 344299 592407 336232 -94144 -115330 122402
5882 122402 138625 305995 508072 467486 319099 590958 152485 298461 175865 -41261
5872d1261n8321J09962N7248M56578j74975q8854l92844K46437L33039M177l63125
5861H8061J11001J37502p4175k19315J29192M3207J01432j13549N6019Q397l93267
5850a25495K5593N6611o7768J60574L42526j47272k12144O0562M85381k08877
5840C69691J08272o6118O2342n20259j23520J86565L39344M38140L6651k61970
5830E69138k70407k14962q6162j51571K87701K67536k85200j49596K24991o057
5820A85411K08698K96995j45286N8206l01844j19412q9169L26374j43566k24742
5810E1665L6460K75218J51482j22236K28622n53064j85494O44447O2759k28574
5800C61285j2470K05183k54483R6750m49187k09218K31815K31828K99366l26461
$$ plain form
5872 -41261 -99582 10380 67628 524206 349231 260377 -132467 113970 447009 451186 88061
5861 88061 199062 336564 262389 43074 172266 215473 316905 203356 259375 267772 -125495
5850 -125495 -99902 -43291 -111059 49515 392041 244769 32625 93187 578568 369691
5840 369691 477963 411845 474187 -46072 -169592 16973 356317 794457 831108 569138
5830 569138 298731 83769 -2393 -153964 133737 401273 116073 -33523 191468 185411
5820 185411 394109 691104 545818 604024 302180 182768 93599 419973 276407 51665
5810 51665 88125 363343 514825 392589 621211 68147 -117347 527100 589859 361285
5800 361285 348815 553998 299515 396265 -52922 -262140 -30325 201503 500869 174408
5790A74408l98059N09154N19277l56707J61928j14054J13826j62583j43838K05021
5780E08373J24833k11691K34730J6157N932k25501K32136L07309J11033j37198
5770I66113j49613r3397j06710O3139o1414M47426l48846m45618j62792K59815
5760C68103Q0679K33010p1756l83839J74842j19306K78323J85608m6078q259j15689
5749E75638k83366K5627K62298m77897j20868J44981o7435J02998j18708J05779
5739A49047k5629R6589N17597k36672k59516j05904j24740J15162J61458k10358
5729G7034j59483K92727j84305L92958r1325J14392p3229j85145N24118J93567
5719I01309k27502m2713K38602k74225J00641J4634K72083l5272J19256l11372
$$ plain form
5790 174408 -223651 285503 804780 448073 610001 495947 609773 447190 303352 508373
5780 508373 633206 421515 656245 672402 678334 452833 684969 992278 1103311 966113
5770 966113 816500 723103 616393 679532 618118 1065544 716698 271080 108288 368103
5760 368103 448782 681792 610036 226197 401039 281733 560056 745664 699586 691327 575638
5749 575638 292272 317899 580197 102300 -18568 126413 58978 161976 43268 149047
5739 149047 123418 220007 737604 500932 241416 135512 10772 125934 287392 77034
5729 77034 -82449 210278 25973 418931 327606 441998 368769 183624 707742 901309
5719 901309 673807 631094 869696 595471 696112 710746 982829 947557 1066813 755441
5709G55441k27005k48796p6843j4778L67390J06543P6545M8116j03568K81913
5699I64958o05768K1635j27466L24957K01327k37123O0374K04748K01287l5224
5689I73705k06972j34981r1943K02177J26188K64982q2851J76401p723J49637
5679A368620j28164l65003K05424j39463K3971K44833l27052L0580N78468l69840
5669A122374j46353j28848J13307M67244l7917j79012R2334n0008Q8946L19035
5659A661102r1855J48401N14899l40978m552l0021L69007j3181P8294N02053q2017
5648B711152K3863k84587l49162j25804J98319j94100o1835J54412m65476r0343
5638A516439L23205k95238k83497L6143k773K80168k48079m08281L64828p0447
$$ plain form
5709 755441 528436 279640 202797 188019 555409 661952 738497 786613 683045 964958
5699 964958 359190 380825 253359 578316 779643 542520 602894 807642 1008929 973705
5689 973705 766733 631752 539809 741986 868174 1133156 1050305 1226706 1218983 1368620
5679 1368620 1240456 875453 1080877 941414 965385 1210218 883166 913746 1492214 1122374
5669 1122374 976021 847173 960480 1427724 1389807 1210795 1303129 1253121 1342067 1661102
5659 1661102 1569247 1717648 2232547 1891569 1887017 1856996 2226003 2212822 2291116 2793169 2711152
5648 2711152 2735015 2450428 2101266 1975462 2173781 1979681 1917846 2072258 1606782 1516439
5638 1516439 1839644 1544406 1260909 1297052 1294279 1574447 1326368 918087 1282915 1212468
5628A212468k52045J45089L2142K4016L8085O7409l63993K0994P4245k76406p2244
5617F49760K94068K14585p32J75779k95584k97960O9989L68229M4331j43802N305
5606A083968K10746O0773o16861O5456K80448K55695J50955l32347j56422L1056
5596A033467j30900o0123L7239L56610J14498k65226J26292J42763p9368j45656
5586A129596o3206l71758m43414K82336r0853N14348J48871q7003L14464k41196
5576A092185j90010j66414N97165J36723j64394l53772J62544L77146m89434J0133
5566A011872j23643J54632K40631l22893j64407N0043L96958K89162K40962j19446
5556A653871j45385J7716k44473j73009J14554j40332j10120K39556n5992P086
$$ plain form
5628 1212468 960423 1105512 1137654 1161670 1199755 1267164 903171 924165 998410 722004 649760
5617 649760 943828 1158413 1157681 1333460 1037876 739916 809905 1178134 1222465 1078663 1083968
5606 1083968 1294714 1355487 738626 804082 1084530 1340225 1491180 1158833 1002411 1033467
5596 1033467 902567 842444 879683 1236293 1350791 1085565 1211857 1354620 1275252 1129596
5586 1129596 1066390 694632 251218 533554 442701 957049 1105920 1018917 1333381 1092185
5576 1092185 902175 735761 1332926 1469649 1305255 951483 1114027 1491173 1001739 1011872
5566 1011872 888229 1042861 1283492 960599 796192 846235 1243193 1532355 1773317 1653871
5556 1653871 1508486 1526202 1281729 1108720 1223274 1082942 972822 1212378 1156386 1163472
5546A163472q7140l40366P8573L66248N64140j24136k41199J11747l90443o759
5536A094137R5778J11188N4285j4868J64443m38029l03643L63300N21971j78768
5526A469794L54672J33150j93288Q1612J17127k28426n9447n60135J82039K29397
5516A526495J56514Q9811O9126J35976k36080j58602j28512O837l38179R0351
5506A213737n9889K01120P5624p1608K87394L04338K38778j50085m79986p6563
5496A482860K59297m20834k8183N86023J20024J29969k99280q4075K53994l38986
5486A660809K60088M8305p2386q7008K49475o3355l54384K71435K3619P7206j14447
5475A899357m1020K56374M0707O1900J14075K12742O8253m92183K87189K70840
$$ plain form
5546 1163472 1076332 735966 814539 1180787 1744927 1620791 1379592 1491339 1100896 1094137
5536 1094137 1189915 1301103 1355388 1340520 1504963 1066934 763291 1126591 1648562 1469794
5526 1469794 1824466 1957616 1764328 1845940 1963067 1734641 1675194 1115059 1297098 1526495
5516 1526495 1683009 1772820 1841946 1977922 1741842 1583240 1454728 1461565 1123386 1213737
5506 1213737 1153848 1354968 1430592 1358984 1646378 1950716 2189494 2039409 1559423 1482860
5496 1482860 1742157 1321323 1293140 1879163 1999187 2129156 1829876 1745801 1999795 1660809
5486 1660809 1920897 1969202 1896816 1809808 2059283 1995928 1641544 1912979 1936598 2013804 1899357
5475 1899357 1858337 2114711 2155418 2217318 2331393 2544135 2612388 2120205 2407394 2678234
5465B678234l60854k87845k9115J14663J43379j84051R9658l56051o4051K52933
5455B006900K06411J98764m9541J25686J62571k41733l0940K6405Q7850L44572
5445B836945J17406o7098j32694k07050R8423l64851K63805M07489k48107K9822
5435B734090J38891k72937M10425J18714j15869j91411K13687J93118k57865J07214
5425C078057M70796K91126r6783k29715R4859N6557o2889l30413k36852M10202
5415C444945q5414M50731l39293J11565K42756J8989L64676q9611K93003J35503
5405D547850j41325j19086q7248l46727p9759L25751M4440J61567L70861K65779
5395D942103L0421L11405j19282m7359L38577J07360J87282M8820r6367N0777
$$ plain form
5465 2678234 2317380 2029535 2000420 2115083 2258462 2074411 2174069 1818018 1753967 2006900
5455 2006900 2213311 2412075 2362534 2488220 2650791 2409058 2378118 2404523 2492373 2836945
5445 2836945 2954351 2887253 2754559 2547509 2645932 2281081 2544886 2952375 2704268 2734090
5435 2734090 2872981 2600044 3010469 3129183 3013314 2821903 3035590 3228708 2970843 3078057
5425 3078057 3548853 3839979 3743196 3513481 3608340 3664897 3602008 3271595 3034743 3444945
5415 3444945 3359531 3810262 3470969 3582534 3825290 3844279 4208955 4119344 4412347 4547850
5405 4547850 4406525 4287439 4200191 3853464 3773705 4099456 4143896 4305463 4676324 4942103
5395 4942103 4972524 5283929 5164647 5117288 5455865 5563225 5750507 5799327 5702960 5753737
5385E753737k7118J05791q5331p8118J48827K66705M24227k14567l9834j747M51167
5374F703739R3884k01956J46456j41023o7073J44737M59400N3727k28737M1044
5364G004198K39664M7883N32115Q8122k54138P5204J70321N19492M73405m78969
5354H417297k72133O57479m7402j78803N46028K24618p6185O2362M30850K81708
5344A0045819o616p3741M3024J46697M5781K59554K98061P7932N14906K96794
5334A1648211K40903o69342Q009K20951J95164N70733m937K85873N04326L2068
5324A3031959J73992Q4172O28278K33095N38024K69593J69761J63288K21903O02109
5314A6116174P69786J00643J08672K57091L28981J026417L62691N91220P17202
$$ plain form
5385 5753737 5726619 5832410 5747079 5668961 5817788 6084493 6508720 6294153 6254319 6252572 6703739
5374 6703739 6797623 6595667 6742123 6601100 6534027 6678764 7138164 7191891 6963154 7004198
5364 7004198 7243862 7291745 7823860 7911982 7657844 7733048 7903369 8422861 8896266 8417297
5354 8417297 8145164 8802643 8755241 8576438 9122466 9347084 9270899 9333261 9764111 10045819
5344 10045819 10039203 9965462 10008486 10155183 10200964 10460518 10758579 10836511 11351417 11648211
5334 11648211 11889114 11219772 11227781 11448732 11643896 12214629 12209692 12495565 12999891 13031959
5324 13031959 13205951 13290123 13918401 14151496 14689520 14959113 15128874 15292162 15514065 16116174
5314 16116174 16885960 16986603 17095275 17352366 17681347 18707764 19070455 19661675 20378877
5305B0378877M78556N0200J07142L02565O75938L63684R94710M82888Q34781Q07065
5295B5476406P28880N85018O80800R65567J118521Q10318M03255J384318J259462
5286C3412545R46498J215787O53893J197111P94044P43300J336089J459888R62229
5277D2721384M61841R65022J258103J916816J825941J985796J061594J396249
5269E3592746J584125J771311J722020J738374K715517K181486K187156K641858
5261G0134593K240782K284538L433778L135136L223307L434691L848569L622626
5253I5358020M279809M659708M997118N111034N486226N178863O068710P054886
5245A38194374P171107P766361P948271Q524533R483171J0379804J1358104J1976378
$$ plain form
5305 20378877 20857433 20907633 21014775 21317340 21993278 22356962 23351672 23834560 24669341 25476406
5295 25476406 26205286 26790304 27471104 28436671 29555192 30365510 30768765 32153083 33412545
5286 33412545 34359043 35574830 36228723 37425834 38219878 38963178 40299267 41759155 42721384
5277 42721384 43183225 44148247 45406350 47323166 49149107 51134903 52196497 53592746
5269 53592746 55176871 56948182 58670202 60408576 63124093 65305579 67492735 70134593
5261 70134593 72375375 74659913 78093691 81228827 84452134 87886825 91735394 95358020
5253 95358020 99637829 104297537 109294655 114405689 119891915 125070778 131139488 138194374
5245 138194374 145365481 153131842 161080113 169604646 179087817 189467621 200825725 212802103
5237B12802103J2669580J3522350J5158294J5811454J7130271J7882332J8112957
5230C23089341J8244412J7720197J6675216J4729669J2142050P795291L257232
5223D13653408j880936p042337j1671919j4753458j7725378j8782352j9706855
5216C22090173j9430321j8569766j7498147j6489207j5811930j4671531j3582473
5209B06036798j2467976j1252469j0475811r727486r074233q200686p343343p146053
5201A30348741o436472n796873n639065m732245m671023m076284m437333l884192
5193I0675254l854721l525488k809857l159561k364814k777506k850004k685075
5185F6648228k372401k150601k226177j400004j880861k184640k071702j813824
$$ plain form
5237 212802103 225471683 238994033 254152327 269963781 287094052 304976384 323089341
5230 323089341 341333753 359053950 375729166 390458835 402600885 410396176 413653408
5223 413653408 411772472 404730135 393058216 378304758 360579380 341797028 322090173
5216 322090173 302659852 284090086 266591939 250102732 234290802 219619271 206036798
5209 206036798 193568822 182316353 171840542 162113056 153038823 144838137 137494794 130348741
5201 130348741 123912269 118115396 112476331 107744086 103073063 98996779 94559446 90675254
5193 90675254 86820533 83295045 80485188 77325627 74960813 72183307 69333303 66648228
5185 66648228 64275827 62125226 59899049 58499045 56618184 54433544 52361842 50548018
5177E0548018j345857j610153j372080j570301j336271j894865j302980n50890
5169C9564621r21133j072873j608156o93600n98839p59885r48346j000614n88058
5160C1373117q68197m33089p96869o56684n96532r52209k72247l33322j360384
5151B5103584q00441l62028Q9167n73722q92698k01626o41217m76170l26318l56556
5141B0561975n92452j7028k64728o78771p50046k08157j20298o28159l67143q3854
5131A6851339J66689o80222p59535n35091k11695O4654l94014o70495l73409p7046
5121A3381175k21944l14301k63046l63390J58201K22208m76519n68111j81669
5112A1372604m30700j87408K80276n80805R9312k00734k23585l30649j25454K18912
$$ plain form
5177 50548018 49202161 47592008 46219928 44649627 43313356 41418491 40115511 39564621
5169 39564621 38643488 37570615 35962459 35268859 34670020 33910135 32961789 31961175 31373117
5160 31373117 30504920 30071831 29274962 28618278 28021746 27069537 26797290 26463968 25103584
5151 25103584 24303143 23941115 24030282 23456560 22563862 22362236 21721019 21244849 20918531 20561975
5141 20561975 19969523 19952495 19687767 19008996 18258950 18050793 17930495 17302336 16935193 16851339
5131 16851339 17018028 16337806 15578271 15043180 14831485 14896139 14502125 13831630 13458221 13381175
5121 13381175 13159231 12844930 12581884 12218494 12376695 12598903 12122384 11554273 11372604
5112 11372604 10941904 10754496 11034772 10453967 10553279 10352545 10128960 9798311 9672857 9891769
5102I891769p41506N5994K82855l95306k93994m00376K2600j51978k65247j28348
5092G876463M4578K10558l85621m587j14133m49093j98374O6187J33232l67320
5082F811890l28982L12984j06893k49866j07733J31788o9356n8095k05234o83814
5072E446689j47940K77240l81166L7554J0393L1361K14810j73437j6104k29690
5062E069710j289j07455l8941J07360J77086l03373K48957l03801J54750J3325
5052E016329l46960Q575L46174k97179l66358J2761j59823j55443j22922N71752
5042D506906k31872K76912l57090j04222k8053p9073K67366M8255l97503j15503
5032C786123L43380J76456j68483l83760M19972l66462j11924J74970j3110R6000
$$ plain form
5102 9891769 9150263 9206257 9489112 9093806 8799812 8399436 8422036 8270058 8004811 7876463
5092 7876463 7921041 8131599 7745978 7741391 7627258 7178165 6979791 7045978 7179210 6811890
5082 6811890 6482908 6795892 6688999 6439133 6331400 6463188 6393832 6335737 6130503 5446689
5072 5446689 5298749 5575989 5194823 5232377 5242770 5274131 5488941 5315504 5299400 5069710
5062 5069710 5068421 4960966 4922025 5029385 5206471 4903098 5152055 4848254 5003004 5016329
5052 5016329 4669369 4677944 5024118 4726939 4360581 4373342 4213519 4058076 3935154 4506906
5042 4506906 4275034 4551946 4194856 4090634 4062581 3983508 4250874 4299129 3901626 3786123
5032 3786123 4129503 4305959 4137476 3753716 4173688 3807226 3695302 3870272 3857162 3953162
5022C953162J8992L14939J3347l99093l64948k23122K26921j09978j85921k6993
5012C217306k5124L25163K73352l15386J6603L69397m72764J25563K7982k25001
5002C317091J8913p7129l21185J0482M19914J51001j94323j16165M2501j3759
4992C237341j69943M9791j62359J25274n24484J33322P4337J64571j11732l24299
4982B491819k2239M97126j93570m34646j66318Q547l3339R712J58766K32653O5690
4971B614201l90199L5716L81794L12136J3077l97117j30050L7516m3934k73710
4961B159430J80766K65909k44375j18531L7508j75607m83305L32667j25621j73361
4951A655480J94234O35471j41415k54161q0052j72367J37888P3332j38092j2936
$$ plain form
5022 3953162 3972154 4287093 4300440 3901347 3536399 3313277 3540198 3430220 3244299 3217306
5012 3217306 3192182 3517345 3790697 3475311 3491914 3861311 3388547 3514110 3542092 3317091
5002 3317091 3336004 3258875 2937690 2948172 3368086 3519087 3324764 3208599 3251100 3237341
4992 3237341 3067398 3117189 2954830 3080104 2555620 2688942 2763279 2927850 2816118 2491819
4982 2491819 2469580 2966706 2773136 2338490 2172172 2180719 2147380 2157092 2315858 2548511 2614201
4971 2614201 2224002 2259718 2641512 2953648 2966725 2569608 2439558 2477074 2433140 2159430
4961 2159430 2340196 2606105 2361730 2243199 2280707 2105100 1621795 1954462 1828841 1655480
4951 1655480 1849714 2485185 2343770 2089609 2009557 1837190 1975078 2048410 1910318 1897382
4941A897382m9372N1194n8120j80687j69700J41513L68514K56673r1892k2158
4931B143347r1865q6489n93793J7776O05135M8610j07080R9202m34071L15333
4921A916105M33084N24552m62350j96133m39951p556k1024k5599K33754L5705
4911A990587j00238K75253k08745k48292L66327L74172J70499m26516M6180L43486
4901B582713o22299J51762k22283k05020N05359j75686J13551Q8858m5834n7083
4891B114038J8271j14866j095m37404L4293K50657P8223J38215k80843k22407
4881A577082N84519K29064K10189n71059k4549N658l11091M52541p8437m12505
4871A661412J42952K61314k56371N9373L66004n7358K70861J2855m3359n50906
$$ plain form
4941 1897382 1848010 1899204 1841084 1660397 1490697 1632210 2000724 2257397 2165505 2143347
4931 2143347 2051482 1964993 1371200 1388976 1994111 2042721 1935641 2034843 1600772 1916105
4921 1916105 2349189 2873741 2411391 2215258 1775307 1767751 1746727 1721128 1954882 1990587
4911 1990587 1890349 2165602 1956857 1708565 2074892 2449064 2619563 2193047 2239227 2582713
4901 2582713 1960414 2112176 1889893 1684873 2190232 2014546 2128097 2216955 2171121 2114038
4891 2114038 2132309 2017443 2016348 1578944 1613237 1863894 1942117 2080332 1799489 1577082
4881 1577082 2161601 2390665 2600854 2029795 2005246 2010904 1699813 2152354 2073917 1661412
4871 1661412 1804364 2065678 1809307 1868680 2234684 2177326 2448187 2461042 2417683 1866777
4861A866777k1166L62008j79811P2661K5899k50096J10447j25760q9420J83759
4851A955298k68921l43283L79888l4337K64113J84651k50654k14735K30654L29013
4841B231687j79743m8467Q7620j36185l9298L9294J28997m17648j08610p9556
4831A478091R770o5716M17009m3142Q2507j38304j01787K2922j56412m145k61094
4820A239699K11151J10215J55049l12880L2436J71020l13613l62619L28504j01575
4810A157387k76245M20844M38421k83717m86529J37811K31415p3428j4356M13549
4800A665152J48665m39899J67114j03541M1261J23280N9596J65275m46909l95974
4790I84020k1271q9621M49516M7383m20008L72711j69539L2715j67142K24344
$$ plain form
4861 1866777 1845611 2207619 2027808 2100469 2126368 1876272 1986719 1860959 1771539 1955298
4851 1955298 1686377 1343094 1722982 1688645 1952758 2137409 1886755 1672020 1902674 2231687
4841 2231687 2051944 2003477 2091097 1954912 1915614 1954908 2083905 1666257 1557647 1478091
4831 1478091 1487861 1422145 1839154 1796012 1878519 1740215 1638428 1661350 1504938 1500793 1239699
4820 1239699 1450850 1561065 1716114 1403234 1435670 1606690 1293077 930458 1258962 1157387
4810 1157387 881142 1301986 1740407 1456690 970161 1107972 1339387 1265959 1251603 1665152
4800 1665152 1813817 1373918 1541032 1437491 1478752 1602032 1661628 1826903 1379994 984020
4790 984020 962749 873128 1322644 1370027 950019 1322730 1153191 1185906 1018764 1243108
4780A243108j56416r3313L06397J2317l99022n9250j39127J04306j04070J58604
4770H73534q4369j33990O25915Q1411n0421m45170l69327j27439K36782m86718
4760A20208J10770N60093K54693J06617K07374j36398m0l39096J30428J05208
4750A119857R8089K57523j76069p80884R6675J49261L4788n5625L67912L20753
4740A432280n02963l59762O1311J00535k5084K49409K21549j65160p4750k74513
4730F62852K20674J28518J4215k24141p9556K88450p1690j1122l27728l55685
4720B44787P83466K96029M1484m81726k80364O32397N5248j01954j00406L93756
4710A482717l46817J3927K03384r7402j2465J05667k50452o7048O1689P1349k09140
$$ plain form
4780 1243108 1086692 993379 1299776 1312093 913071 853821 714694 819000 714930 873534
4770 873534 789165 655175 1281090 1362501 1312080 866910 497583 370144 606926 120208
4760 120208 230978 791071 1045764 1152381 1359755 1223357 1223317 884221 1014649 1119857
4750 1119857 1217946 1475469 1299400 518516 615191 764452 799240 743615 1111527 1432280
4740 1432280 929317 569555 630866 731401 706317 955726 1177275 1012115 937365 662852
4730 662852 883526 1012044 1026259 802118 722562 1011012 939322 928200 600472 244787
4720 244787 1028253 1324282 1365766 884040 603676 1236073 1291321 1189367 1088961 1482717
4710 1482717 1135900 1149827 1353211 1255809 1243344 1349011 1098559 1031511 1093200 1164549 955409
4699I55409J9527N21029j40459J52075j16960k69754J67608L86098m0177R4034
4689A728430j65611l03469k64214O55404j4896j78941J01238m3808K46412j25135
4679A635410Q6794k63508M64141l4620m11133l37446K10246K16794P2725l00741
4669A338662r8789l7103l26259K81156L30843K39918j68175N8139J88581o12266
4659A194707j68872J27436m26693N3029N24395j59675P5005L92112Q8845l84911
4649A315378j25053k76533L90654k16619k67984K8378K49674M5071k6341k07833
4639I08792L43546n1246j69826n2025l37036L62149J68789J83181k37438J87362
4629A306248q6867k75772J718K19830J4837n5228M1155L6377l68837j98283q7191
$$ plain form
4699 955409 974936 1495965 1355506 1507581 1390621 1120867 1288475 1674573 1634396 1728430
4689 1728430 1562819 1259350 995136 1650540 1635644 1456703 1557941 1514133 1760545 1635410
4679 1635410 1722204 1458696 1922837 1888217 1477084 1139638 1349884 1566678 1639403 1338662
4669 1338662 1239873 1202770 876511 1157667 1488510 1728428 1560253 1618392 1806973 1194707
4659 1194707 1025835 1153271 726578 779607 1304002 1144327 1219332 1611444 1700289 1315378
4649 1315378 1190325 913792 1304446 1087827 819843 848221 1097895 1142966 1116625 908792
4639 908792 1252338 1201092 1031266 979241 642205 1004354 1173143 1356324 1118886 1306248
4629 1306248 1219381 943609 945327 1165157 1179994 1124766 1165921 1202298 833461 635178 547987
4618E47987K21510L52094j91122j82079k09219q9167l9492l0293N14716P62403
4608A657338m8123q657n63678j01483O9749k62639m8445K66817k5592n8863J59588
4597A036012j3457P2510j86712L9735K36677k05802j44449K71817J91345m02161
4587H95515J44675r9764J6703M2125O3159M40957M3176k11463l47295L99902j01949
4576A285741j32154J47426M9932K335j1316k70289K83465j71130k01440K22500
4566A205070q439m00968L26623K74276J49585P7592J09028J57865o55376J85273
4556A420529J97509O1781J34568O8742L53895m57229K5418k82373l39279m2781
4546A140780J25277J92654M85978J99349K79953k5377p4817K8057l43337k75746
$$ plain form
4618 547987 769497 1121591 930469 748390 539171 450004 410512 380219 894935 1657338
4608 1657338 1609215 1600558 1036880 935397 1005146 742507 694062 960879 935287 876424 1036012
4597 1036012 1022555 1095065 908353 948088 1184765 978963 834514 1106331 1297676 895515
4587 895515 1040190 940426 957129 999254 1062413 1503370 1546546 1335083 987788 1387690 1285741
4576 1285741 1153587 1301013 1350945 1353280 1341964 1071675 1355140 1184010 982570 1205070
4566 1205070 1196631 795663 1122286 1396562 1546147 1623739 1732767 1890632 1235256 1420529
4556 1420529 1618038 1679819 1814387 1883129 2237024 1779795 1805213 1522840 1183561 1140780
4546 1140780 1266057 1458711 1944689 2144038 2423991 2398614 2323797 2351854 2008517 1732771
4536A732771K46997N2530J65504J74240k48545K35288l7913l20006j33367K010
4526A869509L77329k5960K18357M0494J04537k60477k06199j57486N1040K20766
4516B231910J05917K07771l58802K1360K82783J80294j534L45707m00635r9297
4506B515474O3712J21603k67639l8252J60554M98159M65042m21650R5615j50241
4496C042377m17184L02715j38364M08207L69747O6709j42358k18689j99611j53153
4486B920396K24551M92830J04531l7671L13862m19976M24785P791l98008M67682
4476D100773K72141q2034J86425N18297p8954L11923k24119j39545q6225M94640
4466E273322K67304P1436K74046J17161j87152O2397J76688N54511N46089k29050
$$ plain form
4536 1732771 1979768 2032298 2197802 2372042 2123497 2358785 2320872 2000866 1867499 1869509
4526 1869509 2246838 2220878 2439235 2479729 2584266 2323789 2117590 1960104 2011144 2231910
4516 2231910 2337827 2545598 2186796 2208156 2490939 2671233 2669699 3015406 2614771 2515474
4506 2515474 2579186 2700789 2433150 2394898 2555452 3053611 3518653 3097003 3192618 3042377
4496 3042377 2625193 2927908 2789544 3197751 3567498 3634207 3491849 3273160 3073549 2920396
4486 2920396 3144947 3637777 3742308 3704637 4018499 3598523 4023308 4031099 3633091 4100773
4476 4100773 4372914 4290880 4477305 4995602 4916648 5228571 5004452 4864907 4778682 5273322
4466 5273322 5540626 5612062 5886108 6003269 5816117 5878514 6055202 6609713 7155802 6926752
4456F926752j34426k99085o4480K79325M80881M50534K68690J88228K13079k49880
4446H059618J29856L24315L37929L39010Q72510R5034j56839M62493K8706J86892
4436A0679524O29117N72937K39380J67864N40033M59172J14310N62217N49164
4427A4513718M05840J52218Q20448R74743M50218L75246O07310Q01383M94731
4418A9595855O17796J108604P33336O31745J059722P56144J089195J112496J115285
4409B7820178J165667J263768J891783J610801J306120J955315J902404J792673
4401D0708709K118841K166413K738667K903207K537164L586468L343490L569466
4393F3672425L954446M223656L756024L742976M012700L579090M122907L565841
$$ plain form
4456 6926752 6792326 6493241 6428761 6708086 7188967 7639501 7908191 8096419 8309498 8059618
4446 8059618 8189474 8513789 8851718 9190728 10063238 10158272 10001433 10463926 10492632 10679524
4436 10679524 11308641 11881578 12120958 12288822 12828855 13288027 13402337 13964554 14513718
4427 14513718 14919558 15071776 15892224 16866967 17317185 17692431 18299741 19101124 19595855
4418 19595855 20213651 21322255 22055591 22687336 23747058 24503202 25592397 26704893 27820178
4409 27820178 28985845 30249613 32141396 33752197 35058317 37013632 38916036 40708709
4401 40708709 42827550 44993963 47732630 50635837 53173001 56759469 60102959 63672425
4393 63672425 67626871 71850527 75606551 79349527 83362227 86941317 91064224 94630065
4385I4630065L882436L852944L682643L245095L332349K791009K002591K343588
4377A19762720J967150J343594Q29382O29619m69698p57312j170830j305410k125336
4368A18703879k039852k553114l036197k871002l709117l280017l684445m093851
4360I3436284m112124l865672m234082l775370l576770m070527l744875l616011
4352F2440853l444044l396095l068250l013261k831937k351955k553159j878816
4344C9903336j875618k185912j498644j667623k063122p74400p46983j320258
4336B7770776r84605j234069j539534n46711o88894j105871p62397q60191p59479
4327A9289025o24265m39918r89573o72202o53909m33667m10052m16511n65180
$$ plain form
4385 94630065 98512501 102365445 106048088 109293183 112625532 115416541 117419132 119762720
4377 119762720 121729870 123073464 123902846 124532465 124062767 123305455 122134625 120829215 118703879
4368 118703879 116664027 114110913 111074716 108203714 104494597 101214580 97530135 93436284
4360 93436284 89324160 85458488 81224406 77449036 73872266 69801739 66056864 62440853
4352 62440853 58996809 55600714 52532464 49519203 46687266 44335311 41782152 39903336
4344 39903336 38027718 35841806 34343162 32675539 30612417 29838017 29091034 27770776
4336 27770776 26786171 25552102 24012568 23465857 22776963 21671092 20908695 20048504 19289025
4327 19289025 18664760 18224842 17235269 16563067 15909158 15475491 15065439 14648928 14083748
4318A4083748j91474l40023l23577r15821l51991m15156j61716R418o32964l3188
4308A0727256m86110m62033J36056k59506k47932J12401n92029j60495l04338
4299H463270l79800m2385L11123j13945k22550m54975k14771j36270k90918k6438
4289F892341m74656j30175l44087J6129L69035o22878j89185K58171J73170m75034
4279E472831j83461l15773J70291k22678j21798l37534M10128l02422k53817r4825
4269D220942M80O1767j13543l94o39150K73790K70353l32467k32638J21060j82953
4258C447247o6604l02364L81455k43583N4129l13782P6382Q1807O7936j42068
4248C040555n2955j54001l2611o4547j81280k52445k26512L97552K40456m23406
$$ plain form
4318 14083748 13892274 13552251 13228674 12312853 11960862 11545706 11383990 11393408 10760444 10727256
4308 10727256 10241146 9779113 9915169 9655663 9407731 9520132 8928103 8767608 8463270
4299 8463270 8083470 8041085 8352208 8238263 8015713 7560738 7345967 7209697 6918779 6892341
4289 6892341 6417685 6287510 5943423 5959552 6328587 5705709 5516524 5774695 5947865 5472831
4279 5472831 5289370 4973597 5143888 4921210 4799412 4461878 4872006 4569584 4315767 4220942
4269 4220942 4221422 4283189 4169646 4169252 3530102 3803892 4074245 3741778 3509140 3630200 3447247
4258 3447247 3380643 3078279 3459734 3216151 3270280 2956498 3032880 3114687 3182623 3040555
4248 3040555 2987600 2833599 2800988 2736441 2555161 2302716 2076204 2473756 2714212 2290806
4238B290806j0289j70788J28562K24006l97661j24847L57375j48118J16491N9889
4228B325426j03516J03080l55262J79835q6317j56181m84500j782L80941l74666
4218A427058J48717K16799j25105N9897k82472l14080J75298K73810K8618m0106
4208A568434n53626K82171k63313O0026j76226J76116L46563J22166k52156o10864
4198F99291J7195K62724M014J10541L10982l38246j16841L17755K7593R4344J78908
4187A568260N0897k44822k07020Q1583J02228J11879J14254l16205m4927Q0225
4177A296352k21885l7488J85695M6413j20226J86674k03905j7051J0169L1254
4167A156002n8999M6727l46171J89744P0568m32077R2221l9410l77135J03497
$$ plain form
4238 2290806 2280517 2109729 2238291 2462297 2064636 1939789 2297164 2149046 2265537 2325426
4228 2325426 2221910 2324990 1969728 2149563 2063246 1907065 1422565 1420783 1801724 1427058
4218 1427058 1575775 1792574 1667469 1727366 1444894 1130814 1306112 1579922 1608540 1568434
4208 1568434 1014808 1296979 1033666 1093692 917466 1093582 1440145 1562311 1310155 699291
4198 699291 716486 979210 983224 1093765 1404747 1066501 949660 1267415 1295008 1389352 1568260
4187 1568260 1619157 1374335 1167315 1248898 1351126 1463005 1577259 1261054 1216127 1296352
4177 1296352 1074467 1036979 1222674 1269087 1148861 1335535 1131630 1114579 1124748 1156002
4167 1156002 1097003 1143730 797559 987303 1057871 625794 718015 678605 301470 404967
4157D04967M06998L06962j4083M4349K5820N6106o0394J59792L95237k65597l90594
4146A069563o6422k18157j95272J59518L91503k09413m11383K61975r6161M67961
4136A153712k68601K44794l82623p16291M49203L05075L13111q9834P382l54695
4126F61233k79748K14482J01416J48652l04390M2909K19529R2416k40997J87785
4116H43287L34059m14695M89423j74011L6791j65021N953j12977o8273k82446
4106D92090L17536j57240J3573K62342k60522L31515L7388l21358O9290K04529
4096I89143k84607m636K22328J97119k10701j99778n380M70896m03625k6930J86019
4085I29848R6465J76616l64950j84255J13406J68485L8691K52252J90039l47129
$$ plain form
4157 404967 811965 1118927 1104844 1149193 1175013 1231119 1170725 1330517 1725754 1460157 1069563
4146 1069563 1003141 784984 589712 749230 1140733 931320 519937 781912 685751 1153712
4136 1153712 885111 1129905 747282 30991 480194 785269 1098380 1008546 1015928 661233
4126 661233 381485 595967 697383 846035 541645 584554 804083 896499 655502 843287
4116 843287 1177346 762651 1252074 1078063 1114854 949833 955786 842809 774536 492090
4106 492090 809626 652386 665959 928301 667779 999294 1036682 715324 784614 989143
4096 989143 704536 699900 922228 1119347 908646 708868 703488 1174384 770759 743829 929848
4085 929848 1026313 1202929 837979 653724 767130 935615 974306 1226558 1416597 1069468
4075A069468k3547p5761R6712O08689j80855q3727M35552k65225j65047J35627
4065A551886j34166k35638J64837J6115N5569k61658J0366J72348K64620p0975
4055A533304L30375L05450k92660j63726j0534O0128k45434q0061j32985j82360
4045A121497K85624J81212L2163j82185o57095J9433J84397k94715N9554J338
4035G51223M88193k1129P2461L8040k86388L34708j94806K14695L51456j64670
4025A583783n3786o69J38798K72117k56916J7432j54859k59855R1109J16188q9
4014A493253o837n57548n81463L21540K68717k40753q4758J49930J04785j61169
4004G05697P330K62720j60659l85618N94974l48953k4894J48077r3252l6459j58872
$$ plain form
4075 1069468 1045921 970160 1066872 1675561 1494706 1410979 1846531 1581306 1416259 1551886
4065 1551886 1417720 1182082 1346919 1363034 1418603 1156945 1167311 1339659 1604279 1533304
4055 1533304 1863679 2169129 1876469 1712743 1702209 1762337 1516903 1436842 1303857 1121497
4045 1121497 1407121 1588333 1620496 1438311 781216 800649 985046 690331 749885 751223
4035 751223 1239416 1218287 1290748 1328788 1042400 1377108 1182302 1396997 1748453 1583783
4025 1583783 1529997 1529328 1668126 1940243 1683327 1700759 1545900 1286045 1377154 1493342 1493253
4014 1493253 1486416 928868 347405 668945 937662 696909 612151 762081 866866 705697
4004 705697 713027 975747 815088 429470 1024444 675491 650597 798674 705422 668963 510091
3993E10091k0764L8720k47619l23234q610M39958J21704j18266J76299P5837j49014
3982D95102l75354j54927K97870K14412K03475J63338m89288m22987K21813M23485
3972E76939r6885m85463K67347k27624J15995L70599L0309k10381q9594j03685
3962A47557J28820K18706k56834N5201O878Q2159K11949n48831o65617M35249
3952a84763N30834K0794j26497O65n28126M77103j60777k19433L39384J78366
3942C27550K05474K35903l29741j11689P3137m33731N785M01716k38316L87741
3932E23829J47688j93115k36525m1471R1602K5090k07915J61776L54833O144l34726
3921B97210j56370L58077O4094k55476K15512j99875k85590J15589M62645J69310
$$ plain form
3993 510091 489327 528047 280428 -42806 -51416 388542 510246 391980 568279 644116 495102
3982 495102 119748 -35179 262691 477103 680578 843916 354628 -68359 153454 576939
3972 576939 480054 -5409 261938 34314 150309 520908 551217 340836 251242 147557
3962 147557 276377 495083 238249 293450 300328 382487 594436 45605 -620012 -184763
3952 -184763 346071 366865 240368 241033 -287093 190010 29233 -190200 149184 327550
3942 327550 533024 768927 439186 327497 400634 -33097 -27312 374404 136088 523829
3932 523829 671517 478402 241877 200406 292008 317098 109183 270959 625792 631936 297210
3921 297210 140840 498917 563011 307535 523047 323172 37582 153171 615816 785126
3911G85126n56237l89040K43637N88231m38363o288Q1284k87625K33151l1066
3901B22810J50865R0708k37465k29603q2641K03676q1395j77119j22033n1754
3891c13951K81800R0154K10704l47586n9839L62175j27381k12571k50817M90624
3881A23312l34203K69567M49452j49468j42516M73r8551K62136j0435j69804m6765
3870A53198J72873k35744j74067K08340k47981Q8735L48955j67937j91505K66848
3860B21715r1332J07039O8189j04460l7344j75796O2756L19992j94834K74277
3850D50202j90158J69221K24090k70238O3092L8403j5976q4518l11355l26031
3840b53268M4290R6402J9933m1250L92925l1523k49047j00390K08787L76604k41433
$$ plain form
3911 785126 228889 -160151 83486 671717 233354 227066 308350 20725 253876 222810
3901 222810 373675 464383 226918 -2685 -85326 118350 36955 -140164 -262197 -313951
3891 -313951 -32151 58003 268707 -78879 -138718 223457 96076 -116495 -367312 123312
3881 123312 -210891 58676 508128 358660 216144 216617 118066 380202 369767 199963 153198
3870 153198 326071 90327 -83740 124600 -123381 -34646 314309 146372 -45133 221715
3860 221715 130383 237422 305611 201151 163807 -11989 50767 370759 175925 450202
3850 450202 260044 429265 653355 383117 446209 484612 468636 384118 72763 -253268
3840 -253268 -208978 -112576 -92643 -133893 259032 227509 -21538 -121928 86859 463463 222030
3829B22030n69777l5663K76203K32246O8104j7924o55021L79485m4522j9604n2425
3818b16868J21948J40931J8839j33721L24492j50408k3682L28326o859q3036j63805
3807A56157l76088Q5012J93198q7540R5192n2507L50572Q9694j40896n16762J27807
3796g6161J50079n59068K59984K31116J26418P5515m65479J29522l7836m05238
3786e71148P30929K64995l84817j01445k22450O02741l29066L41710j80453j63581
3776a2585K50577J36642l30424M6312J7158P05l12570P1161L91583m71784O3204
3765a50021j27524L28943l8016k25149J57763l7770M65791l89764j25507J90949
3755D9695p6804M6006K26457M9093o0579m34636k97942J33570N87758q1300j82838
$$ plain form
3829 222030 -347747 -383410 -107207 125039 193143 175219 -479802 -100317 -144839 -164443 -216868
3818 -216868 -94920 46011 64850 -68871 255621 105213 81531 409857 402998 319962 156157
3807 156157 -219931 -134919 58279 -29261 65931 13424 363996 453690 312794 -203968 -76161
3796 -76161 73918 -485150 -225166 5950 132368 207883 -257596 -128074 -165910 -571148
3786 -571148 159781 424776 39959 -61486 -283936 318805 -10261 331449 150996 -12585
3776 -12585 237992 374634 44210 90522 107680 108385 -204185 -133024 258559 -213225 -150021
3765 -150021 -277545 51398 13382 -211767 -54004 -91774 374017 -15747 -141254 49695
3755 49695 -27109 18897 245354 294447 233868 -200768 -498710 -365140 222618 141318 -41520
3744d1520J34947K57878q4820j28536j53136j67641L7524j52069M26609J53589
3734B82825k22464J50781k74156J05851M2816k39870j11346L04407J078k59172
3724b19250M00120n3496R6966k98356L25748J76269L9480m85499l60666L69538
3714i146j42217N4719K25174J28888j11623O8814J95065l94989r6831K69003q6061
3703A00796q6410k31327l4230L65544l14276m7662J28745K23938k64804k2406
3693a82092o81L4882q7750J99879J57509k0079l33074M1477k33699j430P11556
3682B86498K09287j54436o25851K50673R6402k22479J45827k15887j21430P2787
3672b78609j05001J24430K99531O4886n9831K4642k09443j03351k50967M42362
$$ plain form
3744 -41520 93427 351305 266485 137949 -15187 -182828 -145304 -297373 129236 282825
3734 282825 60361 211142 -63014 42837 85653 -154217 -265563 38844 39922 -219250
3724 -219250 180870 127374 224340 -74016 251732 428001 467481 -18018 -378684 -9146
3714 -9146 -151363 -96644 128530 257418 145795 214609 409674 14685 -82146 186857 100796
3703 100796 14386 -216941 -251171 114373 -199903 -247565 -118820 105118 -159686 -182092
3693 -182092 -182773 -147891 -235641 -35762 121747 101668 -231406 -189929 -423628 -425058 286498
3682 286498 495785 341349 -284502 -33829 62573 -159906 -14079 -229966 -351396 -278609
3672 -278609 -383610 -259180 40351 105237 45406 70048 -139395 -242746 -493713 -51351
3662e1351J83323k12244J67711j28663K36963n31939L8377L23144J37038N5234
3652B17593l88123K71441K57278p6997J47907k83615l94704L67054o5660J053
3642E3227K35568k66338j88195l37674J91228L72199m17707j1363J82404K75869
3632H9218n7944m7293P1359l14957J17953k5460j17863J01345R022m7500J7572
3621b04548l3662M08325n6751p4758J46434j98546K60961J35563k77734M2971
3611A48255k40985j76479Q329j05281K72585K589l06002m7157k86801K40829O03764
3600A13646J35098m3799k19997J77808m08572m0706j46589P5441M08103J26425
3590A76858J97548n09526R7130O3642j18805L9253r9196L1812j35992K13163j77651
$$ plain form
3662 -51351 131972 -80272 87439 -41224 195739 -336200 -297823 25321 162359 217593
3652 217593 -170530 100911 358189 281192 429099 145484 -249220 117834 52174 53227
3642 53227 288795 22457 -165738 -503412 -312184 60015 -357692 -369055 -186651 89218
3632 89218 31274 -16019 55340 -259617 -141664 -167124 -284987 -183642 -174620 -222120 -204548
3621 -204548 -238210 170115 113364 38606 185040 -13506 247455 383018 105284 148255
3611 148255 -92730 -269209 -260880 -366161 -93576 -90987 -396989 -444146 -730947 -490118 113646
3600 113646 248744 204945 -15052 162756 -245816 -286522 -433111 -357670 50433 176858
3590 176858 374406 -135120 -37990 25652 -93153 -53900 -153096 -121284 -257276 -44113 -221764
3579b21764K20812K37665J94377q40803m48951J91841Q20290j0535J45051j46005
3569A41978l13966M79819l13415K20858j82875K66577k10843l42119k52174K63338
3559b42822K03747J04728l6295j17554M77392l67267j35559K68699J94903k82396
3549F7576l40537j49575J05429J93661j85894P5268L48986l14259J9728R5007
3539h4610L57851l63197N6748J11379k15424K53872j67135k4811L87581n37389
3529b25135j08352M32167J47432J76264k92323j84394j76093M3603k14066L89551
3519a1346M86707J57316j07570j34775j68178k67588J31583J4957K45097k53976
3509I2227k95387K51922m79018J84164N62555J64474p15746K92077p7390j36839
$$ plain form
3579 -221764 -952 236713 431090 -409713 -858664 -666823 153467 142932 287983 141978
3569 141978 -171988 307831 -5584 215274 32399 298976 88133 -253986 -506160 -242822
3559 -242822 -39075 65653 29358 -88196 389196 21929 -113630 155069 349972 67576
3549 67576 -272961 -422536 -317107 -123446 -309340 -234072 114914 -199345 -179617 -84610
3539 -84610 273241 -89956 -33208 78171 -137253 116619 -50516 -75327 312254 -225135
3529 -225135 -333487 98680 246112 422376 130053 -54341 -230434 -186831 -400897 -11346
3519 -11346 475361 632677 525107 390332 222154 -45434 86149 101106 346203 92227
3509 92227 -203160 48762 -430256 -246092 316463 480937 -234809 57268 -20122 -156961
3499a56961K49026J87118k45022l00668R0207J39229R9705p9099K42568j7755
3489B08348k66445j18258j39997O99544o1087l31310M580j51265N803j73980j07873
3478d31940L43284k17812k57493L53892j91123q189L00949K85605k83860J24734
3468A8047R190j63237J11273K04427K35879l55290K4100k20876p4948k41173M47606
3457e002J63942m45709M59301j26420R2632j57908J45924N5174m8956L24476J3133
3446D70587l85093k78140j20154L17232L42350j27346j72753p7978p4439j81289
3436b87023M37220K46358j40568k90212j18017J82114J23439r3706j7867l2399
3426I339p5269M43121J98209p53641k05514K32427P2696K22637p6823l86253J00331
$$ plain form
3499 -156961 92065 279183 34161 -266507 -176300 -37071 62634 -16465 226103 208348
3489 208348 -58097 -176355 -316352 383192 322105 -9205 -4625 -155890 -150087 -324067 -431940
3478 -431940 -88656 -306468 -563961 -210069 -401192 -409381 -108432 177173 -106687 18047
3468 18047 27237 -136000 -24727 179700 415579 60289 84389 -136487 -211435 -452608 -5002
3457 -5002 158940 -286769 172532 46112 138744 -19164 126760 181934 132978 457454 470587
3446 470587 85494 -192646 -312800 4432 346782 219436 46683 -31295 -105734 -287023
3436 -287023 150197 396555 255987 -34225 -152242 29872 153311 59605 41738 9339
3426 9339 -65930 377191 575400 -178241 -383755 -151328 -78632 144005 67182 -319071 -218740
3415b18740N26673j18328j35553j7434P4656Q2696K3878l19544k34185j16040
3405d51921Q3712N38849k31106O984R9110j56119J38693J70426k6762k73204J76541
3394G5203K09856J3666R694J05324l15103K50072k34091J58746J74947j0275l5285
3383D02754n21632j51056K69924J52672P8763K23173l42794J29123n9139q5429
3373I6359l1198k39745R1704N8766L46232j47647N2760k72014p4412k2463K37658
3362I6000J48754k48891J26155N7435j0074k02865M9508k34240j93549J73473
3352b38294J85599L10072o04735L13746l2554q7344J82266L54271j29457m78420
3342b24850j4778j34062P62757j13591o5414r7349r1223l01515P0453O5183n5664
$$ plain form
3415 -218740 307933 189605 54052 36618 111274 193970 217848 -101696 -335881 -451921
3405 -451921 -368209 170640 -60466 -53482 45628 -110491 28202 198628 171866 -101338 75203
3394 75203 285059 298725 308419 413743 98640 348712 114621 273367 448314 438039 402754
3383 402754 -118878 -269934 -10 152662 231425 454598 111804 240927 181788 96359
3373 96359 65161 -174584 -82880 -24114 322118 174471 227231 -44783 -119195 -141658 96000
3362 96000 244754 -4137 122018 179453 169379 -33486 16022 -218218 -411767 -238294
3352 -238294 -52695 257377 -347358 -33612 -66166 -153510 28756 383027 253570 -224850
3342 -224850 -239628 -373690 389067 275476 210062 112713 21490 -280025 -209572 -144389 -200053
3331b00053k09016K49519M3708l3377l2204Q7382J15090k95053J12410O3533K22749
3320A24688k82421Q5932J5640l13271L15042L9113l18713L14825j67051R2827
3310i3389O07933l12427j5732l65255L5853J88491J89116K24414k43556j11785
3300A03663O5229L21251o9560n0438L00609j48181m98618P1166L94506l36574
3290A53053m6592M40714m29276J31196O4890j26670K04883Q4935j82950q0708
3280B13475J47832n10681J33221j12423K65974K62368j7660K07003O8049j30168
3270E26990J40549m68809k74254J65612K05745j56023K24917J83561j4073j82601
3260C51614L76987M8597l3476m9586n0392r4906K7846j35868l04257L18574k56146
$$ plain form
3331 -200053 -409069 -159550 -115842 -149219 -181423 -94041 21049 -274004 -161594 -98061 124688
3320 124688 -157733 -71801 -56161 -369432 -54390 -15277 -333990 -19165 -186216 -93389
3310 -93389 514544 202117 186385 -178870 -143017 45474 234590 459004 215448 103663
3300 103663 168892 490143 420583 370145 670754 522573 23955 95121 489627 153053
3290 153053 106461 547175 117899 249095 313985 187315 392198 477133 294183 213475
3280 213475 361307 -149374 -16153 -128576 137398 399766 382106 589109 657158 526990
3270 526990 667539 198730 -75524 90088 295833 139810 364727 548288 534215 351614
3260 351614 728601 777198 743722 694136 643744 548838 576684 440816 136559 455133 198987
3249A98987M11397P611Q2141k85619K7579M70920N2420r0164K0606j66158p5196
3238F54524j54480m29889l6626M66615J29712K42007l55403J0738j26774k29603
3228A70821O85679M98351k74404k1347L91308n64217j3673K61054K5224l6297
3218A122499r1068l52372J12074M92709m3489m23653L68308n7220m22916K75434
3208I80306N7727L28434L55065K17136J20224n29334J60181n4919K6658j49918
3198A511560k68511J2785k19154K33655J20933K57768L2653j51580m6735J56812
3188A640186q7557K64920k0128R6577K06626k8362j07240K20116P5127k22791
3178B037474P8398j3197m05728K14078J6482R5354R7490K61181J5241J75975k40059
$$ plain form
3249 198987 610384 617995 700136 414517 442096 913016 965436 875272 895878 729720 654524
3238 654524 500044 70155 33529 500144 629856 871863 516460 527198 400424 170821
3228 170821 856500 1354851 1080447 1059100 1450408 886191 872518 1133572 1158796 1122499
3218 1122499 1031431 679059 791133 1283842 1240353 816700 1185008 1127788 704872 980306
3208 980306 1038033 1366467 1721532 1938668 2058892 1529558 1689739 1634820 1661478 1511560
3198 1511560 1243049 1255834 1036680 1270335 1391268 1649036 1681689 1530109 1483374 1640186
3188 1640186 1552629 1817549 1797421 1893998 2100624 2072262 1965022 2185138 2260265 2037474
3178 2037474 2115872 2102675 1696947 1911025 1927507 2022861 2120351 2381532 2396773 2572748 2332689
3167B332689L39254K49513m09257n03271j63059K50432J3787K01273k79652L0677
3157B062386N00906n18370L47162L6383L15527r5261J10158L05709k90013j64490
3147B610097l4720K77314j66782K39599m8508l0348k30282J04982O1781Q8653
3137B871786O680J14882k25216L9331k56577l51251r0096J37536j92755j34353
3127A919967j57860J34392J56126N59652j35516k50136P8268Q5536l33622J77236
3117B234043R2505k10783j31099K0766p0018k02869k80418m1100K57413p6021
3107A592419J50051k82665J38081K94227K17245l57846j33894k35048o6543k22950
3097A093077J21664j8312N7336m6431P9769J55386l9262J41664j01399k14467
$$ plain form
3167 2332689 2671943 2921456 2512199 2008928 1845869 2096301 2110088 2311361 2031709 2062386
3157 2062386 2563292 2044922 2392084 2428467 2743994 2648733 2758891 3064600 2774587 2610097
3147 2610097 2575377 2852691 2685909 2925508 2877000 2846652 2616370 2721352 2783133 2871786
3137 2871786 2878466 2993348 2768132 2807463 2550886 2199635 2109539 2247075 2054320 1919967
3127 1919967 1762107 1896499 2052625 2612277 2476761 2226625 2304893 2390429 2056807 2234043
3117 2234043 2326548 2115765 1984666 2005432 1935414 1732545 1452127 1411027 1668440 1592419
3107 1592419 1742470 1459805 1597886 1892113 2109358 1751512 1617618 1382570 1316027 1093077
3097 1093077 1214741 1196429 1253765 1207334 1287103 1442489 1403227 1544891 1443492 1229025
3087A229025k41324Q8298j35993K02835r3826K02402N2771j99231j49096m5390
3077I10471R7363j51496Q5225K05189L3563o7382l65138K97730M0636R7879K7709
3066A211749J01538n50532J05269o8778n9116k26396q5001K86272j82144L27601
3056H60462m35095L4595J39098m6842k47937o3801N37868J8160j24453N9297l12463
3045D18889L68322M02840k38395k79913k1538j8239M76076l28157k48066q6629
3035D45190o17602L97283L44890J79745k55328j48222k10641K95935K11001O0215
3025G02466J76071l85132k36646K30483J75057o0722k01790K532p7348L69726
3015F94697J59855l85814R3141l23631r0848K79305J17500N4657j21833n95940
$$ plain form
3087 1229025 987701 1075999 940006 1142841 1049015 1251417 1304188 1104957 955861 910471
3077 910471 1007834 856338 941563 1146752 1180315 1112933 747795 1045525 1086161 1184040 1211749
3066 1211749 1313287 762755 868024 799246 740130 513734 428733 715005 532861 860462
3056 860462 425367 459962 599060 552218 304281 240480 778348 796508 672055 731352 418889
3045 418889 787211 1190051 951656 671743 650205 631966 1108042 779885 531819 445190
3035 445190 -172412 224871 569761 749506 494178 345956 135315 431250 642251 702466
3025 702466 878537 493405 256759 487242 662299 601577 399787 402319 324971 694697
3015 694697 854552 468738 561879 238248 147400 426705 544205 598862 477029 -118911
3005a18911j78405L10506M12231j65685j48054j11736O4501j1214K49441p8654
2995B24020P6050Q8333Q5605n3502j68798m33626K35786J74745m08976M74412
2985B94049n9378j321L46173l62756j05418J0868L37001J22188m01472K64894
2975D44828L1382j13036J52091k02572n6145J12859M4368J40685o6442l74982
2965A13036M26778J27112l62680J88874L39283K56839k31412k33584l4581k05346
2955C84319l02413q4225L36604L3550j02513l67286L19937K14096J09348m00658
2945A40759l88205L02469J04692L58388k64906L5287L56461l9336k94973M40754
2935G51390q6779J09078J07247n95938J09710M0100l125k34319J29907k34118
$$ plain form
3005 -118911 -297316 13190 425421 259736 111682 -54 64447 53233 302674 224020
2995 224020 300070 388403 474008 420506 251708 -181918 53868 228613 -180363 294049
2985 294049 234671 233350 579523 216767 111349 122217 459218 581406 179934 444828
2975 444828 476210 363174 515265 312693 256548 369407 413775 554460 488018 113036
2965 113036 539814 666926 304246 493120 832403 1089242 857830 624246 589665 384319
2955 384319 81906 -2319 334285 367835 265322 -101964 217973 432069 541417 140759
2945 140759 -247446 55023 159715 518103 253197 288484 644945 605609 310636 751390
2935 751390 664611 773689 880936 284998 394708 434808 431683 197364 327271 93153
2925I3153l07093K45309J87343N9707K45063P0906k28132m6045J9091l80122K7182
2914a3638P7348l8903L7302K66061o3252n43834L68948l2164K9048j08321l6233
2903e7638k77315K97730K44629o3402L38354j51673k58395p2331J16324q345j45632
2892c7694N6211k171j3073n0494J04788j415J27707K4022O197K52769l17580K43629
2880C92896j51540n30425M02036P1953j4554k6592J35959l04444K55681k38149
2870g179p1577K0498j91585L85009j06867M4074J54673l8150J48431m04429J59019
2859I1917J04174k53011K81940Q4837k76001K3269J4915k5946m8909J67795k12991
2848d8011Q8497P8981J5320j43094Q1828m04380K29688J76530L78411k69443k54325
$$ plain form
2925 93153 -213940 31369 218712 278419 523482 594388 366256 320211 339302 -40820 -13638
2914 -13638 63710 24807 62109 328170 264918 -278916 90032 57868 86916 -21405 -57638
2903 -57638 -334953 -37223 207406 144004 482358 330685 72290 -41 116283 107938 -37694
2892 -37694 18517 16346 3273 -47221 57567 56152 183859 207881 214078 466847 149267 392896
2880 392896 241356 -289069 112967 184920 170366 143774 279733 -24711 230970 -7179
2870 -7179 -78756 -58258 -249843 135166 28299 72373 227046 188896 337327 -67102 91917
2859 91917 196091 -56920 225020 309857 33856 57125 72040 46094 -2815 164980 -48011
2848 -48011 40486 119467 134787 -8307 73521 -330859 -101171 75359 453770 184327 -69998
2837f9998p1251m102N03990j31045K55414j61204J89234l94289j05865J4510J1176
2826C6570N7126j69732M57390J38869m47468J93767K21508K56108K199J30047
2816H76384j23394p35946J13964K18748l88448O74502k80984N8861j33032K38658
2806E19313P6521m3529q61213r1674J61271M07869r9385j22091J84669J77555
2796C09306J1175k41893j3449J46161P2123k85372m48379R6377J19605K03564
2786c0782N87470m49066k44847L56281K36748l14263k47410N7756K2054q7051
2776a13110J71655k50040j0583k29595Q9932N29551q5189p6894L44292o9893k24906
2765G5220l43193K32211l26107K78062L46595m08927m11257L11099K19569k50952
$$ plain form
2837 -69998 -141249 -145351 358639 227594 483008 321804 511038 116749 10884 25394 36570
2826 36570 93696 -76036 381354 520223 72755 266522 488030 744138 746337 876384
2816 876384 752990 17044 131008 349756 -38692 635810 354826 413687 280655 519313
2806 519313 595834 552305 -308908 -400582 -239311 168558 69173 -52918 131751 309306
2796 309306 320481 78588 65139 211300 283423 -1949 -450328 -353951 -234346 -30782
2786 -30782 556688 107622 -137225 219056 455804 141541 -105869 -48113 -26059 -113110
2776 -113110 58545 -191495 -202078 -431673 -341741 187810 102621 25727 370019 300126 75220
2765 75220 -267973 -35762 -361869 -83807 262788 -146139 -557396 -246297 -26728 -277680
2755b77680M58042M54009j23279n03120j43457K08612J13304J50981k70452r9029
2745c2069n052K03499j56335O1680k71272k88803M69724K09091K66351j57640
2735B99174m72069m26559M83790R3112n27682K85425r9057L41090J74138l71747
2725b20385J58168l70652J67252k13393M12123K7819k00924m622J60579J77852
2715I3817j34381J32660m3678k65636p5318J97349J31432j29037o9196J71536
2705I548J95428L8972n97149L14644L01814J62698m13055k20209j4458K09975
2695a1792m5423j61766L11843j35896L15700k25985m11290K49739L9299p1044
2685a46615o20366P1792L28386k2661L87655J16042k40863l56202L87162k61395
$$ plain form
2755 -277680 180362 634371 511092 7972 -135485 73127 186431 337412 66960 -32069
2745 -32069 -37121 166378 10043 71723 -199549 -488352 -18628 190463 456814 299174
2735 299174 -172895 -599454 -115664 -22552 -550234 -264809 -363866 -22776 151362 -220385
2725 -220385 -62217 -432869 -265617 -479010 -66887 -39068 -239992 -244614 -84035 93817
2715 93817 -40564 92096 48418 -217218 -292536 -95187 36245 -92792 -161988 9548
2705 9548 204976 243948 -353201 -38557 263257 425955 12900 -207309 -221767 -11792
2695 -11792 -57215 -218981 92862 -43034 272666 46681 -364609 -114870 -75571 -146615
2685 -146615 -766981 -695189 -366803 -389464 -1809 114233 -126630 -482832 -95670 -357065
2675c57065M28283k89439m03407L31096J43487K42341k84197J85999k1442l4165
2665e8509N32458j11779m53810j10634R3623L276l70712M93779L16140o00521
2655b66689l31128J51917L3058J61858K37072j58288j30826K83325j71390m566
2645a95657j23418K14618k94802R6635M98635K4820l95532O5104K12957J80090
2635B83450K08359k60872N0697l30525Q2615j90386J9585L08821j85342K80616
2625B67018j67718l6524o3031j74364K16976j75305M8500L3161K10059l78838
2615b20066J87701J03671o9404J0701j69743K55068j85418J51038J09508j54658
2605A8398j09432O7150j2922j11430m4623j33450j7020j78528j68130J71586J55574
$$ plain form
2675 -357065 71218 -218221 -621628 -290532 -147045 95296 -188901 -2902 -24344 -58509
2665 -58509 473949 362170 -91640 -202274 -108651 -105375 -476087 17692 333832 -266689
2655 -266689 -597817 -445900 -412842 -250984 -13912 -172200 -303026 -19701 -191091 -195657
2645 -195657 -319075 -104457 -399259 -302624 196011 220831 -174701 -109597 103360 283450
2635 283450 491809 230937 281634 -48891 33724 -156662 -137077 171744 -13598 267018
2625 267018 99300 62776 -255 -174619 42357 -132948 -84448 -51287 158772 -220066
2615 -220066 -32365 71306 1902 12603 -157140 97928 -87490 63548 173056 18398
2605 18398 -91034 -23884 -36806 -148236 -192859 -326309 -343329 -521857 -689987 -518401 -362827
2594c62827M18200O8826o2592j19285L24425k41689k7951J38394K4043j74565
2584a5021O9295n7056K16884L6985n00598J67787K36092k93102j02056Q5136k6992
2573a82646K4259M2994O3313j21582N1517J31466r8318k15454M30949R5093k92753
2562g1162j02566R7069o6898L52350l6125l3018n35022K99277J05853j28610O5834
2551e3018j13440k58817N0227j04844J10064J84405J00052N0210R0934k05315
2541a49542J70030j49133j13970r0014Q5424j79676K66871J15662l20858K9994
2531c35212L74536K41673N0405r8711q7264k68796k21859j22537O2708j41879
2521e46936O5217K44908j96820J81937q769j50121Q403K74515L33761m55309K19121
$$ plain form
2594 -362827 55373 124199 61607 -57678 266747 25058 -2893 135501 159544 -15021
2584 -15021 54274 -2782 214102 251087 -249511 -81724 154368 -138734 -240790 -155654 -182646
2573 -182646 -158387 -115393 -52080 -173662 -122145 9321 -88997 -304451 126498 221591 -71162
2562 -71162 -173728 -76659 -143557 208793 172668 139650 -395372 -96095 9758 -118852 -53018
2551 -53018 -166458 -425275 -375048 -479892 -369828 -185423 -85371 -35161 55773 -149542
2541 -149542 20488 -128645 -242615 -332629 -247205 -426881 -160010 -44348 -365206 -335212
2531 -335212 39324 280997 331402 232691 145427 -123369 -345228 -467765 -405057 -546936
2521 -546936 -481719 -236811 -433631 -251694 -260463 -410584 -402181 -127666 206095 -249214 -30093
2510c0093K64919m77556n8928m00333K98190n8186j12854L06240j38637q4932
2500d92170N44328J51181k69602j55116K37446j53325j46394o7745M97729J8123
2490A64455K81775K00969j57238m23717l61512P377L69016k34884O5226J1516
2480g7017J51250L2315J34857l9164m73728K94678P3825J550L75207l92517l13003
2469b31747q8649N2572k80566q78J16310L09809J23403m44705j23986L96912L24845
2458A53320j46350k49366l31255n18185N19298k2941j65638K09216K55532K50814
2448d5555J13052k71640R9137Q360j95581l59235L42233L82032k46015J38146
2438c5066L12044j60906n10019K58537K87819j60613m2119o8292k71167J49077
$$ plain form
2510 -30093 234826 -242730 -301658 -701991 -403801 -461987 -574841 -268601 -407238 -492170
2500 -492170 52158 203339 -66263 -221379 16067 -137258 -283652 -351397 146332 164455
2490 164455 446230 647199 489961 66244 -295268 -287891 81125 -153759 -88533 -77017
2480 -77017 74233 106548 241405 202241 -271487 23191 97016 98566 473773 81256 -231747
2469 -231747 -320396 -267824 -548390 -549268 -432958 -123149 254 -444451 -568437 -171525 153320
2458 153320 6970 -242396 -573651 -1091836 -572538 -595479 -761117 -551901 -296369 -45555
2448 -45555 67497 -204143 -105006 -96646 -292227 -651462 -309229 72803 -173212 -35066
2438 -35066 276978 116072 -393947 -135410 152409 -8204 -50323 -118615 -389782 -240705
2428b40705M570K89301m30231L88123q6125Q3639m15884m7784J51189J1326K50043
2417d2538N26474k19733J53153m4604m03727j0480J29361K8706j23820j08192
2407a15400n0088K91048r1006j91146K41292K53933J82231j77199m89073J19558
2397b5850J30144l27147j20672K54533J60074n24590j03445j20982j56519L85917
2387d48537N34650m2923j69435m1006K39129K56143l31696J8320q1192O9149j52922
2376a50320k9990N72790j07457l81997j58092j61864L01895n1361J45954J43870
2366A23428j48438l61989j16264J25123L40707M58943k02897k29989j15413k5081
2356a51870k34369j74897L65607L6070L75243O4602j31178L6263j45774n05843
$$ plain form
2428 -240705 -236135 53166 -377065 11058 -75067 8572 -407312 -455096 -303907 -292581 -42538
2417 -42538 483936 264203 417356 372752 -30975 -41455 87906 116612 -7208 -115400
2407 -115400 -165488 125560 34554 -156592 84700 338633 520864 343665 -145408 -25850
2397 -25850 104294 -222853 -343525 -88992 71082 -453508 -556953 -677935 -834454 -448537
2387 -448537 86113 43190 -126245 -167251 71878 328021 -3675 14645 -66547 2602 -150320
2376 -150320 -180310 392480 285023 -96974 -255066 -416930 -115035 -166396 -20442 123428
2366 123428 -25010 -386999 -503263 -378140 -37433 421510 218613 -11376 -126789 -151870
2356 -151870 -386239 -561136 -195529 -159459 215784 280386 149208 185471 39697 -466146
2346d66146q0246K86000j4684R4968Q2728N9355j78585m37849j70231N61223J37783
2335a25684k06841L43253K25620k16192o2556j87663J46148J70182k25030k86299
2325d25062L70405L83961l88524K26601j01885P0708j98927j96851k43176J01133
2315d01617N22773k6039J37462p34781j3524j66468K32178N93320k10307k81901
2305c48904N34540n6315n33553O6719j63132j53005O534J71008M26717K48274
2295A98883l27018r4915j18638O3937q4288k2427k5239j50617k18620N66347J85280
2284b7315k65179L50098N36884p3640n14189j32990j60446K81973L48983l05022
2274C9157r0176J44984K7389k74459J85496J46080J42807j3783l65065J87598
$$ plain form
2346 -466146 -546392 -260392 -275076 -180108 -97380 -38025 -216610 -654459 -824690 -263467 -125684
2335 -125684 -332525 10728 236348 20156 -42400 -230063 -83915 86267 -138763 -425062
2325 -425062 -54657 329304 -59220 167381 65496 136204 -62723 -259574 -502750 -401617
2315 -401617 121156 95117 232579 -502202 -515726 -682194 -450016 143304 -67003 -348904
2305 -348904 185636 129321 -404232 -337513 -500645 -653650 -647116 -476108 -49391 198883
2295 198883 -128135 -223050 -341688 -277751 -362039 -384466 -409705 -560322 -778942 -212595 -27315
2284 -27315 -292494 57604 594488 520848 6659 -126331 -286777 -4804 344179 39157
2274 39157 -51019 93965 121354 -153105 32391 178471 321278 307495 -57570 130028
2264A30028j91177R2133r3763k87679L3432K07678L09223l1371j96475p1309q2815
2253a82095N4572J50242J51017k59408l02188N9451r2672k01710R2140J75802
2243c54849O7945L78536q0645K00568J4825j87520j75645m49307m0911L69908
2233b57095j78855K64788L27897m9210j0796R0936k48456p1736q2405j36133j94798
2222e45863K44259K34983K79016k34699j25181m70971j7058J49616M80780l48280
$$ plain form
2264 130028 -61149 30984 -62779 -350458 -317026 -109348 199875 168504 -27971 -99280 -182095
2253 -182095 -127523 22719 173736 -85672 -387860 -328409 -421081 -622791 -530651 -354849
2243 -354849 -286904 91632 10987 211555 226380 38860 -136785 -586092 -627003 -257095
2233 -257095 -435950 -171162 156735 107525 96729 187665 -60791 -132527 -214932 -351065 -545863
2222 -545863 -301604 -66621 212395 -22304 -147485 -618456 -635514 -485898 -5118 -353398
$$ [...]
##END NTUPLES=NMR SPECTRUM
##END=
