##TITLE=1H_CG-1154
 CDCl3+DMSO,8 sc, 
 28.9.2021
##JCAMPDX= 6.0         $$ Bruker NMR JCAMP-DX V2.0
##DATA TYPE= NMR SPECTRUM
##DATA CLASS= NTUPLES
##ORIGIN= UXNMR, Bruker Analytische Messtechnik GmbH
##OWNER= root
$$ XWIN-NMR		Version 3.5
$$ Tue Sep 28 11:53:27 2021 Russian Standard Time (UT+4h)  she@DPX200
##.OBSERVE FREQUENCY= 200.1314
##.OBSERVE NUCLEUS= ^1H
##.ACQUISITION MODE= SIMULTANEOUS
##.ACQUISITION SCHEME= undefined
##.AVERAGES= 8
##.DIGITISER RES= 18
##SPECTROMETER/DATA SYSTEM= spect
##.PULSE SEQUENCE= zg30
##.SOLVENT NAME= CDCl3
##.SHIFT REFERENCE= (INTERNAL, CDCl3, 0, 17.1525)
##AUDIT TRAIL= $$ (NUMBER, WHEN, WHO, WHERE, WHAT)
$$ ##TITLE= Audit trail, XWIN-NMR		Version 3.5
$$ ##JCAMPDX= 5.01
$$ ##ORIGIN= Bruker BioSpin GmbH
$$ ##OWNER= she
$$ F:/spectra/data/she/nmr/H-F/1/pdata/1/auditp.txt
$$ ##AUDIT TRAIL=  $$ (NUMBER, WHEN, WHO, WHERE, WHAT)
(   1,<2021-09-28 11:52:25.28 +0400>,<she>,<DPX200>,
      <created by zg, POWCHK disabled, PULCHK disabled
       configuration hash MD5:
       00 E9 B6 7A A2 85 ED C7 34 08 36 98 17 FE 4E 26
       data hash MD5: 16K
       2C 8C 08 B1 04 1F 2E A7 81 5D 79 16 59 71 1A 2F>)
(   2,<2021-09-28 11:52:27.46 +0400>,<she>,<DPX200>,
      <Start of raw data processing
       efp BC_mod = 2 LB = 0.24 FT_mod = 6 PKNL = 1 PHC0 = -14079.96 PHC1 = 16.20087 SI = 16K 
       data hash MD5: 16K
       F1 4E CD DF DC 67 99 04 99 7A 8E 37 A1 F2 A8 CF>)
(   3,<2021-09-28 11:52:42.21 +0400>,<she>,<DPX200>,
      <pk PHC0 = 1.332027 PHC1 = -3.4 
       data hash MD5: 16K
       65 59 A5 21 85 DE 3D 45 22 8E AA 55 F0 B2 6F 40>)
(   4,<2021-09-28 11:52:45.29 +0400>,<she>,<DPX200>,
      <abs ABSG = 5 
       data hash MD5: 16K
       7B B3 6D 98 2B FE DC 79 3C ED 0A 21 57 03 AE FF>)
$$ ##END=
$$ 
$$ hash MD5
$$ C5 19 52 45 C2 AC 95 63 6E BA 1F 70 F0 DD 56 4D
##$RELAX= 
##$RELAX= 
##$RELAX= 
##$RELAX= 
##$RELAX= 
##$RELAX= 
$$ Bruker specific parameters
$$ --------------------------
##$DU= <F:/spectra>
##$EXPNO= 1
##$NAME= <H-F>
##$PROCNO= 1
##$TYPE= <nmr>
##$USER= <she>
##$AMP= (0..31)
100 100 100 100 100 100 100 100 100 100 100 100 100 100 100 100 100 100 
100 100 100 100 100 100 100 100 100 100 100 100 100 100 
##$AQSEQ= 0
##$AQ_mod= 1
##$AUNM= <au_zg>
##$AUTOPOS= <>
##$BF1= 200.13
##$BF2= 200.13
##$BF3= 200.13
##$BF4= 200.13
##$BF5= 200.13
##$BF6= 200.13
##$BF7= 200.13
##$BF8= 200.13
##$BYTORDA= 1
##$CFDGTYP= 0
##$CFRGTYP= 5
##$CHEMSTR= <none>
##$CNST= (0..31)
1 1 145 1 1 1 1 1 1 1 1 1 1 1 1 1 1 1 1 1 1 1 1 1 1 1 1 1 1 1 1 1 
##$CPDPRG= <>
##$CPDPRG1= <>
##$CPDPRG2= <>
##$CPDPRG3= <>
##$CPDPRG4= <mlev>
##$CPDPRG5= <mlev>
##$CPDPRG6= <mlev>
##$CPDPRG7= <mlev>
##$CPDPRG8= <mlev>
##$CPDPRGB= <>
##$CPDPRGT= <>
##$D= (0..31)
0 1.2 0 0 0 0 0 0 0 0.06 0 0.03 0 0 0 0 0.0002 0 0 0 0 0 0 0 0 0 0 0 0 
0 0 0 
##$DATE= 1632815544
##$DBL= (0..7)
120 120 120 120 120 120 120 120 
##$DBP= (0..7)
150 150 150 150 150 150 150 150 
##$DBP07= 0
##$DBPNAM0= <>
##$DBPNAM1= <>
##$DBPNAM2= <>
##$DBPNAM3= <>
##$DBPNAM4= <>
$$ [...]
##$SUBNAM2= <"">
##$SUBNAM3= <"">
##$SUBNAM4= <"">
##$SUBNAM5= <"">
##$SUBNAM6= <"">
##$SUBNAM7= <"">
##$SUBNAM8= <"">
##$SUBNAM9= <"">
##$SW= 20.0188988654967
##$SWIBOX= (0..15)
0 0 2 0 0 0 0 0 0 0 0 0 0 0 0 0 
##$SW_h= 4006.41025641026
##$TD= 16384
##$TD0= 1
##$TE= 0
##$TE2= 300
##$TE3= 300
##$TEG= 300
##$TL= (0..7)
0 120 120 120 120 120 120 120 
##$TP= (0..7)
150 150 150 150 150 150 150 150 
##$TP07= 0
##$TPNAME0= <>
##$TPNAME1= <>
##$TPNAME2= <>
##$TPNAME3= <>
##$TPNAME4= <>
##$TPNAME5= <>
##$TPNAME6= <>
##$TPNAME7= <>
##$TPOAL= (0..7)
0.5 0.5 0.5 0.5 0.5 0.5 0.5 0.5 
##$TPOFFS= (0..7)
0 0 0 0 0 0 0 0 
##$TUNHIN= 0
##$TUNHOUT= 0
##$TUNXOUT= 0
##$USERA1= <user>
##$USERA2= <user>
##$USERA3= <user>
##$USERA4= <user>
##$USERA5= <user>
##$V9= 5
##$VALIST= <valist>
##$VCLIST= <CCCCCCCCCCCCCCC>
##$VD= 0
##$VDLIST= <DDDDDDDDDDDDDDD>
##$VPLIST= <PPPPPPPPPPPPPPP>
##$VTLIST= <TTTTTTTTTTTTTTT>
##$WBST= 1024
##$WBSW= 4
##$XGAIN= (0..3)
0 0 0 0 
##$XL= 0
##$YL= 0
##$YMAX_a= 57235
##$YMIN_a= -69419
##$ZGOPTNS= <>
##$ZL1= 120
##$ZL2= 120
##$ZL3= 120
##$ZL4= 120
##$ABSF1= 16.97293
##$ABSF2= -3.046108
##$ABSG= 5
##$ABSL= 3
##$ALPHA= 0
##$AQORDER= 0
##$ASSFAC= 0
##$ASSFACI= 0
##$ASSFACX= 0
##$ASSWID= 0
##$AUNMP= <proc_1d>
##$AZFE= 0.1
##$AZFW= 0.1
##$BCFW= 0
##$BC_mod= 2
##$BYTORDP= 0
##$COROFFS= 0
##$CY= -3
##$DATMOD= 1
##$DC= 0
##$DFILT= <>
##$DTYPP= 0
##$F1P= 0
##$F2P= 0
##$FCOR= 1
##$FTSIZE= 16384
##$FT_mod= 6
##$GAMMA= 0
##$GB= 0
##$INTBC= 1
##$INTSCL= 0
##$ISEN= 128
##$LB= 0.24
##$LEV0= 0
##$LPBIN= 0
##$MAXI= 10000
##$MC2= 0
##$MEAN= 0
##$ME_mod= 0
##$MI= 1.114404
##$NCOEF= 0
##$NC_proc= -8
##$NLEV= 6
##$NOISF1= 3.799351
##$NOISF2= 2.8
##$NSP= 0
##$NTH_PI= 0
##$NZP= 0
##$OFFSET= 17.15255
##$PC= 1
##$PHC0= -14078.63
##$PHC1= 12.80087
##$PH_mod= 1
##$PKNL= yes
##$PPARMOD= 0
##$PSCAL= 0
##$PSIGN= 0
##$REVERSE= no
##$SF= 200.129970466211
##$SI= 16384
##$SIGF1= 3
##$SIGF2= 2
##$SINO= 5.538805
##$SIOLD= 16384
##$SREGLST= <1H.CDCl3>
##$SSB= 0
##$STSI= 16384
##$STSR= 0
##$SW_p= 4006.41025641027
##$SYMM= 0
##$S_DEV= 0
##$TDeff= 16384
##$TDoff= 0
##$TI= <>
##$TILT= no
##$TM1= 0
##$TM2= 0
##$TOPLEV= 0
##$USERP1= <user>
##$USERP2= <user>
##$USERP3= <user>
##$USERP4= <user>
##$USERP5= <user>
##$WDW= 1
##$XDIM= 16384
##$YMAX_p= 355542728
##$YMIN_p= -1217742
$$ End of Bruker specific parameters
$$ ---------------------------------
##NTUPLES= NMR SPECTRUM
##VAR_NAME=  FREQUENCY,     SPECTRUM/REAL,   SPECTRUM/IMAG
##SYMBOL=    X,             R,               I
##VAR_TYPE=  INDEPENDENT,   DEPENDENT,       DEPENDENT
##VAR_FORM=  AFFN,          ASDF,            ASDF
##VAR_DIM=   16384,         16384,           16384
##UNITS=     HZ,            ARBITRARY UNITS, ARBITRARY UNITS
##FACTOR=    0.244546801953871, 1,           1
##FIRST=     3432.73927361736, 0,            0
##LAST=      -573.670982792911, 0,           0
##MIN=       -573.670982792911, -1217742,    0
##MAX=       3432.73927361736, 355542728,    0
$$ Real data points
##PAGE= N=1
##DATA TABLE= (X++(R..R)), XYDATA
$$ [...]
9990 -482010 -339055 -321541 -103449 516287 263615 36471 -275395 -320350 -409058 230058
9980 230058 323330 367827 394558 13702 306884 -67213 86211 30982 27281 -178922 -226607
9969 -226607 89230 327791 -149134 -62550 -184144 -447428 -538193 -584555 -292181 44552
9959 44552 391935 -122302 -448323 -949329 -449842 69739 165500 194541 363966 -152614
9949 -152614 -352075 -329306 -848848 -369948 -6961 352172 -13312 -275069 -878226 -87007
9939 -87007 319312 -44814 -620448 -845671 -276327 124783 -231476 51664 34224 163779
9929 163779 -2773 -172577 182316 180692 -133489 -310940 367856 454166 305273 -42339
9919 -42339 -339016 -216216 -438283 -79274 -65705 -533673 -449467 62744 404610 468486
9909 468486 114211 66622 411336 294334 -81206 -245181 -158092 -27183 -643130 -714524
9899 -714524 -378583 -259330 116704 -51974 295645 -493332 30951 -199054 530041 444598
9889 444598 39061 -132430 -129770 100088 -222610 -374090 -226834 -134704 -242589 326039
9879 326039 -127872 -455353 -470430 -144456 -32812 -238544 -325959 -725312 -460432 184896
9869 184896 71801 -178563 -627638 -374276 -215295 -603049 -573928 -100559 29303 -121147
9859 -121147 -322964 -61561 114037 -11512 -102856 -129202 205339 204216 -143778 -95384 551446
9848 551446 313092 543528 -34888 -273036 -229168 -54872 -261407 -271298 -45183 -152575
9838 -152575 11256 -362888 -378607 -264765 -426975 -584589 -718320 -743312 -698346 -361782
9828 -361782 103916 248329 -356220 10385 -45589 -284690 -396601 -413169 -119260 -1050527
9818 -1050527 -451227 -433388 -61184 -496117 -679755 -566542 -288391 53643 -202459 132386
9808 132386 374715 304402 91084 -87835 -231334 -262053 -105020 62214 -35981 -322956
9798 -322956 123523 -96646 -483614 -794563 -581947 -280267 -253882 -68491 -472948 -742493
9788 -742493 -624872 -410663 -151551 135936 -409761 -527877 -587199 -612758 46974 52692
9778 52692 -136945 -509145 -319472 79239 306839 -65439 -349290 -293831 339290 59775
9768 59775 114456 192860 58368 382851 281461 261601 115698 -142145 -572535 -670135 -730117
9757 -730117 -379002 -42042 -528220 -406022 -509287 -660065 -136888 -7104 -301761 -204239
9747 -204239 144701 -153792 -82777 330759 383541 -41542 311321 25523 -201662 -235695
9737 -235695 -187669 -109445 48543 -29299 -190436 -584 -31114 -256115 185001 -115797
9727 -115797 -539139 -508881 -543242 -524723 -62532 -239601 -160018 -161029 -100147 -537905 -338891
9716 -338891 -352795 -511813 -349453 9939 -184532 -247738 -273086 -195019 232555 -69907
9706 -69907 549996 502958 211372 -23793 142473 327568 340159 -81754 -280315 -203919
9696 -203919 -137365 -149004 -312860 -282718 171968 -77529 -594673 -536484 -372838 319966
9686 319966 469773 342413 169804 53817 45764 -680950 -485863 -532886 -305082 170344
9676 170344 -149290 -390463 -438324 -61353 -103816 -123486 -42179 118547 294410 -117922
9666 -117922 -412548 -50679 -296154 -312919 -177859 -524049 -303233 -333241 -414877 -352592
9656 -352592 117443 9565 -356857 -443186 -392950 -103798 195399 29671 -124651 224179
9646 224179 -45644 -502296 -664009 -610930 -231089 -696486 -769051 -583252 -215272 115620
9636 115620 -243557 14603 -10555 -248506 -598470 -364040 218599 -307775 -707859 -756420
9626 -756420 -633823 -164740 62466 -132163 195897 155153 -159837 -189237 -581679 -284350
9616 -284350 104529 464253 397348 283553 -170829 -741718 -42525 -158044 392258 196955
9606 196955 -225329 -95335 -5725 -175665 -11198 178118 304570 -351683 -9725 123423
9596 123423 -19687 135707 296282 326814 469650 749173 724410 435824 -121309 -165863
9586 -165863 -221262 277158 211314 291543 -2775 102489 -68338 167407 404018 427048
9576 427048 105697 -255380 -493374 176842 207020 -109483 -132140 -198232 -50788 -117304
9566 -117304 -381228 -549965 -748433 -58357 -41222 -374047 -358985 -291479 -26141 -139331
9556 -139331 -576173 -302522 -213569 -160968 20815 -419217 -536501 -375268 -326412 -49207
9546 -49207 -74031 -271171 -59134 -216613 410938 80648 -156954 125732 210366 217849 1310
9535 1310 -412150 75036 300854 96507 262049 172982 157272 39798 -126627 209481
9525 209481 24728 -512423 18766 244489 -113908 -90813 -170873 -122308 -5994 263256
9515 263256 145588 -242821 -186087 12041 57367 364892 109065 -430951 -152415 -205501
9505 -205501 -326385 -456420 -500992 -684999 -363601 -23025 254973 48219 -431270 -633725
9495 -633725 -81775 -192954 -106886 223690 428071 337072 -30691 463760 341799 -50563
9485 -50563 -51734 213238 214530 -336431 266228 436556 190937 132531 44831 459209 728867
9474 728867 370757 -375356 143093 -48326 -467542 307938 -189192 -367716 -72112 45604
9464 45604 469201 347181 -239160 -522541 -460881 -217192 -78762 -306105 -66368 -163071
9454 -163071 -265824 68072 -40704 170099 30253 -242220 97654 -151407 -413892 -168303
9444 -168303 77499 408304 19361 -680134 -396079 -92213 -194178 -76553 250589 -587813
9434 -587813 -30849 445769 321690 -22787 -492888 -667113 -306538 200984 -38883 -327263
9424 -327263 -295166 -319564 -191152 -596004 -223900 -198250 -500029 -231753 -52167 36183
9414 36183 183766 -166578 284956 413128 -65247 -234361 -303736 -49681 -99842 -380884
9404 -380884 -330472 -64882 -190394 -263844 174199 -235313 -366631 261346 320669 140810
9394 140810 -143107 -149803 -217749 172784 125743 -139897 -429592 -391703 -215390 57576 62901
9383 62901 68566 312185 128973 234804 -155594 -231698 48093 235105 707239 416204
9373 416204 302368 60617 -185824 -271252 117440 609285 574947 559795 47047 483454
9363 483454 355791 51056 -59523 -357321 101261 189000 260396 -234450 -149604 297876
9353 297876 582219 223416 -13448 179627 -93156 -9576 -189939 -979546 -557303 -234094
9343 -234094 252080 386618 558051 -67391 123620 273104 38878 -128112 -70068 127498
9333 127498 547270 14962 -514314 -763777 -368773 -134570 -171338 458648 94134 9220
9323 9220 -157695 397787 369837 175228 -206397 -57414 83661 -156651 -382760 -74030
9313 -74030 -229499 129507 251952 304368 470861 -260946 -355931 -439940 -300530 -260459 -540748
9302 -540748 -167117 -387552 -411326 1067 -178502 -286020 -217069 -116362 -525074 -82963
9292 -82963 -2903 -185588 38757 626631 412153 325080 464794 488811 621713 630856 471227
9281 471227 -127602 -246373 35768 117590 465253 315429 299013 317731 125484 44743
9271 44743 98204 897873 891542 469725 701257 750991 40320 134861 62308 -164364 429510
9260 429510 816268 1130342 310853 169786 296414 271700 488520 626040 607093 13695
9250 13695 492924 128747 -49531 127266 55316 171737 299207 661128 783437 373988
9240 373988 370076 741648 789727 362951 158580 357965 803943 579861 316083 662724
9230 662724 512354 74298 172736 -73921 -416800 -519574 173956 54295 374691 527784
9220 527784 340139 20250 568237 676166 283653 219735 276352 317044 -103078 -31111
9210 -31111 -126453 72791 6504 216905 67429 -179876 353212 361064 275338 224813 -18505
9199 -18505 245232 264681 16098 312952 596353 180471 10840 56215 -7269 27748 285009
9188 285009 349167 461926 757095 585294 294542 216910 424918 541410 211986 -152159
9178 -152159 294527 53867 -165763 404967 474298 4906 43866 138857 -100581 -118630
9168 -118630 168819 111147 -233173 -299040 384352 612072 250453 658017 813940 354176
9158 354176 359342 879943 763692 89110 144442 65825 557501 869050 978402 1032278 278544
9147 278544 167773 601389 454826 259749 183413 -25431 231695 595601 301181 -138121
9137 -138121 127974 592117 765519 607816 608240 694995 560658 622133 648299 466435 766172
9126 766172 305401 351544 223148 412404 714002 725209 471321 915485 120949 270357
9116 270357 -48313 500898 469007 674700 500540 135934 77877 284313 149461 313522
9106 313522 83774 91406 -86724 152929 409417 190182 539882 792410 598724 907584
9096 907584 967047 410214 681352 741829 728052 475748 356363 256507 814067 808723 436458
9085 436458 351921 347740 557534 733155 481171 339581 131123 345804 280544 123950
9075 123950 77125 443706 325162 165032 228369 243875 513862 753674 379449 942919
9065 942919 1090513 1388383 1543278 1497447 809583 491558 434600 1042244 1242932 1342291
9055 1342291 1215101 1256354 1258389 1331341 795641 946212 797555 980366 1381217 1485058
9045 1485058 1225074 782469 878872 958175 1444876 1232720 1132379 1197293 1429165 1915053
9035 1915053 1322137 1041501 1524574 1639608 1435016 1465909 1780725 1448793 1228580 1219582
9025 1219582 931956 1254813 908192 2046605 2109972 1449476 1987129 2208990 2091356 2002313
9015 2002313 2127587 1678141 1914866 2174269 2024242 2277810 2081540 2479377 3386872 3327137
9005 3327137 2916968 3001536 2998972 2932950 3531910 3464284 2911512 3087250 3401429 3706468
8995 3706468 4012181 3961533 4418148 4570597 4638817 4933531 4912901 5448742 5914947 5587826
8985 5587826 5709568 6132354 6246809 6467182 6921153 7358548 8046391 8555135 9108287 9657941
8975 9657941 10135583 10960881 11722305 12420615 13699007 14855985 16652608 17528259 18341864
8966 18341864 18982580 19883177 20826370 21718380 22512988 23211327 23700939 23788443 24367809 24667480
8956 24667480 24102213 23464516 23697751 23437830 22428417 21886007 20957354 19810519 19513151
8947 19513151 18853927 17831416 17236326 17487799 17690309 17599917 18239577 18132538 18987700
8938 18987700 20622677 21432361 22103345 22386239 22892998 24323522 24465236 25152933 25477625
8929 25477625 25493591 25638332 25137112 24608952 24608563 24508434 24023594 23045838 22504546 21506462
8919 21506462 20389387 18458834 16956423 15838187 14305322 13171909 12643660 11814526
8911 11814526 11250301 10896193 10098754 9347921 8693616 7856642 7546756 7290743 7055546
8902 7055546 6712877 6441543 6618426 6160212 5685827 5622887 5564696 5652068 5295082 4953897
8892 4953897 4732591 4632598 4738972 4139335 3667234 3589852 4249380 4183315 3992574 3962881
8882 3962881 3601949 3739702 3636816 3260634 3278503 2867905 2676085 2366496 2572464 2196796
8872 2196796 2015729 2453606 2459002 2710622 2683861 2258538 2137437 2123350 2540824 2148905
8862 2148905 2281920 1987317 1778724 1428822 1665369 1504354 1525926 1388551 1764462 1551858
8852 1551858 1946738 2269442 1889187 1460030 1681676 1433883 1582314 1556564 1762781 1910052
8842 1910052 1690702 1293683 1648523 1794347 1299884 1334566 1520795 1830014 1721671 1418082
8832 1418082 1351457 1401797 1221489 1384202 1216721 1406125 1058504 1331522 1546490 878419
8822 878419 831230 1062155 1548715 1564550 1738139 2171075 1529925 1346922 1255675 1610937
8812 1610937 1253387 869863 1229259 1370879 1340978 897132 698938 1006024 1023471 1331264
8802 1331264 1305844 1428890 1239348 1586353 1466158 1517970 1520005 1033802 1230084 1114746
8792 1114746 1155911 1127500 643289 1114799 1456874 1470837 1346675 1352072 1337184 1478498 1714467
8781 1714467 1639927 1603325 1689789 1296215 1519414 1858305 1855100 1353505 1332183 1829715 1412648
8770 1412648 1234237 1627666 2021384 2138658 1908807 1748605 1313881 1671071 2158258 2099150
8760 2099150 2009069 1607792 1630704 1575800 2339875 2738623 2180542 2267954 2169126 2379175
8750 2379175 2197245 1989823 1853263 2059709 2348001 3066210 2932992 2327917 2251526 2276327
8740 2276327 2615281 2344156 2589061 2613243 2901407 2867393 2877802 3216867 3391605 3624760
8730 3624760 3498914 3404413 3008218 3421278 3896093 4287365 4343524 4024443 4474507 4632959
8720 4632959 4687473 5243785 5687786 5946300 6588419 7218122 7830379 8297572 8590212 9438904
8710 9438904 10153553 10702839 11245324 10956725 10239650 9748604 9262585 8920232 8237974 7346251
8700 7346251 7321403 7109650 7031820 7354521 7272965 7370558 7049147 6699936 6992204 6540892
8690 6540892 6853202 7489585 8131531 8304581 8129484 8249833 8541361 8918778 9478233 10280381
8680 10280381 11179328 11409738 11889095 12884909 13164241 13891209 15215367 16088338 16404718
8671 16404718 16179112 15771425 15075508 14482668 14366980 14051910 14221381 14523454 14789359
8662 14789359 15181822 15724047 16359551 17126902 18245753 19100358 20416059 20845623 21012694
8653 21012694 20973931 20703274 20899419 20553946 20119162 19992947 19950639 20574748 20854942 20986674
8643 20986674 20879422 20926249 21121692 20777091 20658075 20479135 20539693 20239555 19516363 18934590
8633 18934590 19313516 19439237 19209337 19169030 19090503 18900895 18809170 18852689 19038970 18879515
8623 18879515 18587211 19179511 19240012 18771412 18106333 17135652 16073797 14668375 13494610
8614 13494610 12702605 11545752 10445671 9453973 9686588 9657960 8958058 8246421 8131699
8605 8131699 8013387 7461651 7553563 7421244 7121412 6852300 7036542 7219634 7131848 6789458
8595 6789458 6729201 6605801 6184970 5888443 6050122 6084077 6038646 5682703 5830791 5732049
8585 5732049 6008711 6156060 6042658 5626129 5184454 5372490 5500260 5687475 5387794 5524227
8575 5524227 5639603 5690395 5731718 6239142 6091000 5796396 5974611 6113184 5861808 5960865
8565 5960865 6200208 6403795 6642594 6857643 6980207 7318619 8061937 7781356 8391848 8907154
8555 8907154 8966642 10019292 10749442 10975289 10989365 11104720 11455199 11825628 12159884 11974827
8545 11974827 11331792 10803271 10750008 10261380 9958268 9551134 9701174 9761523 8823462 8956621
8535 8956621 9031393 8840461 9360151 9994575 10616023 10820158 10745229 10812806 11476319 12232794
8525 12232794 13207148 14022128 15049929 16555269 17852786 18949733 20010041 21053607
8517 21053607 21563333 22256278 22609468 21837249 21138800 20514593 19621219 19060152 17884720
8508 17884720 16656600 15741743 15405417 15492348 15226925 15045087 15344864 14453401 14720195
8499 14720195 15530721 15110760 15348043 15906596 16561142 17118676 17653309 18438925 19304997
8490 19304997 20270164 22107594 22908856 23606581 24668827 25340069 26455493 26730579 26744111
8481 26744111 26878744 26241750 26299627 25728587 25336987 24253186 23522468 23140698 23155289 22776183
8471 22776183 22022105 22467581 22655565 22980758 23661675 24142935 24995232 26499026 27757014
8462 27757014 28503774 29865674 32027985 34705989 37545985 39984245 42781473 45454803
8454 45454803 47559003 49899078 52245261 53367691 54568536 55423527 56433798 57837355
8446 57837355 60071655 63796253 68488286 69587886 66285787 60330841 52263393 45213303
8438 45213303 39954662 35753106 32797567 30538613 28826315 27834468 27056696 25840933
8430 25840933 25593510 25661486 25738353 26090458 26501555 26879749 27240933 27867506 28138499 28091506
8420 28091506 27331686 26776379 25966716 25095040 24301466 22891740 22041000 20736108 19948567
8411 19948567 19223766 18756338 18519903 18245760 17796827 17482805 17384243 17470500 17614485 17682155
8401 17682155 18502066 19682994 20244632 20693893 21003024 21641107 22330100 22773290 22633634
8392 22633634 22657994 22264649 21868793 21095636 19993347 18864141 17025831 16583004 15696931
8383 15696931 15784247 14173682 13539635 13782502 12801796 12479798 11672137 11590315 11176000 11074487
8373 11074487 10919361 10861842 10996829 10903620 11525841 11513065 11065762 11336935 11982936 12176268
8363 12176268 13003908 13061519 13195266 13190231 12943231 12419985 12228705 12046891 11398363 10692873
8353 10692873 10200103 9960883 9914850 9655922 9351010 8900562 8619923 8682908 8942205 8858592
8343 8858592 8693972 8687239 8489090 9018790 8519789 8522558 8406620 8757351 8976408 9197026
8333 9197026 10257002 10478744 10707512 11299843 11232787 11367501 12104970 12230175 12771524 13211517
8323 13211517 13278518 13623636 13303328 12778854 13236660 13400452 13250690 13528473 13126099 13601665
8313 13601665 13721785 13565291 13751946 13844278 13655099 13847453 14065459 13877702 14117960 14293029
8303 14293029 14848032 15502515 15548108 15580092 16470590 17133424 17692746 17768827 18025847 18610773
8293 18610773 19452243 20188930 20287130 20588321 20689665 21457572 21509035 21782965 21775444 21258981
8283 21258981 21128043 20757755 20667147 20015377 19588054 18769441 18465463 18547281 18160575 18005734
8273 18005734 18383211 18328551 18462208 18310330 18612978 19340820 19992814 21043494 22392764
8264 22392764 23079646 23933106 25007146 26591121 27705725 28592934 29246033 29479242 30002046
8255 30002046 29519124 28271741 27177921 25988042 24467155 23393180 21874199 20603437
8247 20603437 19045560 18132078 18222910 17869126 16821541 16724919 16678737 16725760 16817640 16700681
8237 16700681 17147045 17993523 18427347 19608203 20326567 21134937 22386772 23557057 24282215
8228 24282215 24924535 25309492 25124887 24898219 23750988 22764380 21695641 20288647 18779176
8219 18779176 17633965 16701213 15362409 14481224 13811756 13153217 12848019 12884324 12081025
8210 12081025 11244410 10706071 10345553 10984979 10894880 10662013 10457448 10991788 11294521 11578026
8200 11578026 11695164 11824886 11748691 11970956 11386748 11664166 12113113 14176684 10600125
8191 10600125 5822958 6269656 5696590 6282129 5836290 6233225 5781155 5510564 4827466
8182 4827466 4734324 4714040 4300944 4164171 4010868 4547779 4387866 3656976 3417256 3855835
8172 3855835 3551146 3589917 3882515 3076215 2842105 2641504 2621908 2604950 2658871 2412353
8162 2412353 2644806 2408090 2118252 2195579 2211880 2329376 2571426 2475635 2048250 1875187
8152 1875187 1770919 1512936 1773711 2228180 1539007 1408145 1545721 1514737 1272325 753742
8142 753742 1039371 1446761 1273403 1437326 976985 1310939 1120045 1254384 1086341 1403644
8132 1403644 1134359 1058813 837726 906295 713688 1013343 938601 1053945 906078 506351
8122 506351 956402 1030684 1198647 1193654 1255017 863433 803844 632589 957779 878463 376856
8111 376856 679270 750355 990435 654026 275660 698127 765390 837218 9932 460938
8101 460938 297672 517372 740524 433262 165399 89550 5478 280892 8122 -105453
8091 -105453 318053 491416 893016 834014 473183 608902 1014854 977328 552198 786537
8081 786537 106949 -139381 -55882 408389 130516 3955 -111712 -5377 489440 542881
8071 542881 322864 3821 253259 364119 329671 283368 92020 154304 323527 738121
8061 738121 845478 36042 294178 444574 497725 710251 405481 -154846 -178343 -239543
8051 -239543 -584503 -377687 38701 -331145 3099 391321 877332 -32920 -288328 -307223
8041 -307223 54506 480891 592012 93603 268931 639651 420420 -58947 -176438 -323591
8031 -323591 -459575 -400288 -450109 -44527 -173916 -427218 -150124 132213 -177744 -140544
8021 -140544 492884 649417 434796 -459710 -193034 -104802 276927 284385 -23646 -174523
8011 -174523 138057 270558 243191 538576 408848 453701 387976 54524 -273112 -300818
8001 -300818 -397110 60133 140818 372408 182592 184636 207354 211979 130105 314515 158708
7990 158708 222880 -99610 -66095 -189848 -5523 -435591 -75525 -16285 -224590 -159109
7980 -159109 -371997 -161707 402067 259969 -192050 -286120 134799 -86921 -434614 -263147
7970 -263147 -60690 22995 -62402 -409424 -731302 -418652 73246 380561 139739 -61824
7960 -61824 13662 242161 244739 375926 540673 747699 154363 593786 513222 377699 404395
7949 404395 92848 35746 -307330 -15880 421299 202441 107356 262090 193018 213017
7939 213017 -167460 -760806 -223435 -54187 -17097 409258 413155 59474 139130 281034
7929 281034 61265 235729 375925 312318 552824 500550 418411 411873 125867 -147812 -63191
7918 -63191 -128553 -146488 535353 423109 185189 187684 46384 261051 868999 842566 666765
7907 666765 247461 -51592 172136 380591 29708 204063 649421 222349 262041 73233
7897 73233 387146 222685 -394957 21077 -288087 -258151 -212559 -118185 212974 82520
7887 82520 265880 18793 -240609 -54070 162367 124603 -157614 -106821 -206158 -125774 -267749
7876 -267749 -195516 -87246 358470 223011 -266023 -284164 5260 -143740 -486616 -277558
7866 -277558 -272116 -320805 115044 109519 594905 520680 102404 280160 662860 485260 88951
7855 88951 -183075 -257453 -206811 -408376 -229987 -150016 -128534 254454 -23032 -1217742
7845 -1217742 -98021 -225305 -233953 -133520 134205 439557 698731 287199 -107362 257862
7835 257862 164803 -79949 341255 622850 324804 719993 516805 226322 302467 67191
7825 67191 212343 302924 535985 594095 612207 300130 30753 323297 -99797 -216527
7815 -216527 -81441 736569 1159833 1225851 808528 423023 579129 770832 729599 1042161
7805 1042161 1345374 865998 1318580 1645730 1725025 1397645 1471176 1512259 1484010 1223418
7795 1223418 1436435 1141292 1377681 1130211 1027881 1362696 1373796 972518 1329146 2184821
7785 2184821 2174446 2201857 1952668 2079384 2290315 2385803 2400787 2357221 2748677 2858926
7775 2858926 2724321 2889318 3155615 2869104 3076241 3508726 3428773 3576727 3494040 4549587
7765 4549587 4481838 5014943 5189070 5280136 5992750 6744846 7160108 7404070 8339176 9793116
7755 9793116 10032665 10973321 12252194 13622374 14952486 16169999 17064097 17468467 17246322
7746 17246322 16123442 14773450 13163918 12378433 12193128 11112111 10678282 10493308 10728336
7737 10728336 10686788 10151498 10608221 11319573 11251238 11150632 11728107 13265633 14298296
7728 14298296 14898580 15575062 16621529 17053486 16779043 16447691 15666130 14945046 13619724
7719 13619724 11830594 10237209 9600341 8434209 7828408 7679445 6775791 6636354 5910639
7710 5910639 5221002 4720038 4489610 4474790 4259011 3905878 3748633 3569638 3387666 2778353
7700 2778353 2870807 3440772 2918755 2702381 2338629 2031640 1849488 2202376 2168120 1717114
7690 1717114 1516068 1715322 1626034 1475594 1429841 1805860 1698590 1997243 1407542 1288973
7680 1288973 1405139 1509601 1331892 1305022 1163664 1026792 1097021 564451 94238 1260882
7670 1260882 1004082 1059532 1059321 464494 796149 555410 301999 717077 1037097 649619
7660 649619 951650 1036043 788546 752426 898108 1273390 1294119 1336192 1243617 668078 721092
7649 721092 735603 723107 371550 797840 818984 665180 264932 127146 303659 461527
7639 461527 242575 -59820 -197515 45922 -49809 -115783 -241856 -651315 -440091 -92478
7629 -92478 285411 237021 277064 407317 520383 153302 225854 171323 753269 467469 422541
7618 422541 215770 -133913 100145 -116198 -527763 -547444 241506 420526 145708 164159
7608 164159 25745 -204003 -253943 -147198 109154 188247 393407 -54189 -360755 -13703
7598 -13703 127080 -355573 -293807 -347871 -397378 -169092 72767 -327675 -5160 314330
7588 314330 90244 -55913 -50015 413028 912350 585866 144263 555051 260266 315266
7578 315266 379156 3066 -244549 -238739 -142997 -198005 -129791 249104 407290 -45014 81083
7567 81083 35631 -544634 -450165 -456076 -73426 24617 59385 -124290 -356781 49629 -48562
7556 -48562 514367 -469660 -489771 3735 286519 292715 -7528 -554375 -1009743 -662316
7546 -662316 -130977 -105610 -16802 -336863 -603232 -303667 -382507 -258437 -711866 -927277
7536 -927277 -538751 -238927 128715 82344 -153447 23902 -92015 -242141 -22115 218318
7526 218318 -64154 -277238 -156902 -126904 -421134 -335529 -142738 -161969 -84293 86936
7516 86936 -228979 -434909 -205980 -287027 -348610 153741 -390353 -447449 -703288 -644928 -624895
7505 -624895 -304233 -224036 -525366 -140375 -427825 -533477 -569467 -109028 -258143 646
7495 646 88836 -33183 30829 37573 -143935 -182175 314260 266022 31070 -231455 -407679
7484 -407679 -232376 -557192 -603915 88708 -439829 -463012 -440985 -178473 205019 -239748
7474 -239748 -1078611 -881615 -201303 -110545 -448927 -97710 -174007 -551630 -235915 130809
7464 130809 167589 -158438 -478617 -572378 -181395 216114 -30380 -292110 -497942 -553161
7454 -553161 -159609 296757 601150 108601 -419830 -255449 308774 584447 324941 616044
7444 616044 94149 -291763 71566 -116243 -329228 76734 281670 -249152 112518 117583
7434 117583 41195 -174795 -186799 129379 645731 651964 -165471 -405063 32124 284433
7424 284433 147113 -220125 -361160 -208687 -244315 -390173 -173877 -147231 -26929 -391675
7414 -391675 -723388 -379082 -374710 -364954 -470945 -735810 -283610 -308182 -445506 -417416 9225
7403 9225 -95184 248714 -106309 157566 -145774 -432354 -334374 40213 -436706 -881114
7393 -881114 -660957 -765007 -290560 -229366 -111994 -499136 -392477 -487718 -650666 -475705
7383 -475705 -446848 -759749 -280505 -422400 -645083 -361147 -223106 -283023 -181071 -249035
7373 -249035 248604 -124904 -345135 76193 49073 -296250 29171 -307278 -336408 -375870
7363 -375870 -397766 -3027 -383143 75480 317662 52756 7123 -320000 -455922 170067
7353 170067 174349 6986 -596316 -603860 -120835 -485877 -628476 -392311 -80110 254038
7343 254038 -398115 -621490 -93978 -287594 -310460 -753722 -603960 -412306 -436680 -304447
7333 -304447 146971 310782 71879 -404951 -642684 -422876 14182 -217506 -702344 -242315
7323 -242315 -233068 -225267 -130226 -304820 186448 -32834 -35674 -347772 -223124 -290256 -284674
7312 -284674 -107569 -79796 -309668 -549463 -476149 -367430 228353 -104706 187809 308222
7302 308222 193434 -135664 -103775 -395211 -65169 469654 235493 76367 -210325 -269298
7292 -269298 157068 -406551 -437878 -482198 -97553 -11784 268988 133226 -253066 94507
7282 94507 -52852 23950 -212865 -539014 -541435 -328259 -198911 -189204 138457 -133914 143576
7271 143576 302330 118051 114247 -169777 32497 -41495 -438603 -266058 389130 82078
7261 82078 -451360 8107 293300 209869 -326076 -197619 -5631 -139005 -262941 -213660
7251 -213660 294467 -104282 35959 243709 98283 7330 -105303 -327468 -102846 -205982
7241 -205982 435442 107541 -190648 -267822 -175067 -58295 335936 632031 540535 553548
7231 553548 217304 -131393 215453 514274 418452 853827 848545 319993 423808 750054
7221 750054 442279 621067 966869 621938 230812 302098 509203 431045 373340 513189
7211 513189 546216 863037 954258 994344 1350590 1140934 956995 1141455 1471799 1475028 1441670
7200 1441670 2116395 2066274 2363363 1897790 1732925 2233946 2478488 2986745 3429156 3670121
7190 3670121 3804734 3964322 4696540 4836000 5068507 5701191 5313008 4897688 5179015 4877150
7180 4877150 5080302 4935772 4626266 4178121 4253516 4186247 3936808 4354017 4275568 4217313
7170 4217313 4513195 5014872 5092914 5388075 5916908 6473947 6985968 7499598 7785006 7454106
7160 7454106 7502833 7294631 6865432 6296620 5575536 4602164 4542353 4466442 4160353 4559565
7150 4559565 4142013 4049010 3588115 3402954 3113220 3693472 3705254 3937104 4313403 3966292
7140 3966292 4077439 4482295 5275386 5175199 4862995 4404803 3905367 3923219 3530498 2946555
7130 2946555 2538823 2188622 1646706 1957900 1848716 1328630 1788030 1903594 1637504 1228093
7120 1228093 1063907 1339390 1479536 1114218 1137269 1270081 1027823 775879 436720 668533
7110 668533 466341 303302 518071 874323 474456 777139 863680 607822 613834 728625
7100 728625 182414 215451 693716 318920 359463 -36158 -174099 177495 105598 232896
7090 232896 218566 -120202 79291 304879 233414 -271427 -225195 182683 360267 472760
7080 472760 133847 -94823 61478 48596 -83805 99613 126820 311391 280581 327083
7070 327083 357370 -18760 -255745 170693 -92092 120247 249215 430571 400256 -148894
7060 -148894 242339 -286688 -428871 -370327 -294406 -50905 -97116 -274895 -291350 -257468 470004
7049 470004 222872 -170451 -182339 -183423 185030 -333163 -115692 64560 -204933 -484773
7039 -484773 -196764 29047 -396108 -156005 -164325 -12929 -1003842 -536316 -209874 -29395
7029 -29395 -213760 233992 -361504 -667364 -244724 -73085 112826 162597 108499 1398
7019 1398 -9165 -16652 -265163 -483550 -63902 329828 722599 38869 -318251 46558 222173
7008 222173 252753 72853 -457772 -718373 -302184 -355507 -321000 -83558 -414798 -367096
6998 -367096 -205377 39257 -97849 -36169 32750 -480982 -769302 -561581 -481023 -365953
6988 -365953 -139503 231300 115425 263135 97747 -43622 -198731 -240938 -629383 -444835
6978 -444835 -61838 -499366 -440570 -629647 -563233 -391380 -686106 -917211 -586141 -416894
6968 -416894 -218703 -15557 -143529 246143 -380394 -424013 -411425 -547202 -839296 -714599
6958 -714599 -523158 -430586 -354984 -818914 -890850 -418563 -373502 -480950 -639091 -694299 -346240
6947 -346240 -342172 -406102 118583 327619 193441 -359468 -338202 87066 306019 193865
6937 193865 -40113 -143523 -38338 -99575 -189396 -199187 -321997 151923 -286481 -377123 -486394
6926 -486394 -319334 -480707 -665749 -345459 -412434 -143690 -342368 -206914 -233654 -470614
6916 -470614 -430143 -700821 -527844 -587958 -485194 -856678 -489889 -384316 -188324 -676077
6906 -676077 -1196182 -787420 -816503 -679991 14946 526628 -39853 -561075 -452916 -205512
6896 -205512 -312912 -95116 -10396 -1500 -271970 19805 -279803 -99982 -248263 -355477
6886 -355477 -77278 -128124 -362384 -154258 -157469 -276862 -454507 -517211 -387953 -215536
6876 -215536 -291436 -476472 -243473 -346375 -605807 -789897 -754974 -573341 -552054 -189280
6866 -189280 44394 -291044 -469720 -401395 132591 35536 -145448 -322326 -330252 -88263
6856 -88263 -337194 -301100 210517 -59033 -135536 -223544 -520001 -1121929 -835490 -269709
6846 -269709 -207743 -36515 -199330 -286995 -34859 332142 16497 -171720 -89924 -450905
6836 -450905 -565656 -663649 -287111 -127475 -245271 -551044 -351437 -62115 -307141 -204619
6826 -204619 -246456 -812779 -706445 -647543 -206436 -385001 109122 -313105 -4299 533916
6816 533916 676954 42078 -528078 -320542 -385524 -97439 -410396 -355683 -684234 -154006
6806 -154006 -91306 20341 -212920 -225219 140297 -18064 155776 439867 525987 -81848
6796 -81848 -234565 -53912 -52594 -129443 -391107 -269952 135742 -11334 -101154 75994 59788
6785 59788 66358 -74612 -104670 -323649 -213903 -458652 -403705 -443387 -376962 49106 108283
6774 108283 -426503 -535936 -384799 -91873 -28718 -157205 -168153 -532346 -584850 -174634
6764 -174634 48501 -4188 -226998 -482716 -575338 -1135504 -817634 -207817 -360214 -176536
6754 -176536 45972 135657 -39127 -207194 -265675 -241621 -164799 -185734 55085 349537 13700
6743 13700 -102671 155976 -205392 -730321 -842782 -536435 -433165 -1098070 -676896 -946142
6733 -946142 -776743 -512354 -124971 20421 92129 584141 192097 52497 -393348 -357194
6723 -357194 -287444 -229488 -271204 -770405 -96905 11828 -164206 -471733 -601308 -361456
6713 -361456 -622544 -429744 168522 -86725 -793227 -1124294 -752253 -460875 -501771 -390088
6703 -390088 -468065 -14670 -235823 -182010 -498502 -634541 -354693 58868 -281160 -128755
6693 -128755 -431859 -131702 24834 -143273 -385067 114824 -119985 -468776 -238055 -623624
6683 -623624 -427148 -286847 -576352 -443471 -129937 -655746 -303247 -209560 -228839 -268865
6673 -268865 -596610 -710703 -697923 -669304 -750893 -454739 -506547 -470401 -385062 1532 -168547
6662 -168547 -518442 -407992 -512270 -318128 15293 440199 -372500 -302928 -382895 -550817
6652 -550817 -15434 163912 -129700 200098 -186201 -327904 -229342 -422099 -517234 -376078
6642 -376078 -27339 66513 -15275 -234736 -553041 -430419 -420940 -249255 -405592 -144262
6632 -144262 -30977 -301929 -504969 -327253 186288 -289147 -221626 -51327 -151856 4614
6622 4614 -217935 -303075 -88926 -283516 -347303 -425246 -463935 -466173 -243539 -533235 -506489
6611 -506489 -418051 -626227 -324575 -247382 -462702 -312378 -435178 -748784 -336458 190720
6601 190720 142496 -761596 -357497 225847 36328 -113435 -352604 -318490 -126715 -16401
6591 -16401 -412791 -271853 68919 144529 -263080 -186180 -288669 -423867 -359582 -364231 -304224
6580 -304224 156203 157871 -772832 -353747 -426083 -543400 -349874 -507284 4680 -182442
6570 -182442 -653858 -476805 -21250 47732 376221 -117823 107302 -331608 -506399 -559895
6560 -559895 -118869 -102550 -336372 -49270 166671 364148 179366 -206742 -186194 -346866
6550 -346866 -269925 -262435 -303346 -381776 -566717 -170409 -173933 -215835 -163356 106040 -38526
6539 -38526 13376 -269785 -453844 -325384 -463786 -191258 30226 71238 80376 77091 178869
6528 178869 43386 -249645 -579356 -250071 525885 477905 -216971 86461 -162287 -337328
6518 -337328 -683430 -490884 16217 154182 347798 -41615 -261685 -478498 -660242 -27131
6508 -27131 -181231 17335 -479873 -478486 68329 -124355 -87819 -719201 -356701 23902
6498 23902 -385632 -326438 -389551 -362549 -144491 -164137 -290756 -103707 -154676 -133642 -21069
6487 -21069 -43334 -275931 -498330 -374912 -528120 -767922 -437164 -270140 -185957 -8752
6477 -8752 -7567 -451792 -34901 453760 315973 -69136 -370518 -88763 -408619 -720737
6467 -720737 -143837 -257497 3559 -171668 -106080 -137173 -200174 262110 -154455 -142513
6457 -142513 -83269 -207058 -597555 -427763 -225227 -289440 -520139 -173898 280796 445952
6447 445952 288370 279879 209812 199009 -12654 -446355 -480554 -438969 -554277 -450125 -137820
6436 -137820 -78381 198129 31221 268306 898635 404571 294973 -199753 -295721 -228549
6426 -228549 -450468 -582990 -564595 24617 -299687 122723 -217453 -656331 9893 299226
6416 299226 439798 388253 428345 239960 -118472 -220763 121114 112864 -193750 -375323
6406 -375323 -418614 -195295 -157953 -285923 -183708 29022 -304625 8554 -135154 -569342
6396 -569342 -341695 -349779 -357012 -118400 -7336 -505429 -297339 114567 568130 691642
6386 691642 1005441 386896 -281036 -58757 619242 267281 126311 -96339 -511435 124130
6376 124130 290218 130908 -10870 -172369 -286329 24783 93432 -123038 286830 417831
6366 417831 78793 59767 -338535 -380176 37456 682766 732272 290378 285411 746731 531259
6355 531259 482304 740255 417976 262604 84507 545866 970664 855712 118714 -295074
6345 -295074 -381773 -8359 463328 412912 418061 666703 666075 739267 925534 217852 77643
6334 77643 690107 429236 226851 570305 570926 355437 713522 887568 705365 255196
6324 255196 767867 1022986 757568 826098 801871 1260623 1428037 1591342 1699615 1827488
6314 1827488 1670518 1360707 1746858 1822231 1834530 1632025 1895786 2063564 2316195 2657538
6304 2657538 3120796 3013647 2796044 3216910 3404144 3620993 3855693 4234752 4458026 5117593
6294 5117593 5352514 5829108 6512680 6927998 6654325 6311111 5654858 5765400 5621849 5367851
6284 5367851 5658732 5208525 5304152 5493449 5372333 5491300 5440601 5760243 6069545 5942836
6274 5942836 6170815 6902040 6660121 7018515 7012807 7512268 8073191 8741742 9021893 10039223
6264 10039223 10477324 10720670 10881948 10909438 10908074 10500343 9816023 9377422 8648116 8602473
6254 8602473 7984721 7341157 6734975 6143458 5859596 5335833 5805205 5567348 5756937 5457344
6244 5457344 5280657 5253238 5496618 5446163 5283642 5288353 5763970 6152769 6612405 6608954 6416563
6233 6416563 6234083 6362694 5959739 5810953 5336091 4961201 4582908 4259431 4006943 3510973
6223 3510973 3491276 2811325 2528477 2603882 2377705 1889424 1715046 2008046 2044088 2314886
6213 2314886 2214718 2000919 1603801 1390878 1303074 1320428 1219558 1178211 1176397 1034350
6203 1034350 968665 1020737 834939 983234 1028212 1204007 1112011 914789 780146 611799
6193 611799 702517 397269 225808 353851 532026 431361 307635 364905 687995 642233
6183 642233 136087 256700 462247 7127 135051 783634 1193811 703122 220467 101653
6173 101653 -9366 225819 143595 756464 869870 419791 27666 499459 639690 246532
6163 246532 460242 189413 88708 494668 629264 250968 -8893 108804 69698 -146198
6153 -146198 -285149 -83644 116387 297775 -147036 -210629 -50456 -79514 142893 447223
6143 447223 314665 -66069 107381 -473763 -362460 -230933 -183367 -193653 -356761 -184483
6133 -184483 94857 -69149 -203670 -141492 159253 309915 329759 139579 -413824 -435437
6123 -435437 -231317 -18706 91739 264320 420224 -55492 -13887 78157 218563 293251
6113 293251 73031 -340842 -560439 -230282 3715 -217608 -532399 -389628 -215586 -198710
6103 -198710 -797416 152308 684026 -404829 -421394 12387 170831 48826 -89669 -488237
6093 -488237 -352242 -323351 -302543 -3050 -469567 -286203 223502 175696 432751 -27225
6083 -27225 -183522 -324490 -225815 -615610 -728132 -452358 -285057 -523109 -353855 -176509
6073 -176509 -94308 -43931 -596266 -340715 59111 -131946 59345 -140750 -455425 -534833
6063 -534833 -643660 -394755 -385451 -609819 -200989 14516 -481477 -777032 -287236 56013
6053 56013 -727191 -651090 -469412 -264498 101490 225313 -152587 14625 291267 -246807
6043 -246807 -227389 -124986 -360152 -5756 -494892 -521303 -723221 -345377 -479479 -456954
6033 -456954 -300827 -235244 -427571 -787769 -636400 -540839 -64409 -150260 -141893 -125515 -373730
6022 -373730 -137502 -100044 -335090 -122675 -76880 -51357 -59691 -530350 25948 -76239 -385057
6011 -385057 122516 520043 390746 383836 -228857 -326214 390431 461313 455908 339038 31887
6000 31887 330349 141268 -157082 237988 -41205 -436050 -691632 -267496 -418861 -242482
5990 -242482 -17861 -399921 -446871 -368966 -421140 -395890 -349983 -110560 -76699 -152235 72762
5979 72762 -223655 -491768 -5323 100665 -87197 -34214 -284479 -32182 345871 -21082
5969 -21082 -132553 -576781 -590861 -507033 -390902 -49011 153732 -14324 268583 -189916
5959 -189916 -363754 -702553 -378516 -65032 307505 -318802 -434385 -527484 -596080 17472
5949 17472 -116790 -17287 164939 185138 44305 -221782 -709736 -302318 -51288 -56272 -276675
5938 -276675 -562616 -198852 -391762 -401369 -94775 -231519 93420 -66083 -140843 -442608
5928 -442608 -151734 309482 333175 165476 8267 -379497 -530808 -332501 -336342 -83880
5918 -83880 -210543 -349025 53128 244046 -93094 46452 -73235 -319835 -194981 343436
5908 343436 475301 588610 411691 161449 -283486 -444848 -163312 -28612 -53591 -196991
5898 -196991 -49393 -94353 -473450 -804763 -198442 -219615 321285 308502 538906 248426
5888 248426 241261 26136 -344479 47187 225776 16058 -430261 -223741 63869 -369745
5878 -369745 70017 -389345 -171623 -3094 -469643 -446508 -317580 -213084 -93783 -103667
5868 -103667 37097 -185033 -73964 -283215 94742 209194 520086 593924 -147387 -223703
5858 -223703 -22946 379800 -155526 366010 596915 -70369 -45689 433291 189502 955
5848 955 192434 325909 170274 -129575 -170079 204200 -10235 -142296 1443 28601 -282801
5837 -282801 -251044 -307833 -30128 -198265 -197532 298102 778221 1040559 231340 284273 569706
5826 569706 46652 212618 388061 198202 122659 267472 127927 480320 233840 -254470
5816 -254470 191993 477248 505686 390451 249323 -240805 -163463 -329564 -532253 27117
5806 27117 370127 249311 153971 -203782 -310037 -74486 -46124 349788 51170 59908 -278712
5795 -278712 -284482 -430071 -361305 -339373 -34885 -145476 -156761 111661 207471 10198 -352194
5784 -352194 -349282 56748 -424197 -375554 -69215 83758 -305325 -533403 -315864 -11666
5774 -11666 -208896 -314996 -249561 -243175 100255 465396 368464 6434 8643 -153759 39304
5763 39304 87284 110765 -272914 -227294 -105578 137031 -355529 -552246 -549832 -150599 -214191
5752 -214191 -322055 517064 492806 566676 -76158 -390035 -68577 -52952 241467 -36112
5742 -36112 141333 271566 -75301 13707 178084 148367 -8828 17007 395959 108136
5732 108136 18021 -142909 216975 86335 -386450 -322304 -292963 -76039 -66782 72328 367928
5721 367928 414044 -93335 -175787 -9771 -446111 -321754 -73304 -172857 -276925 102011
5711 102011 203419 13754 -151582 229323 180809 -284503 -389602 -495678 -340290 -137335
5701 -137335 -394646 -490830 -632607 -946336 -803057 -384695 -453831 332200 488695 286031
5691 286031 17625 -21882 286846 591644 111818 -61395 416088 571466 611531 535871
5681 535871 248062 344136 217873 208122 201830 27966 404340 433202 257109 -148250 -28709
5670 -28709 399289 104188 162054 394739 -132431 -60024 463204 434592 704634 591557
5660 591557 342786 -65586 -204309 -249124 -156663 18968 -247248 -131710 -111962 59370
5650 59370 168576 -46311 160039 743424 454327 602724 335461 -2986 -172164 121900
5640 121900 459405 479709 823467 1304817 973731 600980 351104 519552 604965 421487
5630 421487 160546 12857 55835 989929 961837 946259 1312777 920921 572032 182576
5620 182576 584707 700858 624203 996932 771244 388674 57953 151793 224032 434940
5610 434940 490510 872327 874384 147442 279473 615510 684542 789855 416613 370971 464100
5599 464100 441748 651093 599750 237294 485956 604730 576148 780654 670910 530629
5589 530629 503950 588754 534493 497803 371568 -62840 42996 286551 256689 86647 399628
5578 399628 -69956 -101529 -85567 -28118 350584 443534 241028 408812 539281 123964
5568 123964 282100 441328 498669 81398 -78943 -33528 198415 24620 366917 391803
5558 391803 650255 441555 567209 418866 630792 771490 399958 450702 167385 50593
5548 50593 13371 -246515 327120 550665 581288 707479 136368 -54833 30561 361787
5538 361787 331662 433683 415827 450169 872870 555322 407638 806535 314235 40267
5528 40267 387850 826053 654393 512110 352658 154946 469253 560672 669238 -114261
5518 -114261 81392 586819 884503 915186 607633 443683 855472 1179380 1068143 1060858
5508 1060858 1253645 918264 413262 506649 154541 383499 442455 386180 693354 795999
5498 795999 861139 778875 981858 831354 856692 888802 628850 688067 753563 939171 1160673
5487 1160673 837709 574875 615654 843174 646938 419833 374823 367556 340940 453139
5477 453139 166467 88716 173023 -103952 -525922 267384 576994 -42699 156314 11153
5467 11153 73653 515210 402260 -217659 6207 242393 478999 401490 298826 391115
5457 391115 397584 639593 402075 649295 370002 -200245 428662 485925 557270 74665
5447 74665 -3907 169041 624996 180135 -243412 -422847 244925 465949 291689 173257
5437 173257 383294 298297 8866 19291 121156 126773 -13177 57435 547800 880294 626280
5426 626280 723199 82133 235420 378176 -3063 -103386 78567 59544 17400 -304017
5416 -304017 -336331 -163117 356177 573340 542699 388178 323951 389452 171675 240243 262504
5405 262504 161818 730663 270815 -242870 -248058 -251593 -507772 -159477 -77576 -55136 56097
5394 56097 142813 373955 390167 454646 126158 137590 301576 253583 318291 187759 -210838
5383 -210838 -57779 411856 383292 320906 432751 395143 476132 285113 284354 411485 575808
5372 575808 285678 -122908 -292140 148098 181001 353293 23856 65804 388329 219303
5362 219303 285585 98382 638115 470863 244613 632785 395814 238884 6923 421606
5352 421606 -123733 38917 286063 405922 583137 384893 535723 336105 206485 538777
5342 538777 444057 578423 934561 820484 152010 296671 521808 309101 485677 432987
5332 432987 497576 543108 776904 123690 301868 64845 74025 280645 -57529 -31843 326110
5321 326110 100426 426487 523400 243167 251983 266085 356306 903232 918526 416457 270646
5310 270646 450919 444107 -174807 -98772 181284 -126710 241026 583897 698757 877429
5300 877429 840890 1092801 1020479 705978 1048787 656853 456186 731156 328074 286740
5290 286740 248854 267305 514281 606990 460432 606117 621726 465703 717108 663919 957571
5279 957571 1005825 629998 1084514 997183 704140 825125 605119 659644 732852 490353
5269 490353 526924 209430 345238 -70354 -21802 424370 651159 -81594 436999 856047
5259 856047 1139803 949957 571892 1024570 540802 558217 991577 1122505 1148012 1047084
5249 1047084 765856 837501 520255 786840 1099285 661711 652954 1039129 1080969 729866
5239 729866 863517 616752 850902 668740 316645 615862 459475 507944 836710 1058236
5229 1058236 1150728 774954 645521 707401 856828 1537657 1362482 1232497 1105017 1148887
5219 1148887 1222662 773240 853163 831649 759510 1023384 688682 734992 1023785 1335353
5209 1335353 997747 1389908 1057993 1023899 886292 1079823 1078902 1175094 1389053 862203
5199 862203 453014 555087 1235954 949142 1015015 1188138 874331 1078857 1204971 1395346
5189 1395346 798688 857242 1251086 880587 910565 922450 569127 1122786 1067772 997561
5179 997561 1689750 1269745 765940 867444 1094432 1336652 1350471 1262254 1154366 880657
5169 880657 1098443 1555848 1091640 1176694 1258235 1464112 1576877 917003 1097339 1172551
5159 1172551 1185260 624908 790415 731565 633508 1035497 1102935 771464 970151 425254
5149 425254 674458 684863 900107 1307907 941741 621152 416507 559693 492591 695106
5139 695106 1064578 1087765 994154 1208653 1087457 1185413 1472902 1505751 1341547 1403753 1134361
5128 1134361 1330635 1558881 1162685 1258894 900095 820463 777882 90591 205264 967405
5118 967405 790974 863033 765360 1176984 1215223 1099197 974330 1039151 1213251 1413382
5108 1413382 1363808 1397084 1292397 936026 1343658 1554337 1214333 1279427 861278 657696
5098 657696 957566 737262 863010 1341705 1130012 745495 840451 1113763 919122 990930
5088 990930 1179777 1093655 1554807 1353071 1150186 1057824 1008242 1276763 1453941 946070
5078 946070 584487 539220 782524 1463886 1925297 1581535 1367726 1016678 1363206 1377302
5068 1377302 904119 1334490 1104874 952341 1306954 1320525 1358744 1305353 1424787 1634535
5058 1634535 1672964 1779016 2232847 1969297 1749763 1738108 1442154 1280779 1370071 1407491
5048 1407491 1389361 1407062 1829948 1608666 1571324 1302987 1241698 1249400 1278872 1972297 1612922
5037 1612922 1635119 1869908 1342958 1399731 1635737 1305236 1610036 1757895 1682178 1632114
5027 1632114 1673853 1726809 1870352 2025695 1919292 1626191 1492432 1873652 1975181 2354931
5017 2354931 2056195 2201819 2127613 1803033 1874553 1870731 2010475 2168178 1643586 1540202
5007 1540202 1883117 2167086 2467216 2359612 1917910 2113122 2207147 2175592 2036387 1960597
4997 1960597 2319509 2217580 1828852 1694059 1775551 1845274 2036416 2383494 2166240 2074433
4987 2074433 2634213 2575177 2325454 2465336 2176331 1876123 2339895 2414382 2413978 2434352 2789828
4976 2789828 2380272 2169762 2697504 2731044 2839959 2816375 2649341 2657586 2906302 3016214
4966 3016214 2808912 2827401 2559632 2734181 2785753 3004151 3408077 3283937 3092925 3074675
4956 3074675 3453319 3637199 3199640 3445324 3678412 4146091 3957685 3445226 3152344 2871480
4946 2871480 3282446 3450985 3266451 3439098 4176472 4298077 4074599 3962799 3836235 4135007
4936 4135007 4481886 4900097 4657477 4432078 4494868 4543099 4816455 4850489 4950356 5311162
4926 5311162 5581192 5319556 5331286 5738747 5848756 5935913 5881808 5861691 6636041 6890690
4916 6890690 7133701 7256447 7267822 7630576 7575464 7926004 8674597 9232277 9794433 10322031
4906 10322031 10336358 10785907 11326003 10854188 10769009 10596641 10338006 10311949 9842242 9678629
4896 9678629 9827888 9950282 9894069 10162228 9906416 10565985 10697399 10186385 11264767 11887481
4886 11887481 11611263 11873033 12317921 12994618 13743790 14457955 15150345 15648667 16306055
4877 16306055 16627690 16788751 16894612 16470410 16412181 16011288 15587771 14965359 14155142 13930518
4867 13930518 13567614 13391359 13207270 13096870 13078760 12456311 12237237 12273555 12434029 12417092
4857 12417092 12482002 12333401 12043998 12175950 12723120 13303300 12879013 13106735 14079381 14007205
4847 14007205 14275534 14273573 14244303 14221772 13743294 13598895 13097520 12950143 12599577 12745640
4837 12745640 12718923 12051574 11785578 11888005 11662775 11345908 11208175 11489015 11560410 12011794
4827 12011794 11872041 11948286 11934445 11794655 11879801 12175519 12461288 12690962 12693128 12827430
4817 12827430 13173030 13288216 13753631 14063027 13739564 13864506 14176638 14433271 14688323
4808 14688323 14258248 14540837 15132268 15082345 15209296 15019444 15539765 16287502 16800307 16693710
4798 16693710 16335168 16867565 17648386 17824443 18467925 18549737 18933890 18695647 19036170 19991534
4788 19991534 19916761 20517246 20858638 21167032 21804167 22091301 22437793 22870698 23531727 23947301
4778 23947301 24296472 24848289 25358966 26387248 27002801 27144482 27512916 28199460 28509146
4769 28509146 29362781 29679715 30140745 31073251 31185615 32361517 33669670 34115264 34613076
4760 34613076 35344763 36108398 37055546 37827884 38447898 39932555 40987551 42354771 43459428
4751 43459428 44179558 44661731 46174507 47558539 48801500 49764114 50902786 52401304 53975197
4742 53975197 55152089 56292616 57538305 58969128 60611092 62230431 63885575 65574422
4734 65574422 67453144 69144112 70954693 73053388 75438103 77983115 80438622 82456395
4726 82456395 85049989 88086267 91348501 94443861 97775490 101373022 104677944 108734596
4718 108734596 112976934 117618458 121987154 126745793 132760085 138016852 143861466 149919542
4710 149919542 156334708 163857754 171312443 179527221 187831615 196738667 206810598 216676720
4702 216676720 227231339 238329051 249633092 260620576 271751727 283387190 294728526
4695 294728526 305867570 316708109 326689705 335371609 342667703 348706190 352817979 354905901
4687 354905901 355542728 353937619 350454682 345584060 338360117 329896309 320851020 310182135
4679 310182135 298501685 286156366 273071122 260542219 248599849 236283470 224692604
4672 224692604 213588970 202951123 192879894 183168725 174094811 165848319 157792971 151105875
4664 151105875 144336549 137791312 131286947 125809952 121118296 116186163 111582419 107106824
4656 107106824 102986507 99062457 95591352 91882688 88767283 85105267 82050056 79530728
4648 79530728 76731695 74215029 71975529 69585520 67461092 65763466 63335086 61113379
4640 61113379 60060915 58203904 56783000 54989432 53374767 51627176 50162255 48587425
4632 48587425 47315952 46501340 45037063 44100801 42615556 41421282 40386279 38945053
4624 38945053 37685312 37613824 36352459 35294265 34447128 33795018 32976794 32166761 32131807
4615 32131807 31548929 31001668 29934583 29293393 29128327 28156982 28005257 27368400 27019930
4606 27019930 26787260 26380829 26156911 25551701 25120676 24056598 23202841 22836505 22720324
4597 22720324 22202499 21234313 21005199 20692316 19967990 19948603 19815019 19564836 18981047 18656569
4587 18656569 18287251 17800525 17474298 17064307 16320569 16204500 16008756 15962621 15907941 15543568
4577 15543568 14600172 14763321 14515537 14609060 14185833 13992444 13918768 13488755 13567897 13428893
4567 13428893 13084428 12481680 12716575 12892142 12316853 11375541 11589085 11390872 11074675
4558 11074675 11506051 11643966 11445844 11216756 10539466 10629497 10494629 10182308 10114968 10067344
4548 10067344 10256637 10035522 9315201 9089449 9181972 8952598 9057049 8539982 8910507 9121840
4538 9121840 8860808 8762280 8956425 8443550 8207070 8254151 8162541 8445547 8385831 8613325
4528 8613325 8620741 8019813 8144484 8008905 7963795 7959225 7853497 7635302 7363797 7365604 7160670
4517 7160670 7472598 7441679 7590620 7023472 6946855 6883719 7117545 7374279 7261660 7397201
4507 7397201 7409070 7454693 7414819 7723696 8147928 8344608 8393542 8162471 8132294 8354607
4497 8354607 8514680 8654703 8613092 8422316 8850633 8846812 9402051 9798237 10384167 10717733
4487 10717733 11437853 11480244 11472288 12248813 13157287 13836317 14392703 15239157 15566657 15607659
4477 15607659 16598821 16900779 18172515 19183509 19465461 19556200 19555178 19908511 20556301 21209704
4467 21209704 21486585 21399636 20993818 20208058 19530122 19285609 18951697 18666999 18006836 17698109
4457 17698109 16812741 15666453 14760437 14556973 13842309 13382106 12910861 12258259 11594589
4448 11594589 10859635 9975543 9619724 8571585 8283181 7642571 7423550 7310240 6881438
4439 6881438 6731204 6618196 6128274 6256141 6083664 5600237 5523638 5185798 5388421 5286876
4429 5286876 5052745 4445439 4378008 4092281 4630787 4667537 4146913 4174048 4345636 4195674
4419 4195674 3781279 3532293 3829408 3412414 3616001 3734792 3273835 3461446 3414888 3007151
4409 3007151 2958393 3132384 3078473 3172468 3333402 3228456 3230408 3192113 2638956 2508889 2790898
4398 2790898 2730392 2532549 2695847 2880548 2281117 2669415 2710866 2536743 2661974 2625061
4388 2625061 2950986 2298958 2457719 2606268 2213188 1898594 2256544 2023016 2247813 2254504
4378 2254504 2288534 2476108 1883057 1699316 1763306 1935806 1871745 2110301 2363189 1973335
4368 1973335 1975712 1799165 2276345 2565078 2394251 2477826 2453418 2167231 2467002 2425054
4358 2425054 2954653 2529008 2441250 3157115 2912806 3110856 3091053 2969767 3582766 3148130
4348 3148130 3266770 3263973 3630858 3725790 3510281 3394971 3008628 2925800 2780706 2945271
4338 2945271 2890510 2802806 2465295 2420959 2290747 1734616 2115077 2095616 1990344 1747730
4328 1747730 1777506 2129285 1682528 1429600 1413957 1638514 1490718 1065407 1217825 1097730
4318 1097730 927896 1313872 1260988 1305983 798222 750556 565549 885989 769343 820979
4308 820979 1077943 742873 946457 1116924 1134821 1066964 774957 892218 865307 1053658
4298 1053658 700592 1191803 957476 786893 767768 998258 1167831 699131 325436 869769
4288 869769 901163 524995 819165 824542 546815 846318 894490 750297 580225 862018
4278 862018 566417 1053446 1180175 1033388 1038065 726872 562907 419784 543159 155849
4268 155849 806091 1202515 913978 743422 634362 1115815 1183595 870224 1028791 1299456
4258 1299456 1022993 834981 801808 858654 1170756 1346132 1183298 789194 1134857 1023414
4248 1023414 1108983 1387284 1061321 1178981 810224 404331 864122 426753 397583 919742
4238 919742 1213573 1034971 912402 1018478 1389313 1124107 740346 895313 826692 1350872
4228 1350872 1061527 1569276 2013999 1543429 1763270 2158610 2282153 2156105 2695402 2792391
4218 2792391 2471378 2175385 1766517 2315534 2124107 1138463 1432618 1080669 1163542 1523021
4208 1523021 1652624 1285502 1131779 1006521 743808 615040 806646 1056281 1082758 817215
4198 817215 674829 490003 274754 212279 326481 461638 902377 1087181 935533 795078
4188 795078 781489 91361 426506 641769 771231 917751 550614 94107 354198 376775
4178 376775 510959 411221 241594 176687 139873 517065 647497 670485 622878 404983 415854
4167 415854 481313 333727 518846 768733 590418 377928 632467 385055 688445 743737
4157 743737 724017 423850 407679 61186 -55217 83330 200054 262799 -50891 -26910
4147 -26910 602749 545344 394376 553948 502847 972709 1046128 539849 310800 502375
4137 502375 968608 578350 333386 353050 184717 -17426 421141 63542 103367 597615
4127 597615 407296 664721 193195 260371 48309 614454 593359 597662 521890 178697 426747
4116 426747 312542 349608 176851 5719 379 208326 75941 -224930 7689 558276
4106 558276 313234 -76972 96033 588429 661684 337764 195304 774298 498722 530542
4096 530542 304797 257335 872752 277504 335054 511109 434105 379937 615356 472745
4086 472745 152233 139947 30201 518472 486081 266578 600762 786604 596883 334068
4076 334068 298855 538465 464669 317958 641511 396590 394307 369320 171229 139582 172362
4065 172362 428375 21672 180123 -100771 54269 -240480 267288 991695 682729 456723
4055 456723 676067 550391 454904 255667 546760 820493 540259 406774 492788 766662
4045 766662 919380 500366 224438 343826 889367 774514 419551 655674 1112680 732899
4035 732899 521049 250414 346041 191225 -94024 678524 532353 214934 511359 771090
4025 771090 582973 889458 1185288 781649 458386 697213 232706 196416 576016 571551
4015 571551 830690 847355 93727 5953 531649 493625 384517 233845 241372 459718 310003
4004 310003 712973 335285 17992 2931 784140 765989 219332 185769 736893 689478
3994 689478 765874 -10981 -90296 173182 252954 174673 108463 89890 338119 619444 -12033
3983 -12033 -345293 -274644 -35274 234706 512469 316286 62466 24929 11862 94894 85873
3972 85873 74474 -119757 371337 474613 64561 53719 111036 -81421 -317830 -61417
3962 -61417 159605 81870 212602 423399 468081 8953 -113741 -194481 58417 229390
3952 229390 56044 437979 412784 352423 302335 432576 433407 384709 414060 398765 250306
3941 250306 29960 58342 55322 461099 413644 252003 460529 323600 548174 600097 688082
3930 688082 685188 546430 577880 715144 78286 130305 -30306 818593 773154 168654 521734
3919 521734 191732 751928 562674 392009 536791 300257 519455 693467 817496 377590
3909 377590 427839 403748 77417 214691 632665 118756 242148 265481 348558 376193 -46891
3898 -46891 -226044 -302434 -31060 -309578 259828 -257535 -651116 260752 780608 690463
3888 690463 54029 -180061 -85119 277306 285483 330090 279208 406023 596556 260594 86994
3877 86994 270547 388304 228314 392361 509462 564954 32349 89399 124889 363251
3867 363251 650272 17276 -82699 -341602 -328314 -574561 -328375 -163716 735775 542127
3857 542127 -131333 -350829 -200116 50991 265594 416487 -36917 46800 -41862 69334
3847 69334 191615 -169620 -75799 -82266 15290 47504 -609935 1689 501742 -231567 -112994
3836 -112994 223115 308688 198934 671643 1369592 677504 247667 115518 -347887 172088
3826 172088 468239 462696 308068 377911 326445 -745695 -295361 -327835 -149712 -84476 230229
3815 230229 663835 267889 121403 517795 603102 70134 -8125 -154592 54001 228633
3805 228633 -143078 170206 -186659 -522123 -558414 -19915 -42385 -132334 -295516 -186273
3795 -186273 619048 267959 -173100 -255803 231484 192228 -12042 62105 13916 -424034
3785 -424034 -381534 -412771 255340 332836 129760 149985 143615 462578 4911 619884 508814
3774 508814 184896 45064 -603354 -750446 -770290 -523838 -397034 -737499 -916504 -902277
3764 -902277 -580647 -304467 -532042 -148004 -193712 -328944 -264462 -425263 -313594 -174709
3754 -174709 289086 527684 492537 -62279 -174034 -320306 400075 454762 57771 -353348
3744 -353348 -556155 -45198 67575 122051 86258 -464564 -378265 -269706 -332143 -326924 102715
3733 102715 325883 362271 458360 126354 -180529 34103 879185 1181370 773594 389473
3723 389473 83747 498790 423408 470387 450470 251339 48472 88792 184315 -86510 332270
3712 332270 251503 21763 95789 -211479 -702311 -430766 -48316 525929 628437 360063
3702 360063 519133 731334 369322 107931 743567 638031 350270 740520 341450 273859
3692 273859 323282 510496 892830 933604 138950 473216 578977 414732 693446 857001
3682 857001 525366 573897 686459 584985 904721 1081887 496338 903368 871073 824583
3672 824583 563356 657365 341069 100795 90513 700840 752450 147439 529388 820977
3662 820977 580147 108115 408068 286950 981204 1086782 260090 328859 534295 193773
3652 193773 557622 726803 457363 213689 322703 435798 -235751 -307484 -23418 298248
3642 298248 368643 768678 430240 552861 195109 338433 450878 606791 582980 652415
3632 652415 711925 -205372 -136695 -446700 15527 137468 342841 230082 316652 -84581
3622 -84581 88686 479184 174728 -169115 310654 378774 345555 -90669 -436594 -239574
3612 -239574 -268004 90028 146932 -153250 209105 2591 306071 -2141 -706187 -422703
3602 -422703 -291675 -278929 13456 85774 120494 -84897 -184730 -140210 -128141 249116 -6205
3591 -6205 -141043 -304387 -382030 -389083 -216725 261099 465362 132898 -373440 -502330 -205748
3580 -205748 76831 104051 -137074 367757 -136588 -532971 -234149 16624 164633 360344
3570 360344 227070 -207822 -147650 -102760 -191746 -139369 259797 164621 -62158 -216507 295888
3559 295888 188717 65252 62750 140243 -40000 -419387 -331183 51806 -299050 -352436 -102411
3548 -102411 239907 429049 74900 372073 -74633 -263715 137060 309034 171563 114254
3538 114254 544923 196982 -166535 43649 111973 143218 90727 138997 -51548 -524297
3528 -524297 -248985 -186897 134316 570738 207511 -189573 -314807 438901 844387 -66918
3518 -66918 227056 779157 282839 192420 288306 318048 507798 56676 173752 315517
3508 315517 -175362 -223593 -213637 354016 281014 281647 679752 417605 89628 -131762 -5719
3497 -5719 92495 -79688 266876 216456 482202 404479 279435 -448133 -376819 375391 168265
3486 168265 133444 275605 331713 19038 -302578 376400 575322 -36140 -220950 -84349
3476 -84349 290366 171252 427876 509597 356799 457665 138071 79600 298291 714609
3466 714609 318036 640274 511896 -26560 307013 292665 379569 792510 1192835 642399
3456 642399 293944 177423 48710 296875 465076 276194 3605 203200 222757 600568
3446 600568 939069 648540 543662 434210 165595 335529 128855 333851 1009489 1721094
3436 1721094 1177556 977555 913351 532763 688103 671830 940037 1123418 1164316 863903
3426 863903 833961 948133 946850 1141669 999735 1113686 819706 914916 1149382 1175125 1284728
3415 1284728 1169101 1215579 888096 777868 1021750 1408062 1278473 1593023 1219494 1454119
3405 1454119 1824462 2080339 1809724 1614353 1590950 1576329 1743051 1778337 1654749 1746932
3395 1746932 1940067 1904642 1886313 2037788 2417760 2374312 2380903 2385701 2826242 2745027 2040606
3384 2040606 2965258 3552090 3817648 3992801 3821000 4108264 4074611 4413683 4902436 5015392
3374 5015392 5247668 5652617 5464731 4861888 4656107 4719580 4425295 4257723 4103884 3680437
3364 3680437 3746721 3464907 2579765 3024521 3033429 2584580 2438383 2208731 1794991 1835584
3354 1835584 1663816 1607945 1976626 1487710 1406000 1323246 1388093 1058945 1074171 1215541
3344 1215541 963937 697180 451157 342097 693228 864983 1054512 744741 328559 908912
3334 908912 400675 549534 675619 590972 715784 700256 389401 46350 173480 468284
3324 468284 367900 211581 195193 90122 256325 559926 252907 36162 340533 -101096
3314 -101096 -128175 22712 112910 50092 295320 464949 657688 831658 649295 853411
3304 853411 938773 405030 493954 148185 47278 -162586 3296 67501 576010 327083
3294 327083 -131009 -187796 312608 223898 504552 734147 294534 547224 120855 -18986
3284 -18986 362666 993588 920094 488857 548834 583057 337358 638163 635290 750197 296186
3273 296186 435640 271704 -121025 -133152 231539 -29289 747653 674786 222439 -89066
3263 -89066 -537766 -8456 222859 253012 253170 -15954 146542 468008 173278 -201165 -37192
3252 -37192 -186214 87943 408386 -214870 28502 314961 196292 -68019 -172647 -118842
3242 -118842 -329188 -363562 -495454 -233918 93305 60488 -83547 -11828 234574 -103384
3232 -103384 -286373 -197689 -259390 68078 355019 224420 19296 14801 335216 160080
3222 160080 -273553 -68474 -176160 -248649 -407345 -577274 -248216 -465057 -461851 -259448
3212 -259448 -273422 -142591 44649 391169 413854 482703 153741 27641 -66774 -598852
3202 -598852 -185443 -176641 -551372 -214051 288970 172635 -135185 176680 -33913 135085
3192 135085 204238 17106 -308977 -75038 207599 574597 168518 -351751 -221740 -283113
3182 -283113 148982 -359877 -154147 138297 137408 38603 132978 48397 -424806 38544 49545
3171 49545 -339019 -190433 195215 374014 70567 -248477 -366674 -564732 -727101 -293013
3161 -293013 -596027 -644644 -339491 -188978 -316290 -299039 -333741 -274096 -347042 -230022 105603
3150 105603 370553 -169112 -330404 -584112 -88291 -131419 -271876 73108 81610 -96234
3140 -96234 37335 126765 100668 238337 -16666 -27024 -161304 67590 -149829 -69577 -150938
3129 -150938 -195736 66233 148713 29982 -50948 -89277 38868 379467 84658 127354 187648
3118 187648 -13158 -249785 -292837 -20048 30752 -277251 -569227 -362864 12799 477924
3108 477924 795340 328593 -93729 346191 504254 243650 166095 213617 695086 426918
3098 426918 58026 -144346 -128642 134810 29027 -55516 -98239 -391981 -768009 -384151
3088 -384151 183180 95526 -104403 -523315 -169779 320283 -95837 89169 117929 171939
3078 171939 278251 314463 145198 476197 576295 714963 919462 793351 283346 -612
3068 -612 225293 668800 527425 911228 784859 571585 473073 492165 472861 457586 676133
3057 676133 675796 297036 408125 561335 457622 470723 666126 655577 463368 731251 580176
3046 580176 612608 924854 1135465 1368810 856640 741228 864172 700710 762161 1175413
3036 1175413 1699120 1511954 1012701 904979 1229095 1270219 1334630 1140294 848877 939065
3026 939065 963970 747330 1132462 1351348 977245 886024 724968 397725 111187 -41765
3016 -41765 444346 641165 333588 271295 519335 567558 450283 402842 410520 496956 654343
3005 654343 740276 489528 634979 580676 955010 673625 97508 98958 -71553 36912
2995 36912 263642 755297 317838 133452 61847 235344 229819 13955 -290711 456556
2985 456556 403817 235798 303430 -214197 -437931 203196 462455 275056 313849 353196
2975 353196 -80688 55873 -58413 -35304 -280586 16017 -361469 -343727 -196508 -259562
2965 -259562 -64078 217951 692263 261005 -92465 -544229 -452910 -416696 -180594 -850530
2955 -850530 -1066849 -765707 -399481 -340489 -493483 -460228 -147636 -319615 126659 -444904
2945 -444904 -419311 -260263 -725891 -426014 -188237 -435740 -173392 -663257 -471337 -546902
2935 -546902 -670190 -616320 -578934 -108406 77692 210868 -80310 -32942 -59756 -357834
2925 -357834 170045 -178142 226691 247874 -76242 10166 -326955 -137623 -208762 -30204
2915 -30204 -261725 -782949 -839828 -945568 -677618 87015 -246515 -286434 -324945 -658449
2905 -658449 -747054 -371360 -742927 -102312 55527 -660296 -1160868 -426041 -140525 -113821
2895 -113821 70172 -504035 -82207 -232459 -183927 -371648 -348425 -452766 -897753 -297653
2885 -297653 -201658 -461810 -344010 -396914 -441124 -356710 -222104 -443322 -604674 -861628
2875 -861628 -417834 -500467 -672247 -37130 -398782 -550727 -394493 -389752 -427717 -312069
2865 -312069 -262449 80838 -172063 40561 42156 -54918 -274289 -800518 -917625 -391478
2855 -391478 -420231 -568849 -511847 -471909 -483711 -591380 -501239 -183613 37637 443613 323391
2844 323391 34006 55127 -96831 84477 -81722 -258579 -557946 -701082 -530636 -345474
2834 -345474 -312227 -725998 -608561 15237 -53341 -350424 94918 -86830 -313657 -53322
2824 -53322 299903 68237 204697 -24927 18675 143125 -183935 -93961 -98652 -176370 -493198
2813 -493198 -165286 37004 47560 -163305 -150942 -158663 -399427 -651533 -655650 -171841 -429503
2802 -429503 -211644 -316006 -417878 -155740 -326012 -298997 -369765 -404176 -292786 -248907
2792 -248907 -550314 74815 -61617 -539664 -584546 -557928 -766891 -496373 -180630 101631
2782 101631 -141725 -323497 -336797 227693 238291 -138997 37994 -365717 -957452 -320608
2772 -320608 -561085 -544845 -631861 -445657 95615 279885 -225124 -407724 50613 -164593
2762 -164593 -365655 -207566 -168702 -553451 -680227 -566266 -282836 -199670 -416394 -569196
2752 -569196 -342829 81708 -271055 137464 275182 261908 -8151 -386835 -555323 -666431
2742 -666431 -732507 -582897 -629915 -868348 -786140 -320547 -199503 -320414 -856403 -1042029
2732 -1042029 -776959 -610566 -504090 -454690 -450095 -178263 -78258 -284642 -103137 -265021
2722 -265021 -105657 -392147 -149020 -122592 -199337 -669798 -559575 -63496 139202 -57440
2712 -57440 -82033 -265999 -465814 -922859 -143180 -306130 -368851 -471908 -688841 -525809
2702 -525809 -544187 -719724 -412864 -114043 -149178 -296014 -759736 -548858 -656193 -408036
2692 -408036 37858 -577574 -415312 -615592 -803855 -745437 -288562 60713 138393 -468333
2682 -468333 -297926 -154345 -305784 -142094 172237 161954 -31059 -34503 239811 281707
2672 281707 418571 525483 143673 -190183 -271382 -133521 144593 -98619 -227610 -222356
2662 -222356 -286727 -201580 -544939 -498477 -341460 204138 449255 345197 -284432 326278
2652 326278 434681 117796 -86781 -244456 -353693 -203175 24326 118198 5386 316156
2642 316156 273192 -111718 -371384 -343351 -613087 -343194 151934 120257 73874 -214830
2632 -214830 -403628 -365578 -350990 -298913 -71422 -318788 -136761 412226 135077 122721
2622 122721 -178317 329289 126715 124002 123789 -200968 -525476 -389644 473147 -11083 -213496
2611 -213496 -477725 -136845 365138 239169 -149050 271670 435199 425189 308174 39177
2601 39177 6803 41082 6137 256198 293259 -57756 448705 -10594 -234224 625336 918923
2590 918923 930372 866288 480651 289921 28184 211738 813960 905580 553036 693718
2580 693718 546727 449357 286307 70916 -160731 179546 400706 275846 57253 -47296
2570 -47296 174329 168535 339993 340432 420734 162362 91814 -243976 -310540 -136967 -428159
2559 -428159 -310891 -222046 39813 146847 496867 634482 706903 985514 760550 494301
2549 494301 222480 127922 520865 594098 240125 4807 331155 501583 356210 29257
2539 29257 250387 269254 -151999 41910 406641 112011 75709 161015 287350 310949 182587
2528 182587 337382 163448 9601 -98710 -154458 265898 185740 142792 419088 477886
2518 477886 664971 594254 423663 528259 576789 188550 223649 235263 554933 233826
2508 233826 219095 286552 243141 276722 382606 475790 426444 168216 772362 277970 -15488
2497 -15488 204894 207464 269153 354505 440579 553501 397073 203401 879409 785356 484597
2486 484597 267566 394632 606519 749247 684413 373397 777575 965792 996088 475559
2476 475559 637975 1232326 1252036 1093519 843978 592136 910430 1363353 1023411 555719
2466 555719 916992 1114813 979821 1041428 1097760 1001150 1339560 1136474 1502967 1788661
2456 1788661 1679967 1724429 1617152 1860199 2134596 2216845 2154448 2066269 1556178 1431448
2446 1431448 1878181 2063072 2020252 2579152 2490271 2361502 2159111 2099272 2145444 2129425
2436 2129425 2327788 2372332 2296145 2742877 2109255 2238225 2255945 2432281 3130909 2663246
2426 2663246 2851967 3547549 3843243 3694521 3442222 3937135 4104936 3739077 3501318 3909925
2416 3909925 4351730 4603307 5056354 4824498 5284251 5337534 5121542 5294994 5284657 5275961
2406 5275961 5859897 5773750 5944885 6541492 6886387 7054586 6971491 7741846 8006740 7811084
2396 7811084 8443224 8460948 8652407 9011896 9226358 9414512 10086795 11275039 11777896 12217017
2386 12217017 12773663 13757574 13253995 13694745 14002679 14654053 15636485 16234807 17437679
2377 17437679 18349492 19206177 19893214 20406950 21536699 22715540 23623442 24524743 26057361
2368 26057361 27419283 29129839 30981917 32859337 35144772 38237426 41252448 44307605
2360 44307605 48241470 52267275 56389040 61366976 67393214 75698734 83781303 91661456
2352 91661456 102073951 115219305 132694988 151561794 163014685 172918813 182234918
2345 182234918 170469133 144790704 124697715 110921891 99656126 88878732 79961832
2338 79961832 73289212 69017000 65691690 62860439 58794824 52529157 47562527 43374294
2330 43374294 39423299 36746216 33897334 31861812 30049066 28147303 26729438 25269711
2322 25269711 23852163 22705293 22227976 20543440 19405155 19058969 17900742 16833579
2314 16833579 16531665 15761836 15699799 14758388 13845079 13387816 12993454 12477425 11753803 11711036
2304 11711036 11336020 10249475 10355717 9840192 9487732 9180725 9177376 9218137 8798500 8045200
2294 8045200 7826076 7675164 7557897 7174475 7492794 7432902 7240396 6640156 6057011 6241255
2284 6241255 6063547 5906751 5716171 5734706 5523726 5155804 5084166 4747092 4832130 4257267
2274 4257267 4330478 4454250 3882718 4009920 4174879 3954944 3868759 3330203 2702059 3320397
2264 3320397 3347747 3408455 3098206 2741820 2937218 3014645 2363032 2326242 2909238 2777650
2254 2777650 2159835 2298854 2241135 2161616 1940891 2022881 2001677 1745964 1929945 1752793
2244 1752793 1739265 1898170 1721122 1908561 1490569 1643377 1695836 1468832 1152396 1611957
2234 1611957 1550030 1438236 1286083 1369252 1000722 1125300 1105818 1179214 1396540 1288740
2224 1288740 1186703 1475740 1202976 884756 1183574 971248 841574 1210345 834800 1347097
2214 1347097 1360167 1297282 1444527 590369 656072 745223 640205 289976 1145641 950677
2204 950677 858221 795867 469617 817207 450779 192652 461317 587827 899630 646519
2194 646519 940678 1329361 909242 768438 376727 915336 734356 246679 181127 120899
2184 120899 -76906 -4731 72453 293505 402719 84218 405457 599069 819885 216082
2174 216082 -201024 343815 720238 195982 301468 485015 455192 226051 267306 133555
2164 133555 12820 56933 131163 69866 181029 172352 359450 96025 89801 259104 553641
2153 553641 516890 47521 426544 545613 244254 489708 424349 -25892 153791 281935
2143 281935 112365 375677 585887 108671 -62438 60074 298006 252865 164125 192688
2133 192688 460303 546530 538265 263925 52211 -323071 -478811 -213473 -221087 541953 580281
2122 580281 366848 79785 282669 456829 519696 796185 775373 797442 950552 667464
2112 667464 261894 236791 477173 765632 848121 599396 603792 739892 1533037 1357232
2102 1357232 1276662 1259716 1316771 1150368 635454 1048816 904856 433689 206571 208289
2092 208289 429217 140170 152460 254809 319900 -136434 -29508 723592 193956 -263789
2082 -263789 59557 28875 -139686 -108653 -452487 -372384 -241545 352617 325704 317727 -58368
2071 -58368 130185 61998 397926 -222033 -176731 -200024 -102329 -223566 -186722 -27213 263245
2060 263245 52604 -32730 -159929 241276 341087 114885 82901 238821 172935 387081
2050 387081 18829 -237830 122746 -45735 456113 371065 114368 -247806 277781 -170966
2040 -170966 -226454 -704213 -954008 -501444 -637982 -382175 216539 157990 256837 215119
2030 215119 356908 25718 153313 -78851 -567113 -438323 -121369 -380639 -610781 -370797
2020 -370797 -286878 -70670 73215 -21216 -510124 -818921 -909013 -469298 22578 -235453
2010 -235453 -234986 -515682 -504518 132687 -310033 65421 -18440 -274150 -288708 -184313 -518212
1999 -518212 -373827 106399 185081 420862 123062 -264119 -456284 -527081 -356925 -190020
1989 -190020 -187728 -203722 -196918 -376439 -843963 -498135 156013 -38943 17093 -179936 -68933
1978 -68933 634390 221023 397484 534669 -46754 -186628 -607232 -183617 -82891 -423782
1968 -423782 -592655 -558487 29854 -28983 -638043 -890750 -397716 -188540 42721 -89506
1958 -89506 -247237 -644880 -547458 -832651 -421290 -767551 -508122 -84217 -289165 -446214
1948 -446214 -428933 -183252 33895 -148234 50095 -573501 -406457 -240921 61438 -428739
1938 -428739 -743692 -748272 -601446 -265055 -239416 180092 -451270 -490850 -473098 -916071 -380606
1927 -380606 -81876 -663253 -56793 196160 -34302 -312588 235661 340511 -123719 -122495
1917 -122495 174138 -212426 -728367 -286650 -272721 -252657 117135 385738 396328 434662
1907 434662 193974 -146240 -330703 -146129 4325 -440516 -344795 -216325 44208 -413064
1897 -413064 -140246 -415151 -339887 -259228 -373051 -225929 48856 238609 -144286 -348991
1887 -348991 -204805 -14282 -456082 -534813 -154694 -77557 14349 -503929 -379367 -454463
1877 -454463 -85186 -136384 31565 -371508 -231090 117259 -185127 61722 24336 -348517
1867 -348517 -67784 29320 330842 185656 -54432 -289530 -49501 -485131 -772375 -493135
1857 -493135 -217355 268437 -176155 -561719 -758767 -369080 -81863 -519657 -294229 -95199
1847 -95199 -187211 -493944 -695205 -597907 -401442 -114879 -399382 -353415 -476428 -326301
1837 -326301 -305223 64803 -566097 -762774 -404096 -426922 -433104 -506707 -158791 228666 137507
1826 137507 87469 -339839 -175739 -459332 -369972 -210029 -75446 296500 87342 -75221
1816 -75221 104679 -109863 -489152 -261809 -56624 -345949 -412668 -973990 -585834 -443824
1806 -443824 -431658 -120793 249178 75810 -17621 -128191 -133244 -381638 -668600 -285369
1796 -285369 -350478 -494965 -636429 -216836 -81036 -235340 -541288 -420283 -135281 -73432
1786 -73432 -394617 -151334 -42770 -168628 24924 -753201 -780906 -319218 -365838 -113915
1776 -113915 -104724 -315423 -479636 -119790 -144779 90945 131142 -538156 -749750 -773730 -374333
1765 -374333 -276797 -69630 -95434 -29160 113918 -161171 -380025 -305836 47151 -52542 -15426
1754 -15426 8837 -628837 -116004 382125 -96764 -735669 -568555 -137512 9350 -253644
1744 -253644 -740775 -649319 68012 209063 5760 -397415 -707460 -641931 -213215 -18504
1734 -18504 -194559 -295316 -759848 -386781 -222080 -714971 -615903 -128679 -138407 585735
1724 585735 504220 -125090 -147797 112375 85943 156954 -98545 -4837 -325192 -383274 -164895
1713 -164895 -436171 -796670 -417851 -346431 -246046 -93039 -161511 -64505 -72012 -350804 -612334
1702 -612334 -365045 -262032 -198815 -236991 79131 -50400 -74169 166654 -101210 -321402
1692 -321402 -471127 -679964 -350138 -219502 40947 109854 -203402 -149327 446556 565859
1682 565859 -316403 -335975 -16220 176382 358510 189984 -488074 -637151 29993 -401628
1672 -401628 -227280 7690 -386829 -380640 -112831 70086 -310100 -428803 -593289 -198348
1662 -198348 -40408 -243023 -105420 -146533 -232165 -335405 -123616 -332612 -21575 12373
1652 12373 -197092 74377 -516896 -83160 163855 -62914 -515871 -659949 -398159 -442098
1642 -442098 -207867 -339880 -614000 -491038 -419163 25805 125853 -81953 -28418 -262798
1632 -262798 -218676 -578809 -438636 -390295 -213901 188015 -142015 -203515 -87647 -325930
1622 -325930 -367631 -572978 -406912 -772695 -588505 -489564 -404890 -41516 -272750 -334713
1612 -334713 -373611 147790 -72505 -36042 -310304 -384024 33646 6513 -16417 -237847 -407368
1601 -407368 -100783 -181773 77271 -241606 -457778 -802978 -474958 259037 19137 -180790
1591 -180790 -475541 -702907 -984524 -441721 -95588 -148408 -230714 -152872 275990 93425
1581 93425 -139505 -8501 -541160 -595849 -668124 -450149 -203259 194860 388106 -436143
1571 -436143 -515081 -137319 450707 349713 -321580 -540014 -739264 -796410 -316314 164425
1561 164425 -429850 -653368 -451333 -335426 -240474 -820613 -850201 -317491 -74933 -79768
1551 -79768 -726728 -473648 -497126 -424799 -904751 -627973 -648101 -513391 -293015 -602284
1541 -602284 -771780 -516584 -721271 -873213 -235404 -775509 -693259 -395611 -82290 -1280
1531 -1280 -16191 -177253 -567704 -632038 -62321 -242411 -257447 -121524 -64359 -129905 -264203
1520 -264203 -191627 -430708 -221022 235098 -295292 -817564 -988366 -907332 -826441 -230958
1510 -230958 -226451 -100366 84766 96966 255898 38266 25238 22985 -162382 -43747 -240442
1499 -240442 -170278 -426198 -526806 214137 107096 1619 -123324 -554451 -719068 78782
1489 78782 -227491 -724045 -720048 -482860 -219171 372051 64328 -477891 -106944 -9816
1479 -9816 -37648 -453165 -791394 -70623 79540 -229485 39952 -154544 -446438 -92578
1469 -92578 7417 -42257 -44206 -27783 -533815 -17722 109602 43906 217868 -623924 81978
1458 81978 166639 -38163 -136385 144531 431058 465318 -91686 -179140 -451910 -238767 -383838
1447 -383838 -500840 -208984 -148032 220751 508421 267680 -430201 -460324 -217877 -98805
1437 -98805 34020 146666 -248007 -387139 83220 158652 380527 212614 -167473 -624789
1427 -624789 -464707 -228709 -119587 727118 434709 192482 -261298 -326007 -98421 -105605
1417 -105605 -343319 -280579 -445306 -560343 -519124 -210739 -322771 -110525 -229295 -222455
1407 -222455 -14573 -39276 -419337 -690720 -637896 -238072 380536 215431 -104144 35077
1397 35077 -226510 -349845 -388544 -782360 -572123 -120023 292339 14723 -194808 -116056
1387 -116056 -70013 -19072 -394016 -665579 -603152 -628837 -529115 -494978 -478082 -611230 -29087
1376 -29087 124719 94017 354021 4564 -316173 -101019 -657999 50391 -74276 -601608
1366 -601608 -186786 82591 -159628 -486374 -559562 130124 -123309 -185773 -53748 -947165
1356 -947165 -640148 27229 143157 -299369 -723835 -473742 -279783 -124430 101489 -363174
1346 -363174 -169687 -344757 -558547 -600823 -653652 -358530 -314581 -430644 -54893 -321757
1336 -321757 -437472 -121194 68199 160934 -336146 13836 121964 300291 130810 -100839
1326 -100839 -58730 -753045 -203050 160656 63358 -221431 -383743 -36159 -239747 -438459
1316 -438459 -552340 -293395 -162394 -243224 -198338 -104122 -78885 -299690 295378 52062
1306 52062 -297842 -448016 -754933 -571886 -223815 -449242 -462649 -76718 41058 19341
1296 19341 55631 -159415 -264604 -551309 -479737 26495 318680 157251 -261827 -296706
1286 -296706 -228183 -407721 -327743 -446293 -226154 170346 -248075 -334350 -60923 -212040
1276 -212040 -89561 -213933 -231020 -107064 -82241 -35402 -81664 -449887 -610702 -396804
1266 -396804 -128785 -139240 -273705 56241 -34144 148135 133037 -295921 -87277 -269092
1256 -269092 -20035 72461 -265153 -372859 -181330 105001 -26991 267365 368697 -252355
1246 -252355 -257104 244083 -67431 -402767 -308603 48610 -36235 -260611 -207423 -189516 -250529
1235 -250529 -97980 60184 -154678 -769781 -610430 -256157 -337061 -235599 -407158 -632007
1225 -632007 -280871 82933 123560 -7177 -311490 -420861 -159560 65207 -163008 -379781
1215 -379781 -85035 119751 -145571 -357431 -306515 -684548 -198868 41335 292978 -395319
1205 -395319 -396188 -35709 42438 -272073 -733049 -532988 -475754 -379691 -553046 -204654 -16009
1194 -16009 -315054 -217580 -331913 -353310 -459832 -194580 198057 -28676 -275948 -464380
1184 -464380 -241342 -301271 -340922 -714445 -744476 -552529 -600277 -350149 -232122 38791
1174 38791 -257318 -446276 -286917 42521 -62667 -144599 -264175 209472 593187 332481
1164 332481 13533 -171668 -52382 260553 178524 25907 -71788 -481156 -584687 -762900
1154 -762900 -356243 37741 -242147 -109705 214900 2287 -7561 -374349 -169192 -328070
1144 -328070 -317317 -539753 -396763 -24045 -212233 -701004 30876 431853 240765 935681
1134 935681 -126980 -888200 -556829 -164991 -15295 455810 143614 -225286 -11058 381365
1124 381365 239484 258954 149276 -78819 336456 207419 -56525 -333033 -13641 226331
1114 226331 286007 -219783 -547976 -404304 196083 330947 -15037 -312096 244248 59729
1104 59729 133695 22611 -383093 -274665 -46646 -242616 -644284 -637930 -837271 -569145
1094 -569145 -599891 -506741 -573617 -733927 -417821 -621025 -655854 138517 248346 148692 270291
1083 270291 297573 47660 71733 53699 25199 -137510 -466849 -13691 -316272 -230981 -263968
1072 -263968 -323456 -298767 -218211 -223852 -416338 -84192 153764 -59523 233920 48429 -183755
1061 -183755 155006 -550548 -392762 53641 -102205 -214801 -645295 -508742 -26133 -15906
1051 -15906 14548 391086 -20836 -91811 -198609 333063 410323 -193372 -39089 146939
1041 146939 -473811 -559586 -365853 -552621 -102010 193964 290306 -227102 -471078 -577781
1031 -577781 -566550 -680489 -220450 -215565 -268523 -60943 -93904 -82634 -176677 -529738 -328540
1020 -328540 -255547 -668964 -630458 81508 407548 55441 -7769 222507 59618 263449
1010 263449 -127120 -294744 -246388 145144 -37980 -433045 -100149 74773 -349749 -202869
1000 -202869 -90907 -130947 -255139 -425864 -513297 -39647 35955 168322 -1878 -584639
990 -584639 -509076 74115 -138924 -260970 -3898 51934 -28345 -282971 70449 -357477
980 -357477 -381978 -294912 -296140 -697566 -446935 -87116 16812 -47390 51500 168473 -107041
969 -107041 162090 -1687 111104 320195 233407 642617 761145 491746 169452 132824
959 132824 148256 125356 -351620 7195 -89661 -142395 -379311 -390238 -389313 -227432 -57191
948 -57191 -236394 -328895 -568740 -591657 -382837 -167436 278392 482386 171462 8488
938 8488 439797 671459 614961 -92782 -330673 -85315 -59583 -207942 -205795 190460 483928
927 483928 729081 344716 206913 -66975 -106711 -4217 -207316 -91212 420940 158472
917 158472 208588 662626 1158464 -79395 -283430 -204702 -186241 -170605 16694 -275276
907 -275276 -78712 -97402 196099 -145851 -413052 -364008 -224151 145121 167102 321528
897 321528 581700 457449 -205545 182639 240843 515353 168454 -299301 -14321 271919
887 271919 -8412 -196265 -373514 -136989 -103359 55797 300512 115862 -47907 -64475
877 -64475 -347098 -133358 73280 371714 -280478 -8245 -29344 231762 427939 297286
867 297286 99815 -23040 -437490 144084 153268 -322949 -552712 -339412 -400673 -483366 58372
856 58372 -192620 -195129 328092 317562 195290 202916 270297 -174840 -155777 -236429 -284664 325304
844 325304 -19572 -498915 -668795 -183635 -84156 196793 -193334 -396066 -423950 -654140
834 -654140 -400714 236633 345507 205390 116846 333161 496286 371411 -375056 -487415
824 -487415 -73954 -36247 -14470 -300387 -240574 -178395 246441 -6363 -255136 -135117 44928
813 44928 180247 -99368 -647133 -535355 -324983 -48149 350793 5049 736 63433 432117
802 432117 227718 420808 417688 -63016 85160 441807 236820 30170 225937 -55996
792 -55996 -256067 323532 265389 313194 667097 135890 -84071 -58210 -112632 -67575 -31052
781 -31052 247673 354310 197677 200835 252779 -19516 174028 391468 233889 -169795 279138
770 279138 -180955 -360633 282352 113338 88708 315071 336103 501761 543257 488416 180107
759 180107 138470 -80607 58881 57109 -153463 -152910 -281612 150973 443098 497390 318432
748 318432 97421 150859 458304 538635 -152353 -212647 -320129 72108 234934 303365 226104
737 226104 69304 71199 -62585 -216185 -147603 -84168 -78952 -265358 -45905 -168978 -607161
726 -607161 -251421 339859 519542 551283 190105 -197025 9936 -128444 -52390 -176626
716 -176626 21996 -178561 26348 -9740 141787 59514 390267 215492 -50418 101303
706 101303 -360985 -304715 -65806 -189390 -507 214966 -8004 -233299 215568 116741
696 116741 442589 365361 -3230 -522943 -624377 -106389 507021 445509 -320897 -439081
686 -439081 342297 593474 284555 285380 447395 142087 234405 -44356 25023 727519 315810
675 315810 -206457 -423796 -585081 -799881 -232525 -107627 -126243 64205 115777 -78479
665 -78479 485034 98274 -79470 292257 108183 325462 178032 81256 383726 714108
655 714108 100632 -287568 -288935 -194507 -378760 -158524 211775 400080 217816 -87832
645 -87832 -126183 -372969 -7116 28753 423847 633567 222512 32089 118583 614400 529564
634 529564 747468 452408 374052 499841 468820 367489 241681 36299 294878 410277
624 410277 169234 -302857 -341234 28002 -75773 -312287 -263852 57159 340505 432062
614 432062 57861 -46446 -226350 207836 697544 410247 204942 457452 493699 292753
604 292753 308052 132773 153019 -96788 31427 252985 3756 54491 -20722 -366876 485632
593 485632 373818 -118022 1178 -244884 118269 -71609 17123 -267316 -364393 137118
583 137118 604402 495300 613028 451815 149523 2847 246647 -2883 20302 317273
573 317273 499548 424867 343418 -35110 -157225 -116274 42268 -524863 -635350 -619140 -45173
562 -45173 -258196 251486 138142 140696 227642 339619 244077 -123393 -74200 204727 250978
551 250978 165475 367460 238255 270989 509226 452247 140480 51802 -637630 -252161 -107426
540 -107426 -26235 -223880 -324743 -363869 710998 432258 -142811 -154839 158547 334290
530 334290 -103519 -44952 -170821 -178501 149779 -60006 130646 -285969 -91569 262181
520 262181 703280 518441 -15896 215565 -10850 182896 29155 -264673 215844 167288
510 167288 9412 402540 451654 510034 437101 -197071 108481 328225 -228915 -215737 -162087
499 -162087 76278 53591 -32662 26137 -87611 -130452 40524 145188 265897 -101047 -550225
488 -550225 -468843 -178034 10749 92272 -268488 -70638 185279 -77657 166699 238214
478 238214 -17648 213001 174444 -244836 13433 38185 41838 -168040 49926 -808 -168778
467 -168778 -69467 -118228 -246833 310978 122003 -226233 -262667 14437 -194889 -329665
457 -329665 -69259 326498 410257 8631 525188 372423 326133 -10210 -63790 586241
447 586241 460598 324060 30347 -100287 10080 304930 370109 -104992 -255056 -181898
437 -181898 -168471 -134836 -371503 -139920 49085 -150 368857 168608 -298544 204598
427 204598 411324 745 294813 363357 3096 -89754 82140 400670 146422 -49990
417 -49990 476019 585827 189964 -280864 138916 178613 264568 481576 -148770 -264266
407 -264266 165382 559928 386201 168964 -136586 -47409 633224 384298 508201 479414
397 479414 311757 98389 103111 33394 -177701 47876 -245043 362188 769440 569342
387 569342 288547 -216234 -36753 4747 -70163 177338 211919 -10298 323920 578877
377 578877 347558 41913 135685 122784 172720 -95105 174636 44995 394504 584034
367 584034 958220 75816 86347 -28309 -208339 134382 -369695 -237184 20725 321832
357 321832 53000 -240848 -144173 356621 -99417 -533244 -111420 -690 251348 47675
347 47675 174638 431395 232911 -165921 -17834 690326 477735 304358 42999 597582
337 597582 410882 303712 380282 169057 187599 332558 341839 20191 17767 226987 171748
326 171748 -18212 -79027 -248021 -42209 154195 152105 280599 22910 97301 311286 90135
315 90135 218922 168428 -69641 149021 -4871 291648 634690 92239 -150856 188127
305 188127 160635 10214 235070 453730 198714 361802 124274 301 -525325 121539
295 121539 290254 545279 391925 380240 392329 289624 246026 -57173 -153356 27081 196743
284 196743 -75769 183751 168471 89804 465890 411649 218198 108314 482844 237753
274 237753 218981 776540 708130 890684 812521 779841 219119 429329 473138 149286 142834
263 142834 561090 434827 105550 -68139 360998 526740 92669 253579 -89977 -52789
253 -52789 -124874 280266 185141 299910 298354 56732 541669 663304 296408 -662 49043
242 49043 70886 281220 429409 498012 574059 775912 254048 613106 201567 248835 425218
231 425218 -194251 -177874 380799 146589 152002 3901 -248466 129990 97900 -273308 36239
220 36239 119052 -289167 -220753 242068 333570 319024 52547 -46220 -118420 91660 429808
209 429808 384951 305636 306450 198412 417327 -268953 -77831 818198 996526 721680 387970
198 387970 131697 255738 440966 388814 -179961 175324 373556 -17959 -8281 -226232
188 -226232 -11792 212267 127975 497047 525458 493354 569070 -19443 193576 277142 217550
177 217550 -188821 225373 230907 93497 272038 206906 209867 424745 290358 402399 933522
166 933522 637328 170581 272075 -29552 -125353 -213144 -8511 174372 165717 131774 213053
155 213053 1118 184719 329729 309511 217629 138491 -79597 -37136 37347 -7305 -231668
144 -231668 318794 -210391 -252542 105113 -90586 91189 232344 93473 293238 451783
134 451783 7807 -25803 -380275 181742 161907 -26845 -87811 -264663 63184 451795
124 451795 185231 242218 276846 -21958 124329 533217 758679 407531 353295 129967
114 129967 47050 111897 332853 226410 12548 73747 -248824 -469398 -48929 287452
104 287452 621610 805501 680692 220958 -102113 9498 -87484 237636 224839 -121041
94 -121041 -192534 17599 335355 453744 277593 618109 721189 463004 494916 438810 384624
83 384624 405264 397164 314044 422041 48623 148280 94678 41872 -84755 -218222 32483
72 32483 13238 205179 -247161 -329538 -35986 213507 530410 17784 -130907 272870 232712
61 232712 -179482 13772 173876 -8395 133355 -74885 44221 -102810 -211463 -122892
51 -122892 89007 -59410 111601 -232216 185352 256815 -610 173184 107745 -210552
41 -210552 -8531 82472 -188139 -281825 -306746 -9922 -13791 74480 214433 362639 411833
30 411833 211420 -93148 -53401 -121713 -362992 94238 -56322 -423590 -397529 108241 211741
19 211741 178220 19343 197300 200504 30182 -91517 -1172 7722 -11466 83233 3148 -125103
7 -125103 -465856 -11471 -155270 100302 -188046 -393364 -204151
0 -204151
$$ Imaginary data points
##PAGE= N=2
##DATA TABLE= (X++(I..I)), XYDATA
16383 -523321 -920415 -1015805 -828134 -867770 -643944 -564188 -861570 -540018 -489773 -249618
16373 -249618 -522380 -908737 -747674 -496479 -712106 -994925 -798513 -843849 -796863 -700001
16363 -700001 -431853 -274129 -266568 -157179 -408282 -722650 -504024 -189107 -304522 -267562
16353 -267562 -225368 -588579 -597313 -518106 -480191 -395684 90428 -138563 -151434 -410219 -445672
16342 -445672 -328999 -281824 -199059 -99488 -95857 -25200 30985 119844 176753 121513 -61627
16331 -61627 -328047 -194917 -300547 76386 -235340 43257 222887 199861 45878 167135
16321 167135 44342 29085 539790 196338 387113 180617 449222 231288 413188 574144
16311 574144 334119 243168 308168 432076 490603 587504 410630 521129 485514 300717
16301 300717 542161 459090 122216 355622 295917 606774 552354 328928 338852 855890
16291 855890 1058760 809830 800749 956135 824560 812598 654659 553585 456346 302633
16281 302633 667963 889345 734460 608663 845535 1073751 532962 743402 974656 909767
16271 909767 672574 579052 956496 1279406 1170638 1142846 981275 1410113 1383239 957220
16261 957220 941368 805265 887543 489699 946908 972005 778246 945117 690703 802278
16251 802278 871946 1172380 1205286 1318503 1252316 1153631 966644 1042160 1028549 677521 678557
16240 678557 1257474 1030166 759752 407834 879266 908204 1103501 1254505 1300039 1093254
16230 1093254 1146182 1294165 1100853 1249931 1326239 1307446 785479 602923 938678 1390118
16220 1390118 1344941 1503178 1499467 1568703 1185295 1363159 1678934 1701738 1252419 1174232
16210 1174232 1440797 1261656 1333093 1565840 1163581 1259956 815689 1029450 1362400 1618361
16200 1618361 1302925 1063795 1253685 1056955 1061698 1058170 1119652 1491812 1242814 1086572
16190 1086572 1106403 642331 757187 1041698 1394332 1603716 1487725 1585361 1457495 798964
16180 798964 1268238 1685326 1546452 1565677 1171937 1161196 1629411 1597247 1433630 1613162
16170 1613162 1642265 1621446 1319203 1640211 1112931 1098534 1473910 1024824 953886 1435482
16160 1435482 1458570 1859810 1906494 2220061 1969131 1686120 1764015 1811093 1478647 1223373
16150 1223373 1210371 1446996 1772873 1526946 1787125 1927605 1638015 1388185 1483075 1130918
16140 1130918 1673065 1844977 1299419 1452557 1676903 1407052 1786263 1622769 1574263 1602370
16130 1602370 1552383 1794496 1915331 2054952 1290989 1344131 1513635 1353457 1510692 1549010
16120 1549010 1399702 1356582 1244879 1327617 1519363 2248642 1778012 1211885 1765348 1534404
16110 1534404 1695246 1504328 1856475 1824009 2028660 2266684 2164278 1820568 1881075 2009841
16100 2009841 1682892 1582312 1567970 1441562 1616281 1759845 1772360 1601791 1931286 1848246
16090 1848246 2021677 1884839 1996389 1946594 1842702 1391538 1384552 1399755 1351168 1622577
16080 1622577 1632830 1682842 1214923 1764598 1773773 1526048 1454957 1542680 1574372 1339438 1634656
16069 1634656 1400330 1889021 2339383 1410148 1479004 1561948 1828739 1475435 954528 1405834
16059 1405834 1794951 1980159 1345934 2056285 2254075 1739663 1750759 1227626 1060138 1367973
16049 1367973 1843614 1386489 1743641 2200014 1575294 1746213 2037359 1750488 1688340 1719143
16039 1719143 1722969 1208966 1349185 1713663 1675731 1529168 1431108 1569662 1557607 1402968
16029 1402968 1207502 843776 1609491 1874537 1576153 1635045 1663692 1950351 1418447 1452001
16019 1452001 1223829 1346609 1351727 1704672 1571690 1506493 1746381 1776832 1837712 1829831 1929174
16008 1929174 1493364 1922776 1762801 1738508 1805416 2100723 2162955 1941045 1674763 1440006
15998 1440006 1518001 1506783 1270697 1969858 1691728 1525984 1340352 1588911 1668667 1498658
15988 1498658 1857942 1380055 1477172 2152454 1994320 1680914 2171658 2262875 1960061 1964968
15978 1964968 1586409 1456247 1579763 1671857 1356514 1273374 1227872 1716393 1962891 1400975
15968 1400975 2145511 1773888 1242413 1545181 1822845 1449351 1637073 1107627 1057169 1285337
15958 1285337 1301602 1566530 1575066 1813571 1477697 1447253 1463410 1449198 1348834 1148923
15948 1148923 1682229 1701909 1473732 1633360 1837739 1879960 1784182 1624687 1242869 1434154
15938 1434154 1381727 1386270 1955780 1375055 1157532 1610723 1908459 2239975 2249367 1913533
15928 1913533 1443907 1246110 1096279 889635 1375340 1555234 1298943 1119186 1708798
15919 1708798 2033511 1910092 1751117 1657838 1548125 1984848 1845727 2111234 2110559 1626375
15909 1626375 1550537 1743909 2059531 1929328 2230695 1982172 2309407 2281565 2208420 2390020
15899 2390020 2247386 1834220 2053329 1865178 1771460 1457532 1557987 1746211 2001771 2118011
15889 2118011 1902011 1770398 1369641 1049697 1720523 1789279 1410095 1196031 1405359 1684808
15879 1684808 1228465 1347361 1478550 1383657 1701545 1686009 1574350 1609175 1474455 1587422
15869 1587422 1710974 1947325 1842834 1687252 1811792 1453271 948226 1497257 1911306
15860 1911306 2148957 2164346 2398810 2298597 1418447 1797915 1642164 1637117 1864329 1836475
15850 1836475 1665649 1556257 1798648 1797153 1744549 1571991 1744266 1581100 1450390 1643663
15840 1643663 1985864 2051301 2048997 1540418 1564477 1623676 1429154 1775165 2219989 2057480
15830 2057480 2116559 1991761 1982595 1724963 1748889 1520032 1497102 1452521 1736893 1715398 1814974
15819 1814974 1543653 1542530 1300417 1077384 1016489 1105179 1713028 1565551 1781726 1848059
15809 1848059 1726335 1835692 1814227 1620685 1725935 1456087 1619577 1396960 1300669 1263293
15799 1263293 1472323 1767272 2175233 2246020 2069450 1846258 1837376 1591858 1702173 1915212
15789 1915212 1692916 1595558 1507298 1983542 2153074 1285823 1359342 1376583 1093494 1182217
15779 1182217 1586835 1564651 1485791 2033016 1640097 1606853 1587290 1476669 1731883 1866504
15769 1866504 1853225 1590148 1333266 1465811 1378859 1091899 1333808 1407606 1970953 1818127
15759 1818127 1269667 1527251 1437779 1832595 2368565 2274960 1743908 1393564 1382054 1208010
15749 1208010 1746920 2016857 1640261 1568841 1695279 1855431 1934044 1654020 1746996 1637653
15739 1637653 1816401 2137311 2137428 1777054 1388902 1499562 1617631 1517847 1413472 1961849
$$ [...]
##END NTUPLES=NMR SPECTRUM
##END=
