##TITLE=1H_CG-1152
 CDCl3, 8 sc, 
 24.08.2021
##JCAMPDX= 6.0         $$ Bruker NMR JCAMP-DX V2.0
##DATA TYPE= NMR SPECTRUM
##DATA CLASS= NTUPLES
##ORIGIN= UXNMR, Bruker Analytische Messtechnik GmbH
##OWNER= root
$$ XWIN-NMR		Version 3.5
$$ Tue Aug 24 09:52:20 2021 Russian Standard Time (UT+4h)  she@DPX200
##.OBSERVE FREQUENCY= 200.131506
##.OBSERVE NUCLEUS= ^1H
##.ACQUISITION MODE= SIMULTANEOUS
##.ACQUISITION SCHEME= undefined
##.AVERAGES= 8
##.DIGITISER RES= 18
##SPECTROMETER/DATA SYSTEM= spect
##.PULSE SEQUENCE= zg30
##.SOLVENT NAME= D2O
##.SHIFT REFERENCE= (INTERNAL, D2O, 0, 17.5167)
##AUDIT TRAIL= $$ (NUMBER, WHEN, WHO, WHERE, WHAT)
$$ ##TITLE= Audit trail, XWIN-NMR		Version 3.5
$$ ##JCAMPDX= 5.01
$$ ##ORIGIN= Bruker BioSpin GmbH
$$ ##OWNER= she
$$ F:/spectra/data/she/nmr/H-F/1/pdata/1/auditp.txt
$$ ##AUDIT TRAIL=  $$ (NUMBER, WHEN, WHO, WHERE, WHAT)
(   1,<2021-08-24 09:50:52.87 +0400>,<she>,<DPX200>,
      <created by zg, POWCHK disabled, PULCHK disabled
       configuration hash MD5:
       00 E9 B6 7A A2 85 ED C7 34 08 36 98 17 FE 4E 26
       data hash MD5: 16K
       31 93 5B 04 9C 44 9A 68 63 EC 82 0C 7B F8 9B 64>)
(   2,<2021-08-24 09:50:55.20 +0400>,<she>,<DPX200>,
      <Start of raw data processing
       efp BC_mod = 2 LB = 0.24 FT_mod = 6 PKNL = 1 PHC0 = -13361.39 PHC1 = 20.001 SI = 16K 
       data hash MD5: 16K
       E8 C8 0C 29 85 EC 46 EA E2 43 6B EC E3 C0 4C 08>)
(   3,<2021-08-24 09:51:23.93 +0400>,<she>,<DPX200>,
      <pk PHC0 = 1.346263 PHC1 = -4.2 
       data hash MD5: 16K
       E8 02 00 99 0D 6A F3 55 BE 95 4C 3A EA AF C4 07>)
(   4,<2021-08-24 09:51:27.29 +0400>,<she>,<DPX200>,
      <abs ABSG = 5 
       data hash MD5: 16K
       F9 F2 4C 0C D8 7B F6 F5 95 97 E8 81 8F 4F 57 8E>)
$$ ##END=
$$ 
$$ hash MD5
$$ 0B 2E A9 3B 82 BF D1 09 FB 24 C4 C2 D7 D7 32 9A
##$RELAX= 
##$RELAX= 
##$RELAX= 
##$RELAX= 
##$RELAX= 
##$RELAX= 
$$ Bruker specific parameters
$$ --------------------------
##$DU= <F:/spectra>
##$EXPNO= 1
##$NAME= <H-F>
##$PROCNO= 1
##$TYPE= <nmr>
##$USER= <she>
##$AMP= (0..31)
100 100 100 100 100 100 100 100 100 100 100 100 100 100 100 100 100 100 
100 100 100 100 100 100 100 100 100 100 100 100 100 100 
##$AQSEQ= 0
##$AQ_mod= 1
##$AUNM= <au_zg>
##$AUTOPOS= <>
##$BF1= 200.13
##$BF2= 200.13
##$BF3= 200.13
##$BF4= 200.13
##$BF5= 200.13
##$BF6= 200.13
##$BF7= 200.13
##$BF8= 200.13
##$BYTORDA= 1
##$CFDGTYP= 0
##$CFRGTYP= 5
##$CHEMSTR= <none>
##$CNST= (0..31)
1 1 145 1 1 1 1 1 1 1 1 1 1 1 1 1 1 1 1 1 1 1 1 1 1 1 1 1 1 1 1 1 
##$CPDPRG= <>
##$CPDPRG1= <>
##$CPDPRG2= <>
##$CPDPRG3= <>
##$CPDPRG4= <mlev>
##$CPDPRG5= <mlev>
##$CPDPRG6= <mlev>
##$CPDPRG7= <mlev>
##$CPDPRG8= <mlev>
##$CPDPRGB= <>
##$CPDPRGT= <>
##$D= (0..31)
0 1.2 0 0 0 0 0 0 0 0.06 0 0.03 0 0 0 0 0.0002 0 0 0 0 0 0 0 0 0 0 0 0 
0 0 0 
##$DATE= 1629784252
##$DBL= (0..7)
120 120 120 120 120 120 120 120 
##$DBP= (0..7)
150 150 150 150 150 150 150 150 
##$DBP07= 0
##$DBPNAM0= <>
##$DBPNAM1= <>
##$DBPNAM2= <>
##$DBPNAM3= <>
##$DBPNAM4= <>
##$DBPNAM5= <>
$$ [...]
##$SUBNAM3= <"">
##$SUBNAM4= <"">
##$SUBNAM5= <"">
##$SUBNAM6= <"">
##$SUBNAM7= <"">
##$SUBNAM8= <"">
##$SUBNAM9= <"">
##$SW= 20.0188882624521
##$SWIBOX= (0..15)
0 0 2 0 0 0 0 0 0 0 0 0 0 0 0 0 
##$SW_h= 4006.41025641026
##$TD= 16384
##$TD0= 1
##$TE= 0
##$TE2= 300
##$TE3= 300
##$TEG= 300
##$TL= (0..7)
0 120 120 120 120 120 120 120 
##$TP= (0..7)
150 150 150 150 150 150 150 150 
##$TP07= 0
##$TPNAME0= <>
##$TPNAME1= <>
##$TPNAME2= <>
##$TPNAME3= <>
##$TPNAME4= <>
##$TPNAME5= <>
##$TPNAME6= <>
##$TPNAME7= <>
##$TPOAL= (0..7)
0.5 0.5 0.5 0.5 0.5 0.5 0.5 0.5 
##$TPOFFS= (0..7)
0 0 0 0 0 0 0 0 
##$TUNHIN= 0
##$TUNHOUT= 0
##$TUNXOUT= 0
##$USERA1= <user>
##$USERA2= <user>
##$USERA3= <user>
##$USERA4= <user>
##$USERA5= <user>
##$V9= 5
##$VALIST= <valist>
##$VCLIST= <CCCCCCCCCCCCCCC>
##$VD= 0
##$VDLIST= <DDDDDDDDDDDDDDD>
##$VPLIST= <PPPPPPPPPPPPPPP>
##$VTLIST= <TTTTTTTTTTTTTTT>
##$WBST= 1024
##$WBSW= 4
##$XGAIN= (0..3)
0 0 0 0 
##$XL= 0
##$YL= 0
##$YMAX_a= 863605
##$YMIN_a= -815346
##$ZGOPTNS= <>
##$ZL1= 120
##$ZL2= 120
##$ZL3= 120
##$ZL4= 120
##$ABSF1= 17.49955
##$ABSF2= -2.519489
##$ABSG= 5
##$ABSL= 3
##$ALPHA= 0
##$AQORDER= 0
##$ASSFAC= 0
##$ASSFACI= 0
##$ASSFACX= 0
##$ASSWID= 0
##$AUNMP= <proc_1d>
##$AZFE= 0.1
##$AZFW= 0.1
##$BCFW= 0
##$BC_mod= 2
##$BYTORDP= 0
##$COROFFS= 0
##$CY= -3
##$DATMOD= 1
##$DC= 0
##$DFILT= <>
##$DTYPP= 0
##$F1P= 0
##$F2P= 0
##$FCOR= 1
##$FTSIZE= 16384
##$FT_mod= 6
##$GAMMA= 0
##$GB= 0
##$INTBC= 1
##$INTSCL= 1.334414e-10
##$ISEN= 128
##$LB= 0.24
##$LEV0= 0
##$LPBIN= 0
##$MAXI= 10000
##$MC2= 0
##$MEAN= 0
##$ME_mod= 0
##$MI= 1.114404
##$NCOEF= 0
##$NC_proc= -4
##$NLEV= 6
##$NOISF1= 3.799351
##$NOISF2= 2.8
##$NSP= 0
##$NTH_PI= 0
##$NZP= 0
##$OFFSET= 17.51666
##$PC= 1
##$PHC0= -13360.04
##$PHC1= 15.801
##$PH_mod= 1
##$PKNL= yes
##$PPARMOD= 0
##$PSCAL= 0
##$PSIGN= 0
##$REVERSE= no
##$SF= 200.130003595267
##$SI= 16384
##$SIGF1= 3
##$SIGF2= 2
##$SINO= 5.538805
##$SIOLD= 16384
##$SREGLST= <1H.CDCl3>
##$SSB= 0
##$STSI= 16384
##$STSR= 0
##$SW_p= 4006.41025641026
##$SYMM= 0
##$S_DEV= 0
##$TDeff= 16384
##$TDoff= 0
##$TI= <>
##$TILT= no
##$TM1= 0
##$TM2= 0
##$TOPLEV= 0
##$USERP1= <user>
##$USERP2= <user>
##$USERP3= <user>
##$USERP4= <user>
##$USERP5= <user>
##$WDW= 1
##$XDIM= 16384
##$YMAX_p= 324992261
##$YMIN_p= -80378
$$ End of Bruker specific parameters
$$ ---------------------------------
##NTUPLES= NMR SPECTRUM
##VAR_NAME=  FREQUENCY,     SPECTRUM/REAL,   SPECTRUM/IMAG
##SYMBOL=    X,             R,               I
##VAR_TYPE=  INDEPENDENT,   DEPENDENT,       DEPENDENT
##VAR_FORM=  AFFN,          ASDF,            ASDF
##VAR_DIM=   16384,         16384,           16384
##UNITS=     HZ,            ARBITRARY UNITS, ARBITRARY UNITS
##FACTOR=    0.24454680195387, 1,            1
##FIRST=     3505.60936692834, 0,            0
##LAST=      -500.800889481925, 0,           0
##MIN=       -500.800889481925, -80378,      0
##MAX=       3505.60936692834, 324992261,    0
$$ Real data points
##PAGE= N=1
##DATA TABLE= (X++(R..R)), XYDATA
$$ [...]
6747E325993K37638K19044J66994J41013J44352P2588M1644Q326p9140p4302p4410
6736F129740j15501j08961j32043j51559k00373k06884j93044k15394k28491k24484
6726D353006k10607k03696j86443j84008j80606j44098j38607j41906j07812j14241
6716B740982j18402j00925o3677n5244p6046p0772n8419m0526l6995n2149k0955
6705B046872m6625n6274n970n98l3946k581K896n627k5695j4234l9901k5655K3086
6692A815748L1896k0355p708j9989J850k625J9243k004k5088j9600k2491J2328
6680A761205N46o874M691p362j5181q653J0222l945j9929j9519m8367j6458k245
6667A628131P702p6593J3582l4451k1496l0724n2565l0781l4405l3611l5857j6084
$$ y = [5325993, 5563631, 5782675, 5949669, 6090682, 6235034, 6307622, 6349266, 6357592, 6278452, 6204150, 6129740, 6014239, 5905278, 5773235, 5621676, 5421303, 5214419, 5021375, 4805981, 4577490, 4353006, 4142399, 3938703, 3752260, 3568252, 3387646, 3243548, 3104941, 2963035, 2855223, 2740982, 2622580, 2521655, 2457978, 2402734, 2326688, 2255916, 2197497, 2156971, 2119976, 2067827, 2046872, 2000247, 1943973, 1938003, 1937405, 1903459, 1900878, 1903774, 1898147, 1872452, 1858218, 1818317, 1792662, 1815748, 1847644, 1827289, 1819581, 1799592, 1801442, 1798817, 1818060, 1816056, 1790968, 1771368, 1748877, 1761205, 1761751, 1754877, 1759568, 1752206, 1737025, 1728372, 1738594, 1734649, 1714720, 1695201, 1646834, 1630376, 1628131, 1635833, 1559240, 1572822, 1538371, 1516875, 1486151, 1433586, 1402805, 1368400, 1334789, 1298932, 1282848]
6655A282848j6422j5180l1295k4454m4524l2965k9580p719l0388m2435M133j2790
6643I99229j5528l5251j4942l8359l4621n419p194j3481k5837k8112p120R888
6631G83253n3204m4609J1593m2016K717q511l1429J6194r293j5382k8611Q0P741
6618E88523l975m55r201L783Q550k6924k741J1630o484N999k0225j4144L3937
6605E68273M2426j9106k4031K9438j506l0500j9997J1351n2664j879j7950K6537
6593E10392j8328k618l1387l3392q633m9192j5079j1133q387l0385J6501L4516
6581C52875n989K163j7381l938o533j037N834o013q871L4651J8634p486J2819
6568C69728k2961N082N492k5495L3787K9229J5683M744k5661J562K496O701l630
$$ y = [1282848, 1266426, 1251246, 1219951, 1195497, 1150973, 1118008, 1088428, 1080709, 1050321, 1007886, 1012019, 999229, 983701, 948450, 933508, 895149, 860528, 855109, 847915, 834434, 808597, 780485, 773365, 783253, 730049, 685440, 697033, 655017, 657734, 649223, 617794, 633988, 624695, 609313, 580702, 580782, 588523, 584548, 584093, 574892, 578675, 587225, 560301, 557560, 569190, 562706, 568705, 548480, 534336, 568273, 610699, 591593, 567562, 597000, 595494, 564994, 544997, 556348, 503684, 501805, 483855, 510392, 492064, 489446, 458059, 424667, 416034, 366842, 351763, 340630, 332243, 301858, 318359, 352875, 346886, 349049, 331668, 327730, 321197, 320160, 325994, 319981, 311110, 345761, 364395, 356909, 369728, 346767, 351849, 357341, 331846, 365633, 394862, 410545, 415289, 389628, 391190, 393686, 400387, 396757]
6555C96757Q493k1734j2635l909k3261k2663O683O364l1732n785J2316M286l0333
6542B82847q843o270k8109o668J5529M005N220j1436K8689J6010m3403j3133K4424
6529B58862K6013M304k1653k768J7785j8079j8125N2534L7096K124Q533m0242
6517C06384L0742P076k2932L19k832R750K0326k0096J3931j6576P742K9750K6711
6504C90295k8086j9379J5193J5150N393j4733P984k596o420m699J2382N473L4207
6491D10164L7982j0080l790J9582j266j2368J6451J0293J9738K47K5017K5993
6479E37963J4111k3020R670J4564R572N1319k140j1821J2904J442n643J0724J0524
6466F30169J1293n007j1238k4467p155L556o409L5607R79m1545l4129j7790n014
$$ y = [396757, 405250, 383516, 370881, 366972, 343711, 321048, 327731, 334095, 302363, 296578, 308894, 313180, 282847, 274004, 267734, 239625, 232957, 248486, 252491, 257711, 246275, 274964, 290974, 247571, 234438, 258862, 284875, 289179, 267526, 264758, 282543, 264464, 246339, 298873, 335969, 338093, 346626, 306384, 337126, 344202, 321270, 321589, 318757, 328507, 348833, 328737, 342668, 326092, 333834, 363584, 390295, 362209, 342830, 358023, 373173, 378566, 363833, 371817, 369221, 362801, 358102, 370484, 375957, 410164, 448146, 438066, 434276, 453858, 452592, 440224, 456675, 466968, 486706, 486953, 511970, 537963, 552074, 529054, 538724, 553288, 562860, 614179, 612039, 600218, 613122, 614564, 608921, 619645, 630169, 641462, 636455, 625217, 600750, 593595, 597151, 590742, 626349, 627328, 585783, 551654, 533864, 528850]
6453E28850j0320l8760j3512k6065N429L348j2820j9045n2315K1396K4795p144
6441D03837k2371L403J0839J0334J2275k655l2880J8215L986J5629j8385K6438
6429D28665M965k0469K4611k2252o606M411O92k9056j5965L3519n061k5790j0985
6416C60679L413J433k1157m3690J8923l343p324p780K0565j0710m4270M946J2117
6403B83802J198j6229K6081k4117j5567J006N0751j4885r7K2025j4877K5214K0912
6390C45217J7234J0298j7308K7355j4254K0688J0827L4477J3770n606N2836K7512
6378E23046j7111K480L1507J7833K9041N102J7814J234L6054k23M6124L5497K6650
6365G55048J4513J9950L398j362l176K7990l4521j8013K3527j5712j0921k2012
$$ y = [528850, 518530, 479770, 466258, 440193, 445622, 448970, 436150, 417105, 364790, 386186, 410981, 403837, 381466, 384869, 395708, 406042, 418317, 415662, 382782, 400997, 404983, 420612, 402227, 428665, 433630, 413161, 437772, 415520, 408914, 413325, 414017, 384961, 368996, 402515, 397454, 371664, 360679, 364092, 365525, 344368, 300678, 319601, 316258, 308934, 301154, 321719, 311009, 266739, 271685, 283802, 285000, 268771, 294852, 270735, 255168, 256174, 306925, 292040, 291943, 313968, 299091, 324305, 345217, 362451, 372749, 355441, 382796, 368542, 389230, 400057, 434534, 448304, 442698, 495534, 523046, 505935, 508415, 539922, 557755, 586796, 591898, 609712, 610946, 647000, 646777, 692901, 728398, 755048, 769561, 789511, 792909, 791547, 788371, 816361, 781840, 763827, 787354, 771642, 760721, 738709]
6353G38709n0450j4084o016m0483m0607k4801j8974l1122j9217m1288k5487l6057
6341C90123j2580L161o028j0802j9514m1913j5020Q221j5681Q0l96m989j9588
6328B55074m3655j32P067j8057K367K84P619q623l7715k0931j5203l19K612K9062
6314A59450p251j2870p594N406L104j4541n1236J1501M4815r237k2206K0871j992
6301A18220N200j150k0972J4558k7490K1090O522j7509j2448r959K595q38Q354
6288H6173J9830J5156l061p419j0290p257L180j2913O621K5348k7086j1716J8577
6275I5143j5231K4195J8714J2826l0974p4k175k6032N103K9745j649q67J1470
6262A20194l988K0712j237j6567K875J6869o269M622j7073k894M88K2798K130
$$ y = [738709, 688259, 674175, 668159, 627676, 587069, 562268, 543294, 512172, 492955, 451667, 426180, 390123, 377543, 380704, 374676, 363874, 344360, 302447, 287427, 295648, 279967, 280047, 279651, 274662, 255074, 211419, 211287, 218354, 200297, 202664, 202948, 210567, 201944, 164229, 143298, 128095, 127776, 130388, 159450, 152199, 139329, 131735, 137141, 140245, 125704, 74468, 85969, 130784, 121547, 99341, 120212, 118220, 123420, 122270, 101298, 115856, 88366, 109456, 115978, 98469, 86021, 76062, 78657, 77819, 86173, 106003, 121159, 118098, 110679, 100389, 93132, 96312, 83399, 90020, 115368, 88282, 76566, 95143, 79912, 104107, 122821, 135647, 104673, 104599, 102424, 76392, 81495, 111240, 109591, 108724, 120194, 116206, 136918, 135681, 119114, 121989, 138858, 132589, 137211, 120138, 117244, 117732, 140530, 142660]
6249A42660k1165J2241K3499j5797r645K384j6021L860J7116J4844j4067m0379
6237I9530j5583L0924k10M867J1137K3325j9140j2578J0947j8664q907Q767n762
6224A08653K2711l2421j3205L4767n987N23j5675l1822M831J9225j0073K7412
6212A08939k1989Q559K074L804O877K1945j2498o150j5261K2480j3536p685K0818
6199A18377j3171q044P106k1177J949L0354K1541j3961n576N695K0652k0887k8445
6186I4413j3680K9879o277l2454N945m693o852j2439L1558j4922j0048o444Q880
6173F2866j3705N474K7187J3226j9152m4934L2241j1367r259J8597j15j9064k88
6160D1707L3609K0163P811p544p569j5800j7390Q591J2102j5520J5584R724j3972
$$ y = [142660, 121495, 133736, 157235, 141438, 131793, 134177, 118156, 122016, 139132, 153976, 139909, 99530, 83947, 114871, 114661, 119528, 130665, 153990, 134850, 122272, 133219, 114555, 105648, 114415, 108653, 131364, 98943, 85738, 120505, 114518, 115041, 99366, 67544, 72375, 91600, 81527, 108939, 86950, 95509, 97583, 101387, 108264, 130209, 117711, 111561, 96300, 118780, 105244, 97559, 118377, 105206, 97162, 104268, 83091, 85040, 115394, 136935, 122974, 117398, 123093, 143745, 122858, 94413, 80733, 110612, 104335, 71881, 77826, 73133, 66281, 53842, 85400, 70478, 60430, 53986, 62866, 49161, 54635, 81822, 95048, 75896, 30962, 63203, 51836, 42577, 61174, 61059, 41995, 41707, 75316, 95479, 103290, 95746, 88177, 72377, 54987, 63578, 75680, 60160, 75744, 85468, 71496]
6147G1496M214Q251o0N762j3912L7912p750J3536K5879j5645j1546n800m518K6840
6133A34659J1115K2956P000l42N972K6840R541J5610m773l343K2011K3130o080
6120B64296J3734j4637J5745J3640J0890L0771K2805O093J5008P542L6091l00
6108D21678L6725L5310L8868J0781N0061N3244J3293L2585M8518J5624K6212L3385
6096H16284L8K5601m0272K826J6455k5479j1326l2040j6684l0651l6044l3177
6084F35531n2073o774m7506l8569m4160K656j7680k9705k6337j1088k9397n81
6072C34317j6420m2914j9541n52n758k5729k7788k4611K7792k6126N180M1822
6060B19672l3810j9275k6810o336j4086j6858J3904L6716j849J3187l4656k4246
$$ y = [71496, 75710, 83961, 83901, 89663, 75751, 113663, 105913, 119449, 145328, 129683, 118137, 112337, 107819, 134659, 145774, 168730, 175730, 175388, 181360, 208200, 217741, 233351, 228578, 225235, 247246, 270376, 264296, 278030, 263393, 279138, 292778, 303668, 334439, 357244, 363337, 378345, 385887, 421978, 421678, 458403, 493713, 532581, 543362, 593423, 646667, 659960, 692545, 741063, 756687, 782899, 816284, 816322, 841923, 801651, 804477, 820932, 795453, 784127, 752087, 735403, 704752, 668708, 635531, 583458, 576684, 529178, 490609, 446449, 449105, 431425, 401720, 375383, 364295, 334898, 334317, 317897, 274983, 255442, 254890, 249132, 223403, 195615, 171004, 198796, 172670, 177850, 219672, 185862, 166587, 139777, 133441, 119355, 102497, 116401, 153117, 151268, 164455, 129799, 105553]
6048A05553R142j0674J0135j7564l8287J4512o414l49l366k0310K0539M6563o933
6035A02547k9867m1795L8530K5J9326K710l0006K067L674k9871J3810K6830L42
6022G8322J212k8201p06O809o026k389p915J8110l939R319j0366j1077J1249J1186
6008F5588n510j0881J053j1382J9953R822j0496j5670m039J1724K579l263M592
5995E4070j0878k3124J058J116N822O363R935r363k1712K7957q750N039O798q544
5981C5787n301r391j0677K9616J0639J4583k5308k2383l163L0266p544n694Q168
5968C9598L132M643k061J9077J6324j699j1784l5516L184O84K5413k148N85j406
5954E8026o129q841o163k627m156J8019K9714o271n68k7489l624L6200j3670M843
$$ y = [105553, 114695, 104021, 114156, 96592, 58305, 72817, 66403, 66054, 62688, 42378, 62917, 109480, 102547, 72680, 30885, 69415, 69440, 88766, 91476, 61470, 63537, 67211, 37340, 51150, 77980, 78322, 79534, 51333, 50627, 57436, 51410, 49021, 41106, 59216, 55277, 64596, 54230, 43153, 54402, 65588, 60078, 49197, 50250, 38868, 58821, 68643, 58147, 42477, 38438, 50162, 52741, 49478, 54070, 43192, 20068, 21126, 22242, 28064, 34427, 44362, 34999, 13287, 41244, 32494, 37533, 44331, 35787, 30486, 21095, 10418, 40034, 50673, 65256, 39948, 17565, 14402, 44668, 37124, 31430, 39598, 42730, 47373, 45312, 64389, 80713, 79014, 67230, 31714, 34898, 35582, 60995, 58847, 59432, 58026, 51897, 43056, 36893, 34266, 30110, 48129, 77843, 71572, 71004, 43515, 39891, 76091, 62421, 67264]
5940F7264K3065k9470J650Q290j4013O543r21P695Q527Q039j3389O982j2589j9859
5926D7814L2837J9602l8869J2397K7257j2212J740q817k0331J9618J4346O487
5914A01869m695K291N118K890K9705k5774J2499K327J1961l071q369r779J3591
5901A30563j23k22J0699j1362J4894P516j3349R411L025J6795J7226n056K7181
5888B07198l7373j6903L606n167K5017J9869j4111K6063K388n457l6865L4944
5876B03209K0574j0820K898l1356K1826K12r454J7422J2386J6620l882j5261k309
5863B22065j8103q194P864l742K2281j506j3456l6319L9918L0443n509J7999l621
5850B50120P159l528k1098Q742m186k0322k2920L1032o8j3839k3343k699R961
$$ y = [67264, 90329, 60859, 62509, 70799, 56786, 63329, 62408, 70103, 78630, 86669, 73280, 80262, 67673, 47814, 80651, 100253, 61384, 73781, 101038, 88826, 90566, 81749, 61418, 81036, 95382, 101869, 97174, 99465, 104583, 107473, 137178, 111404, 123903, 126230, 138191, 135120, 126751, 116972, 130563, 130440, 130218, 140917, 129555, 144449, 151965, 138616, 148027, 151052, 167847, 185073, 180017, 207198, 169825, 152922, 156528, 151361, 176378, 196247, 182136, 208199, 210587, 205130, 168265, 203209, 223783, 212963, 215861, 184505, 206331, 206543, 197089, 214511, 226897, 243517, 239635, 224374, 222065, 203962, 195768, 203632, 199890, 222171, 220665, 207209, 170890, 210808, 241251, 235742, 253741, 250120, 257279, 253751, 232653, 241395, 237209, 216887, 193967, 224999, 224931, 211092, 187749, 185050, 195011]
5837A95011Q688j5979k2815L2821o557j4391J8136j0138j8879J2949j9799M52
5825A59499K6991l8948R85K979j175J3127k7127K3383J2077l831j7573J988K2321
5812A74696l6515L76J6255k0352j4024J3737k5700j139J9624j0559K7329j7617
5800A26111K8132k2423k0906j2385q08J8636j0498j2943L674j6524J0420j7625
5788G2861m822O399J0803J3403n3228k1283L3275K0320n074Q000L492k069p36
5775H1341j1742k5021Q518K5339N553j79k6013J1671j5047j6466K8908K1793k9150
5762E9505Q07n574j8115K3605o728R737l2697L6580J108n113o043l5662K0771
5749D2181K0702K550k2542M8o058m056L1691P699K196j6943J0322r375l1040l1575
$$ y = [195011, 203699, 187720, 164905, 197726, 191169, 176778, 194914, 184776, 165897, 178846, 159047, 159499, 186490, 147542, 148527, 151506, 150331, 163458, 136331, 159714, 171791, 167960, 150387, 152375, 174696, 138181, 138557, 154812, 134460, 120436, 134173, 108473, 107334, 126958, 116399, 143728, 126111, 154243, 131820, 110914, 98529, 97721, 116357, 105859, 92916, 96590, 80066, 90486, 72861, 68039, 74438, 85241, 98644, 45416, 24133, 57408, 77728, 72654, 80654, 84146, 82077, 81341, 69599, 44578, 53096, 78435, 83988, 83809, 57796, 69467, 54420, 37954, 66862, 88655, 59505, 60312, 54738, 36623, 60228, 53500, 63237, 30540, 67120, 68228, 63115, 57072, 21410, 42181, 62883, 65433, 42891, 42939, 36881, 32825, 64516, 72215, 74411, 57468, 67790, 58415, 27375, -4200]
5735d200j767J0698K265K7098M1681M426m793k082j1501j2449O593Q333k4469
5722C9833K787J4841J678l2404J870j4975L5491J2672j229L831k0090J4232K414
5709F0951N089j6096j4076J4301J5344q582k5955j0741P535R024k8069K1603M434
5696C4762n842J6035O442j9218J6015P442P257k545l8546O361K8053n642k4491
5683B6083M121J2540L2090Q524n629J0052l9585j0545J0854j8558Q854N151j599
5670D2353L56L171J8498K720P06K9358l2363j1665Q903p310r059l7448K1400L3171
5656F2791R07P227r118N015k893L1o010J2490k1437K5350k0149K801K8888j8111
5642F7782k6895K158N901J2837n463k8638k5290j4765K9618K0142R343j7677p297
$$ y = [-4200, -5967, 4731, 6996, 34094, 75775, 80201, 75408, 73326, 61825, 49376, 55969, 64302, 39833, 42620, 57461, 59139, 26735, 28605, 13630, 49121, 61793, 60564, 64395, 44305, 58537, 60951, 66040, 49944, 35868, 50169, 65513, 56931, 30976, 20235, 27770, 36794, 8725, 30328, 34762, 28920, 44955, 51397, 32179, 48194, 55636, 62893, 60348, 21802, 28163, 56216, 50574, 26083, 30204, 42744, 74834, 83358, 77729, 87781, 48196, 37651, 48505, 29947, 38801, 43952, 42353, 42709, 45880, 64378, 67098, 67804, 97162, 64799, 53134, 62037, 54727, 45668, 8220, 29620, 62791, 63698, 70925, 61807, 66822, 63929, 63960, 57950, 70440, 49003, 74353, 54204, 57005, 85893, 67782, 40887, 43045, 48946, 61783, 56320, 27682, 2392, -12373, 17245, 37387, 46730, 29053, 21756]
5629B1756K3578K2278J9704j1537J194q344m4823J4435K1188J1092l9164q52L1525
5616F2030r946k4972J9769K0310l2189k1035L949J8345n385N30K0703P580N211
5603F4900L658J2967k2800K627j5038j1050M5472K2118l793K024l1007j2588J5219
5590G2709r417R755K627J3394L088k7539J7284J6088j4580O933M049J2451K0307
5577A27149n420Q923p893j3641K2506Q33J7699k509o29M0850q894K921j19L1367
5563B13143j1761L570J567j0401P530k3450P714j5576m6999K263K1305J221k2958
5550A27168m395K9964J4309j8999j2940j8463k2681K3410j0109L682q112J6412
5538A19246K1303k0361K0791N988j0479j1422k0635K220k1905o672K5099j050
$$ y = [21756, 45334, 67612, 87316, 75779, 76973, 68629, 23806, 38241, 59429, 70521, 31357, 30505, 62030, 52084, 27112, 46881, 67191, 35002, 13967, 17916, 36261, 30876, 31406, 52109, 59689, 64900, 68558, 81525, 58725, 61352, 46314, 35264, 80736, 102854, 99061, 101085, 70078, 57490, 72709, 63292, 73047, 75674, 89068, 92156, 64617, 81901, 97989, 83409, 90342, 94391, 106842, 127149, 121729, 130652, 122759, 109118, 131624, 132457, 150156, 147647, 147018, 187868, 178974, 181895, 181776, 213143, 201382, 204952, 206519, 196118, 203648, 180198, 187912, 172336, 125337, 127600, 148905, 150126, 127168, 122773, 152737, 167046, 148047, 135107, 116644, 93963, 117373, 107264, 110946, 102834, 119246, 140549, 120188, 140979, 146967, 136488, 125066, 104431, 106651, 84746, 78074, 103173, 102123]
5526A02123J1070k9737J5502J2241J1986k984n726R888j167J1433k8162J1366
5514A17833j1550M0419J0947J4516n496o387k3689k9198K359J202L6126k2076
5502A25006K0965m578k421K4539j9898k0332R495J4569r737K2382r178r781k0084
5489A20947L1590L4292M407j5430Q637k987l360j6126k115K4595o146J4125K4446
5476B16875l3063k0347N569J6995j3926J2711J4700m1697l735j9552J0612L02
5464A45444l822J8943K770o452r269j4608J3030p167r793J3948j3446P027K1927
5451A58532j2580j8866J6982O725r758J6386k370k0167Q193O743K8692J0468m8962
5438A40018L1047R776j9041m124J7616q642N110Q73J528J1894J6737l874o390
$$ y = [102123, 113193, 83456, 98958, 111199, 123185, 120201, 114475, 124363, 123196, 134629, 106467, 117833, 106283, 146702, 157649, 172165, 166669, 160282, 136593, 107395, 109754, 110956, 147082, 125006, 145971, 141393, 138972, 163511, 143613, 123281, 132776, 147345, 137608, 159990, 150812, 141031, 120947, 152537, 186829, 191236, 175806, 184443, 181456, 178096, 161970, 159855, 184450, 178304, 192429, 216875, 183812, 163465, 169034, 186029, 172103, 184814, 199514, 157817, 154082, 134530, 145142, 145444, 141622, 160565, 163335, 156883, 147614, 133006, 146036, 138869, 129076, 143024, 129578, 136605, 158532, 145952, 127086, 144068, 150793, 141035, 157421, 155051, 134884, 143077, 149820, 178512, 188980, 140018, 171065, 180841, 161800, 157676, 175292, 166650, 171760, 172633, 174161, 186055, 202792, 198918, 192528]
5425A92528N086j76k030k0576Q197J9954j3091r022J2735R013N038k0421p093
5412A80142L91n95N586j2451M163K1059L349J0022P16k6666J505L6355L114K9366
5398B56056j4853k7341J0312k5717J0348j5007J7430J167j5215j5763k755Q93
5386A79555K2410j4633N008r25n562P121k1214K7202J2010m030k6103k3825R647
5373A66661l416J6804l424J379j4988q483M0134j9404P995J918j4217J248J1421
5360A83628R371k41M344N278k0778o949J8010L897o240Q72j2280l378J5884k0133
5346A71285l754L264N016P824k9419l918Q53K4702m070J0128J2806k2788J5371
5333A87300k0167n629J8410J1003j6175l519K3188k3642j1839L7374M378p603
$$ y = [192528, 197614, 197438, 195408, 174832, 183029, 202983, 189892, 180870, 193605, 202618, 207656, 187235, 180142, 180533, 179938, 185524, 173073, 177236, 198295, 201644, 211666, 212382, 185716, 187221, 223576, 226690, 256056, 241203, 213862, 224174, 198457, 208805, 193798, 211228, 212395, 197180, 181417, 178662, 179555, 201965, 187332, 192340, 191415, 185853, 192974, 171760, 198962, 210972, 206942, 180839, 157014, 166661, 163245, 180049, 176625, 178004, 163016, 154533, 194667, 175263, 183258, 185176, 170959, 172207, 183628, 192999, 192758, 197102, 202380, 181602, 174653, 192663, 196560, 190320, 191192, 178912, 175534, 191418, 171285, 167531, 170795, 175811, 183635, 154216, 150298, 151151, 175853, 171783, 181911, 194717, 171929, 187300, 167133, 161504, 179914, 190917, 174742, 171223, 194411, 170769, 158930, 196304, 200682, 193079]
5321A93079K6694p449q182M204P484k3366R899j4314j8685o472K0542J1780M0405
5308B35619j150j5160J3765l37l0115r348K5597M200k2710q865J3037K5909j6721
5295B13721M64L8118J8186j34q82n242k328J0532k76K0391l7244Q236p645k680
5281B53217J326K6807J1086j0534L4283M2664k3370p705J3417N066J9424l717
5269C61964r14j7117J9141L925R439L1536K2734j2291N187J0516K257l0916M651
5256D10112j6811j2037J1180o937M312N798j9509k995O938m0793j522J1508K2038
5243C71282l685r906j3619K2226J5790k5993M431q154j3971J918M4381j3627l7547
5230C33526K576K6067j900l629J8149J8609j9232Q02m061j9523N2777J2762j9988
$$ y = [193079, 219773, 212324, 204142, 208346, 215830, 192464, 202363, 188049, 169364, 162892, 183434, 195214, 235619, 234469, 219309, 233074, 232737, 202622, 193274, 218871, 223071, 200361, 191496, 204533, 230442, 213721, 214185, 252303, 270489, 270355, 269473, 264231, 261903, 272435, 272159, 292550, 255306, 263542, 255897, 253217, 254543, 281350, 292436, 281902, 316185, 358849, 335479, 327774, 341191, 346257, 365681, 361964, 361050, 343933, 363074, 366999, 376438, 407974, 430708, 418417, 423604, 434120, 436377, 405461, 410112, 393301, 381264, 392444, 385507, 389819, 395617, 376108, 373113, 380051, 339258, 337736, 349244, 371282, 367597, 357691, 344072, 366298, 382088, 356095, 360526, 352372, 338401, 340319, 384700, 371073, 333526, 336102, 362169, 360269, 356640, 374789, 393398, 374166, 374968, 370907, 351384, 404161, 416923, 396935]
5217C96935j8634j7298k0495J4751K432K4200j0263K3025j7120O442R092q23j038
5204C91206j7488J6933K8362J2384j886Q612Q264J723N508L053J7763J6853p753
5191D83534j7320J1559m649R197L3652K1730p685R763k15o789J5672J0038j442
5178E57045K8251J0794r417K709p420K0001J8141M849O663J2667J3406N9516K2390
5165G39595j1660k2095J1292N7342M97K6668J1262J8990L0081M9740L3652N5810
5153A001174M6340K5224L5547K2340K9895L8251N2733M7038N9538Q4924P3015
5142A516019L6777Q3918J05700Q2579J00488J42822J35765J27311J39190J69414
5132B639983J63879K41993J59745M9175l5726l9439l5365m2185N524L0370L1769
$$ y = [396935, 378301, 361003, 340508, 355259, 357691, 381891, 371628, 394653, 377533, 383975, 393067, 392244, 391206, 373718, 390651, 419013, 431397, 429511, 438123, 446387, 448110, 453618, 456671, 474434, 491287, 483534, 466214, 477773, 473124, 482321, 515973, 537703, 530018, 539781, 539566, 532777, 548449, 558487, 557045, 585296, 596090, 586673, 589382, 581962, 601963, 620104, 624953, 631616, 644283, 657689, 717205, 739595, 727935, 705840, 717132, 774474, 774971, 801639, 812901, 831891, 861972, 911712, 945364, 1001174, 1047514, 1072738, 1108285, 1130625, 1160520, 1198771, 1251504, 1298542, 1358080, 1443004, 1516019, 1552796, 1636714, 1742414, 1824993, 1925481, 2068303, 2204068, 2331379, 2470569, 2639983, 2803862, 3045855, 3205600, 3254775, 3219049, 3179610, 3144245, 3102060, 3107584, 3137954, 3169723]
5121C169723R8916R6239P8764P9301P7070J44263J28650J51888J58587Q3925J42219
5110D409545J70361K08882K64863L20224K70536K37953K39504J66788j15627l80315
5100E792714m16172l23208k75906k32222j81736j59809j03922q8324j26743j47384
5090C737288j50404q9781r6340r9230p0607j8634k3561o4726J0189P9739M9319
5079C263252L9000M796n4516m2225j27656k33281l20945k59146j27622j27578
5069B014079j19662j17147j08511j15219j18528l1618k8124o755k6723o5449p1851
5058A204492l7854n2474l8484k8556J2005J6034q249k1075l0464J0501Q98o568
5046A020206K2957k2121k2839n8059k1783n3298m6093j2427l0900n0005k5661
$$ y = [3169723, 3268639, 3364878, 3443642, 3522943, 3600013, 3744276, 3872926, 4024814, 4183401, 4267326, 4409545, 4579906, 4788788, 5053651, 5373875, 5644411, 5882364, 6121868, 6288656, 6173029, 5792714, 5376542, 5053334, 4777428, 4545206, 4363470, 4203661, 4099739, 4011415, 3884672, 3737288, 3586884, 3497103, 3400763, 3301533, 3230926, 3212292, 3188731, 3124005, 3134194, 3213933, 3263252, 3302252, 3307048, 3252532, 3210307, 3082651, 2849370, 2528425, 2269279, 2141657, 2014079, 1894417, 1777270, 1668759, 1553540, 1435012, 1403394, 1375270, 1368515, 1341792, 1276343, 1204492, 1166638, 1114164, 1075680, 1047124, 1059129, 1075163, 1066914, 1045839, 1015375, 1025876, 1026774, 1020206, 1043163, 1021042, 998203, 940144, 918361, 865063, 818970, 806543, 775643, 725638, 699977]
5035F99977j2928o973j7875k1021l829m002L142m735L940k3770k9950O418n587
5022E82807m803K5730l3922j3034K352l3960k964p563O500L0403k5800N190k2330
5009E08606k3140l1917J0026J9712n128q430J1898j2863L724j0902j5853J365
4997D47098j1459P308j7760q289j0727j287J3964l895O233J5285q695j6575j1874
4984C99327q949l1117L0946j4992R866j663J1128J0048m977J7666j1696k7173
4972C78414N719j3955P438q11j0720R205n353k3753J5489J7749l9106J7229L582
4959C61127o565L0174k0239j2873K34n449N087j3037l375K421K1532P021p235
4946C58823p235J4689k4210K3775k5131P690K3100j0401K3200k0283j1672K3120
$$ y = [699977, 687049, 680076, 662201, 641180, 637351, 633349, 636491, 631756, 635696, 611926, 581976, 588394, 582807, 578004, 603734, 569812, 556778, 559130, 525170, 522206, 514643, 521143, 551546, 525746, 530936, 508606, 485466, 453549, 463575, 483287, 478159, 469729, 481627, 468764, 472488, 461586, 445733, 447098, 435639, 442947, 425187, 416898, 406171, 404884, 418848, 414953, 421186, 436471, 427776, 411201, 399327, 390378, 359261, 390207, 375215, 385081, 383418, 394546, 404594, 399617, 417283, 405587, 378414, 384133, 370178, 377616, 376805, 366085, 375290, 369937, 346184, 361673, 379422, 340316, 357545, 361127, 354562, 384736, 364497, 351624, 351858, 346409, 351496, 338459, 335084, 337505, 359037, 366058, 358823, 351588, 366277, 342067, 365842, 340711, 348401, 371501, 361100, 384300, 364017, 352345, 375465]
4934C75465j3947n472r065Q713q695q612M2383K874O568j2453K1479l628k8251
4921C67359J1954m458k8543O302L605J3380P447n072l245N191J1722m674M553
4908C85521K2443l066j2382P416Q103M176J847j707J2169J7993K983P027j2449
4895D40074k7135N219k0086N612M427J1069J7675n568J4953j78l0982r589K5386
4882D30877L59L74m130M674M068K7260k4472k915L4527o600p632J7519q493n908
4868D59508j4937L7910J7353j1588J6463J2352l1085J3021L1206j1232J7551M820
4856E41342j4582J3998P797P011N974k2681J3670j8977J6341K6762l6311L8619
4844E78963o239j2933J3845m765P472J4261j5565P667n245q5J4691J8551K9571
$$ y = [375465, 361518, 356046, 346981, 355694, 346999, 338387, 380770, 383644, 390212, 377759, 399238, 395610, 367359, 379313, 374855, 346312, 352614, 356219, 369599, 377046, 371974, 368729, 373920, 385642, 380968, 385521, 407964, 404898, 392516, 399932, 408035, 412211, 414058, 412351, 424520, 442513, 445496, 452523, 440074, 412939, 418158, 398072, 403684, 408111, 419180, 436855, 431287, 446240, 446062, 415080, 405491, 430877, 431236, 431610, 427480, 432154, 436222, 463482, 439010, 436095, 470622, 464022, 456390, 473909, 465416, 459508, 444571, 482481, 499834, 488246, 504709, 517061, 485976, 498997, 530203, 518971, 536522, 541342, 526760, 540758, 548555, 555566, 561540, 538859, 552529, 533552, 549893, 576655, 540344, 578963, 572724, 559791, 573636, 568871, 576343, 590604, 575039, 582706, 577461, 577376, 592067, 610618, 640189]
4831F40189j4573k206r327Q473N1444L8194k6728j3541j276J9122J8616k0985
4819F87402K4124L4347J9657K4645M107L1944Q846p829q432J6640M948l2998j0198
4806G97203j0081L74K8977L2132R418K749M070p731N974j7824m655N5252L6138
4793I31996k2078L5985k7262O279K5939L0240K0079J6401J4621P196K2864P318
4781A069578j9001M2201K9959l685J5859J4646M5505l446J0055M010K1337L0030
4769A257048O4416L3419K9650P1041k0645J3283K5379K0194N1447K6425K9514
4758A601171M6511M7561N3209K5566L1693P1300L9877K9184R98J1003J8272L2792
4746B009137K2573J9619j0820M0346N3648K4422K1861L5375M5110L8903N7628
$$ y = [640189, 625616, 623410, 614083, 622556, 674000, 712194, 685466, 671925, 670649, 689771, 708387, 687402, 711526, 745873, 765530, 790175, 794282, 826226, 835072, 827243, 818811, 835451, 840399, 807401, 797203, 787122, 787496, 816473, 848605, 858023, 860772, 864842, 857111, 863085, 845261, 840606, 895858, 931996, 909918, 945903, 918641, 924920, 950859, 981099, 1001178, 1017579, 1032200, 1039396, 1062260, 1069578, 1050577, 1092778, 1122737, 1119052, 1134911, 1149557, 1195062, 1191616, 1201671, 1205681, 1227018, 1257048, 1321464, 1354883, 1384533, 1455574, 1434929, 1448212, 1473591, 1493785, 1545232, 1571657, 1601171, 1647682, 1695243, 1748452, 1774018, 1805711, 1877011, 1916888, 1946072, 1947070, 1958073, 1976345, 2009137, 2031710, 2051329, 2040509, 2080855, 2134503, 2158925, 2180786, 2216161, 2261271, 2300174, 2357802]
4735B357802N7775M7972K4797K3304j2676K8019J0071L9955J3568L0633N1899
4724B673119L1201O5139O9330L8523L6233O8954P1207M7356N7458P8535L0819
4713C267874J6125O1866L7768L9168P9709K9072O9905L2754N8793P1264P3853
4702C838151R0712Q4808Q1797R3821O9814J07903O6277O6573Q6979J14306R3954
4691D795095O8386R3111N2939J06445R0433P0574J12463J31418J14692J03019
4681E738575J16948J04304P1385J19956J54933J07838J35425J29974J29595R6080
4671F905013R0658J53600J23658J10210J05262J12776Q4851J30565P5156R6425
4661G988174P1977N7353Q0199M5071O4887K6758N0478P501K1179J9229k8133N659
$$ y = [2357802, 2415577, 2463549, 2488346, 2511650, 2498974, 2526993, 2537064, 2577019, 2590587, 2621220, 2673119, 2704320, 2769459, 2838789, 2877312, 2913545, 2982499, 3053706, 3101062, 3158520, 3237055, 3267874, 3283999, 3345865, 3383633, 3422801, 3502510, 3531582, 3601487, 3634241, 3693034, 3764298, 3838151, 3928863, 4013671, 4095468, 4189289, 4259103, 4367006, 4433283, 4499856, 4586835, 4701141, 4795095, 4863481, 4956592, 5009531, 5115976, 5206409, 5276983, 5389446, 5520864, 5635556, 5738575, 5855523, 5959827, 6031212, 6151168, 6306101, 6413939, 6549364, 6679338, 6808933, 6905013, 6995671, 7149271, 7272929, 7383139, 7488401, 7601177, 7686028, 7816593, 7891749, 7988174, 8060151, 8117504, 8197703, 8242774, 8307661, 8334419, 8384897, 8392398, 8413577, 8432806, 8404673, 8410332]
4649H410332P229L942k9223j1321n5582k9992n471k4978k0060m9269n7255p272
4637H131080n1520o3361m4797o1719m2616o1451p5819r7194q5545r6213o0262
4626G390583r3571j27508q8753j03102j46398j23182j21862j10894j33092j65725
4616F176496j29572j23944q9729j48985j60198j11400j02772j32286j19049r9759
4606D958802j32535q1497r6916j23561q5727o2312j14409r8282j00074p5876m845
4595C982768r7286o8597l2997m4345q0595o5285p719k0967l9636m6597J3019p946
4583C483817l5643j8783j4974N180j1518l2187K235j0574n493l4014J0879P416
4571C346341j5063J2203l7236p4817k6246K13l5022j6474k7304j3682K3908j5798
$$ y = [8410332, 8417561, 8421503, 8392280, 8380959, 8325377, 8295385, 8289914, 8264936, 8244876, 8195607, 8138352, 8131080, 8079560, 8016199, 7971402, 7909683, 7867067, 7805616, 7729797, 7632603, 7547058, 7450845, 7390583, 7297012, 7169504, 7080751, 6977649, 6831251, 6708069, 6586207, 6475313, 6342221, 6176496, 6046924, 5922980, 5833251, 5684266, 5524068, 5412668, 5309896, 5177610, 5058561, 4958802, 4826267, 4744770, 4647854, 4524293, 4438566, 4376254, 4261845, 4163563, 4063489, 3987613, 3982768, 3885482, 3816885, 3783888, 3739543, 3658948, 3593663, 3585944, 3564977, 3525341, 3478744, 3491763, 3483817, 3448174, 3429391, 3414417, 3419597, 3408079, 3375892, 3378127, 3367553, 3362060, 3328046, 3338925, 3346341, 3331278, 3343481, 3306245, 3231428, 3205182, 3205395, 3170373, 3153899, 3126595, 3112913, 3136821, 3121023]
4559C121023j9269j1411K903j4646Q838K445n399N135R030M6337J1304J6330L5770
4546C208390l094k207L1433N990J9764O0256J5296o350O533M6880j6287j3450
4534C353154J3512k6852J3730K0779O21k8806L778J6429J90J08p693q655J2319
4521C362614K834J9200J0457M631m523N83N6619K4483K4663J3077O92k969q47
4508C511514n850j4137J0035J8363j70j4827O72J3046j488n0149j9167j0133k4510
4495C413199k1972J478n9119k0439l1335J2271k2465j6145N74k3327k3605l8642
4483C170473R651m0812l1330n004n0345j3296J7004l0904k234n942O059L77o353
4470C017344M6952N7809M8432O4229L6699L8613O0864N885m7022J9695j6629l2471
$$ y = [3121023, 3101754, 3090343, 3093246, 3078600, 3087438, 3089883, 3084484, 3089619, 3098649, 3144986, 3156290, 3172620, 3208390, 3205296, 3203089, 3234522, 3240512, 3260276, 3320532, 3335828, 3329478, 3336011, 3382891, 3366604, 3353154, 3366666, 3339814, 3353544, 3374323, 3374944, 3346138, 3349916, 3366345, 3366535, 3366643, 3358950, 3350295, 3362614, 3365448, 3384648, 3395105, 3399736, 3395213, 3395796, 3452415, 3476898, 3501561, 3514638, 3515330, 3512361, 3511514, 3505664, 3491527, 3501562, 3519925, 3519755, 3504928, 3505600, 3518646, 3517158, 3467009, 3447842, 3437709, 3413199, 3391227, 3392705, 3333586, 3313147, 3281812, 3294083, 3271618, 3255473, 3256047, 3232720, 3209115, 3170473, 3180124, 3139312, 3107982, 3102978, 3052633, 3039337, 3056341, 3025437, 3023203, 3017261, 3023320, 3023697, 3017344, 3064296, 3122105, 3170537, 3234766, 3271465, 3310078, 3370942, 3376827, 3329805, 3349500, 3332871, 3300400]
4458C300400k4233n3567j2077j316j8699l0333l0435m0647m0924K2888r255o5602
4446B996200m3121k1272K4003J3465K4298O301Q942l0236m4073j22132j47673
4435B664702j00409q5999j56757j41414j07028j23838l8334m6011o1690l8353
4425A764869l6293j5582j5885R88O928k693J2622j5625J4484L2410M4289N2704
4413A843216K8193L0717k0286j7557p1459q2895o4756n7360m9760m0115n6902
4402A441036o0433o1346p7415m5356j5465l5968l9154j0716l5978k9564n3237
4391I76404L679q675L0216l8574l4459j2096o111q949l6353J8794j6470k7259
4379H40147j0968J4761o28j4140K4516M455j688n8727L978l04K0643k3315J9048
$$ y = [3300400, 3276167, 3222600, 3210523, 3209207, 3190508, 3160175, 3129740, 3089093, 3048169, 3071057, 3061802, 2996200, 2953079, 2931807, 2955810, 2969275, 2993573, 2999874, 3008816, 2978580, 2934507, 2812375, 2664702, 2564293, 2478294, 2321537, 2180123, 2073095, 1949257, 1910923, 1864912, 1803222, 1764869, 1728576, 1712994, 1697109, 1698097, 1705025, 1702332, 1714954, 1699329, 1713813, 1746223, 1790512, 1843216, 1871409, 1902126, 1881840, 1864283, 1792824, 1709929, 1645173, 1587813, 1538053, 1497938, 1441036, 1380603, 1319257, 1241842, 1196486, 1181021, 1145053, 1105899, 1095183, 1059205, 1029641, 976404, 980083, 971408, 1001624, 963050, 928591, 916495, 910384, 901435, 865082, 883876, 867406, 840147, 829179, 843940, 843312, 829172, 853688, 858143, 856455, 797728, 801706, 801402, 822045, 798730, 817778]
4366H17778j53l8971J0130m34k936j6417J6477L994M419m207J8300Q305k0107
4353G96178K4057j4912K8719K6406l4352J1705P740m0641R52J037j1455j0556
4341G84878J3139k6537r253L5357j6555m461o103n72M790j7914J3450l482M983
4328G71720Q664Q208j4947j9769R209o984n93l504L992q528m112j252j0535j2618
4314G18951K4909l2885K1253J9793M811K0655l564l3046J3091N468j1185O861
4302G55112L732l369o391j030K9052j2228L5430Q792j3331J733Q138Q807l6365
4289G78082p631J6473j9882J3770M018k334J2404Q312j9308J9185J2004r073r272
4276G96748J7145J1258k0545K6558P208l1262k569J3148m797k5224k325J6852
$$ y = [817778, 817625, 778654, 788784, 788350, 785414, 768997, 785474, 789468, 793887, 789680, 807980, 816285, 796178, 820235, 805323, 834042, 860448, 826096, 837801, 845541, 804900, 805852, 806889, 795434, 784878, 798017, 771480, 762227, 797584, 781029, 776568, 770465, 769893, 774683, 756769, 770219, 766737, 771720, 780384, 788592, 773645, 753876, 763085, 756101, 755508, 752004, 755996, 747468, 743356, 742104, 731569, 718951, 743860, 710975, 732228, 752021, 756832, 777487, 773923, 740877, 753968, 759436, 748251, 755112, 758844, 755475, 749084, 748054, 777106, 764878, 800308, 809100, 795769, 797502, 805640, 814447, 778082, 770451, 786924, 767042, 780812, 784830, 782496, 794900, 803212, 783904, 803089, 815093, 806020, 796748, 813893, 825151, 804606, 831164, 838372, 807110, 804541, 817689, 812892, 787668, 785343, 802195]
4264H02195J4625p825J9757k0191J3765l611M043J0071q93M064K645N052L0188
4251H73885j5882q87K9550o639K9182l692R902q454j1972P298J8606L124l910
4238I20111J1091L107J9401J8281J8623J3749J455J0177l573j551K0691J3711
4226A045273p988K3286j9615J8657R341K2896m325M728p475K4905J1752J2609
4214A134044L7737J7527j4035l921M2757N9978l230L2983K2647p771N5445L6357
4202A410518K7724Q6259P3686O9445P0785P6218O1577J14836J11018R6732J09450
4191B308248N9347R583l0577r7140o8457r8273j17178o6640o4715r956o152o4919
4179A753171k4116N320J2414N3806n900J6839j155J2817J1095L9362K7483K2873
$$ y = [802195, 816820, 808995, 828752, 808561, 822326, 818715, 822758, 832829, 831936, 836000, 838645, 843697, 873885, 858003, 857116, 886666, 880027, 909209, 905517, 915419, 906965, 894993, 902291, 920897, 924021, 920111, 931202, 934309, 953710, 971991, 990614, 1004363, 1005818, 1015995, 1012422, 1010871, 1031562, 1045273, 1037285, 1060571, 1040956, 1059613, 1068954, 1091850, 1087525, 1092253, 1084778, 1109683, 1121435, 1134044, 1171781, 1189308, 1175273, 1171352, 1214109, 1274087, 1270857, 1303840, 1326487, 1318716, 1374161, 1410518, 1438242, 1524501, 1598187, 1667632, 1738417, 1814635, 1876212, 1991048, 2102066, 2198798, 2308248, 2367595, 2377178, 2346601, 2249461, 2181004, 2082731, 1965553, 1898913, 1834198, 1824242, 1818090, 1753171, 1729055, 1734375, 1746789, 1800595, 1794695, 1811534, 1810379, 1823196, 1834291, 1873653, 1901136, 1924009]
4167A924009L5200J1582L6452J3766M2278N3572O4724M4765L1296P6949O6573
4156B401166O2066Q0248M1952N6361O9789P6407J33006Q3288J02473R4769J08135
4145C309660R8651R0120J12745J19231Q6485R3134Q5322O7729N5140L9641M8698
4134D206556M4445L9853L2553Q6473M1650N2471J11711R7543O9703N6007O3202
4123D902167P2379N9862Q2373O5638O0997K1899O6809M2419M9472J3537L2997
4112E470549M5718N0769N3690N6945R9705K4064P6288N5763O7335M1630J7184
4101F059640k689L1751K691j3324J6576j3346k2803j2063K7317L600K648k1247
4089F058751k9852k1072p9347n5971o1014p0094l0411n2323o4331q2319p5472
$$ y = [1924009, 1959209, 1970791, 2007243, 2021009, 2063287, 2116859, 2181583, 2226348, 2257644, 2334593, 2401166, 2463232, 2543480, 2585432, 2641793, 2711582, 2787989, 2920995, 3004283, 3106756, 3201525, 3309660, 3408311, 3498431, 3611176, 3730407, 3816892, 3910026, 3995348, 4063077, 4118217, 4157858, 4206556, 4251001, 4290854, 4323407, 4409880, 4451530, 4504001, 4615712, 4713255, 4782958, 4838965, 4902167, 4974546, 5034408, 5116781, 5182419, 5243416, 5265315, 5332124, 5374543, 5424015, 5437552, 5470549, 5516267, 5567036, 5620726, 5677671, 5777376, 5801440, 5877728, 5933491, 6000826, 6042456, 6059640, 6056951, 6088702, 6091393, 6078069, 6094645, 6081299, 6058496, 6046433, 6073750, 6077350, 6079998, 6058751, 6028899, 6007827, 5928480, 5872509, 5811495, 5741401, 5710990, 5658667, 5594336, 5512017, 5436545]
4078E436545j12242j22349j45925j40934r2021j10392q3187p7348m7664m9386
4068D455097k0280K327J9656M0918O1146R6N7223L8621N5695N3978L8341O9909
4056D872727J14217K9035N741M8957M3085o4577q8168r5438q0795k4589n6510
4045D703685n963L8652L0968M8274O0202L8648J10136R3553P7014J00127J39703
4034E434999Q9059Q5422J03861R5589J31311J02965P9248P4577K5757J9921J0916
4023F253625j9031K0237N0622J9060J2787N8580r304p061K7720J188R185N490
4011F423098j3088Q522L0323Q816j1788j9085K0525l8857j162l8057m1019J5184
3999F343412k5563l794K0393j1524K6750k540P612K1266L4382J8622J7131M0942
$$ y = [5436545, 5324303, 5201954, 5056029, 4915095, 4823074, 4712682, 4629495, 4552147, 4504483, 4455097, 4434817, 4437144, 4456800, 4497718, 4558864, 4558960, 4616183, 4654804, 4710499, 4764477, 4802818, 4872727, 4986944, 5015979, 5021720, 5070677, 5113762, 5049185, 4961017, 4865579, 4784784, 4760195, 4703685, 4697722, 4736374, 4767342, 4815616, 4875818, 4914466, 5024602, 5118155, 5195169, 5295296, 5434999, 5524058, 5609480, 5713341, 5808930, 5940241, 6043206, 6122454, 6197031, 6222788, 6242709, 6253625, 6234594, 6254831, 6305453, 6324513, 6337300, 6395880, 6386576, 6379515, 6407235, 6408423, 6417608, 6423098, 6410010, 6418532, 6448855, 6457671, 6445883, 6426798, 6447323, 6408466, 6407304, 6369247, 6328228, 6343412, 6317849, 6314055, 6334448, 6322924, 6349674, 6347134, 6354746, 6376012, 6410394, 6429016, 6446147, 6487089]
3987F487089J1491J713M7793O170M4464j9828k3008J8726j026N7989L3576N5107
3975F720256N6162J03609J58100K08082K36571L15307L82736L42266L56919M18841
3965I298849K18060l98084p40150o53400l95558k53052j71943j16117j21354j50985
3955F516266j59999j57047j27033r0204r4013q8152o0318l9419m7009Q899n990
3944E655981K2410Q50L4800L8496K7244O2893O906L7104j0545p48K3481j0914
3932E887958J8191K7532P6705R1404O4482O0530J03176R0285P1665R3795J10911
3921F696634O8228P0105L4325Q115J4299Q389J9036M6312q975n786m642j0038
3909F936002j9532j1968M2075P5389J39781J13251J16868J48476J71860K20706
$$ y = [6487089, 6498580, 6500293, 6548086, 6554256, 6598720, 6578892, 6555884, 6574610, 6573584, 6631573, 6665149, 6720256, 6776418, 6880027, 7038127, 7246209, 7482780, 7798087, 8180823, 8523089, 8880008, 9298849, 9516909, 9118825, 8378675, 7725275, 7329717, 7076665, 6904722, 6788605, 6667251, 6516266, 6356267, 6199220, 6072187, 5981983, 5887970, 5799818, 5739500, 5700081, 5653072, 5661971, 5655981, 5678391, 5679241, 5714041, 5752537, 5779781, 5842674, 5849580, 5886684, 5876139, 5875391, 5898872, 5887958, 5906149, 5933681, 6010386, 6101790, 6166272, 6226802, 6329978, 6420263, 6491928, 6585723, 6696634, 6764862, 6834967, 6869292, 6877407, 6891706, 6900095, 6919131, 6965443, 6956468, 6950682, 6946040, 6936002, 6916470, 6904502, 6946577, 7021966, 7161747, 7274998, 7391866, 7540342, 7712202, 7932908]
3899G932908K17161J91544J50350J87003J55477J43112J42750J47529K08885K35312
3889I712031K73993K63930L14661K88577K34450J89818J57897J31229K8519l3107
3879A1561998j08351j94373k35580k51654k24242j53050q3967k4446m1887L9080
3869A0283528J12652J07369J39539J32924J31347J10136P3765L2732K852m1897
3859A1084947q5691m4805j4694k7162L3331J08274R2521J72445J98220K44518
3849A1761904K63343L12477L17970L57774L64479L56608L18549K50700K43008
3840A4546812K44776K73289K69119K63153L08765L55945M64129M90349N90087
3831A7806424P23433Q83949J101029J294566J398882J536637J875776K211995
$$ y = [7932908, 8150069, 8341613, 8491963, 8678966, 8834443, 8977555, 9120305, 9267834, 9476719, 9712031, 9986024, 10249954, 10564615, 10853192, 11087642, 11277460, 11435357, 11566586, 11595105, 11561998, 11453647, 11259274, 11023694, 10772040, 10547798, 10394748, 10310781, 10286335, 10244448, 10283528, 10396180, 10503549, 10643088, 10776012, 10907359, 11017495, 11091260, 11123992, 11126844, 11084947, 10999256, 10954451, 10939757, 10912595, 10945926, 11054200, 11146721, 11319166, 11517386, 11761904, 12025247, 12337724, 12655694, 13013468, 13377947, 13734555, 14053104, 14303804, 14546812, 14791588, 15064877, 15333996, 15597149, 15905914, 16261859, 16725988, 17216337, 17806424, 18529857, 19413806, 20514835, 21809401, 23208283, 24744920, 26620696, 28832691]
3823B8832691K704588L290336M041764M197150M007593L789962M940849K045997
3815E7850930m065244o600366n258273l007630j578649n55267R2502Q29147J318768
3806C9025918J954169K559473L124497L390364L390067L165993L129478L084904
3798F2824863J034314k566707m768129m788553l748847k790220k111712j761736
3790D1323273j555777j500386j526022j517253j553517j525714j398348j290793
3782B9455463j194156j104021r56564q46647p58115p42573p37760p93461p41802
3773B1580364p43939p03256o59447o08204n41742m63186m30921l93130l80583
3764A6655956l87083l42690l48514m06044m13987l72195l56552l36948l44230
$$ y = [28832691, 31537279, 34827615, 38869379, 43066529, 47074122, 50864084, 55804933, 57850930, 53785686, 47185320, 41927047, 38919417, 37340768, 36785501, 36878003, 37707150, 39025918, 40980087, 43539560, 46664057, 50054421, 53444488, 56610481, 59739959, 62824863, 63859177, 61292470, 56524341, 51735788, 47986941, 45196721, 43085009, 41323273, 39767496, 38267110, 36741088, 35223835, 33670318, 32144604, 30746256, 29455463, 28261307, 27157286, 26200722, 25354075, 24595960, 23853387, 23115627, 22322166, 21580364, 20836425, 20133169, 19473722, 18865518, 18323776, 17860590, 17429669, 17036539, 16655956, 16268873, 15926183, 15577669, 15171625, 14757638, 14385443, 14028891, 13691943, 13347713]
3755A3347713l45459l14894k98063l28781l24106k33670l01508k97747k86181
3746A0617304k82891k58346k42117k48319k52656k06191j72758j86678j82297
3737H585051j57048j59838j57097j06260r6533j07561r4079q6039j05302j16320
3727G398974j18872j53194j52861j81194j22115j16612j14120r0848m9394m4177
3717F255587k120J1492M011K7722J7928M0671Q1440J44007J80461J98403K76037
3706G235639K89343K48791K75177K20481J96513j5489l54981m67116m71048m30270
3696F727040l38968k23444j87672j49434j19156l4840n9837j4021J460N8865P5666
3685E735659Q5002Q0793Q9947M0542Q6586R1283L7131N5402J7055o348m3987j79623
$$ y = [13347713, 13002254, 12687360, 12389297, 12060516, 11736410, 11502740, 11201232, 10903485, 10617304, 10334413, 10076067, 9833950, 9585631, 9332975, 9126784, 8954026, 8767348, 8585051, 8428003, 8268165, 8111068, 8004808, 7908275, 7800714, 7706635, 7620596, 7515294, 7398974, 7280102, 7126908, 6974047, 6792853, 6670738, 6554126, 6440006, 6349158, 6299764, 6255587, 6253467, 6264959, 6268970, 6296692, 6314620, 6355291, 6436731, 6580738, 6761199, 6959602, 7235639, 7524982, 7773773, 8048950, 8269431, 8465944, 8450455, 8095474, 7628358, 7157310, 6727040, 6388072, 6164628, 5976956, 5827522, 5708366, 5673526, 5613689, 5599668, 5601128, 5659993, 5735659, 5820661, 5901454, 5991401, 6031943, 6118529, 6209812, 6246943, 6302345, 6319400, 6313052, 6269065, 6089442]
3673F089442k08928k32205k51152k11637j77233j47865j19844r1693p5214o0161
3663D513510l4772m5911o004k0256K0133L338J6827K9423n82J8932K4416M329
3651D523383O1282L4124J00748P0542J11598J03411J8506l8896p8085j48247j36620
3640D621746j23518q9283o4013m8594J1051o201r643k2874M8216l2121j2470j3480
3628D258816J1113m388k2592m763m178k3557n273j6753j3374J193M9802K8502
3616D254548k004K6630L3465J601L6750L9249N7119K4260K7560L963J8254K2136
3604D543531L0446J7267N3048N3206O7303Q6647J06533R2403J06849J48228J33124
3593E438585J59385K14339K24321K07787K24893K30538K62071K71051K78434L06161
$$ y = [6089442, 5880514, 5648309, 5397157, 5185520, 5008287, 4860422, 4740578, 4648885, 4573671, 4513510, 4478738, 4432827, 4426823, 4406567, 4426700, 4430038, 4446865, 4476288, 4475706, 4494638, 4519054, 4523383, 4584665, 4618789, 4719537, 4790079, 4901677, 5005088, 5023594, 4984698, 4906613, 4758366, 4621746, 4498228, 4408945, 4344932, 4296338, 4307389, 4301188, 4291545, 4268671, 4316887, 4284766, 4272296, 4258816, 4269929, 4265541, 4242949, 4238186, 4234008, 4210451, 4205178, 4188425, 4175051, 4176244, 4226046, 4254548, 4252544, 4279174, 4312639, 4314240, 4350990, 4390239, 4447358, 4471618, 4499178, 4503141, 4521395, 4543531, 4573977, 4591244, 4644292, 4697498, 4764801, 4851448, 4957981, 5050384, 5157233, 5305461, 5438585, 5597970, 5812309, 6036630, 6244417, 6469310, 6699848, 6961919, 7232970, 7511404, 7817565]
3583G817565L11356K31765J53387J28349J07051J78023K02685K72814K89376L92548
3573A0084919L60121L32462K99206K45120J74848J47334J16203J12877J02720
3564A1975810J59126K16657K20444K36710L16215L74912L83478L81420L47256
3555A4612028J84199j98743m22693l40693j65357j9025J19853K48484K77945K82703
3545A4578701K70534L19903L18976L52802L13080L14219L90503L96422M70691
3536A7725831N84670O71436P73102Q17654Q58567Q09932P08385O12229M66463
3527B4028269K91795J66354M1217L0957P4759P9089O1661M0322M2601M9753L3042
3516B4939819r1564j40017j73954k17832l04174l72480m25934l79399l95076m11086
$$ y = [7817565, 8128921, 8360686, 8514073, 8642422, 8749473, 8927496, 9130181, 9402995, 9692371, 10084919, 10445040, 10777502, 11076708, 11321828, 11496676, 11644010, 11760213, 11873090, 11975810, 12134936, 12351593, 12572037, 12808747, 13124962, 13499874, 13883352, 14264772, 14612028, 14796227, 14597484, 14174791, 13834098, 13668741, 13649716, 13769569, 14018053, 14295998, 14578701, 14849235, 15169138, 15488114, 15840916, 16153996, 16468215, 16858718, 17255140, 17725831, 18310501, 18981937, 19755039, 20572693, 21431260, 22241192, 22949577, 23561806, 24028269, 24320064, 24486418, 24527635, 24558592, 24633351, 24712440, 24774101, 24814423, 24857024, 24906777, 24939819, 24848255, 24708238, 24534284, 24316452, 24012278, 23639798, 23213864, 22834465, 22439389, 22028303]
3506B2028303l84584l51020l77075l56912k69755k81398k39625k02254k08728
3497A9356952j93010k06041k45620k62890k35766k36339k21071k46228k57727
3488A7252260k98166k40421k91344l23852l48750k92859k61006k26129k51097
3479A4718636k02973k53236j84357j77072j31074j30124o4775o0990j3304J4605
3469A3515336N3001P7473O2423N2852N2446M542J2733p084m6389k6009N076m8287
3457A3708113k8449L1065O7580O7627Q8719N8082R7730N7202M6152K7231Q3253
3446A4304305M8215Q0260K6370R9693J25631J84366J39393J68585J82220K52891
3436A5611929K55051K95497L10871L37787L44477L73311L64399L93307M19956
$$ y = [22028303, 21643719, 21292699, 20915624, 20558712, 20288957, 20007559, 19767934, 19565680, 19356952, 19163942, 18957901, 18712281, 18449391, 18213625, 17977286, 17756215, 17509987, 17252260, 16954094, 16713673, 16422329, 16098477, 15749727, 15456868, 15195862, 14969733, 14718636, 14515663, 14262427, 14078070, 13900998, 13769924, 13639800, 13575025, 13514035, 13500731, 13515336, 13568337, 13645810, 13708233, 13761085, 13813531, 13818073, 13830806, 13823722, 13777333, 13751324, 13756400, 13708113, 13679664, 13710729, 13778309, 13845936, 13934655, 13992737, 14090467, 14147669, 14193821, 14221052, 14304305, 14352520, 14432780, 14459150, 14558843, 14684474, 14868840, 15008233, 15176818, 15359038, 15611929, 15866980, 16162477, 16473348, 16811135, 17155612, 17528923, 17893322, 18286629, 18706585]
3427A8706585M49792M24766M65913M79868N72402O54808O87655O96475P30972
3418B3869236O75001P02903P92296R19987R57434J051303J171043J248076J286312
3409C2673591J301092J377375J504298J737986J946728K174962K412596K741237
3401D7869865L145833L575526L941322M596101N601878P173757Q542702R120440
3393I3567424R846561J2222187J4675345J8004226K2396067K6966857K7141931
3386B24820598K5725368K5107516L3058084J6280695k7287942n2474092m7271403
3379A97958824l1767160k1208885j4567665j0939478p857445o207092n053593
3372A00357506m376223l659219l238590k675740k845906k811701k721276k434420
$$ y = [18706585, 19156377, 19581143, 20047056, 20526924, 21099326, 21754134, 22441789, 23138264, 23869236, 24544237, 25247140, 26039436, 26959423, 27916857, 28968160, 30139203, 31387279, 32673591, 33974683, 35352058, 36856356, 38594342, 40541070, 42716032, 45128628, 47869865, 51015698, 54591224, 58532546, 63128647, 68730525, 75904282, 84446984, 93567424, 103413985, 115636172, 130311517, 148315743, 170711810, 197678667, 224820598, 250545966, 275653482, 308711566, 324992261, 297704319, 245230227, 197958824, 166191664, 144982779, 130415114, 119475636, 111618191, 105411099, 100357506, 95981283, 92322064, 89083474, 86407734, 83561828, 80750127, 78028851, 75594431]
3364G5594431k428540k335717k564335k608462k652793k476971k430650k237646
3356E5859317k132342j981472j837517j643509j641734j498157j454657j355696
3348D2314233j390477j265844j220227j099191j007895r00368q77488q24067q63102
3339C2865574p87625p21530o63634o55693n50480n81160n42540n53568m42007
3330B7367337m36414l68545m02776l87269m40647l62282k81499k75486k90039
3321B4122380l68312m89042m86956m75104m62413l82038l29501l22792l03554
3312B0502668l06483k53055k33481k62477k86418l26786l36562l79312m02763
3303A7715331m58807n06334m63078m94069m55742m44166m67810m69297m65883
$$ y = [75594431, 73165891, 70830174, 68265839, 65657377, 63004584, 60527613, 58096963, 55859317, 53726975, 51745503, 49907986, 48264477, 46622743, 45124586, 43669929, 42314233, 40923756, 39657912, 38437685, 37338494, 36330599, 35430231, 34552743, 33728676, 32865574, 32077949, 31356419, 30692785, 30037092, 29486612, 28905452, 28362912, 27809344, 27367337, 26930923, 26562378, 26159602, 25772333, 25331686, 24969404, 24687905, 24412419, 24122380, 23754068, 23265026, 22778070, 22302966, 21840553, 21458515, 21129014, 20806222, 20502668, 20196185, 19943130, 19709649, 19447172, 19160754, 18833968, 18497406, 18118094, 17715331, 17256524, 16750190, 16287112, 15793043, 15337301, 14893135, 14425325, 13956028, 13490145]
3294A3490145m19634l74991l89126l68712l40767k84001k67161k73281j83665
3285A0588807j85351j68399j41922j46847j78415k02715j90062j59989k11549
3276I003558j61921j97571j68776j19609j26442j62345j50294j38914j09327j33248
3266G535111r8914j11073p5971p2832l1441q6800n1432q4636r1035q4241j33293
3255F613443j39975j19435j29282r0798r1209r1149p9593m3292p6580n8463n7847
3244E635820o1887m2087n3438n5247k4366j187O439j2867K752k9133K429J4655
3232E381883M2336K7697j0078m425L0003K9759P8350Q973J5948O8042P9689K8675
3220E776852K4767N5559O4233O1509Q1603Q3396J06368J14111Q4510Q3978J78855
$$ y = [13490145, 13070511, 12695520, 12306394, 11937682, 11596915, 11312914, 11045753, 10772472, 10588807, 10403456, 10235057, 10093135, 9946288, 9767873, 9565158, 9375096, 9215107, 9003558, 8841637, 8644066, 8475290, 8355681, 8229239, 8066894, 7916600, 7777686, 7668359, 7535111, 7436197, 7325124, 7249153, 7176321, 7144880, 7058080, 7006648, 6922012, 6830977, 6746736, 6613443, 6473468, 6354033, 6224751, 6133953, 6042744, 5951595, 5872002, 5828710, 5752130, 5693667, 5635820, 5573933, 5531846, 5478408, 5423161, 5398795, 5397608, 5404047, 5391180, 5393932, 5364799, 5367228, 5381883, 5424219, 5451916, 5441838, 5437413, 5467416, 5497175, 5575525, 5584498, 5600446, 5668488, 5748177, 5776852, 5801619, 5857178, 5921411, 5982920, 6064523, 6147919, 6254287, 6368398, 6452908, 6536886, 6715741]
3209F715741J59504J64109K01769K03186J92351K60901K72705L49907L65927L46808
3199I232908L17246K68638J83251P9864m8176r4111n7543n8431J7699J2393L6791
3188I890529L0541K7827M6838L2792M7479M1479L3922l126J923o643j3500J6356
3176A0146417L5746O0834M9701P5754Q1027J12713J49791J05086J46288J78069
3166A1141426K09776K40099K61466K69684L18423L64328L75358M25470M63932
3157A4069962N69567N68618O64290O84705P50080P67761Q55649Q16403Q40916
3148B0587951Q16462Q04056P06351O68639N99618N46633M98746M84219M73015
3139B6185690M04822M09467M19925M20415M46938M10318L84349L90606L61386
$$ y = [6715741, 6875245, 7039354, 7241123, 7444309, 7636660, 7897561, 8170266, 8520173, 8886100, 9232908, 9550154, 9818792, 10002043, 10081907, 10033731, 9939620, 9882077, 9823646, 9841345, 9853738, 9890529, 9921070, 9948897, 9995735, 10028527, 10076006, 10117485, 10151407, 10148281, 10150204, 10143561, 10130061, 10146417, 10182163, 10242997, 10292698, 10368452, 10449479, 10562192, 10711983, 10817069, 10963357, 11141426, 11351202, 11591301, 11852767, 12122451, 12440874, 12805202, 13180560, 13606030, 14069962, 14639529, 15208147, 15872437, 16557142, 17307222, 18074983, 18930632, 19747035, 20587951, 21404413, 22208469, 22914820, 23583459, 24183077, 24729710, 25228456, 25712675, 26185690, 26590512, 26999979, 27419904, 27840319, 28287257, 28697575, 29081924, 29472530, 29833916]
3130B9833916L07634L05843L41592L68363M08633M48287M77870N40549N71204
3121C3603891N42582M72105L87006K73149J92101O0040N614m561l3867M5513K818
3110C5546391j4248m3707j40841j77061k57743l36887l87746m96142n93855n92783
3100C2505378o45058o58884o53391o27824o23775n99137n30808n27595m93476
3091B7145430m50668m49973l92201l93436l88179l23857k95497k92838k69387
3082B3889394k22489k74568k60716k53838l13401k99650l22276l88552l75432
3073B1178472l25964k77757j91180r2103j1952J02197R3519R5008R4483o4212
3063B0600511m30049p08290p45095o45058m64946l31232k61081j89061j98171
$$ y = [29833916, 30141550, 30447393, 30788985, 31157348, 31565981, 32014268, 32492138, 33032687, 33603891, 34146473, 34618578, 35005584, 35278733, 35470834, 35530874, 35536488, 35531927, 35498060, 35543573, 35546391, 35532143, 35488436, 35347595, 35170534, 34912791, 34575904, 34188158, 33692016, 33098161, 32505378, 31860320, 31201436, 30548045, 29920221, 29296446, 28697309, 28166501, 27638906, 27145430, 26694762, 26244789, 25852588, 25459152, 25070973, 24747116, 24451619, 24158781, 23889394, 23666905, 23392337, 23131621, 22877783, 22564382, 22264732, 21942456, 21553904, 21178472, 20852508, 20574751, 20383571, 20291468, 20279516, 20381713, 20475232, 20570240, 20664723, 20600511, 20170462, 19462172, 18717077, 18072019, 17607073, 17275841, 17014760, 16825699, 16627528]
3054A6627528j70000j68554r3984k0968M0406P5887J37719K05462K93066M12823
3044A7339385N45423P13358Q07824Q02244P63139N72482j16871j107572j617392
3035A8702020j591299j256339r44095p56076o09397n33966m48637m17007l83030
3026A1762174l53428k86079k64951k30588j98914j78648j43112j27277j11335
3017I867842o1752m1781j6435l1159j4530K9102K5023N5757N3780O8652Q4517
3006A0019016J00496J37672J45140K18591K30696K49092L46473L50724L97990
2997A2195890M88160N41110N94819O56619P75841Q54895R47799J026908J075082
2988A9157123J170884J145799J166787J140744J065059J020534R09307P61435
$$ y = [16627528, 16457528, 16288974, 16194990, 16174022, 16214428, 16290315, 16428034, 16633496, 16926562, 17339385, 17884808, 18598166, 19405990, 20208234, 20971373, 21543855, 21426984, 20319412, 18702020, 17110721, 15854382, 14910287, 14154211, 13544814, 13010848, 12562211, 12145204, 11762174, 11408746, 11122667, 10857716, 10627128, 10428214, 10249566, 10106454, 9979177, 9867842, 9806090, 9764309, 9747874, 9716715, 9702185, 9731287, 9756310, 9812067, 9865847, 9934499, 10019016, 10119512, 10257184, 10402324, 10620915, 10851611, 11100703, 11447176, 11797900, 12195890, 12684050, 13225160, 13819979, 14476598, 15252439, 16107334, 17055133, 18082041, 19157123, 20328007, 21473806, 22640593, 23781337, 24846396, 25866930, 26776237, 27537672]
2980B7537672N77806M03603J79624j19274k85168m98880o72949p26800p94644
2971B5600990p90307p51092p20924o74147o18775n28197m76220m11073m31130
2962B0199125l75257l51519l38821l20710l04088l30985l40858l38322l44730
2953A7153835l92923m06800m33070m72378m91592m88191n30792n21145m84670
2944A2932274n20515m77710m49305m08203m02263l71219l75505l53569l57405
2935I216580l27979l28353k60041k28628k30057k20961j81731j92039j84202j62282
2925F900307j49315j48302j46989j75458j80374j16738j42921j34473j06192j21297
2915E478248j22875q9754q0913p5023q3393j15497p3187p7674p1069n9101o6959
$$ y = [27537672, 28115478, 28519081, 28698705, 28579431, 28294263, 27795383, 27122434, 26395634, 25600990, 24810683, 24059591, 23338667, 22664520, 22045745, 21517548, 21041328, 20630255, 20199125, 19823868, 19472349, 19133528, 18812818, 18508730, 18177745, 17836887, 17498565, 17153835, 16760912, 16354112, 15921042, 15448664, 14957072, 14468881, 13938089, 13416944, 12932274, 12411759, 11934049, 11484744, 11076541, 10674278, 10303059, 9927554, 9573985, 9216580, 8888601, 8560248, 8300207, 8071579, 7841522, 7620561, 7438830, 7246791, 7062589, 6900307, 6750992, 6602690, 6455701, 6280243, 6099869, 5983131, 5840210, 5705737, 5599545, 5478248, 5355373, 5265619, 5184706, 5109683, 5026290, 4910793, 4837606, 4759932, 4688863, 4629762, 4562803]
2904D562803p2669m9873o9071k8733m5424n5675J3878k5799k3401P524k0177J4673
2892D208056J2392r763N1415O5623M5194N4003K638n1479j34585j22849j17012
2881D003633j12626p0563q1700o2848k0096k9681o2474J462m4581n6663m779m6236
2869C412848l5439L253j0234R849K9444k5946k3614k6645J4940K5857m373J0872
2857C380812P771k0749k4056J2067k0847J6238r699K7778L0839j8822J6013j2465
2845C384880J1647O3786J0510M746p771Q238L538M668L1002K6571M3786O814L9603
2832C632018O5289N1700N6766K6092k2102M2915P6415J9440L9486Q2181M6762
2821D116962K2539K4232K8423N0601Q6369N5601O2401P9278R9565Q2626R9261
$$ y = [4562803, 4490134, 4440261, 4371190, 4342457, 4297033, 4241358, 4255236, 4229437, 4206036, 4213560, 4193383, 4208056, 4220448, 4210685, 4262100, 4327723, 4372917, 4426920, 4429558, 4378079, 4243494, 4120645, 4003633, 3891007, 3820444, 3738744, 3675896, 3655800, 3626119, 3563645, 3565107, 3520526, 3463863, 3459084, 3412848, 3377409, 3380662, 3370428, 3380277, 3409721, 3383775, 3360161, 3333516, 3348456, 3374313, 3369940, 3380812, 3388583, 3367834, 3343778, 3355845, 3334998, 3351236, 3341537, 3369315, 3400154, 3381332, 3397345, 3384880, 3396527, 3460313, 3470823, 3475569, 3467798, 3476036, 3479574, 3484242, 3515244, 3541815, 3585601, 3592415, 3632018, 3697307, 3749007, 3805773, 3831865, 3809763, 3852678, 3929093, 3948533, 3988019, 4070200, 4116962, 4139501, 4163733, 4192156, 4242757, 4329126, 4384727, 4447128, 4526406, 4625971, 4708597, 4807858]
2810D807858R0363J19459J05604J10007J24837J04123J79939J36488J26472J16201
2800F021351J53482J52347J58658J51499J31569J66903J67216J49881J40840J93598
2790G587344K00723J90309K04320J79957K28003K31124K48020K63945K22711K91314
2780I847770K67942K56079L43344L27404L56295L91461M09981M24767M45541M21820
2770A3492404M06824M08314L96872M20466M07807L91337M40774N30339N72903
2761A7468040N72555O64264P47515Q18341R26970J030041J125243J235608J397242
2752B5985819J539340J741722J933217K200136K523553K869447L223937L635158
2744D5652329M133639M673860N299091N940106O466047O673552O539682N896699
$$ y = [4807858, 4898221, 5017680, 5123284, 5233291, 5358128, 5462251, 5642190, 5778678, 5905150, 6021351, 6174833, 6327180, 6485838, 6637337, 6768906, 6935809, 7103025, 7252906, 7393746, 7587344, 7788067, 7978376, 8182696, 8362653, 8590656, 8821780, 9069800, 9333745, 9556456, 9847770, 10115712, 10371791, 10715135, 11042539, 11398834, 11790295, 12200276, 12625043, 13070584, 13492404, 13899228, 14307542, 14704414, 15124880, 15532687, 15924024, 16364798, 16895137, 17468040, 18040595, 18704859, 19452374, 20270715, 21197685, 22227726, 23352969, 24588577, 25985819, 27525159, 29266881, 31200098, 33400234, 35923787, 38793234, 42017171, 45652329, 49785968, 54459828, 59758919, 65699025, 72165072, 78838624, 85378306, 91275005]
2736I1275005M505900J980900j514191m703203o377556o286836n061356l708461
2728G0110202k488589j569160q82743o78647q01634j265112j720297j844860j604324
2719E7254836j204676p62917l61823j44390J4985l148j92542n30261q85984j405000
2709E1779080j925047k334529k591930k727796k614911k474996k325291k108880
2701C2675700j943169j751539j581632j470830j347643j256463j148665j004905
2693B1170854r41520q79781q10945p53913o95912o38521n71556n39330n25052
2684A4814324n06872m54238m14963m19549l73241l52479l16831l28010l11016
2675A1337125l15997l48501l74803l73542l62120l56360l14598l26255k77617
$$ y = [91275005, 95780905, 97761805, 96247614, 91544411, 85166855, 78880019, 73818663, 70110202, 67621613, 66052453, 65169710, 64491063, 63689429, 62424317, 60704020, 58859160, 57254836, 56050160, 55287243, 54925420, 54781030, 54796015, 54792867, 54600325, 54070064, 53184080, 51779080, 49854033, 47519504, 44927574, 42199778, 39584867, 37109871, 34784580, 32675700, 30732531, 28980992, 27399360, 25928530, 24580887, 23324424, 22175759, 21170854, 20229334, 19349553, 18538608, 17784695, 17088783, 16450262, 15878706, 15339376, 14814324, 14307452, 13853214, 13438251, 13018702, 12645461, 12292982, 11976151, 11648141, 11337125, 11021128, 10672627, 10297824, 9924282, 9562162, 9205802, 8891204, 8564949, 8287332]
2666H287332k83591k57271k56516j81667k30926j68737j61262j70344j60603j98957
2656F217458j28201q5345j10977r0133j34214j09287j02924p5139r8737j38058
2646E144443j11243j16085j21417j41387j37652j07031j09335j08959j41544q6685
2636C963105p5372o5898p0353j18864q1067n4252j06964o3905n1489q4127o8690
2625C122124l6869n9599p6751m3841o9891m1640p0141j0812m5362l3521o7889
2614B565808n5493n5037j3157m5745o2736o2130j9086k6808j832m8250p7063j9355
2602B079116k8088l1498k6022l9598m4827r209m1478o3804n7900k1788m1509m8770
2590A624625r882j4625j9810m4880k6011j7608l9013k4253J5277j5180l9886k381
$$ y = [8287332, 8003741, 7746470, 7489954, 7308287, 7077361, 6908624, 6747362, 6577018, 6416415, 6217458, 6089257, 6003912, 5892935, 5802802, 5668588, 5559301, 5456377, 5381238, 5282501, 5144443, 5033200, 4917115, 4795698, 4654311, 4516659, 4409628, 4300293, 4191334, 4049790, 3963105, 3887733, 3821835, 3751482, 3632618, 3551551, 3497299, 3390335, 3326430, 3274941, 3190814, 3122124, 3085255, 3025656, 2948905, 2905064, 2835173, 2793533, 2723392, 2712580, 2667218, 2633697, 2565808, 2510315, 2455278, 2442121, 2396376, 2333640, 2271510, 2252424, 2225616, 2223784, 2175534, 2098471, 2079116, 2051028, 2019530, 1993508, 1953910, 1909083, 1899874, 1858396, 1794592, 1736692, 1714904, 1673395, 1624625, 1614743, 1600118, 1580308, 1535428, 1509417, 1491809, 1452796, 1428543, 1443820, 1428640, 1388754, 1386373]
2578A386373j382m3843l7171P831n642k3438N787p429r623l224m2775Q134r641
2565A223957l500p914l063j7640k1095k2177r305r246J0358J2564l4191N99l7027
2552A082320k0784P767j2491j9110N721J7921l262m2312k677p691j9631l769o71
2539I81331J9614j3371l3348J2624j2220l7783l4110j6493J676L5184K0659k3876
2527H99887m0117m117m571k178j479K585J694k3025m0446K0665R430j2723R327
2514H14932j6649k0608r58J5800j6078j3180J4391P313k4730n004k6599K1640
2502G50270k0972j6978L5109K0844m9229r824Q960L5117j4914j6990L6357j45
2490G57605p545M0986J4250j3046N2868M7579j1608N993M0150L015K3925J2994
$$ y = [1386373, 1384991, 1341148, 1303977, 1311808, 1306166, 1282728, 1288515, 1281086, 1271463, 1268239, 1225464, 1233598, 1223957, 1220457, 1212543, 1209480, 1191840, 1170745, 1148568, 1139263, 1130017, 1140375, 1152939, 1118748, 1119347, 1082320, 1061536, 1069303, 1056812, 1037702, 1043423, 1061344, 1058082, 1015770, 1013093, 1005402, 985771, 982002, 981331, 1000945, 987574, 954226, 966850, 954630, 916847, 882737, 866244, 867920, 903104, 923763, 899887, 859770, 855653, 851082, 848904, 847425, 850010, 851704, 828679, 788233, 808898, 818328, 805605, 814932, 798283, 777675, 776717, 792517, 776439, 763259, 777650, 784963, 760233, 755229, 728630, 750270, 729298, 712320, 747429, 768273, 719044, 709220, 718180, 753297, 738383, 721393, 757750, 757605, 750060, 791046, 805296, 792250, 845118, 892697, 881089, 887082, 927232, 930247, 954172, 967166]
2478I67166m3969j5220P151j5413q1703o532l942k5835J882m4443p955L5270o84
2465G65773o0928l271j6238P807R490J6845l5985q985k456l506j6820j5660j2846
2452F23220l4240j2160j8495K669k9638k1714j5174n628j109l0774n114q433M006
2439D47416l308k6534k0508k0492K3747k6405j7373k2940k1758K7043n234m6660
2427B86994R843o486K6652j561j6480q313L477j0452j634j4218m702j7500k0057
2414B25563j2782J7676J831j7102J757j6538p322l698j8201J8199R238j0852K0059
2401B07828j4651P51l8220J1686J0949R895k0320r52J9237P303K36l9148M196
2388A58790J0056k5026J1253m0601L134K7202J3491J550O35n5919R958K4830m03
$$ y = [967166, 923197, 907977, 915128, 899715, 818012, 811480, 807538, 781703, 783585, 739142, 731187, 766457, 765773, 704845, 701574, 685336, 693143, 702633, 719478, 683493, 674508, 672052, 668546, 651726, 636066, 623220, 588980, 576820, 558325, 560994, 531356, 509642, 494468, 488840, 487731, 456957, 451843, 443410, 447416, 444108, 417574, 397066, 376574, 400321, 373916, 356543, 333603, 311845, 338888, 333654, 286994, 296837, 290351, 317003, 315442, 298962, 290649, 294126, 283674, 282040, 267822, 263120, 245620, 225563, 212781, 230457, 232288, 215186, 216943, 200405, 193083, 189385, 171184, 189383, 198621, 187769, 207828, 193177, 193928, 155708, 167394, 178343, 188238, 167918, 166966, 186203, 193506, 193742, 154594, 158790, 168846, 143820, 155073, 114472, 117606, 144808, 158299, 159849, 160484, 104565, 114523, 139353, 138950]
2375A38950j9188J6130N978M675k5777k306J66k0406l207K1668K2001k0228J1532
2362A29988m156K1983k4764n153j2396o606j9782J689K0986n414j0716J3425k2024
2349G7060L586L536j9780L422M3904M50k4778j7411J574J3900O752j3731q758
2336F9726J5821n60J7282r546q259r22L3854K0794r808k2790P45n144j7811J4869
2322I8251Q353l5866j6056k830J2821K2532l1132K0771m547J6109L765m9800J4525
2309E6896J3332l849q839K3193J25K484L545j253j7898Q048J516L6629R355j5395
2295A07889k880j6417P394K1273M2843j0608j364k0252q056J619l977j8276r522
2282H9666j0928k348K0730P136j4416R730J2272j7443k9284K3125O537l1316k7104
$$ y = [138950, 119762, 135892, 141870, 146545, 120768, 118462, 118628, 98222, 95015, 116683, 138684, 118456, 129988, 125832, 147815, 123051, 117898, 105502, 98896, 79114, 80803, 101789, 96375, 85659, 99084, 77060, 80646, 84182, 64402, 67824, 111728, 112178, 87400, 69989, 71563, 85463, 92215, 78484, 69726, 85547, 84987, 102269, 92723, 84464, 83542, 117396, 138190, 128382, 105592, 106337, 101193, 83382, 98251, 106604, 70738, 54682, 51852, 64673, 87205, 56073, 76844, 72297, 88406, 92171, 42371, 56896, 70228, 66379, 57540, 80733, 80858, 83342, 86887, 85634, 67736, 75784, 77300, 113929, 123284, 107889, 105009, 88592, 95986, 117259, 160102, 149494, 148130, 127878, 119822, 121441, 117464, 99188, 89666, 78738, 76390, 97120, 104256, 89840, 99570, 111842, 94399, 65115, 88240, 94777, 63461, 36357]
2269C6357N642L2779L775l2236K924L9381k2034r713J052J955J9792J3179j2820
2256H0033p873p091k0908n636K2096J5592j3767P131k1084m779j7813L1886l177
2243E4610N450M346k2085J9564Q663k920l1762P934O620o517K256J1103Q298K521
2229F8081n287k1551j9638J1999L4688k4425j0045M132K134J1364L644K849n029
2216E2916j9817J5210L2080N334k9925l628L4607J412k9071k1957K1199O124L5453
2203I9937k6607j9671M0545J079n879j2407K728n519J9164J3646l9338K704l43
2190G0039K526J2128M865Q513Q691J7845k3084j8107j105k1859l5206K0854J4158
2177F0258j079K7930n696J2972j4220o379J2087j862L279j2208k4494J9937J6676
$$ y = [36357, 41999, 74778, 78553, 46317, 49241, 88622, 66588, 56875, 57927, 59882, 79674, 92853, 80033, 72160, 65069, 44161, 38525, 60621, 76213, 62446, 69577, 48493, 43714, 25901, 57787, 54610, 60060, 64406, 42321, 61885, 70548, 67628, 35866, 43800, 50420, 43903, 46159, 57262, 65560, 68081, 62794, 41243, 21605, 33604, 68292, 43867, 33822, 37954, 40088, 51452, 55096, 57945, 52916, 33099, 48309, 80389, 85723, 55798, 52170, 86777, 88189, 59118, 37161, 58360, 64484, 99937, 73330, 53659, 94204, 95283, 89404, 76997, 79725, 74206, 93370, 107016, 67678, 70382, 70039, 72565, 84693, 89558, 98071, 106762, 124607, 101523, 83416, 82311, 60452, 25246, 46100, 60258, 59179, 87109, 81413, 94385, 80165, 73786, 85873, 84011, 87290, 75082, 50588, 70525, 87201]
2164H7201L0627q856j0817n807R459j6880k7480R955O613L643J0314k9671J3470
2151G1771J2314j6401K2888R451Q356K1151k3228l870O365L241k9637N048N297
2138I2746L2183K3402l1621O39K740k0410P190K1534J372K7198K493j7823K2285
2125A63928L177J8578K945m770L705R644M2508l052j987j04L9432q693l996j013
2111B60302K9303K4908j5020k796J0569K3818Q669J5158J5884M699j1969M0825
2099D04350k451j4645J3476K5125K2638K2807K2200K6240o62P083J8106K7642
2087E71909N5285j0059K3164K0350K6613L9738J6411O6324P2307K1082M1238M8730
2075I93092Q6131O6352N9529P9921R2737M4639O9324Q7846J55462K01234J78920
$$ y = [87201, 117828, 108972, 98155, 92348, 101807, 84927, 57447, 67402, 74015, 77658, 87972, 58301, 71771, 84085, 67684, 90572, 100023, 108379, 129530, 106302, 102432, 108797, 112038, 82401, 87449, 92746, 124929, 148331, 116710, 117349, 120089, 99679, 106869, 128403, 129775, 156973, 159466, 141643, 163928, 167105, 185683, 188628, 183858, 187563, 197207, 239715, 236663, 234676, 234572, 274004, 265311, 261315, 260302, 289605, 314513, 299493, 296697, 307266, 331084, 339753, 354911, 370795, 375494, 363525, 404350, 401899, 387254, 400730, 425855, 448493, 471300, 493500, 519740, 519078, 526161, 544267, 571909, 627194, 617135, 640299, 660649, 687262, 727000, 743411, 809735, 882042, 903124, 944362, 993092, 1079223, 1145575, 1205104, 1285025, 1377762, 1422401, 1491725, 1579571, 1735033, 1936267, 2115187]
2064B115187J82073K50873K52229K71277K82456L73150M20771N49559O20848Q27228
2054F145651J042157J410466J638436J759777J682551J647517l96773k472567
2046A2457215k699847k177426j348019r76667o56436n50384m09883l36612k65798
2037C036143k70948j53502j53920j64582k58064k09459j77079p0116j15651q8584
2027A374238p1753p4552n3724n3985p2690k6736l5583k7242l6219l3556p5310
2016H12888k5560k7922l3256l5838j2732l5393l0307k3737k5592j5939l7493l8742
2004D70377j9074P03R343l0333k6568j8720J7658k9103l7340k765Q76J3457j5118
1991C33393j570j283J4507k5884j7115p415k3507k19j5383l1996m255k0862K5082
$$ y = [2115187, 2297260, 2548133, 2800362, 3071639, 3354095, 3727245, 4148016, 4697575, 5318423, 6145651, 7187808, 8598274, 10236710, 11996487, 13679038, 15326555, 14929782, 12457215, 9757368, 7579942, 6231923, 5255256, 4598820, 4048436, 3638553, 3301941, 3036143, 2765195, 2611693, 2457773, 2293191, 2035127, 1825668, 1648589, 1578473, 1462822, 1374238, 1302485, 1227933, 1174209, 1120224, 1047534, 1020798, 985215, 957973, 921754, 888198, 812888, 787328, 759406, 726150, 690312, 677580, 642187, 611880, 588143, 562551, 546612, 509119, 470377, 451303, 452006, 461349, 431016, 404448, 385728, 403386, 374283, 336943, 334178, 335054, 348511, 333393, 331823, 330540, 345047, 319163, 302048, 294633, 271126, 270907, 255524, 223528, 219273, 198411, 223493]
1978B23493m1590R955o418o746N446j8381k5240J2710K5265k6625J3456J1592
1966A76917j3290m676l0095n095j0357p075O751q381Q086l046J7664j384K634
1953A28653J2385k7021J5M076j7044r270K1795J2736l3850q031j5641L0905K0169
1940A19877J2733j4159j7041j2047j0337j4962Q0k3333L386J6010j4488J4643
1928F0362J7242J1459j4326j5372O914J0393l7787j937P686j7840K5703n843j0137
1915C6517M1374M471k2780l7931J0965J0699o497j7250j0806J7289J9169j5460
1903B9760J3770J4091j7833l5290J0897J4943k3686k3162K4390J6374K5221L455
1891E2930j0597j0264k396j7587Q158K8257j4623J575l845J1876N779j0002k5200
$$ y = [223493, 181903, 191858, 185440, 178694, 184140, 165759, 140519, 153229, 178494, 151869, 165325, 176917, 163627, 158951, 128856, 123761, 113404, 106329, 113080, 104699, 112785, 109739, 127403, 126019, 128653, 141038, 114017, 114032, 118108, 101064, 91794, 113589, 126325, 92475, 84444, 68803, 99708, 119877, 132610, 118451, 101410, 89363, 79026, 64064, 64144, 40811, 44197, 60207, 45719, 60362, 77604, 89063, 74737, 59365, 66279, 76672, 38885, 36948, 44634, 26794, 52497, 46654, 36517, 77891, 82362, 59582, 21651, 32616, 43315, 36818, 19568, 8762, 26051, 45220, 29760, 43530, 57621, 39788, 4498, 15395, 30338, 6652, -16510, 7880, 24254, 49475, 52930, 42333, 32069, 29673, 12086, 20244, 48501, 33878, 35453, 31608, 43484, 49263, 39261, 14061]
1878A4061k402J5472K2763P133l9027l2579M903K1418j2662J2883J7402j2487
1866A6878Q041K526j6420J3110J9750m513n804n483j175J3818j9557q530L267
1853A5908L6943j0771j5264J7104j9442M84O95j8438j1577J7382J5401j4739q344
1840E342K3259J2073j8809K0968q668p089N053r07R808j3683R68J7939O584j0328
1826D2510j4492j5159J807r762Q341J565j4262q093J2819j373J6679J8916j397
1813C8099r37L942k2321k964K0901R969O658m553m898K5539k3379l0019J0888
1800B6925J8838m9783L659Q653k4109J0160J2716m266r440J8493K5879J6969r693
1787D5001l3497j8197O221L4673Q073K768j579J3j6958j8951p996K10L6348p894
$$ y = [14061, 11659, 27131, 49894, 57027, 18000, -14579, -9676, 11742, -920, 11963, 29365, 16878, 24919, 27445, 11025, 24135, 43885, 39372, 33568, 28085, 26910, 40728, 21171, 12641, 15908, 52851, 42080, 26816, 43920, 24478, 24962, 25657, 7219, -4358, 13024, 28425, 13686, 5342, 28601, 40674, 21865, 42833, 34165, 27076, 32129, 31222, 41030, 27347, 28315, 46254, 52838, 42510, 28018, 12859, 14666, 4904, 13245, 14810, 548, -7545, 5274, 3901, 20580, 39496, 38099, 37162, 41104, 18783, 15819, 36720, 46689, 53347, 48794, 43896, 69435, 46056, 16037, 26925, 45763, -4020, -361, 8292, -15817, -5657, 7059, 2793, -6647, 11846, 37725, 54694, 45001, 11504, -6693, -472, 34201, 42274, 45042, 43463, 43476, 26518, 7567, -429, -219, 36129, 28235]
1773B8235j1111J026k654k701L4067m8415N665J3734k1395l595R856r40o137J0844
1759F479J91K2077Q76k8593j708J8652j0500j5506k5610L5171n665M919J066j4102
1745a2253L3066o953p045j8828J2021j9844J2314J5480k2465J4076l934R233j1910
1732g042K728o289J4122j0818Q657q509L248n480j7717k711J6738Q707p034L756
1718g644k637R353J3192N462N050o010k4026K0263o443j1628l621j5466l287Q820
1704a8622k210Q056J6800k353L719K3454r326l9314J2927m579n296J2195k3199
1691b7748P420O021K6497k1617Q14K6175m99L540k4117J1911Q716j0533l320L500
1677F760j1430J2325k0953J4659j905j5540k596M115M983J990R134K820K0292
$$ y = [28235, 17124, 18150, 15496, 12795, 46862, -1553, 4112, 17846, -3549, -7144, 2712, 1772, -4365, 6479, 6670, 28747, 29623, 1030, -678, 17974, 7474, -8032, -33642, 1529, -4136, 783, 1849, -12253, 20813, 13860, 6815, -12013, 8, -19836, -7522, 7958, -14507, -431, -4365, 4868, -7042, -4314, -10603, 3519, -7299, 1358, -7151, -3903, -9383, -27100, -29811, -13073, -4366, -11400, -7644, -10281, -928, 12264, 17726, 22776, 16766, -7260, 13003, 6560, -5068, -8689, -24155, -27442, -18622, -20832, -12776, 4024, 1671, 5390, 28844, 19518, -19796, -6869, -11448, -16744, -4549, -27748, -20328, -14307, 12190, -9427, -8613, 17562, 17063, 20603, -3514, 8397, 17113, 6580, 3260, 6760, -4670, 7655, -13298, 1361, -544, -16084, -18680, -14565, -9582, -7592, 1542, 4362, 24654]
1664B4654j8574J2254j0875j8889J647O853p534j866L129J8057j667m0365o878
1651d0054K0443j0753j5037K4793K6874k5961r732k770L3920k0426J075K625P964
1638g039P790k9106L3364K9676l241j5499l2793J6345N432K875j4727k0497R07
1625b6513K2202L8734J2026l1016k990J18P750k271n9712j6158P816K3843L3314
1612G143p215K5000n0150m01L4669r586K232J953j871j3378J6696l907l249r373
1598a1437J6208J618L697j2685k368r664J9640J3264k0102K882Q634M102R356
1585B3145m408l0807N390k4457J930J7397k9267j2951M8591K6059k2196k459p039
1572a1072k339L08R336j370k216n671P342l695J320M993N94j7005L3254J0272
$$ y = [24654, 6080, 18334, 7459, -11430, -9783, -2930, -10464, -12330, -9201, 8856, 7189, -33176, -40054, -19611, -30364, -45401, -20608, 6266, -19695, -29427, -32197, 1723, -18703, -17628, -15003, -7039, 751, -28355, 5009, 34685, 31444, 15945, -16848, -503, 4929, 7804, -6923, -27420, -26513, -4311, 34423, 46449, 15433, 12443, 12561, 20311, 18040, -41672, -57830, -50014, -26171, 7143, -72, 24928, -25222, -25623, 9046, -540, 1692, 3645, 1774, -11604, 5092, 1185, -2064, -11437, 4771, 6389, 10086, -2599, -4967, -14631, 5009, 18273, -1829, 1053, 9687, 13789, 23145, 18737, -12070, -6680, -31137, -29207, -11810, -41077, -54028, -5437, 20622, -1574, -4033, -11072, -13411, -13103, -3767, -5137, -7353, -13024, -5682, -9377, -8057, -3064, -2470, -19475, 13779, 24051]
1558B4051K893o578j7097k4508J2806K2057r254n941P63J9488M711j5625k2159
1545a4393j1662J509K3943O09k924K8425j0451j1820j7808J0086J535k7080J8428
1532a1603K8622j4333n451J0515o525k972N221k3273J8935K1759k7320R129J966
1519D670Q96n650l2645M2851q536q975J8306l6419J4867K4207k6053P082K3940
1506A8541J6526k7570K0664k307k3000o588j302N653J7183j4602o335j3900J814
1493a5223J4348j2844m0334N8888L5527k5380p630m7217j032r649M254K4048M1951
1480A9707j8193j6231l5764J8118L2276K4367k0374j4582J398Q895k992r548J2499
1467d24J2759j4754l4010r033J3446J7752K6450L563M270j9200m018M294j4031
$$ y = [24051, 26944, 20366, 3269, -21239, -8433, 13624, 4370, -1571, -808, 18680, 23391, 7766, -14393, -26055, -24546, -603, 6, -2918, 25507, 15056, 3236, -14572, -4486, -2951, -30031, -11603, 17019, 2686, -2765, 7750, 1225, -1747, 3474, -19799, -864, 20895, -6425, 2704, 4670, 5566, -84, -32729, 10122, 1586, -7389, 10917, -25502, -10635, 13572, -12481, -5399, 18541, 35067, 7497, 28161, 25854, 2854, -3734, -5036, 617, 17800, 3198, -3137, -17037, -15223, -875, -13719, -54053, 4835, 40362, 14982, 7352, -39865, -40897, -50546, -46292, -22244, 19707, 1514, -14717, -50481, -32363, -87, 24280, 3906, -10676, -9278, -383, -3375, -12923, -424, 12335, -2419, -36429, -45462, -32016, -14264, 12186, 15749, 20019, 819, -3199, 1095, -12936]
1454a2936J3848o46l687J2445J956m933p098k8557J3294J3975Q413n895k9765
1441b9586K5322J5457J0491j9389m996J1233J0179k6935J1792n570j6080j8611
1429c6693O064K5434P499q399l054k7925R168J6502K2201r640j2960O252j7939
1416b3490n500J7895k7251J4181K4483k649J5582K2660l8812l3266j1570J8409
1404b9328K7949k0680k124k2015j5605L9871K7969o923q548P88J5250j2912J6352
1391A0044r370n08P926l9328J375J0535l918K1881k1861L5654M161k0932o464
1378a0805Q288k3021J0414J8618o4j4591N932J5834l824n329N762k354j3948k4871
1364c3959o200J1427J4205J5094J5992p966j9009J5722k3446J3953J8701k7522
$$ y = [-12936, 912, 266, -3421, 9024, 10980, 6047, -1051, -29608, -16314, -2339, 6074, 179, -29586, -4264, 11193, 21684, 2295, -2701, 8532, 18711, -8224, 3568, -2002, -18082, -36693, -30629, -5195, 2304, -6095, -9149, -37074, -27906, -11404, 10797, 1157, -11803, -5551, -23490, -28990, -11095, -38346, -24165, 318, -2331, 13251, 35911, -2901, -36167, -47737, -29328, -1379, -22059, -24183, -46198, -61803, -21932, 6037, -886, -9434, -8646, 6604, -6308, 10044, 674, 166, 8092, -31236, -29861, -19326, -23244, -1363, -23224, 12430, 16591, -4341, -10805, -2517, -25538, -15124, 3494, 3430, -11161, -5229, 10605, 6781, 1452, 7214, 4860, -9088, -33959, -40159, -28732, -14527, 567, 16559, 8593, -10416, 5306, -18140, -4187, 14514, -13008]
1352a3008l392l386L01L065p732o493j0000M5082j0407O491j4890m041M0304j2427
1338I467k157p253m319m467m089k7920r160J4466L5672j7395K5677l0041Q131
1325a3388j1289K0101j5117R737N102k859J5211r915K858J3646L556j3251j0165
1312e773j7490l2358J4930K6882j6885r864K3494n213j0582M6728j6419j7737
1300b0287J6574k0204q65K991M171J1739k051j2005j6519k781m582K4433L0623
1287A1237o10n4563J9887J1434r473j5698K3855Q721k15n517O552R835j8328Q119
1273d764q330J4678K0058l3115J2915J262M286J4606j357k4988k2445M9673n270
1260A7209L127j7117J528j056k9572K6379P625j2321K5416Q959l8217L1363n098
$$ y = [-13008, -16400, -19786, -19485, -16420, -24152, -30645, -40645, 4437, -5970, 521, -14369, -18410, 21894, 9467, 7310, 57, -4262, -8729, -12818, -40738, -49898, -35432, 240, -17155, 8522, -21519, -13388, -24677, -4576, -19693, -9956, -4854, -7713, 7498, -2417, 441, 14087, 17643, 4392, -5773, -23263, -55621, -40691, -13809, -30694, -40558, -17064, -22277, -32859, 13869, -2550, -20287, -3713, -23917, -24782, -21791, -17620, -5881, -7932, -19937, -36456, -39237, -43819, -19386, 11237, 10627, -43936, -24049, -12615, -22088, -37786, -13931, -5210, -5425, -10942, -4390, 5445, -12883, -4764, -13094, 1584, 21642, -11473, 1442, 2704, 6990, 21596, 20239, -4749, -27194, 22479, 17209, 20336, 3219, 4747, 3691, -25881, 498, 8123, -4198, 21218, 30177, -8040, 23323, 18225]
1247A8225n401j6923o405L296J1275q200K3890j8607R696l174N046j0028j4950
1234a2260J941O505l164R104j184j0209J1113M763r483N066j0271k9693J5008
1221b2764J8494K7582j8025j7971R47K4980j8516R070q699O228K2991J3290r517
1208B8090j4270j8629J5842k3171p899L3459L815K769q191j003q459r73r296J7447
1194I531j7774M3k8869K9781J2135K1072L634k5870k4045Q961J7406j7051J3961
1181B915j6404j6734M396J1529K1123Q976L668n386k2973j6289k4732N1518R221
1168A0828j3019J0529k4031O132L374J3582J1079l9244K2389k2619j8867L5091
1156d776o244k5906R201K4608l9149m875K5616Q696J5641R448j9109j6666Q339
$$ y = [18225, 12824, -4099, -10504, -7208, 4067, -4133, 19757, 1150, 10846, 7672, 12718, 2690, -12260, -10319, -3814, -6978, 2126, 942, -9267, 1846, 6609, -2874, 2192, -8079, -37772, -22764, -4270, 23312, 5287, -12684, -11737, 13243, -5273, 3797, -4902, 1326, 24317, 37607, 28090, 13820, -4809, 11033, -12138, -20037, 13422, 17237, 20006, 11815, 10812, 2353, 1380, -7916, 9531, -8243, -8200, -37069, -7288, 4847, 25919, 29553, 3683, -20362, -11401, 6005, -11046, 2915, -13489, -30223, -25827, -14298, 6825, 15801, 19469, 14083, -8890, -25179, -49911, 1607, 10828, -2191, 8338, -15693, -9561, -6187, 7395, 18474, -20770, 1619, -21000, -39867, -4776, -11020, -36926, -27725, -3117, -42266, -47141, -21525, -12829, 2812, 12260, -6849, -23515, -15176]
1143a5176j3185J8892j303J3039O416R698l166j8065j2989m840Q054Q836k2784
1130b6573O112J8082o309J2205J1741o696k3436N556J6280k427m110j48J3999
1117A4276R549j688r816j3447o417n488J9029J3566j8165O131k3084K2977o905
1104E18k5392J1299l58L0700J8189j7652j5651l858Q550k5231J587L224M092J9881
1090I898J1395l2689n706K1059k8325j9266K6562n862P431j4584K9586J137m1938
1077d1302J5515j7135K3480L5009j8220k0439j6441l14N2228M054j5428l3115
1065c2108Q800j0413J8164K1578N621J0541j1407k7310j2611J2698J6788L359
1053C700j2012P625M193l030k551j1270j0111O36N5L3349J6821k7456k4000m206
$$ y = [-15176, -28361, -9469, -10772, 2267, 8683, 18381, 15215, -2850, -15839, -20679, -12625, -3789, -26573, -20461, -2379, -8688, 3517, 15258, 8562, -14874, -9318, 6962, 4535, 425, 277, 14276, 23825, 22137, 12321, -1126, -7543, -13031, 5998, 19564, 1399, 7530, -15554, 7423, 518, -24874, -13575, -13933, 16767, 34956, 17304, 1653, -2205, 6345, -18886, -17299, -14075, -9983, 9898, 21293, -11396, -17102, 3957, -24368, -43634, -17072, -22934, -15503, -30087, -501, 636, -41302, -25787, -42922, -19442, 15567, -2653, -23092, -39533, -39847, 12381, 16435, 1007, -32108, -23308, -33721, -15557, 6021, 11642, 22183, 10776, -16534, -29145, -16447, 341, 3700, -8312, -687, 3506, 476, -2075, -13345, -23456, -22820, -22765, 10584, 27405, -51, -24051, -28257]
1039b8257K9902j7429L559r21K8672j7294l2806L2276J3847j30J5324j9257m810
1026B676l0769l586N3907j4332j1905r486l328k3937L0210K4832k5658O342k2243
1013b7277L1099J4810k0318J1800R499O951j6076q922k1677K3527O74p106L993
1000I77L215Q542j8406K0126J0318o027q317K3515j8104k5646K1269J9689j0223
987B0928q432J4913P467j7602l140k2434L957n123j7086o90J8809k3229k007J7347
973a6322j02J1058O162k5035k2690J0305L0168Q484J6373j9149k0987J5974J0194
960D433k2130m814J3098J3500M8826l0595j2396j2059L218K8302j6354l471r677
947a19p757Q440J7798l545J6447J7403l0863l570m7635P74L8761J5419o562J78
$$ y = [-28257, 1645, -15784, -12225, -13146, 15526, -1768, -34574, -2298, 11549, 11419, 26743, 7486, 2676, -28093, -31679, 22228, 7896, -4009, -13495, -16823, -40760, -10550, 14282, -11376, -5034, -27277, 3822, 18632, -1686, 10114, 19613, 26564, 10488, 1566, -20111, 3416, 4090, -3016, 977, 4192, 12734, -5672, 14454, 24772, 18745, 10428, 33943, 15839, -9807, 11462, 31151, 20928, 12496, 27409, 34876, 17274, 14134, -8300, -4343, -9466, -26552, -27242, -8433, -31662, -33669, -16322, -16424, -5366, 796, -24239, -46929, -36624, -6456, 2028, 18401, -748, -21735, -5761, 4433, -17697, -22511, -9413, 4087, 52913, 22318, 9922, -2137, 1081, 29383, 13029, 9558, -119, -7876, 564, 18362, 14817, 31264, 48667, 17804, 14234, -33401, -32627, 6134, 21553, 14991, 15169]
933A5169j8874o698M268K4379k0147j2561j4387M581P007K5728J3900n504j0839
920F022K6886k8327j5325L5435p914j0791k042q440J5915q0J2973L0833j9585
907C5560k8929Q815r984k9741p162K1413K3338j3829r346l832K7803l520M599
894A5185k9822q903K5856j1011J2778K1582k1453L2185O350k4269k8558j2643
882b2723R282l519k0168J5627Q033j3111K4882L7879q954j3300J1260J2168M655
869D2011k3930j594o017j1510j5305J3092j3878k1844J4809N193r585J6102J7824
856E368q140N630J4541q407K0422k0277k4926J457R729Q436j1869j8583M1759
843A5140k2202o428J2810j2181O638R981J9548k1454o971o806J6739J044J0724
$$ y = [15169, -3705, -10403, -6135, 18244, -1903, -14464, -28851, -24270, -17263, 8465, 22365, 16861, 6022, 32908, 4581, -10744, 24691, 16777, 5986, 3944, -4496, 11419, 11339, 24312, 55145, 35560, 6631, 15446, 5462, -24279, -31441, -10028, 13310, -519, -9865, -13697, 14106, 10586, 15185, -14637, -23540, 2316, -8695, 4083, 25665, 4212, 36397, 42747, 18478, -10080, -22723, -13441, -16960, -37128, -21501, -13468, -26579, -1697, 36182, 27228, 13928, 25188, 37356, 42011, 18081, 16487, 10470, -1040, -16345, -3253, -17131, -38975, -24166, -18973, -28558, -12456, 5368, -2772, 2858, 17399, 8992, 29414, 9137, -15789, -14332, -4603, 3833, -8036, -26619, 15140, -7062, -13490, -680, -12861, -6223, 3758, 23306, 1852, -5119, -11925, 4814, 5858, 16582]
830A6582J9903k243m420l2166m581M481j1314J822p636J4346j6951K9256o509
817E70p158o056N156P971R206j9060m350k322J7817k598k3612J9550J4241j7419
803h064m220Q861j6830K3741P61J5535j3096K696m713J3882J7182l3594j7418
790a5277K3170q599R899J2293j6880R848J2782q104j7911k559j4614N632j4816
777b5136J2290Q280P303N535J3809L494k2704n830k099r305L670J6006j8736K3265
763I842J5924k009J0197p112p998r182j0125M806K8852j9152q819k5894k9542
750e0212J9462L6593l809j4393r815J2245J4087j987l6301K773L7111j2710J5419
737H463J8491j6911j5023J4607l354p236P000j5808K4611K4756l2440j4057K1650
$$ y = [16582, 36485, 34242, 29822, -2344, -6925, -2444, -13758, -11936, -19572, -5226, -22177, 7079, 570, -6588, -12644, -7488, 483, 9689, -9371, -13721, -16043, 1774, -824, -24436, -4886, 9355, -8064, -12284, -3423, -20253, 3488, 4249, 19784, 6688, 9384, 4671, 18553, 35735, 2141, -15277, 7893, -706, 9193, 21486, 4606, 14454, 27236, 19132, 1221, -1338, -15952, -10320, -25136, -12846, -4566, 2737, 8272, 22081, 25575, 2871, -2959, -5058, -14363, -10693, 5313, -13423, 9842, 25766, 23757, 33954, 26842, 18844, 9662, -463, 4343, 33195, 14043, 5224, -20670, -50212, -30750, 5843, 2034, -12359, -22174, -9929, 4158, 2171, -34130, -31357, 5754, -6956, 8463, 26954, 10043, -4980, 9627, 6273, -963, 6037, -9771, 14840, 39596, 7156, -6901, 14749]
724A4749k255k4827J7334J7321j2170o006J1834j9777j6985q925j1540J0747J1846
711a8654r64m909K8242j5977J7603J6023J2291l0142l8259N324J8685J5861l8135
698c3011J3351l556N259L4224L6372k6049k3359j85M2810k516l5046k7719K3154
685C729r713l91j180r765J2879P744m414Q845l280M21k670l1475J1665P25j7665
670c4545K2215J8369J2553Q028k0876m01L623K7515L411k1997o638j1630l890
657d263J5054J4044j2527j6120Q99K6787m6686J4289L6835j7223j8694l8090M6444
644G49m28j9922j6007L3446K034j8613j6739L5986K3917K14R853k5613k6279J5376
630b026k768J219p919K215Q308K425Q602j9394L6465l7853j6085P934N275q148
$$ y = [14749, 12494, -12333, 5001, 22322, 10152, 4146, 15980, -3797, -20782, -29707, -41247, -30500, -18654, -19618, -24527, 3715, -12262, 5341, 21364, 33655, 3513, -34746, -29422, -10737, 5124, -33011, -19660, -23216, -17957, 16267, 52639, 26590, 3231, 3046, 45856, 43340, 8294, -19425, 3729, -5984, -6375, -7555, -17320, -4441, 3303, -1111, 7734, 4454, 4875, 2205, -29270, -17605, -16880, -34545, -12330, 6039, 18592, 26620, 5744, 5343, 8966, 36481, 39892, 17895, 11257, -373, -4263, 10791, 24835, 12308, -3812, -2913, 23874, -22812, -8523, 28312, 11089, -7605, -45695, 749, 321, -19601, -35608, -2162, -128, -18741, -35480, 506, 24423, 24637, 34490, 8877, -17402, -2026, -4794, -3575, -11494, -9279, -971, 1454, 10056, -9338, 27127, -10726, -26811, -18877, -13602, -21750]
616b1750l915k184K5971j1182K40L344k2835R731j0845K2315n96J500J8746N622
602A4162p229j6825k5231L3287J3411o925j5512l1330M980j1571J1407L1340j179
589g215m81J7078l88Q509l7288L060N977J6369q975o057J6276J8804l826k0372
575A471j3851K489Q303j3030O489P402J3299j6214K1391P872q032Q032k856M459
561B7224k003m747j8749q858J1535o41J4386j3167M284m428m906O386K6931J640
547C4887q936j8639j3445j674K6217o637j0020k06P886j885r738q92k6405J1982
533a7505L1471j3222J2876k4040j1762l129R061P518J5920M545l5807J0044K5272
520A1242K9527j8366j628K666m046j0250j6460L6375l7117j8277R711J8978j7188
$$ y = [-21750, -25665, -27849, -1878, -13060, -12820, -9476, -32311, -22580, -33425, -11110, -11706, -10206, 8540, 14162, 6933, -9892, -35123, -1836, 11575, 4650, -10862, -42192, -37212, -48783, -37376, -6036, -7215, -7696, 9382, 8994, 17503, -19785, -16725, -10748, 5621, -3354, -9411, 6865, 25669, 21843, 1471, -12380, -9891, -1588, -14618, -8129, -727, 12572, -3642, 17749, 25621, 17589, 25621, 22765, 27224, 25221, 20474, 1725, -7133, 4402, 3761, 18147, 4980, 9264, 4836, -70, 6316, 33247, 34887, 25951, 7312, -6133, -7807, 18410, 11773, 1753, 1547, 9433, 7548, -2190, -3082, -29487, -17505, 13966, 744, 13620, -10420, -22182, -25311, -16250, -8732, 7188, 11733, -24074, -14030, 11242, 40769, 22403, 20775, 23441, 19395, 9145, -7315, 29060, -8057, -26334, -16623, 2355, -14833]
507a4833R010k95l4333m359K7253K1713L321j3976j2957J6770N336P81j5909J3939
493A461J8993p879J8370J4053n3099J5220J8733j3016j9414L7324j7220k8042
481a4516J5332M682j6997K3176k0600Q558N98j2634l761j336k0N548j7901J0566
467a9305L205J9862L0851l6794J4179j0398j7579M330K3312P309k8415k519J6660
454D698J7649o5k3455K243j4283J0366J6012J4457J1392j7127j1384J1689K1986
441D4178J573k7713j6029J7013j1480J8399k8315J6234q522j4856Q064o553O788
428a219r867l850J4660R193q905Q19o653L798m503J5375m527J241k5043j5154
414c4635L506K0233J9353j7713L408k5535J402j4598Q578J694L172K452j9983
$$ y = [-14833, -5823, -6118, -40451, -44810, -17557, 4156, 7477, -6499, -19456, -2686, 2650, 3431, -12478, 1461, 20454, 12575, 30945, 44998, -8101, 7119, 25852, 12836, -6578, 30746, 13526, -14516, 816, 5498, -11499, 11677, -8923, -365, 233, -12401, -16162, -17498, -17518, -11970, -29871, -19305, -16100, 3762, 34613, -2181, 11998, 1600, -15979, -11649, 11663, 18972, -9443, -11962, 4698, 22347, 22282, -1173, 1070, -13213, -2847, 13165, 27622, 39014, 21887, 10503, 22192, 44178, 45751, 18038, 2009, 19022, 7542, 25941, -2374, 13860, 5338, -9518, -1454, -8007, -1219, -11086, -14936, -276, 8917, 12, 831, -5822, -2024, -6527, 8848, 4321, 5562, -19481, -34635, -31129, -10896, 8457, -9256, -5848, -31383, -29981, -44579, -36001, -34307, -31135, -28683, -48666]
401d8666J9781J2778q419P076n74j8117K1413L5379j6133K1245K2859k3811j0159
388A4652J3595l9762k3797N682j2405J9286P812L2410r901k0383k6874L571m957
375d1071J4313J4942p498J691O979m297K248L303m373j3389L371j1682r430J8135
361b6758l548j2599J8065O698j7514j9047K4686L019J9496K1403j638j3376r630
348a0743J533r312J2903j6462j6092J0447n993K9294m3208L641L2896j6576M256
335b3416L0972j1769M659o03l3815K0708J8591k939n354J7536l0375k2280J2026
322b6059j2135k035L3101J5334o811k0401L586j2344m579j5771J1392K8801j8853
309b6774N173p652J601p813R743L4673k4668l4213L6075J8086k7739P200R731
$$ y = [-48666, -28885, -16107, -24526, -17450, -18024, -36141, -14728, 20651, 4518, 25763, 48622, 24811, 14652, 28247, -11515, -35312, -29630, -42035, -22749, -14937, 17473, 7572, -12811, -39685, -36114, -41071, -26758, -11816, -19314, -17623, -10644, -14941, -12693, -9390, -13763, -27152, -23781, -35463, -44893, -26758, -30306, -42905, -24840, -18142, -35656, -54703, -30017, -26998, -7502, 13901, 12263, -1113, -10743, -9210, -18522, -5619, -22081, -38173, -27726, -33719, -4425, -47633, -43992, -11096, -27672, -23416, 7556, -4213, 446, -157, -33972, -13264, 5327, 2388, -2966, 14570, -15805, -38085, -26059, -38194, -40229, -7128, 8206, 1395, -19006, -15420, -27764, -32343, -48114, -36722, -7921, -26774, -21601, -29253, -27652, -35465, -25722, 8951, -15717, -49930, -13855, 4231, -23508, -16308, -6577]
296f577j8695j5139j6729M921K7033J0630K2093j4740n898L90n401l9893Q445
283d9560L0022j1930j1217P746J3722L191K1517O233l4824L270J3618J0106J3474
270A5368j433q053l092j982r335J1105j9261j4640K1207K0070k0497r803k5781
257d6127j0532K6121J1665P635j7370K8423l755J1964m3033p341R290k0206K8815
244b4451j6786o126L7789J2804j4793m670O504J444R520m293J2537k0058j5604
231b6183j3856N23K1117R016j7901j4024J3659j2433n74l017k505M72K6847m769
217b3628R319J2968Q748K4627j4410n999N980k9677j423L2467k373j5102j543
204d6q555l1525J4336o514k4654J8664K250J0734L06j8024J0510J6303k1689J4872
$$ y = [-6577, -25272, -40411, -57140, -52219, -25186, -14556, 7537, -7203, -13101, -12711, -18112, -58005, -49560, -19538, -31468, -42685, -34939, -21217, -18026, 3491, 9724, -25100, -21830, -8212, 1894, 15368, 13935, 5882, 2790, 808, -8527, 2578, -16683, -31323, -10116, 9954, -10543, -20346, -46127, -56659, -30538, -18873, -11238, -28608, -185, -3940, 8024, -35009, -42350, -33060, -53266, -24451, -41237, -47363, -9574, 3230, -11563, -16233, -9729, -8285, 1235, -3058, 9479, -10579, -26183, -40039, -39516, -18399, -9383, -27284, -41308, -27649, -40082, -40656, -43673, -46178, -45706, -18859, -23628, -14309, -1341, 7407, 32034, 17624, 11625, 17605, -12072, -13495, 18972, 16599, 1497, -46, -8601, -40126, -25790, -32304, -56958, -38294, -36044, -25310, -25004, -43028, -32518, -16215, -37904, -23032]
190b3032o413j3338m263l658o335J4243N04K4286L615k4971j8849K3563J3754
177b0894J7726J5895j5229Q569q092L562k6084N209n095r974K1785L217l763p269
163b0437k2581Q533J1354J5604J9738j601J2205k5778l2640r492J7540L120J3088
150a1347J8496k1893K0579O080j4306j2815L5244j8668j4336j3102j4544J4508
138b6104R595J7523j6089k3800j2440M4748j0574l738J6391j6088J3947J06j1550
125a8073o975J7779J4253j0504j64j8179P478N85o898Q932J5309M052j3368n461
111a1234J0856n218j7154l898J3203k87k7231k156K1973k4856m332J3856M2908
98F430j5717l8761O801N304k831J4300Q966J2957j0701J3025K839K117j1102O523
$$ y = [-23032, -29445, -42783, -47046, -50704, -57039, -42796, -42292, -18006, -14391, -39362, -58211, -34648, -20894, -3168, 12727, -2502, 6067, -2025, 1537, -24547, -19338, -24433, -34407, -12622, -9405, -13168, -20437, -43018, -34485, -23131, -7527, 12211, 10610, 22815, -2963, -35603, -45095, -27555, -24435, -11347, 7149, -14744, 5835, 11915, -2391, -15206, 20038, 1370, -12966, -26068, -40612, -26104, -16509, 1014, -15075, -38875, -51315, -6567, -17141, -20879, -4488, -20576, -6629, -6523, -18073, -25048, -7269, 6984, -3520, -3684, -21863, -14385, -13800, -20698, -11766, 3543, 7595, -5773, -11234, -378, -5596, -22750, -26648, -13445, -13732, -40963, -43119, -21146, -46002, -50334, -36478, 6430, -9287, -48048, -41247, -35943, -38774, -24474, -15508, -2551, -13252, -227, 2612, 4729, -6373, 150]
84A50j7758j1641J5533M126J3596k3238J6851j2544k7994m665K7048n026P483
71a8079R096N168K44R132o335M942j8956j2947n579k917K9237n785r367k388j8563
56d3097J4220j758Q118j0254J2528J538M35K110J0154j1788j3468N390J0946L588
42a1338j896j0884o096j1442P724L0682j6654r135M302Q842j2450J169P838P329
28a2009P761Q595k7851j7497L97K2262l079j1950J2062m319o927n273L563L4397
14A32J9555k0554j4982K712p123K710K3710j6084j2341j9791K8782K5099q128
1C697o116
0b419
$$ y = [150, -17608, -29249, -13716, -9590, 4006, -19232, -2381, -14925, -42919, -47584, -20536, -25562, -18079, -8983, -3815, -3571, 5561, -774, 4168, -14788, -27735, -33314, -36231, -6994, -12779, -22146, -24534, -43097, -28877, -30635, -22517, -32771, -20243, -18705, -18270, -16160, -6006, -17794, -31262, -25872, -14926, -11338, -13234, -24118, -30214, -41656, -33932, -3250, -19904, -29039, -24737, -15895, -28345, -27176, -19338, -12009, -4248, 4347, -23504, -41001, -40604, -18342, -21421, -33371, -21309, -25628, -32555, -37828, -34265, 132, 19687, -867, -15849, -13137, -20260, -17550, 6160, -9924, -22265, -42056, -13274, 11825, 3697, -2419]
$$ Imaginary data points
##PAGE= N=2
##DATA TABLE= (X++(I..I)), XYDATA
$$ [...]
##END NTUPLES=NMR SPECTRUM
##END=
