##TITLE=1H_CG-1152-Al
 CDCl3, 8 sc, 
 31.8.2021
##JCAMPDX= 6.0         $$ Bruker NMR JCAMP-DX V2.0
##DATA TYPE= NMR SPECTRUM
##DATA CLASS= NTUPLES
##ORIGIN= UXNMR, Bruker Analytische Messtechnik GmbH
##OWNER= root
$$ XWIN-NMR		Version 3.5
$$ Tue Aug 31 11:56:37 2021 Russian Standard Time (UT+4h)  she@DPX200
##.OBSERVE FREQUENCY= 200.131506
##.OBSERVE NUCLEUS= ^1H
##.ACQUISITION MODE= SIMULTANEOUS
##.ACQUISITION SCHEME= undefined
##.AVERAGES= 8
##.DIGITISER RES= 18
##SPECTROMETER/DATA SYSTEM= spect
##.PULSE SEQUENCE= zg30
##.SOLVENT NAME= CDCl3
##.SHIFT REFERENCE= (INTERNAL, CDCl3, 0, 17.5093)
##AUDIT TRAIL= $$ (NUMBER, WHEN, WHO, WHERE, WHAT)
$$ ##TITLE= Audit trail, XWIN-NMR		Version 3.5
$$ ##JCAMPDX= 5.01
$$ ##ORIGIN= Bruker BioSpin GmbH
$$ ##OWNER= she
$$ F:/spectra/data/she/nmr/H-F/1/pdata/1/auditp.txt
$$ ##AUDIT TRAIL=  $$ (NUMBER, WHEN, WHO, WHERE, WHAT)
(   1,<2021-08-31 11:55:30.25 +0400>,<she>,<DPX200>,
      <created by zg, POWCHK disabled, PULCHK disabled
       configuration hash MD5:
       00 E9 B6 7A A2 85 ED C7 34 08 36 98 17 FE 4E 26
       data hash MD5: 16K
       32 CD 5A D0 B5 EC EC 14 02 02 87 29 FB 82 9C B3>)
(   2,<2021-08-31 11:55:33.78 +0400>,<she>,<DPX200>,
      <Start of raw data processing
       efp BC_mod = 2 LB = 0.24 FT_mod = 6 PKNL = 1 PHC0 = -13361.18 PHC1 = 15.20099 SI = 16K 
       data hash MD5: 16K
       FC 97 3F E2 74 32 0D FE 42 5C 44 07 A9 10 B5 35>)
(   3,<2021-08-31 11:55:51.18 +0400>,<she>,<DPX200>,
      <pk PHC0 = 1.652341 PHC1 = -2.6 
       data hash MD5: 16K
       1B 2D 07 BC 6D 75 F5 97 2E 13 3F 2C 38 EB A9 18>)
(   4,<2021-08-31 11:55:54.42 +0400>,<she>,<DPX200>,
      <abs ABSG = 5 
       data hash MD5: 16K
       BD 44 86 7A 89 4B 91 20 9F 56 F2 C1 DB 35 22 F4>)
$$ ##END=
$$ 
$$ hash MD5
$$ EF 86 5E B9 ED 71 24 E9 9C F8 C8 63 E6 88 7C 30
##$RELAX= 
##$RELAX= 
##$RELAX= 
##$RELAX= 
##$RELAX= 
##$RELAX= 
$$ Bruker specific parameters
$$ --------------------------
##$DU= <F:/spectra>
##$EXPNO= 1
##$NAME= <H-F>
##$PROCNO= 1
##$TYPE= <nmr>
##$USER= <she>
##$AMP= (0..31)
100 100 100 100 100 100 100 100 100 100 100 100 100 100 100 100 100 100 
100 100 100 100 100 100 100 100 100 100 100 100 100 100 
##$AQSEQ= 0
##$AQ_mod= 1
##$AUNM= <au_zg>
##$AUTOPOS= <>
##$BF1= 200.13
##$BF2= 200.13
##$BF3= 200.13
##$BF4= 200.13
##$BF5= 200.13
##$BF6= 200.13
##$BF7= 200.13
##$BF8= 200.13
##$BYTORDA= 1
##$CFDGTYP= 0
##$CFRGTYP= 5
##$CHEMSTR= <none>
##$CNST= (0..31)
1 1 145 1 1 1 1 1 1 1 1 1 1 1 1 1 1 1 1 1 1 1 1 1 1 1 1 1 1 1 1 1 
##$CPDPRG= <>
##$CPDPRG1= <>
##$CPDPRG2= <>
##$CPDPRG3= <>
##$CPDPRG4= <mlev>
##$CPDPRG5= <mlev>
##$CPDPRG6= <mlev>
##$CPDPRG7= <mlev>
##$CPDPRG8= <mlev>
##$CPDPRGB= <>
##$CPDPRGT= <>
##$D= (0..31)
0 1.2 0 0 0 0 0 0 0 0.06 0 0.03 0 0 0 0 0.0002 0 0 0 0 0 0 0 0 0 0 0 0 
0 0 0 
##$DATE= 1630396529
##$DBL= (0..7)
120 120 120 120 120 120 120 120 
##$DBP= (0..7)
150 150 150 150 150 150 150 150 
##$DBP07= 0
##$DBPNAM0= <>
##$DBPNAM1= <>
##$DBPNAM2= <>
##$DBPNAM3= <>
##$DBPNAM4= <>
$$ [...]
##$SUBNAM3= <"">
##$SUBNAM4= <"">
##$SUBNAM5= <"">
##$SUBNAM6= <"">
##$SUBNAM7= <"">
##$SUBNAM8= <"">
##$SUBNAM9= <"">
##$SW= 20.0188882624521
##$SWIBOX= (0..15)
0 0 2 0 0 0 0 0 0 0 0 0 0 0 0 0 
##$SW_h= 4006.41025641026
##$TD= 16384
##$TD0= 1
##$TE= 0
##$TE2= 300
##$TE3= 300
##$TEG= 300
##$TL= (0..7)
0 120 120 120 120 120 120 120 
##$TP= (0..7)
150 150 150 150 150 150 150 150 
##$TP07= 0
##$TPNAME0= <>
##$TPNAME1= <>
##$TPNAME2= <>
##$TPNAME3= <>
##$TPNAME4= <>
##$TPNAME5= <>
##$TPNAME6= <>
##$TPNAME7= <>
##$TPOAL= (0..7)
0.5 0.5 0.5 0.5 0.5 0.5 0.5 0.5 
##$TPOFFS= (0..7)
0 0 0 0 0 0 0 0 
##$TUNHIN= 0
##$TUNHOUT= 0
##$TUNXOUT= 0
##$USERA1= <user>
##$USERA2= <user>
##$USERA3= <user>
##$USERA4= <user>
##$USERA5= <user>
##$V9= 5
##$VALIST= <valist>
##$VCLIST= <CCCCCCCCCCCCCCC>
##$VD= 0
##$VDLIST= <DDDDDDDDDDDDDDD>
##$VPLIST= <PPPPPPPPPPPPPPP>
##$VTLIST= <TTTTTTTTTTTTTTT>
##$WBST= 1024
##$WBSW= 4
##$XGAIN= (0..3)
0 0 0 0 
##$XL= 0
##$YL= 0
##$YMAX_a= 899291
##$YMIN_a= -877040
##$ZGOPTNS= <>
##$ZL1= 120
##$ZL2= 120
##$ZL3= 120
##$ZL4= 120
##$ABSF1= 17.49467
##$ABSF2= -2.524366
##$ABSG= 5
##$ABSL= 3
##$ALPHA= 0
##$AQORDER= 0
##$ASSFAC= 0
##$ASSFACI= 0
##$ASSFACX= 0
##$ASSWID= 0
##$AUNMP= <proc_1d>
##$AZFE= 0.1
##$AZFW= 0.1
##$BCFW= 0
##$BC_mod= 2
##$BYTORDP= 0
##$COROFFS= 0
##$CY= -3
##$DATMOD= 1
##$DC= 0
##$DFILT= <>
##$DTYPP= 0
##$F1P= 0
##$F2P= 0
##$FCOR= 1
##$FTSIZE= 16384
##$FT_mod= 6
##$GAMMA= 0
##$GB= 0
##$INTBC= 1
##$INTSCL= 1.334414e-10
##$ISEN= 128
##$LB= 0.24
##$LEV0= 0
##$LPBIN= 0
##$MAXI= 10000
##$MC2= 0
##$MEAN= 0
##$ME_mod= 0
##$MI= 1.114404
##$NCOEF= 0
##$NC_proc= -6
##$NLEV= 6
##$NOISF1= 3.799351
##$NOISF2= 2.8
##$NSP= 0
##$NTH_PI= 0
##$NZP= 0
##$OFFSET= 17.50933
##$PC= 1
##$PHC0= -13359.53
##$PHC1= 12.60099
##$PH_mod= 1
##$PKNL= yes
##$PPARMOD= 0
##$PSCAL= 0
##$PSIGN= 0
##$REVERSE= no
##$SF= 200.130005063425
##$SI= 16384
##$SIGF1= 3
##$SIGF2= 2
##$SINO= 5.538805
##$SIOLD= 16384
##$SREGLST= <1H.CDCl3>
##$SSB= 0
##$STSI= 16384
##$STSR= 0
##$SW_p= 4006.41025641026
##$SYMM= 0
##$S_DEV= 0
##$TDeff= 16384
##$TDoff= 0
##$TI= <>
##$TILT= no
##$TM1= 0
##$TM2= 0
##$TOPLEV= 0
##$USERP1= <user>
##$USERP2= <user>
##$USERP3= <user>
##$USERP4= <user>
##$USERP5= <user>
##$WDW= 1
##$XDIM= 16384
##$YMAX_p= 438445612
##$YMIN_p= -321325
$$ End of Bruker specific parameters
$$ ---------------------------------
##NTUPLES= NMR SPECTRUM
##VAR_NAME=  FREQUENCY,     SPECTRUM/REAL,   SPECTRUM/IMAG
##SYMBOL=    X,             R,               I
##VAR_TYPE=  INDEPENDENT,   DEPENDENT,       DEPENDENT
##VAR_FORM=  AFFN,          ASDF,            ASDF
##VAR_DIM=   16384,         16384,           16384
##UNITS=     HZ,            ARBITRARY UNITS, ARBITRARY UNITS
##FACTOR=    0.24454680195387, 1,            1
##FIRST=     3504.14245155696, 0,            0
##LAST=      -502.267804853297, 0,           0
##MIN=       -502.267804853297, -321325,     0
##MAX=       3504.14245155696, 438445612,    0
$$ Real data points
##PAGE= N=1
##DATA TABLE= (X++(R..R)), XYDATA
$$ [...]
5505C734685K26316J28373J7506J70008l9403l2532k582k05630o2868J43102P6024
$$ 3734685 3961001 4089374 4106880 4276888 4237485 4204953 4202371 3996741 3933873 4076975 4152999
5494D152999P0865J00116L6535M3738o4617l3228q3952p3223r9350K8650m3210
$$ 4152999 4223864 4323980 4360515 4404253 4339636 4306408 4222456 4149233 4049883 4078533 4035323
5483D035323R1100Q2864Q909J67009P5960m8481K33366J86229M2793q6775j59485
$$ 4035323 4126423 4209287 4218196 4385205 4461165 4412684 4646050 4832279 4875072 4788297 4628812
5472D628812M6372O2768K1564o2244j8232Q0808J7786J11338m0563j0830j62067
$$ 4628812 4675184 4737952 4759516 4697272 4679040 4759848 4777634 4888972 4848409 4837579 4675512
5461D675512k9791J35943Q4283n851M0477l1245N016Q3030m7332N9858K4850l2530
$$ 4675512 4645721 4781664 4865947 4860096 4900573 4869328 4874344 4957374 4910042 4969900 4994750 4962220
5449D962220J86535P5092n7418j83597j43408j27466j08591j3766n453P8217p5687
$$ 4962220 5148755 5223847 5166429 4982832 4839424 4711958 4603367 4589601 4584148 4662365 4586678
5438D586678n9798O7726M1105j6231P1519J69636J9375K4423q5245j07260r7345
$$ 4586678 4526880 4594606 4635711 4619480 4690999 4860635 4880010 4904433 4819188 4711928 4614583
5427D614583r236J35340Q8906P8425j30004j26573m2121l9848j98848j83832q7733
$$ 4614583 4605347 4740687 4829593 4908018 4778014 4651441 4609320 4569472 4370624 4186792 4099059
5416D099059N531j08654q4905o522O8028J28132o5303m689K4582J3715O6482j4031
$$ 4099059 4104590 3995936 3911031 3904509 3972537 4100669 4035366 4030677 4055259 4068974 4135456 4121425
5404D121425m8351K23888J7911O2763J16909k885J68025j09113J08564K14716
$$ 4121425 4073074 4296962 4314873 4377636 4494545 4491660 4659685 4550572 4659136 4873852
5394D873852k4215Q2957K04862J87828J54654K26264J88179L64021M25893N44209
$$ 4873852 4849637 4932594 5137456 5325284 5479938 5706202 5894381 6258402 6684295 7228504
5384G228504N31686N63625O98311R17819J338019J448630J818814K121705K386975
$$ 7228504 7760190 8323815 9022126 9939945 11277964 12726594 14545408 16667113 19054088
5375A9054088J979986N78673j867350l434678l236082k161673j327431j023311
$$ 19054088 21034074 21612747 19745397 16310719 13074637 10912964 9585533 8562222
5367H562222p64400m24798k85624k40793j18032j4054j38179n1549k82997j10981
$$ 8562222 7797822 7373024 7087400 6846607 6728575 6714521 6576342 6524793 6241796 6130815
5357F130815R4679J83723K46650J30491L06063K61183J02069m18550m32834n94278
$$ 6130815 6225494 6409217 6655867 6786358 7092421 7353604 7455673 7037123 6604289 6010011
5347F010011l90377k61755l90777j74506j40186r1193r2022j30175j5721k5352
$$ 6010011 5619634 5357879 4967102 4792596 4652410 4561217 4469195 4339020 4323299 4297947
5337D297947j7289M21j14025n6668j19150j07682n1468j40219j1354p48o6603
$$ 4297947 4280658 4281079 4167054 4110386 3991236 3883554 3832086 3691867 3680513 3679765 3613162
5326C613162k4304m7109j66378j3925K06127K9969n5028J18698K03320q4188o3027
$$ 3613162 3588858 3541749 3375371 3361446 3567573 3597542 3542514 3661212 3864532 3780344 3717317
5315C717317K9344o9498M0843o8088n6711q4301q4521K5334k6207N1215n9945
$$ 3717317 3746661 3677163 3718006 3649918 3593207 3508906 3424385 3449719 3423512 3474727 3414782
5304C414782o1476n3930M0175K3799l584n7136O2146N8943J0536Q4805j22929
$$ 3414782 3353306 3299376 3339551 3363350 3359766 3302630 3364776 3423719 3434255 3519060 3396131
5293C396131m3062o85K5572j33656K8612K8345l7965o5425K1633M356j02526J27830
$$ 3396131 3353069 3352384 3377956 3244300 3272912 3301257 3263292 3197867 3219500 3223856 3121330 3249160
5281C249160Q8312M767r7908r429j21095j12193M487k2092M804K670L8291Q06
$$ 3249160 3337472 3342239 3244331 3234902 3113807 3001614 3006101 2984009 2988813 2991483 3029774 3030580
5269C030580O1288J8392M6288m6578j5599J3606k5829N30J6040K0052L9311M9264
$$ 3030580 3091868 3110260 3156548 3109970 3094371 3107977 3082148 3082678 3098718 3118770 3158081 3207345
5257C207345l180K5942j0750n4772R9427R803j3978o6887O2730J60860M8406q130
$$ 3207345 3204165 3230107 3219357 3164585 3264012 3273815 3259837 3192950 3255680 3416540 3464946 3456816
5245C456816l4870l834j04033m2140O0187k1223J26222M3334o2924K2872L0018
$$ 3456816 3421946 3418112 3314079 3271939 3332126 3310903 3437125 3480459 3417535 3440407 3470425
5234C470425J14527M8332P6343j09061P0933M1189n4472J21760Q7491m7059R9060
$$ 3470425 3584952 3633284 3709627 3600566 3671499 3712688 3658216 3779976 3867467 3820408 3919468
5223C919468J29751N2270k7587l2636j00635J5038M6049N6546m8974J07007L8700
$$ 3919468 4049219 4101489 4073902 4041266 3940631 3955669 4001718 4058264 4009290 4116297 4154997
5212D154997P1091K47974o4471O965M4920R9163L8951K0939p780J9483o1207R968
$$ 4154997 4226088 4474062 4409591 4416556 4461476 4560639 4599590 4620529 4612749 4632232 4571025 4580993
5200D580993Q1539J8594l8747J5688n6124J914J11917J69375P8816q2680J14840
$$ 4580993 4662532 4681126 4642379 4658067 4601943 4603857 4715774 4885149 4963965 4881285 4996125
5189D996125J26427J3283L1249J32122J23500j9316J84152M3446O2845J24062
$$ 4996125 5122552 5135835 5167084 5299206 5422706 5403390 5587542 5630988 5693833 5817895
5179E817895L9116L1147R129J85609J69354Q6343P856J52016J49297k628J80047
$$ 5817895 5857011 5888158 5897287 6082896 6252250 6338593 6346449 6498465 6647762 6645134 6825181
5168F825181K46948J30550L7666J74099K77701L35014K94528L08196O35525N22029
$$ 6825181 7072129 7202679 7240345 7414444 7692145 8027159 8321687 8629883 9265408 9787437
5158I787437O79018P76602R40301J076930J173904J405568J754667K160003K779566
$$ 9787437 10466455 11243057 12183358 13260288 14434192 15839760 17594427 19754430 22533996
5149B2533996K975327K716321K916931K275121r74332m696248n512327m142173
$$ 22533996 25509323 28225644 31142575 33417696 32443364 27747116 22234789 18092616
5141A8092616k400387j559378j089683q73206o22226n52064m75874k1585m1944
$$ 18092616 15692229 14132851 13043168 12169962 11547736 10995672 10519798 10498213 10456269
5132A0456269k7582P9035J69493J75899Q5341K16050K93561K32061L63599K53014
$$ 10456269 10428687 10507722 10677215 10853114 10938455 11154505 11448066 11680127 12043726 12296740
5122A2296740K25452l56877j006026j164047q74344n66402k33285k57909k35450
$$ 12296740 12522192 12165315 11159289 9995242 9120898 8554496 8321211 8063302 7827852
5113G827852j47834k11952r2419k24087J5667j22004N3430k31781l3270j6212
$$ 7827852 7680018 7468066 7375647 7151560 7167227 7045223 7098653 6866872 6833602 6817390
5103F817390k00453j46128j60993k549J14100j09413k68897q8030k1561m5313
$$ 6817390 6616937 6470809 6309816 6307267 6421367 6311954 6043057 5955027 5933466 5888153
5093E888153N4084R3458K8406l5247N7558Q3041p0805r6541k40357k29812k17803
$$ 5888153 5942237 6035695 6064101 6028854 6086412 6169453 6098648 6002107 5761750 5531938 5314135
5082E314135M1198j12711k7338o2429K5331O1286m6031J44355M2720L705m4210
$$ 5314135 5355333 5242622 5215284 5152855 5178186 5239472 5193441 5337796 5380516 5384221 5340011
5071E340011M4260J07719J29162j5484J64143J04351J27609J95562L05945K07916
$$ 5340011 5384271 5491990 5621152 5605668 5769811 5874162 6001771 6197333 6503278 6711194
5061F711194Q2442K28043P9800j92734l68510l96069l63785k21433o8343M0912
$$ 6711194 6793636 7021679 7101479 6908745 6540235 6144166 5780381 5558948 5490605 5531517
5051E531517p4031L2293n1519Q2999R864N9714j0935j5243L3184O0764J43750
$$ 5531517 5457486 5489779 5438260 5521259 5531123 5590837 5579902 5564659 5597843 5658607 5802357
5040E802357J21139O6043J08926J82637L88308K6489K28991K31918J70246J75786
$$ 5802357 5923496 5989539 6098465 6281102 6669410 6695899 6924890 7156808 7327054 7502840
5030G502840J59667j72702l20448k73650l84987j16692j01866j25653k7116N2369
$$ 7502840 7662507 7489805 7169357 6895707 6510720 6394028 6292162 6166509 6139393 6191762
5020F191762p7102L552j3855O3775q5156p995M8848J08736N6178Q6759M7525J9312
$$ 6191762 6114660 6118212 6104357 6168132 6082976 6074981 6123829 6232565 6288743 6375502 6423027 6442339
5008F442339J46741J3540J27919J62068R5211J43339P3123R3624M3163p7224j23151
$$ 6442339 6589080 6602620 6730539 6892607 6987818 7131157 7204280 7297904 7341067 7263843 7140692
4997G140692n4199k45768j01935m8154j58409j22095k5001j08491m5202j93150
$$ 7140692 7086493 6840725 6738790 6690636 6532227 6410132 6385131 6276640 6231438 6038288
4987F038288j01093J36315M0248N1402j35117M1283J11048m5802J7056J3141q5495
$$ 6038288 5937195 6073510 6113758 6165160 6030043 6071326 6182374 6136572 6153628 6166769 6081274
4976F081274j11838J18620R1676k9463k1427J10824K9630Q6132j56044n5262r4370
$$ 6081274 5969436 6088056 6179732 6150269 6128842 6239666 6269296 6355428 6199384 6144122 6049752
4965F049752k6563K6945r5134M9644Q7183J62277O9821J19087J15375j3478J40925
$$ 6049752 6023189 6050134 5955000 6004644 6091827 6254104 6323925 6443012 6558387 6544909 6685834
4954F685834J08930j54515j61801j26064j50604j42602r0756j42534j81842j73789
$$ 6685834 6794764 6640249 6478448 6352384 6201780 6059178 5968422 5825888 5644046 5470257
4944E470257o8235o9939J7208K7426j0826K9862j19589k6267j38729J29981J81258
$$ 5470257 5402022 5332083 5349291 5376717 5365891 5395753 5276164 5249897 5111168 5241149 5422407
4933E422407R4882j338m9495K07518J16974K312O224K24164J12995l6938j03726
$$ 5422407 5517289 5515951 5466456 5673974 5790948 5793260 5799484 6023648 6136643 6099705 5995979
4922E995979k0058N5300j05808r1122j09142j73373l1850k07078q1280o6687N6306
$$ 5995979 5975921 6031221 5925413 5834291 5725149 5551776 5519926 5312848 5231568 5164881 5221187
4911E221187j67143l1897L0757j02174o9969r2394o0472O0944j14295J12281O6554
$$ 5221187 5054044 5022147 5052904 4950730 4880761 4788367 4727895 4788839 4674544 4786825 4853379
4900D853379j03360p6549K31574J07088j8140R6889J16680O1374L8741j34472
$$ 4853379 4750019 4673470 4905044 5012132 4993992 5090881 5207561 5268935 5307676 5173204
4890E173204k5334k3607l9335O2436j00473K3813j6078p2026p7767J74814P1346
$$ 5173204 5147870 5124263 5084928 5147364 5046891 5070704 5054626 4982600 4904833 5079647 5150993
4879E150993Q0207K01687P9150J7476J59538J82899J02095K75633K26046K35336
$$ 5150993 5231200 5432887 5512037 5529513 5689051 5871950 5974045 6249678 6475724 6711060
4869F711060K45632J64399L58983K66789L58621M17743M25039L78604M15994k40922
$$ 6711060 6956692 7121091 7480074 7746863 8105484 8523227 8948266 9326870 9742864 9501942
4859I501942j109724j167407q25318o74776l88533k13189k31002j71809j79437
$$ 9501942 8392218 7224811 6399493 5724717 5336184 5122995 4891993 4720184 4540747
4850D540747j67982p0750j79522N0101P4048M161n5791k0221l2155j12548J17962
$$ 4540747 4372765 4302015 4122493 4172594 4246642 4250803 4195012 4174791 4142636 4030088 4148050
4839D148050R4423j37065O0584Q8716j8672O3522P2529q1234j26699j10373o781
$$ 4148050 4242473 4105408 4165992 4254708 4236036 4299558 4372087 4290853 4164154 4053781 4047000
4828D047000k6237q1820Q6319L7297j22087j16017p367L0124l1921m3184J0722
$$ 4047000 4020763 3938943 4025262 4062559 3940472 3824455 3817088 3847212 3815291 3772107 3782829
4817C782829K0514k3073J25552J66975N0353L0791J33544j04569j13083k7337
$$ 3782829 3803343 3780270 3905822 4072797 4123150 4153941 4287485 4182916 4069833 4042496
4807D042496j59234p426N879k03155r0264j09586j45801M0174n663K9842j25528
$$ 4042496 3883262 3875836 3881715 3678560 3588296 3478710 3332909 3373083 3367420 3397262 3271734
4796C271734J32182O4746m920j20416P177R4279j492M1580q0678p667L8521M6445
$$ 3271734 3403916 3468662 3463742 3343326 3350503 3444782 3443290 3484870 3404192 3396525 3435046 3481491
4784C481491J7607J05138L1719J36986N8617L9040J71478K02777Q4182P7634l6828
$$ 3481491 3499098 3604236 3635955 3772941 3831558 3870598 4042076 4244853 4329035 4406669 4369841
4773D369841n4824k8414k51930k4587m41K4229j39480n4544L6130o2573q7655
$$ 4369841 4315017 4286603 4034673 4010086 4009645 4033874 3894394 3839850 3875980 3813407 3725752
4762C725752l3518J37065l2504K16387N2254q368J20387J30791j17661o4074R4526
$$ 3725752 3692234 3829299 3796795 4013182 4065436 4057068 4177455 4308246 4190585 4126511 4221037
4751D221037j57303J66116j54414p4903j45160K7819n2040j2082K6962r5710M5
$$ 4221037 4063734 4229850 4075436 4000533 3855373 3883192 3831152 3819070 3846032 3750322 3750367
4740C750367J06981P9974q5385K800Q1482N5195M2106j72159J49811m4859m0611
$$ 3750367 3857348 3937322 3851937 3854737 3936219 3991414 4033520 3861361 4011172 3966313 3925702
4729C925702K4487j01458P3167m7005J2286j11761l4224Q2534J3555j7500J32198
$$ 3925702 3950189 3848731 3921898 3874893 3887179 3775418 3741194 3823728 3837283 3819783 3951981
4718C951981r0622K4896O9810J0702p2668m4867q4183o1869m1999m190J3832k2703
$$ 3951981 3861359 3886255 3956065 3966767 3894099 3849232 3765049 3703180 3661181 3656991 3670823 3648120
4706C648120q7955j884j9646J8527J13310p154j08607k0236K2373j1256k553O1166
$$ 3648120 3560165 3558281 3538635 3557162 3670472 3663318 3554711 3534475 3556848 3545592 3543039 3604205
4694C604205j70493j11430j38664Q821P0316p4983l7816k3744O3918K568r6174
$$ 3604205 3433712 3322282 3183618 3192439 3262755 3187772 3149956 3126212 3190130 3192698 3096524
4683C096524K2070j02638p2646r878J14126o4465j12615P2244k807n0718j15499
$$ 3096524 3118594 3015956 2943310 2933432 3047558 2983093 2870478 2942722 2939915 2889197 2773698
4672B773698O0667J5667j14222r5563M9677K2859N1659p3744J9788O248l6782
$$ 2773698 2834365 2850032 2735810 2640247 2689924 2712783 2764442 2690698 2710486 2716734 2679952
4661B679952L0707q9098n4044M4609j09349p546P0658K5195m181l602o8513O275
$$ 2679952 2710659 2621561 2567517 2612126 2502777 2495231 2565889 2591084 2586903 2583301 2514788 2521063
4649B521063p9415M6556N7612L0081P1131M4390P469j7353n234j4749j0190l7207
$$ 2521063 2441648 2488204 2545816 2575897 2647028 2691418 2698887 2681534 2676300 2661551 2651361 2614154
4637B614154Q6213K0242q3486L9241K750J21665q9330o6155k1664j7181J302K6292
$$ 2614154 2700367 2720609 2637123 2676364 2679114 2800779 2711449 2645294 2623630 2606449 2607751 2634043
4625B634043Q2772k4235L7404J8665j04428R8117J12391m5419m1319M9974J45305
$$ 2634043 2716815 2692580 2729984 2748649 2644221 2742338 2854729 2809310 2767991 2817965 2963270
4614B963270n443N2200j04283k0425N610L230L9038J02293M626O9365r7516L0612
$$ 2963270 2957827 3010027 2905744 2885319 2890929 2894159 2933197 3035490 3040116 3109481 3011965 3042577
4602C042577J14996Q3022K6433m9782p8433Q5942Q8798J11417o6471J17300R3978
$$ 3042577 3157573 3240595 3267028 3217246 3138813 3224755 3313553 3424970 3358499 3475799 3569777
4591C569777o7601K9094k2241j9750J168L6883M0012p9878N1214R5927K230J19283
$$ 3569777 3502176 3531270 3509029 3489279 3490447 3527330 3567342 3487464 3538678 3634605 3636835 3756118
4579C756118J62964O1187P3833k8659l1790Q6532J49307J43202O6060J36520J8710
$$ 3756118 3919082 3980269 4054102 4025443 3993653 4080185 4229492 4372694 4438754 4575274 4593984
4568D593984J49128J7023l3671P2512P3226R3549J24632k09154j6468Q1958Q7996
$$ 4593984 4743112 4760135 4726464 4798976 4872202 4965751 5090383 4881229 4864761 4946719 5034715
4557E034715n9506L3465L3550J22725J19373J36905K7494j5340J80910L8036J06372
$$ 5034715 4975209 5008674 5042224 5164949 5284322 5421227 5448721 5433381 5614291 5652327 5758699
4546E758699K8936J66512J13483M7529Q626o1332O3744q3946J1529P838M2916
$$ 5758699 5787635 5954147 6067630 6115159 6123785 6062453 6126197 6042251 6053780 6061618 6104534
4535F104534J0867n8098P9297K8845J0232J14370K33966K6574J04758Q9848J17924
$$ 6104534 6115401 6057303 6136600 6165445 6175677 6290047 6524013 6550587 6655345 6745193 6863117
4524F863117J45926J48570O8445J53570J38189N9764R3075j9172K28354P4424
$$ 6863117 7009043 7157613 7226058 7379628 7517817 7577581 7670656 7651484 7879838 7954262
4514G954262m1683R6293K69083J18296K40538K72458L06880J69308J56782N11371
$$ 7954262 7912579 8008872 8277955 8396251 8636789 8909247 9216127 9385435 9542217 10053588
4504A0053588L93755M64836O15092N78797O63540P76108O22322K71936l78687
$$ 10053588 10447343 10912179 11527271 12106068 12769608 13545716 14168038 14439974 14061287
4495A4061287q59773r51091q53578n68733l28702k80167l93851k12560k63988
$$ 14061287 13201514 12250423 11396845 10828112 10499410 10219243 9825392 9612832 9348844
4486I348844k39607r2056l04140j38605k32422k16204j16196j11075j49619j39191
$$ 9348844 9109237 9017181 8713041 8574436 8342014 8125810 8009614 7898539 7748920 7609729
4476G609729m0600j02652o0390k769R5421m7680r2157J22331m1961J3860N1860
$$ 7609729 7569129 7466477 7406087 7403318 7498739 7451059 7358902 7481233 7439272 7453132 7504992
4465G504992L9356m715K4384j514j1101p7620o6216L2843R5952j8612L6685P4792
$$ 7504992 7544348 7539633 7564017 7562503 7551402 7473782 7407566 7440409 7536361 7517749 7554434 7629226
4453G629226Q4746K50668J29109N1051n3258J84444J75021n0150k54102k54641
$$ 7629226 7713972 7964640 8093749 8144800 8091542 8275986 8451007 8400857 8146755 7892114
4443G892114k46805j99261j69885J5469k40810j52527M4265o3157j2784O2086
$$ 7892114 7645309 7446048 7276163 7291632 7050822 6898295 6942560 6879403 6866619 6928705
4433F928705j08160k7472K4563J0054q3525j05402n9484p9072j0906j1469M7888
$$ 6928705 6820545 6793073 6817636 6827690 6744165 6638763 6579279 6500207 6489301 6477832 6525720
4422F525720N9945J12504n731j5714O6913J56821J10191J14536J56863J63151
$$ 6525720 6585665 6698169 6692438 6676724 6743637 6900458 7010649 7125185 7282048 7445199
4412G445199j5596Q3369l2344q0235n3203j13917j42297j8634p1118P2339R7234
$$ 7445199 7429603 7512972 7480628 7400393 7347190 7233273 7090976 7072342 7001224 7073563 7170797
4401G170797j3196J36873J70774k7821J37511K90645N7961R3602K83917J58498
$$ 7170797 7157601 7294474 7465248 7437427 7574938 7865583 7923544 8017146 8301063 8459561
4391H459561J87069J44043N4813l3225j76959k35755l09870j94290k0026k59963
$$ 8459561 8646630 8790673 8845486 8812261 8635302 8399547 8089677 7895387 7875361 7615398
4381G615398k46960j00822n3912R2842n84r3054L3571J46121m1758j5916J19908
$$ 7615398 7368438 7267616 7213704 7306546 7305962 7212908 7246479 7392600 7350842 7334926 7454834
4370G454834o0082L3732l5795J03516J27887J00328j3467j9440L2712J89461P7480
$$ 7454834 7394752 7428484 7392689 7496205 7624092 7724420 7710953 7691513 7724225 7913686 7991166
4359G991166J2326M0309L9501M3618j0940l2021L9845n2899j3667Q4271m2847
$$ 7991166 8003492 8043801 8083302 8126920 8115980 8083959 8123804 8070905 8057238 8141509 8098662
4348H098662L8482j9512K7505K3143j08438l463N8354r76J91040K5376J37579
$$ 8098662 8137144 8117632 8145137 8168280 8059842 8056379 8114733 8113757 8304797 8330173 8467752
4337H467752J16606J96692j01286P8561j13148K22615J42991N1421J89720R3737
$$ 8467752 8584358 8781050 8679764 8758325 8645177 8867792 9010783 9062204 9251924 9345661
4327I345661J90062M9133J4712J71662l0754N7183R3826q0059l6639m8872j10236
$$ 9345661 9535723 9584856 9599568 9771230 9740476 9797659 9891485 9811426 9774787 9725915 9615679
4316I615679r7845j27693k0332r4892p1354J23184L9848L0256k9025K1137K0308
$$ 9615679 9517834 9390141 9369809 9274917 9203563 9326747 9366595 9396851 9367826 9388963 9409271
4305I409271J48337M6662Q7413L85J2035J10310P8323R4073J32755M3358M7754
$$ 9409271 9557608 9604270 9691683 9692068 9704103 9814413 9892736 9986809 10119564 10162922 10210676
4294A0210676K33161P4206P7166R9829j26175n6266j82451j19632q9465j35284
$$ 10210676 10443837 10518043 10595209 10695038 10568863 10512597 10330146 10210514 10121049 9985765
4284I985765j41479j66992l6365k78015j35956k3498k3656l616j74595o001p6186
$$ 9985765 9844286 9677294 9640929 9362914 9226958 9203460 9179804 9176188 9001593 8995592 8919406
4273H919406m9165l7504j30675N7467j17555J0311J61113J0107j9616O0124J289
$$ 8919406 8870241 8832737 8702062 8759529 8641974 8652285 8813398 8823505 8803889 8864013 8865302
4262H865302P57L0559J04219j756j12010j3613m1062J6390j2994P3525N5659J19542
$$ 8865302 8866059 8896618 9000837 8999081 8887071 8873458 8832396 8848786 8835792 8909317 8964976 9084518
4250I084518o9026O9430j5756n3930r2095j676p4342j33308l7046p2666J35351
$$ 9084518 9015492 9084922 9069166 9015236 8923141 8921465 8847123 8713815 8676769 8604103 8739454
4239H739454m1527j03589j18565j25050Q0806j12397J10659L9276r966M7520j00920
$$ 8739454 8697927 8594338 8475773 8350723 8431529 8319132 8429791 8469067 8459101 8506621 8405701
4228H405701P0650r6631J7547M8359j9193M1249j1638P1219q5072N1657M5680
$$ 8405701 8476351 8379720 8397267 8445626 8426433 8467682 8456044 8527263 8442191 8493848 8539528
4217H539528N0729J28029n2880J07714j02083J9077J22765J08589l9165J9006
$$ 8539528 8590257 8718286 8665406 8773120 8671037 8690114 8812879 8921468 8882303 8901309
4207H901309L5032n9990N465J17211Q0329N2088m4300j1808K4728J16246J97602
$$ 8901309 8936341 8876351 8881816 8999027 9079356 9131444 9087144 9075336 9100064 9216310 9413912
4196I413912k69N0953K5821J01580M4494J16427P6185O4408N7313J04344R2925
$$ 9413912 9413643 9464596 9490417 9591997 9636491 9752918 9829103 9893511 9950824 10055168 10148093
4185A0148093Q8368J68685N9649J40284J37606J60658J97370J33693J74870J72667
$$ 10148093 10236461 10405146 10464795 10605079 10742685 10903343 11100713 11234406 11409276 11581943
4175A1581943L07395J45811J70577P8445K09367L4357K483P2567J02653J24824
$$ 11581943 11889338 12035149 12205726 12284171 12493538 12527895 12530378 12602945 12705598 12830422
4165A2830422K5518K08990L00131K16450J60569L18593L03549K40714K72128K73400
$$ 12830422 12855940 13064930 13365061 13581511 13742080 14060673 14364222 14604936 14877064 15150464
4155A5150464M28378M45522L31468M25627M38219L71377M22582L91399L75476
$$ 15150464 15578842 16024364 16355832 16781459 17219678 17591055 18013637 18405036 18780512
4146A8780512L25710K84640K49134J26437J29664K63264K55093J39665J94543
$$ 18780512 19106222 19390862 19639996 19766433 19896097 20159361 20414454 20554119 20748662
4137B0748662L38561L59880K29238M84106L82574M25744L89474M73049O82451
$$ 20748662 21087223 21447103 21676341 22160447 22543021 22968765 23358239 23831288 24513739
4128B4513739O56112M60257M10466L62737K89155K47101K24249J4444q9335M3696
$$ 24513739 25169851 25630108 26040574 26403311 26692466 26939567 27163816 27178260 27088925 27132621
4118B7132621j9705r223o0853o4618N5899k4407J28475k8010J55407K07943N4193
$$ 27132621 27112916 27103693 27042840 26978222 27034121 27009714 27138189 27110179 27265586 27473529 27527722
4107B7527722O7911R8341J57321P5242j1787n7274J3699J1015J36480L6436L2539
$$ 27527722 27595633 27693974 27851295 27926537 27914750 27857476 27871175 27882190 28018670 28055106 28087645
4096B8087645R885l7387q5054q1312k68366q8416j20385m02784m02969l31959
$$ 28087645 28097530 28060143 27975089 27893777 27625411 27536995 27416610 27013826 26610857 26278898
4086B6278898k81011n43312l36808m01734l62227l68642j68022l13350k09244
$$ 26278898 25997887 25454575 25117767 24716033 24353806 23985164 23817142 23503792 23294548
4077B3294548j45781k57867j75975p8763p2491j94014j15596j14711m5783J84713
$$ 23294548 23148767 22890900 22714925 22636162 22563671 22369657 22254061 22139350 22093567 22278280
4067B2278280o3188j07109J23860J75557J58974K2406K21734K12581L92123J29477
$$ 22278280 22215092 22107983 22231843 22407400 22566374 22588780 22810514 23023095 23415218 23544695
4057B3544695K59443O8408J45731L39818K44447K81754J18201L35425J89443L27198
$$ 23544695 23804138 23872546 24018277 24358095 24602542 24884296 25002497 25337922 25527365 25854563
4047B5854563L52050K49742L54853M25504M21254N27158M28628L60481L94570
$$ 25854563 26206613 26456355 26811208 27236712 27657966 28185124 28613752 28974233 29368803
4038B9368803K06611q7392L1508Q380J1415K62086J88912L62228L13910M62893
$$ 29368803 29575414 29488022 29519530 29527910 29539325 29801411 29990323 30352551 30666461 31129354
4028C1129354N05236L89064M22130N26034N61083N33697N92554O61658P05339
$$ 31129354 31634590 32023654 32445784 32971818 33532901 34066598 34659152 35320810 36026149
4019C6026149O64915P56549Q14484R68874P87598Q03572R54614Q05232P75625
$$ 36026149 36691064 37447613 38262097 39230971 40018569 40822141 41776755 42581987 43357612
4010D3357612M07823j03917n08368n65894m18467R6205k7176o3002q0196k82630
$$ 43357612 43765435 43661518 43153150 42587256 42168789 42264994 42237818 42174816 42094620 41811990
4000D1811990o20895n84645q40625o16523m86287m16198l00928j39974j37890
$$ 41811990 41191095 40606450 39765825 39149302 38663015 38246817 37945889 37805915 37668025
3991C7668025j15193l9179J22935J02640k47401n3045Q500r9589j46623k92768
$$ 37668025 37552832 37513653 37636588 37739228 37491827 37438782 37447282 37347693 37201070 36908302
3981C6908302j79291m00812n11753l45175l43722k70816k19436k84603k59720
$$ 36908302 36729011 36328199 35816446 35471271 35127549 34856733 34637297 34352694 34092974
3972C4092974N2704l9489J00043R0564J58391K27740K32475O9604K80741K32628
$$ 34092974 34145678 34106189 34206232 34296796 34455187 34682927 34915402 34985006 35265747 35498375
3962C5498375J02282K12985M5319K19113K31808K00051L77416J51848K37892K83229
$$ 35498375 35600657 35813642 35858961 36078074 36309882 36509933 36887349 37039197 37277089 37560318
3952C7560318J49332n3338k18054j21747n2145j2175o3284p122J07586J689O347
$$ 37560318 37709650 37656312 37438258 37316511 37264366 37252191 37188907 37181785 37289371 37291060 37297407
3941C7297407J01376Q3169j23568m06l4216J5788R4912J39475M5140J36542J92690
$$ 37297407 37398783 37481952 37358384 37357978 37323762 37339550 37434462 37573937 37619077 37755619 37948309
3930C7948309K3820j98537k07565l05150q1951k7011r0570P6478L93760K72937
$$ 37948309 37972129 37773592 37566027 37260877 37178926 37151915 37061345 37137823 37531583 37804520
3920C7804520L38522M85061L37583L60519J02346k57127o60662o43412p99622
$$ 37804520 38143042 38628103 38965686 39326205 39428551 39171424 38510762 37867350 37067728
3911C7067728o02003l79283k62978j10135j24429J25001J92876K32334K96299
$$ 37067728 36465725 36086442 35823464 35713329 35588900 35713901 35906777 36139111 36435410
3902C6435410L92145L80235M58735N27316L34420K67876K96838L77561L26941
$$ 36435410 36827555 37207790 37666525 38193841 38528261 38796137 39092975 39470536 39797477
3893C9797477K27805R7177M5451P3366n0765k8157J07772J86981K11173K60529
$$ 39797477 40025282 40122459 40167910 40241276 40190511 40162354 40270126 40457107 40668280 40928809
3883D0928809M93674M75203L49283K78428L86939L80009N31598M86234N41160
$$ 40928809 41422483 41897686 42246969 42525397 42912336 43292345 43823943 44310177 44851337
3874D4851337O22762O84403P91468J017881R84465J237408J295746J489757J691221
$$ 44851337 45474099 46158502 46949970 47967851 48952316 50189724 51485470 52975227 54666448
3865E4666448J769795J807134J565681J213757O70262J12410j025403j961223
$$ 54666448 56436243 58243377 59809058 61022815 61693077 61805487 60780084 58818861
3857E8818861k358703k177244j640066j274051j120295p24325o71307n03954m15019
$$ 58818861 56460158 54282914 52642848 51368797 50248502 49524177 48852870 48348916 47933897
3848D7933897l71149l01377k52993k108n8303r78K18821J78344J64776J72367
$$ 47933897 47562748 47261371 47008378 47006270 46947967 46946989 47165810 47344154 47508930 47681297
3838D7681297J16098L30311L99600L72487L61768M11333M40290N16709O67864
$$ 47681297 47797395 48127706 48527306 48899793 49261561 49672894 50113184 50629893 51297757
3829E1297757O65529O99723O15430O82965Q85902R45487J098344J233552J034331
$$ 51297757 51963286 52663009 53278439 53961404 54847306 55792793 56891137 58124689 59159020
3820E9159020P75625R16296R67772P51140L25798J87756L56388L60124O94929
$$ 59159020 59934645 60850941 61818713 62569853 62895651 63083407 63439795 63799919 64494848
3811F4494848J022559J285142J281828J578960J805293J742214J585032J492947
$$ 64494848 65517407 66802549 68084377 69663337 71468630 73210844 74795876 76288823
3803G6288823J423848J259454J267265J493166J802094K129327K519015K738755
$$ 76288823 77712671 78972125 80239390 81732556 83534650 85663977 88182992 90921747
3795I0921747L266554L814008M341164M882470M855978M517676L999087L189365
$$ 90921747 94188301 98002309 102343473 107225943 112081921 116599597 120598684 123788049
3787A23788049J327007j498355m290236n447508n026424m011829l132494k135534
$$ 123788049 125115056 123616701 119326465 113878957 108852533 104840704 101708210 99572676
3779I9572676j353638q98780q28061p93592n85992o10484o11311p00298n99768
$$ 99572676 98219038 97320258 96492197 95698605 95112613 94502129 93890818 93190520 92590752
3770I2590752n92957m71617m48761j03374Q638R6315K09086r080j43505p4449
$$ 92590752 91997795 91526178 91077417 90974043 90982681 91078996 91288082 91279002 91135497 91061048
3760I1061048l43766n08428n58028l04941k94190k68360r3843L6649j98144p59573
$$ 91061048 90717282 90208854 89650826 89345885 89051695 88783335 88689492 88726141 88527997 87768424
3750H7768424j416449j723409j470769j336691j054845j193330r53709o73892
$$ 87768424 86351975 84628566 83157797 81821106 80766261 79572931 78619222 77945330
3742G7945330o86341m52272l74026k73016m23313m56975n19534p27799j179007
$$ 77945330 77258989 76806717 76432691 76159675 75736362 75279387 74759853 74032054 72853047
3733G2853047j166913j434091j530343j401570j180018j082179p94894o29012
$$ 72853047 71686134 70252043 68721700 67320130 66140112 65057933 64263039 63634027
3725F3634027m30282k61731k00616q3757o1536K17492M44445N56246P00629Q85025
$$ 63634027 63203745 62942014 62741398 62657641 62596105 62813597 63258042 63814288 64514917 65399942
3715F5399942N87281L78961N30549P78040N51296M84483K06124K86095P20271
$$ 65399942 65987223 66366184 66896733 67674773 68226069 68710552 68916676 69202771 69923042
3706F9923042J240978J748431K396467K838531L573888M356971N081370N603329
$$ 69923042 71164020 72912451 75308918 78147449 81721337 86078308 91159678 96763007
3698I6763007N725235N826987M924838L712752K159437k187434p074475r131852
$$ 96763007 102488242 108315229 113240067 116952819 119112256 116924822 109850347 100718495
3690A00718495q154785o147955m581869l414738k679308j909386j287423j136745
$$ 100718495 92563710 86415755 81833886 78419148 75739840 73830454 72543031 71406286
3682G1406286o09125j17567M44356J070583J351861J745684K063010K538881K896132
$$ 71406286 70797161 70679594 71123950 72194533 73546394 75292078 77355088 79893969 82790101
3673H2790101L335563L613807L377157K874135J820698P87136r08368l127543
$$ 82790101 86125664 89739471 93116628 95990763 97811461 98598597 97690229 94562686
3665I4562686m683868n195612n137464m505692l887908l381236k920969k563196
$$ 94562686 89878818 84683206 79545742 75040050 71152142 67770906 64849937 62286741
3657F2286741k413883k042919j813288j513990j157297r23567n26121n32174l22759
$$ 62286741 59872858 57829939 56016651 54502661 53345364 52421797 51895676 51363502 51040743
3648E1040743l53600m67580p55731p05327n60734m53297k75482m3225J15602K18597
$$ 51040743 50687143 50219563 49463832 48758505 48197771 47744474 47468992 47425767 47541369 47759966
3638D7759966N41296P07351R06404P78841Q35669Q64122L54561J96096l68691
$$ 47759966 48301262 49008613 49915017 50693858 51529527 52393649 52748210 52944306 52575615
3629E2575615j084507j667119k067902k146915k008589j519915j344437j095057
$$ 52575615 51491108 49823989 47756087 45609172 43600583 42080668 40736231 39641174
3621C9641174r71858q18086o79065n38706n87390m39350m06696l54649j87078
$$ 39641174 38669316 37851230 37172165 36633459 36046069 35606719 35200023 34845374 34658296
3612C4658296k10136q9393j26756j21468j47403N513J5154l5461p5775r7761q8666
$$ 34658296 34448160 34358767 34232011 34110543 33963140 33968653 33983807 33948346 33872571 33774810 33686144
3601C3686144j34525j52789l3036j22625n4950k5920j04640N619k0627n0569R2658
$$ 33686144 33551619 33398830 33365794 33243169 33188219 33162299 33057659 33063278 33042651 32992082 33084740
3590C3084740M5197l5258l3560K50284J71975Q7356n4723L4605J40466J41676
$$ 33084740 33129937 33094679 33061119 33311403 33483378 33570734 33516011 33550616 33691082 33832758
3580C3832758P5920J07816L43100K12210J15023J79086J41297J80435L00290K05993
$$ 33832758 33908678 34016494 34359594 34571804 34686827 34865913 35007210 35187645 35487935 35693928
3570C5693928K31561Q1313K60323K78604R5420K72719K45665K16826J51336J90372
$$ 35693928 35925489 36006802 36267125 36545729 36641149 36913868 37159533 37376359 37527695 37718067
3560C7718067J01426J00893J94598K05165L17863L18427K76584L19181K90088
$$ 37718067 37819493 37920386 38114984 38320149 38638012 38956439 39233023 39552204 39842292
3551C9842292K57368K45370K08750M66805L93020N03380N33221O35161P38410
$$ 39842292 40099660 40345030 40553780 41020585 41413605 41916985 42450206 43085367 43823777
3542D3823777Q97500Q29852Q40558Q91056R31170J097311J026207J154440J064765
$$ 43823777 44721277 45551129 46391687 47282743 48213913 49311224 50337431 51491871 52556636
3533E2556636J096550J238594J293008J283020J289812J322434J388921J431755
$$ 52556636 53653186 54891780 56184788 57467808 58757620 60080054 61468975 62900730
3525F2900730J545291J616993J638879J699338J785014J930488J946726J957037
$$ 62900730 64446021 66063014 67701893 69401231 71186245 73116733 75063459 77020496
3517G7020496K036264J905287J885398J730966J576348J294968J064054P31689
$$ 77020496 79056760 80962047 82847445 84578411 86154759 87449727 88513781 89245470
3509H9245470O47259N25589O86583P77129O28238O24011P45741P36548P45652
$$ 89245470 89892729 90418318 91104901 91882030 92510268 93134279 93880020 94616568 95362220
3500I5362220N15355M43840L66550J8760J31028k40459m49834p42322q01638q84001
$$ 95362220 95877575 96321415 96687965 96706725 96837753 96597294 96147460 95405138 94603500 93719499
3490I3719499j119038j007922j052863j042949r60479p55190o47882n18271n13146
$$ 93719499 92600461 91592539 90539676 89496727 88536248 87781058 87133176 86614905 86101759
3481H6101759n49807m20005l60641l74720l98594m11848m13221l51693j94464
$$ 86101759 85551952 85131947 84771306 84396586 83997992 83586144 83172923 82821230 82626766
3472H2626766m3030j3490J59866J09907R8396N9153j30328j87668k01373l35653
$$ 82626766 82583736 82570246 82730112 82840019 82938415 82997568 82867240 82679572 82478199 82142546
3462H2142546j41485k97902l10729k72610j18293l85715m17869m81334n98790
$$ 82142546 82001061 81703159 81392430 81119820 81001527 80615812 80197943 79716609 79117819
3453G9117819p60070r46843j069372j282706j218012j409275j429103j410195
$$ 79117819 78357749 77410906 76341534 75058828 73840816 72431541 71002438 69592243
3445F9592243j482828j481617j210407j151233j333248j167383r35004q96833
$$ 69592243 68109415 66627798 65417391 64266158 62932910 61765527 60830523 59933690
3437E9933690p50405p31883n88801m45665n46694m44783n14803n72656n39279
$$ 59933690 59183285 58451402 57862601 57416936 56870242 56425459 55910656 55338000 54798721
3428E4798721o19880n04214m98966m14215k15867j97110l6849k792o4919P1039
$$ 54798721 54178841 53674627 53175661 52761446 52545579 52348469 52311620 52308828 52243909 52314948
3418E2314948K08119P2657j52983J9384J26537o5688R285J9126o056N323K35535
$$ 52314948 52523067 52595724 52442741 52462125 52588662 52522974 52532259 52551385 52545329 52550652 52786187
3407E2786187K75695K56486K82728K60534L89312L96039L57356N13880N24527
$$ 52786187 53061882 53318368 53601096 53861630 54250942 54646981 55004337 55518217 56042744
3398E6042744O69061O23545O12066P12109R14256J060402J115051J129634J144431
$$ 56042744 56711805 57335350 57947416 58659525 59573781 60634183 61749234 62878868 64023299
3389F4023299J342687J198174J352316J324788J531924J529438J660535J783344
$$ 64023299 65365986 66564160 67916476 69241264 70773188 72302626 73963161 75746505
3381G5746505K017534K129247K012630K178923K430450K240476K186254K030153
$$ 75746505 77764039 79893286 81905916 84084839 86515289 88755765 90942019 92972172
3373I2972172J978379K073814K168536K092707K169724K252171K289905K722022
$$ 92972172 94950551 97024365 99192901 101285608 103455332 105707503 107997408 110719430
3365A10719430K816219K926964L213261L493646L778950M000683M108144M100283
$$ 110719430 113535649 116462613 119675874 123169520 126948470 130949153 135057297 139157580
3357A39157580L887410L609416L248052K272829J444824M79732n96741j529190
$$ 139157580 143044990 146654406 149902458 152175287 153620111 154099843 153503102 151973912
3349A51973912k257587k479893k768484k553651k242962k008861j751515j488276
$$ 151973912 149716325 147236432 144467948 141914297 139671335 137662474 135910959 134422683
3341A34422683j275342j086502o42171l88372L113L37706L67978O00370P86639
$$ 134422683 133147341 132060839 131418668 131030296 131033409 131371115 131739093 132339463 133126102
3332A33126102O33900L12898M3688j89209n56929q16148q50811j136814j189676
$$ 133126102 133760002 134072900 134116588 133927379 133370450 132554302 131703491 130566677 129377001
3323A29377001j101587r43020p64000o48743k74071J40032M04621N10423R82631
$$ 129377001 128275414 127332394 126568394 125919651 125645580 125785612 126190233 126700656 127683287
3314A27683287J382184J573795J823393K014988K044034K046450J765725J282668
$$ 127683287 129065471 130639266 132462659 134477647 136521681 138568131 140333856 141616524
3306A41616524N57133P7810p13684j708871k523688l264340l764654m218620m522665
$$ 141616524 142173657 142251467 141537783 139828912 137305224 134040884 130276230 126057610 121534945
3297A21534945m673838m805242m635021m523301m341610m023329l833088l566572
$$ 121534945 116861107 112055865 107420844 102897543 98555933 94532604 90699516 87132944
3289H7132944l119432k772046k684812k427846k162841j844560j716066j440679
$$ 87132944 84013512 81241466 78556654 76128808 73965967 72121407 70405341 68964662
3281F8964662j282916r85730r68427q81735o26065n14304m92538k68214k11393
$$ 68964662 67681746 66696016 65727589 64845854 64219789 63705485 63212947 62944733 62733340
3272F2733340j97550k77167j51573o4280k18049o28160q23399r95805q65389o91176
$$ 62733340 62535790 62258623 62107050 62042770 61824721 61196561 60373162 59377357 58511968 57820792
3262E7820792p68402n22946m74183q07311p70623j115775j516171j483543j405788
$$ 57820792 57052390 56529444 56055261 55247950 54477327 53361552 51845381 50361838 48956050
3253D8956050j282381j332648j173274r44963r64590p56666q13891q85272p86250
$$ 48956050 47673669 46341021 45167747 44222784 43258194 42501528 41687637 40802365 40016115
3244D0016115n45849n51539m59377m49455l03221l08527m33899k35933l23581
$$ 40016115 39470266 38918727 38459350 38009895 37706674 37398147 36964248 36728315 36404734
3235C6404734k21012j96064k71053k26531j17363j61894n9362p9564j12726k5517
$$ 36404734 36183722 35987658 35716605 35490074 35372711 35210817 35151455 35071891 34959165 34933648
3225C4933648j8728k3133J63088K0633K76313J26225O6616K80461K23059M25064
$$ 34933648 34914920 34891787 35054875 35075508 35351821 35478046 35544662 35825123 36048182 36473246
3215C6473246K95269N08712N85113M55923O47519O10582M48515M49766M34167
$$ 36473246 36768515 37277227 37862340 38318263 38965782 39576364 40024879 40474645 40908812
3206D0908812L22198L61985M25270O63267O74755O85426O80816O00381N77069
$$ 40908812 41231010 41592995 42018265 42681532 43356287 44041713 44722529 45322910 45899979
3197D5899979N19371J34280L11546L85821M12985M69828L46356L06861M70933
$$ 45899979 46419350 46553630 46865176 47250997 47663982 48133810 48480166 48787027 49257960
3188D9257960M52898N67178N59693N60092P04656O97013N33210O95219M50414
$$ 49257960 49710858 50278036 50837729 51397821 52102477 52799490 53332700 54027919 54478333
3179E4478333N53800Q61638P62163Q45869O91328P76898P99796P90414O48480
$$ 54478333 55032133 55893771 56655934 57501803 58193131 58970029 59769825 60560239 61208719
3170F1208719O06280P00548O85000P38514Q78197Q47197R21317J014052J148120
$$ 61208719 61814999 62515547 63200547 63939061 64817258 65664455 66585772 67599824 68747944
3161F8747944J384125J209388J389730J584993J476905J515805J645647J839808
$$ 68747944 70132069 71341457 72731187 74316180 75793085 77308890 78954537 80794345
3153H0794345K022857K012539K292263K406879K432863K644396K576410K417106
$$ 80794345 82817202 84829741 87122004 89528883 91961746 94606142 97182552 99599658
3145I9599658K397736K423790K314767K256586K124425K260933J982362K030055
$$ 99599658 101997394 104421184 106735951 108992537 111116962 113377895 115360257 117390312
3137A17390312K199494K395251K711758K646633K650230K854381L044503K990018
$$ 117390312 119589806 121985057 124696815 127343448 129993678 132848059 135892562 138882580
3129A38882580L053659L395937L566187L621621L561552L609999L466581L232533
$$ 138882580 141936239 145332176 148898363 152519984 156081536 159691535 163158116 166390649
3121A66390649K967790K656248K340423J881102J668122J585842J519671J517914
$$ 166390649 169358439 172014687 174355110 176236212 177904334 179490176 181009847 182527761
3113A82527761J590568J548587J371702J310104J032516R93043O45036M91537
$$ 182527761 184118329 185666916 187038618 188348722 189381238 190374281 191019317 191510854
3105A91510854K83996L73344K54442M78619P24151Q93074J067944R25589L73853
$$ 191510854 191794850 192168194 192422636 192901255 193625406 194518480 195586424 196512013 196885866
3096A96885866m86642j661245l061001m280990n000178n492389n257062m844050
$$ 196885866 196399224 194737979 191676978 187395988 182395810 176903421 171646359 166802309
3088A66802309m516276l967645l724791l477940l475170l464584l790538l825526
$$ 166802309 162286033 158318388 154593597 151115657 147640487 144175903 140385365 136559839
3080A36559839m015934l980988l953713l762528l680618l316119l071806k854880
$$ 136559839 132543905 128562917 124609204 120846676 117166058 113849939 110778133 107923253
3072A07923253k512084k225342j935298j903906j587997j475403j322759j098883
$$ 107923253 105411169 103185827 101250529 99346623 97758626 96283223 94960464 93861581
3064I3861581q72929m54138k66938n2899L02106P39189R17667J016118J120705
$$ 93861581 92988652 92534514 92267576 92214677 92516783 93255972 94173639 95189757 96310462
3055I6310462J500574K028318K083774J812481R30244m25185k005656l400953
$$ 96310462 97811036 99839354 101923128 103735609 104665853 104240668 102235012 98834059
3047I8834059m277183m471756l926384l203743k526706j998849j746518j613126
$$ 98834059 94556876 90085120 86158736 82954993 80428287 78429438 76682920 75069794
3039G5069794j307907j104346r87871q53256q39318q22543n13474m80745n66217
$$ 75069794 73761887 72657541 71669670 70816414 69977096 69154553 68641079 68160334 67594117
3030F7594117n65663n55452j394444j702312j493417j348134r23959p75709o69607
$$ 67594117 67028454 66473002 65078558 63376246 61882829 60534695 59610736 58835027 58165420
3021E8165420l31601k46587J12198K26966L11479N97933O90291J103140J319205
$$ 58165420 57833819 57587232 57699430 57926396 58237875 58835808 59526099 60629239 61948444
3012F1948444J677862J897034K069788J942353J613314J225128m6631j541278
$$ 61948444 63626306 65523340 67593128 69535481 71148795 72373923 72327292 70786014
3004G0786014j879327j365102n97297J10222M90217N28059O22335R50571J541264
$$ 70786014 68906687 67541585 66944288 67054510 67544727 68072786 68695121 69645692 71186956
2995G1186956J991236K382909K615524L013871L418847L588839M056938M425282
$$ 71186956 73178192 75561101 78176625 81190496 84609343 88198182 92255120 96680402
2987I6680402M505251M835205N064639M979556M539667L781118K118180k12953
$$ 96680402 101185653 106020858 111085497 116065053 120604720 124385838 126504018 126291065
2979A26291065j795958k104020j898127j586447j410630j206258q17764q43865
$$ 126291065 124495107 122391087 120492960 118906513 117495883 116289625 115471861 114627996
2971A14627996k80243K81679N00329Q53783J176655J427544J785037J912453K136940
$$ 114627996 114347753 114629432 115129761 115983544 117160199 118587743 120372780 122285233 124422173
2962A24422173K169830K095708J964659J663918J167338N90967k39155j104447
$$ 124422173 126592003 128687711 130652370 132316288 133483626 134074593 133835438 132730991
2954A32730991j903694k791000l595850m352789m765594n004881m978513m847456
$$ 132730991 130827297 128036297 124440447 120087658 115322064 110317183 105338670 100491214
2946A00491214m642375m365254l909990l769501l455040l176659k920946k895174
$$ 100491214 95848839 91483585 87573595 83804094 80349054 77172395 74251449 71356275
2938G1356275k722046k829913k519773k262926k203906k044519j778498j653483
$$ 71356275 68634229 65804316 63284543 61021617 58817711 56773192 54994694 53341211
2930E3341211j429333j352737j383145j292864j205040j264427j471470j330156
$$ 53341211 51911878 50559141 49175996 47883132 46678092 45413665 43942195 42612039
2922D2612039j174436r33057r90978r05058q59087o81756p58009o64096o58426
$$ 42612039 41437603 40504546 39513568 38608510 37749423 37067667 36309658 35645562 34987136
2913C4987136o57125m44739n83103m57796m86582m64125m22616k90492l79918
$$ 34987136 34330011 33885272 33302169 32844373 32357791 31893666 31471050 31180558 30800640
2904C0800640m72809l77811l97721l01565k67913r6969k70287j30965n55o0963
$$ 30800640 30327831 29950020 29552299 29250734 28982821 28885852 28615565 28484600 28484045 28423082
2894B8423082k0206L1143O3971R1726J89161M67579R7875l34775q01431j121353
$$ 28423082 28402876 28434019 28497990 28589716 28778877 29246456 29344331 29009556 28208125 27086772
2884B7086772j008727q69544o54718n15936m67212l82857l96528k84046k62469
$$ 27086772 26078045 25208501 24553783 24037847 23570635 23187778 22791250 22507204 22244735
2875B2244735j89543j91348k34344j46740k25195j92385m2249k29084k04580j76312
$$ 22244735 22055192 21863844 21629500 21482760 21257565 21065180 21022931 20793847 20589267 20412955
2865B0412955j45723j47652j35189j49828j21732r6480j2310K1298n6820N4489
$$ 20412955 20267232 20119580 19984391 19834563 19712831 19616351 19604041 19625339 19568519 19623008
2855A9623008j19919r9299M657P3130m5370N0794j2382J23530O5883J33337q6388
$$ 19623008 19503089 19403790 19408447 19481577 19436207 19487001 19474619 19598149 19664032 19797369 19710981
2844A9710981R5313J67251J47826m703R6505J26443J07411J64008K21820K50761
$$ 19710981 19806294 19973545 20121371 20116668 20213173 20339616 20447027 20611035 20832855 21083616
2834B1083616K24251K18386J26483K48757M35341L86685K42111N89507L92732
$$ 21083616 21307867 21526253 21652736 21901493 22336834 22723519 22965630 23555137 23947869
2825B3947869M29159M67901N28247P24845O55865M63374J62296J28848r2668l17962
$$ 23947869 24377028 24844929 25373176 26098021 26753886 27217260 27379556 27508404 27415736 27097774
2815B7097774j32365L4637J47258J70740J90837J67155K62582L45059M47292M22236
$$ 27097774 26965409 27000046 27147304 27318044 27508881 27676036 27938618 28283677 28730969 29153205
2805B9153205K92901M61922L97648L54438O95474N83033O46771P12290P72710
$$ 29153205 29446106 29908028 30305676 30660114 31355588 31938621 32585392 33297682 34070392
2796C4070392P42651P97282O35454P15237P05259P54922P84862O45492Q90359
$$ 34070392 34813043 35610325 36245779 36961016 37666275 38421197 39206059 39851551 40741910
2787D0741910J025581R03338Q11243J026202J073334J072089J263799J304787
$$ 40741910 41767491 42670829 43482072 44508274 45581608 46653697 47917496 49222283
2779D9222283J438091J502423J547774J496568J652117J727952J743449J771068
$$ 49222283 50660374 52162797 53710571 55207139 56859256 58587208 60330657 62101725
2771F2101725J704243J802567J773881J813009J937068K009910K223112K364130
$$ 62101725 63805968 65608535 67382416 69195425 71132493 73142403 75365515 77729645
2763G7729645K626321K863489L031696L184183L480490L858230M404740M930874
$$ 77729645 80355966 83219455 86251151 89435334 92915824 96774054 101178794 106109668
2755A06109668N314510N706066O201905O869477P374357P970863Q632617R527791
$$ 106109668 111424178 117130244 123332149 130201626 137575983 145546846 154179463 163707254
2747A63707254J0470672J1751991J3247750J5037563J6647358J7937987J8384112
$$ 163707254 174177926 185929917 199177667 214215230 230862588 248800575 267184687
2740B67184687J7150047J4166580R031286K584100k505949n032308n137529l977560
$$ 267184687 284334734 298501314 307532600 310116700 307610751 302578443 297440914 293463354
2732B93463354k703026j066666P86474K658597M219698N153303N908543O417103
$$ 293463354 290760328 289693662 290480136 293138733 297358431 302511734 308420277 314837380
2724C14837380O726349P193818Q082899R838562J2584901J5390393J7590128J8025773
$$ 314837380 321563729 328757547 336840446 346679008 359263909 374654302 392244430 410270203
2716D10270203J5813117J0466985J895307q904441j9080581k6235254k9034979
$$ 410270203 426083320 436550305 438445612 429541171 410460590 384225336 355190357
2709C55190357k8780265k6536069k3694279k0800888j8227901j5926799j3847031
$$ 355190357 326410092 299874023 276179744 255378856 237150955 221224156 207377125
2702B07377125j2029864j0552769r204662q211867p722405p557986p594943p491953
$$ 207377125 195347261 184794492 175589830 167377963 159655558 152097572 144502629 137010676
2694A37010676p188506o631593o072955n516587m923124m433730m015875l597921
$$ 137010676 129822170 123190577 117117622 111601035 106677911 102244181 98228306 94630385
2686I4630385l352401k974961k753560k415326k379989k192585k325775k504610
$$ 94630385 91277984 88303023 85549463 83134137 80754148 78561563 76235788 73731178
2678G3731178k643073k791867k751610k529697k420038k061876j836166j830465
$$ 73731178 71088105 68296238 65544628 63014931 60594893 58533017 56696851 54866386
2670E4866386j503797j477859j305335j272871r52107r74732r44474q59675q91613
$$ 54866386 53362589 51884730 50579395 49306524 48354417 47379685 46435211 45575536 44683923
2661D4683923j109983j137867j214992j278907r96761j165803j157780j001602
$$ 44683923 43573940 42436073 41221081 39942174 38945413 37779610 36621830 35620228
2653C5620228q48118q51452p37394q95554p31117o98493n92337o55269n94518
$$ 35620228 34772110 33920658 33183264 32287710 31556593 30858100 30265763 29610494 29015976
2644B9015976m37362n40944m99302m62422n31434l86600m21669m68402n94021
$$ 29015976 28578614 28037670 27538368 27075946 26544512 26157912 25736243 25267841 24673820
2635B4673820n57745l51629m59673o35484n35947n48696l66476m98087n08847
$$ 24673820 24116075 23764446 23304773 22669289 22133342 21584646 21218170 20720083 20211236
2626B0211236l27232l29340l05200m56123l91442k50205k09376k07975k62423
$$ 20211236 19884004 19554664 19249464 18793341 18401899 18151694 17942318 17734343 17471920
2617A7471920l12325j11230l40932k37918k14335q1565l16941l12100j52477j96753
$$ 17471920 17159595 17048365 16707433 16469515 16255180 16173615 15856674 15544574 15392097 15195344
2607A5195344k65606l98562k98180l61135k46113k26496k30461k61123k31579
$$ 15195344 14929738 14531176 14232996 13871861 13625748 13399252 13168791 12907668 12676089
2598A2676089j80399l80699k19385j93964k91680j96284j20345j63219j30874
$$ 12676089 12495690 12114991 11895606 11701642 11409962 11213678 11093333 10930114 10799240
2589A0799240j59721k23933k08604o9831r6807k08659k57447j13873j36322j87749
$$ 10799240 10639519 10415586 10206982 10137151 10040344 9831685 9574238 9460365 9324043 9136294
2579I136294j12322j33500l7105o9830m2203j68492j52297j75182j21347k4794
$$ 9136294 9023972 8890472 8853367 8783537 8741334 8572842 8420545 8245363 8124016 8099222
2569H099222p4101j65793l1778j12712m4858j48457q0320j74975l9483k23744
$$ 8099222 8025121 7859328 7827550 7714838 7669980 7521523 7441203 7266228 7226745 7003001
2559G003001r9227l6088j86907j32940l9512n1756r7192l5152l5206j27229k27596
$$ 7003001 6903774 6867686 6680779 6547839 6508327 6456571 6359379 6324227 6289021 6161792 5934196
2548E934196j07789n2702J7135l2986j51164j27511k2227r7037J697j16528l3049
$$ 5934196 5826407 5773705 5790840 5757854 5606690 5479179 5456952 5359915 5361612 5245084 5212035
2537E212035r624q5147n1874o0151q6260j32570j35643o4122j01247q1845N9365
$$ 5212035 5202411 5117264 5065390 5005239 4918979 4786409 4650766 4586644 4485397 4403552 4462917
2526D462917Q938K3233k3602j00139J4350o6414k3877j1142P6773j82635P7933
$$ 4462917 4471855 4495088 4471486 4371347 4385697 4319283 4295406 4284264 4361037 4178402 4256335
2515D256335j50752j25408j27550L1506j3909K7193J5669L3009J3211o4698p0973
$$ 4256335 4105583 3980175 3852625 3884131 3870222 3897415 3913084 3946093 3959304 3894606 3823633
2504C823633j31214m1898K20n1091L2816p9664R6990R2761L1839k8469j6156J19941
$$ 3823633 3692419 3650521 3650741 3599650 3632466 3552802 3649792 3742553 3774392 3745923 3729767 3849708
2492C849708j35632J52597J15983k5919j2890J12048K450J79223p09Q3451j2949
$$ 3849708 3714076 3866673 3982656 3956737 3943847 4055895 4058345 4237568 4236859 4320310 4307361
2481D307361n2053O0763n383K9300m1289j89250Q6346J6510q5898J7509j5977
$$ 4307361 4255308 4316071 4310688 4339988 4298699 4109449 4195795 4212305 4126407 4143916 4127939
2470D127939Q4504J9022j01463J39069P2316p7413K4763k1962R866j0890l0541
$$ 4127939 4212443 4231465 4130002 4269071 4341387 4263974 4288737 4266775 4276641 4265751 4235210
2459D235210m6745N5545o9278k37121j6862j35608r7865j15985k45329p1976m2451
$$ 4235210 4188465 4244010 4174732 3937611 3920749 3785141 3687276 3571291 3325962 3253986 3211535
2448C211535k70096j31318j024P3243k6985k08074o3870j52657l7879j33101J3925
$$ 3211535 2941439 2810121 2809097 2882340 2855355 2647281 2583411 2430754 2392875 2259774 2273699
2437B273699j7279l1050J06517j69598n6653O3548j70855j9388k3430k20705M1998
$$ 2273699 2256420 2225370 2331887 2162289 2105636 2169184 1998329 1978941 1955511 1734806 1776804
2426A776804Q5392o141m1303L288j69412l0443J12571r6454j6628L2060l787Q8766
$$ 1776804 1862196 1856055 1814752 1818040 1648628 1618185 1730756 1634302 1617674 1649734 1645947 1734713
2414A734713j48442j26542K3021m8453M4466Q7823j90908m6630K7914Q241j67766
$$ 1734713 1586271 1459729 1482750 1434297 1478763 1566586 1375678 1329048 1356962 1365203 1197437
2403A197437q9822J38234q4002l2527j4140J24813j5247p0810j0770J46596j03110
$$ 1197437 1107615 1245849 1161847 1129320 1115180 1239993 1224746 1153936 1143166 1289762 1186652
2392A186652J0807M5226j20631N1880O436n5746Q1118j39971P147K7671r1326
$$ 1186652 1197459 1242685 1122054 1173934 1180370 1124624 1205742 1065771 1072918 1100589 1009263
2381A009263p571q1489R1283p8517R849m9854Q1904O8158R866k4746j04335r2624
$$ 1009263 1001692 920203 1011486 932969 942818 892964 974868 1043026 1052892 1028146 923811 831187
2369H31187o5018J52915k0535R53J97739q8444j08244M4710K4998n4988m8397
$$ 831187 766169 919084 898549 899502 1097241 1008797 900553 945263 970261 915273 866876
2358H66876l9318J525j27034J600R5477J4629j2923j21580J18688m3438l8410
$$ 866876 827558 829083 702049 703649 799126 813755 800832 679252 797940 754502 716092
2347G16092M0231j02520j0602L2734P5846j40852m7578J14237L9678o4616L4158
$$ 716092 756323 653803 643201 675935 751781 610929 563351 677588 717266 652650 686808
2336F86808K8206q3490K1503J07140j11079l1616R2263q4815O0482j30233k1960
$$ 686808 715014 631524 653027 760167 649088 617472 709735 624920 685402 555169 533209
2325E33209J8930J38807l7543r1631J57639J2346n0972q5593K696N1974O558q3358
$$ 533209 552139 690946 653403 561772 719411 731757 680785 595192 597888 649862 656420 573062
2313E73062m3367L9109K41M1771Q8154j66159l0313J2505K9717Q7695p6149j3558
$$ 573062 529695 568804 569045 610816 698970 532811 502498 515003 544720 632415 556266 542708
2301E42708M6812J22623r9231n0624R728J10656R7132k0656p0138m0392J37444
$$ 542708 589520 712143 612912 562288 572016 682672 779804 759148 689010 648618 786062
2290G86062j29267j14858N0760n7434m9498M159J8796P9804m8709O2311k8777
$$ 786062 656795 541937 592697 535263 485765 489924 508720 588524 539815 602126 573349
2279E73349k23574M7188n864O3955L4414P8982j3810k2565o7420P381Q995j25481
$$ 573349 349775 396963 391099 455054 489468 568450 554640 532075 464655 472036 481031 355550
2267C55550n3082J52679J36360k6258o0162o7222L6933n479k691r2524M0731J00399
$$ 355550 302468 455147 591507 565249 505087 437865 474798 469319 466628 374104 414835 515234
2255E15234k03768l7120L5902N0261J3832J10118j0104r3928J6936q297n643n5690
$$ 515234 311466 274346 310248 360509 374341 484459 474355 380427 397363 389066 383423 327733
2243C27733n0710J92672l464p7641J6827n1662J61918P4228r3761m7203Q3543
$$ 327733 277023 469695 466231 388590 405417 353755 515673 589901 496140 448937 532480
2232E32480o2045M7461N3360j25204k9545J73115j34931J05976n7688r0672L4095
$$ 532480 470435 517896 571256 446052 416507 589622 454691 560667 502979 412307 446402
2221D46402k5730J5493j7202M6551k9251N6501Q9861r758j49516j1235Q382Q7601
$$ 446402 420672 436165 418963 465514 436263 492764 582625 572867 423351 412116 420498 508099
2209E08099L3746j64209M3124o2185Q9560n6123q1115K2799m2594J20758m5311
$$ 508099 541845 377636 420760 358575 448135 392012 310897 333696 291102 411860 366549
2198C66549j0047k9652J8677J34013q9731K1794o0509m2624P9839L9676K4886
$$ 366549 356502 326850 345527 479540 389809 411603 351094 308470 388309 427985 452871
2187D52871L6207M1576K3180r0963p4682J35041K4668n1137n9629q2666P0508
$$ 452871 489078 530654 553834 462871 388189 523230 547898 496761 437132 354466 424974
2176D24974r6678R0271J65634r2256J7658p017M2217o0689r3198R3439p290P3815
$$ 424974 328296 418567 584201 491945 509603 502586 544803 484114 390916 484355 477065 550880
2164E50880L7715J2026O4978J0304j41308R2588J30763j7065o0256q7140N6350
$$ 550880 588595 600621 665599 675903 534595 627183 757946 740881 680625 593485 649835
2153F49835k8831n8894M1736O0752P582j842L2465K3448n957n5392M4663L8910
$$ 649835 621004 562110 603846 664598 672180 670338 702803 726251 720294 664902 709565 748475
2141G48475q2006P2999Q0940O1513Q1716k6559O828N1307l7625P5645o446N7141
$$ 748475 666469 739468 820408 881921 963637 937078 943906 995213 957588 1033233 1026787 1083928
2129A083928P185l7053m9156Q0473P5484k3608k2220J37141k4808K7131P6189
$$ 1083928 1091113 1054060 1004904 1085377 1160861 1137253 1115033 1252174 1227366 1254497 1330686
2118A330686K491k2825r6726J04170R5328j4069p2871j40680L14916P9390n6470
$$ 1330686 1333177 1310352 1213626 1317796 1413124 1399055 1326184 1185504 1500420 1579810 1523340
2107A523340M6272J47631P8232q5434j9892j8649M0557L3049M2953J87426j34955
$$ 1523340 1569612 1717243 1795475 1710041 1690149 1671500 1712057 1745106 1788059 1975485 1840530
2096A840530J21607J48097Q7638L8771L5647O990K0907N4366O9497J25840m3971
$$ 1840530 1962137 2110234 2197872 2236643 2272290 2279280 2300187 2354553 2424050 2549890 2505919
2085B505919K27334K08975J78334K31717J67442K50466J91550K23007K69655K36195
$$ 2505919 2733253 2942228 3120562 3352279 3519721 3770187 3961737 4184744 4454399 4690594
2075D690594L03989K41192K51306M65103N30259O18323O23859Q74355R14072R30598
$$ 4690594 4994583 5235775 5487081 5952184 6482443 7100766 7724625 8598980 9513052 10443650
2065A0443650Q69956Q95917J058859J397073J877473K345097K798863L390986
$$ 10443650 11313606 12209523 13268382 14665455 16542928 18888025 21686888 25077874
2057B5077874M664877N502859O911218R931996O998645m911206r606449j0476419
$$ 25077874 29742751 35245610 42156828 52088824 59087469 54176263 44569814 34093395
2049C4093395q036882m806913l450125k450673j928813j389306j334230r16079
$$ 34093395 26056513 21249600 17799475 15348802 13419989 12030683 10696453 9780374
2041I780374p79877l78439n58140o05041o17596n62007n44198k44164l48065j55972
$$ 9780374 9000497 8622058 8063918 7458877 6841281 6279274 5735076 5490912 5142847 4986875
2031D986875k82537l89320k15885j57409k68956r3419j89917j14659J8922r3913
$$ 4986875 4704338 4315018 4099133 3941724 3672768 3579349 3389432 3274773 3293695 3199782
2021C199782r4253k7083k26080k40957j25482l9544j60730j38755L7729p3145
$$ 3199782 3105529 3078446 2852366 2611409 2485927 2446383 2285653 2146898 2184627 2111482
2011B111482k42219l7569L2325p8151j81704l8898L2555n6133j63064P337j9811
$$ 2111482 1869263 1831694 1864019 1785868 1604164 1565266 1597821 1541688 1378624 1385961 1366150
2000A366150m4335r1108P0193m0645l9557L1940j21668L7131p7210j12871J361
$$ 1366150 1321815 1230707 1300900 1260255 1220698 1252638 1130970 1168101 1090891 978020 979381
1989I79381L3299K9949l909m9053k9819R935P9274J99j94109J2676L1484m8034
$$ 979381 1012680 1042629 1038720 989667 959848 969783 1049057 1049256 855147 867823 899307 851273
1977H51273o3071l8867K5021J36544l6527n0657j14308q2534M2031R7785J9733
$$ 851273 788202 749335 774356 910900 874373 823716 709408 626874 668905 766690 786423
1966G86423j89556o5335K1082L6815j5284q7598L8393j5926r5191R4607P9432
$$ 786423 596867 531532 552614 589429 574145 486547 524940 509014 413823 508430 587862
1955E87862p2663j17858j06090J11159M9790j7781N3407j37513n7149J06954J53727
$$ 587862 515199 397341 291251 402410 452200 434419 487826 350313 293164 400118 553845
1944E53845k1069j04571N536M4875j14672L5831m3212P3429o3458J7738m753q3593
$$ 553845 532776 428205 433741 478616 363944 399775 356563 429992 366534 384272 379519 295926
1932B95926O121Q4857J24146q0074N873l4878p9007J24782Q1807r8735j29321
$$ 295926 302047 386904 511050 430976 436849 401971 322964 447746 529553 430818 301497
1921C01497j02024J5897N7087J1390P2813n4222j51398O3741J7830J88041j26538
$$ 301497 199473 215370 272457 283847 356660 302438 151040 214781 232611 420652 294114
1910B94114r9532L8728k9021Q4612L0072L0725j20803M0817O463N2243k11037
$$ 294114 194582 233310 204289 288901 318973 349698 228895 269712 276175 328418 117381
1899A17381l1117R042Q7640m5302n168O8040j7580L1970k1448J73783r2102q0287
$$ 117381 86264 95306 182946 137644 132476 200516 182936 214906 193458 367241 275139 194852
1887A94852j38573N8928J53441J8277p1839P123K2369M9081O7987L4590l7097
$$ 194852 56279 115207 268648 286925 215086 222209 244578 293659 361646 396236 359139
1876C59139j31873j70130J31642q6243j3265P1133L7852J2520j17602P1222m9187
$$ 359139 227266 57136 188778 102535 89270 160403 198255 210775 93173 164395 115208
1865A15208o2799N1630N8478J4732J01224J3399r3589o0728M9687j13712j6683
$$ 115208 52409 104039 162517 177249 278473 291872 198283 137555 187242 73530 56847
1854E6847j104L0657O1467J5927Q6122j5498n4864K5201j9810k8323l3898j14656
$$ 56847 55743 86400 147867 163794 249916 234418 179554 204755 184945 156622 122724 8068
1842H068J438l1289N9386N9374K7654M0398n0064j01482J6903l2231P9394J24739
$$ 8068 9506 -21783 37603 96977 124631 165029 114965 13483 30386 -1845 77549 202288
1830B02288q5915N4299J6788k8518j49500j8013J11215Q482N1831N5137j41770
$$ 202288 116373 170672 187460 158942 9442 -8571 102644 111126 162957 218094 76324
1819G6324k2088R4679L8760J48L9745R078K7580K0516O3311J8678r5370n6979
$$ 76324 54236 148915 187675 187823 227568 236646 264226 284742 348053 366731 271361 214382
1807B14382j7399J5991j7390l4512L60k0859L6044n3358J7860j2884p534J4967
$$ 214382 196983 212974 195584 161072 161432 140573 176617 123259 141119 128235 120701 135668
1795A35668n4861r3356k0215R9788l9646Q2228j5713j8079k7056K0816k8969J05127
$$ 135668 80807 -12549 -32764 67024 27378 109606 93893 75814 48758 69574 40605 145732
1783A45732M4638p8121j2151j13765K7998J17710l4098n5542K3965j4123j36145
$$ 145732 190370 112249 100098 -13667 14331 132041 97943 42401 66366 52243 -83902
1772h3902J11534M7246l9723o2925L5041O8022M6864n041k7092n4771R053M1518
$$ -83902 27632 74878 35155 -27770 7271 75293 122157 117116 90024 35253 44306 85824
1760H5824M734j97745Q4474J02986l7339O4263O1397q9383p4505p5557N6538j2029
$$ 85824 90558 -107187 -22713 80273 42934 107197 168594 79211 4706 -70851 -14313 -26342
1748b6342k8522J4478j38351P0171L2994J18635K584l1699j50451j8258J9958
$$ -26342 -54864 -40386 -178737 -108566 -75572 43063 45647 13948 -136503 -154761 -134803
1737a34803N5811P4451M0447m8715R7979O6998m112j36339J00158k9144k24L0404
$$ -134803 -78992 -4541 35906 -12809 85170 152168 148056 11717 111875 82731 82507 112911
1725A12911n3972L940R8139p7981n5600M5010j00576R775j1909n7320P5834q063
$$ 112911 58939 62879 161018 83037 27437 72447 -28129 -18354 -30263 -87583 -11749 -19812
1713a9812J390m893O2099o4709L6037j5709O007J05076o3832M6281j09755l1594
$$ -19812 -18422 -23315 38784 -25925 10112 -5597 410 105486 41654 87935 -21820 -53414
1701e3414P6710J4894r7925J39353K7517j14735J2491J19878J0537l7741n8229
$$ -53414 23296 38190 -59735 79618 107135 -7600 4891 124769 135306 97565 39336
1690C9336l0154j27531j852M6735o7773J9160K43773n9337K9696l7495l3243J8463
$$ 39336 9182 -118349 -120201 -73466 -141239 -122079 121694 62357 92053 54558 21315 39778
1678C9778l8069M5407J6924N5360j28406l8780M3444O9816r5305k618J5158q0287
$$ 39778 1709 47116 64040 119400 -9006 -47786 -4342 65474 -29831 -32449 -17291 -97578
1666i7578M7132m3633J4634N0285K0111P0801K6663o1547O3731r4440j9554P0992
$$ -97578 -50446 -94079 -79445 -29160 -9049 61752 88415 26868 90599 -3841 -23395 47597
1654D7597l9308o3366K936Q8500o4358j35276L2920J22339O6630r1043P13J31303
$$ 47597 8289 -55077 -52141 36359 -27999 -163275 -130355 -8016 58614 -32429 -31716 99587
1642I9587j2298l3358J03697j58716j03432O3608m5735K5409M9963o7627n9655
$$ 99587 87289 53931 157628 -1088 -104520 -40912 -86647 -61238 -11275 -78902 -138557
1631a38557N6042k8078J40060J17556j14502p6123N6530j22706J19703j45312
$$ -138557 -82515 -110593 29467 147023 32521 -43602 12928 -109778 9925 -135387
1621a35387o8908J11753J27577j9732J24467j09935k07051J43057m2948j791K1816
$$ -135387 -204295 -92542 35035 15303 139770 29835 -177216 -34159 -77107 -78898 -57082
1610e7082M9051k05j00038n6043J83811J3344m4321j9093o677o9422Q1497Q8379
$$ -57082 -8031 -8236 -108274 -164317 19494 32838 -11483 -30576 -37253 -106675 -25178 63201
1598F3201j117j01921L2757L3640j65707m8677J39822O4576p6391J9307p3010
$$ 63201 62084 -39837 -7080 26560 -139147 -187824 -48002 16574 -59817 -40510 -113520
1587a13520j1767L7766j6866Q9159O1582q8463J4964q6350J9560N8975L300o0508
$$ -113520 -125287 -87521 -104387 -15228 46354 -42109 -27145 -113495 -93935 -34960 -31660 -92168
1575i2168l323N2524R4898j7754o1535N8638L4225o4321L1480J8472K4376K2547
$$ -92168 -95491 -42967 51931 34177 -27358 31280 65505 1184 32664 51136 75512 98059
1563I8059n9256q3269k1333m3651l204O0374N0147j283q5569j1023K9252P2797
$$ 98059 38803 -44466 -65799 -109450 -112654 -52280 -2133 -3416 -88985 -100008 -70756 2041
1551B041j2830l478j7620l8558K4139j8616q4415J1413Q0987j952r887R8348k6300
$$ 2041 -10789 -14267 -31887 -70445 -46306 -64922 -149337 -137924 -56937 -58889 -68776 29572 3272
1538C272J0175p8577j0712l5661J50443K2239p2891K8528k1496L4709K674q702
$$ 3272 13447 -65130 -75842 -111503 38940 61179 -11712 16816 -4680 30029 32703 24001
1526B4001P4182j2508r1112p259J4695n6852M5450K25669k5917j76011r5065j9541
$$ 24001 98183 85675 -5437 -12696 1999 -54853 -9403 216266 190349 14338 -80727 -100268
1514a00268M5145J0434J02879J47181j77674o793k9660m012k7029M2992l1650
$$ -100268 -55123 -44689 58190 205371 27697 20904 -8756 -12768 -39797 3195 -28455
1503b8455j18235J30147N522k377j10291Q1263K3901O6041P701j12629o9742O7596
$$ -28455 -146690 -16543 -11021 -13398 -123689 -42426 -18525 47516 55217 -57412 -127154 -59558
1491e9558J29331J4552r3525q283J35915r2956n3701K3489m3056o2497L133Q8534
$$ -59558 69773 84325 -9200 -17483 118432 25476 -28225 -4736 -47792 -110289 -107156 -18622
1479a8622k3324m2345j5849P8778L1815m1990j7474o9134r3486O8675N7241Q2395
$$ -18622 -41946 -84291 -100140 -21362 10453 -31537 -49011 -118145 -211631 -142956 -85715 -3320
1467c320r6000j3467J44584j41558l5234O1361n8815M5586K12862j43955j2735
$$ -3320 -99320 -112787 31797 -109761 -144995 -83634 -142449 -96863 115999 -27956 -40691
1456d0691N0434j54157N9600K6124j2842J12656o3105p4261J912N0453K0961p8862
$$ -40691 9743 -144414 -84814 -58690 -71532 41124 -21981 -96242 -94330 -43877 -22916 -101778
1444a01778P6622N970L7373j17574N0521Q5327j20093J45987J7232o7166L7395
$$ -101778 -25156 -19186 18187 -99387 -48866 36461 -83632 62355 79587 12421 49816
1433D9816p773k8065J4467j18995P152j223M5389o5157k7029m6051Q3653j01500
$$ 49816 42043 13978 28445 -90550 -83398 -84621 -39232 -104389 -131418 -177469 -93816 -195316
1421a95316J25035J750l7479J39407p8771M8189J317N5672L1369r2224o1481l3506
$$ -195316 -70281 -68531 -106010 33397 -45374 2815 4132 59804 91173 -1051 -62532 -96038
1409i6038J914P3545j0932O7241n8961l6663n18O4436j9964m6524o0714P5697
$$ -96038 -94124 -20579 -31511 35730 -23231 -59894 -60412 4024 -15940 -62464 -123178 -47481
1397d7481p6624o9879P0901O8197Q6432m5463m8574o5964L3054J04549N7818K32
$$ -47481 -124105 -193984 -123083 -54886 31546 -13917 -62491 -128455 -95401 9148 66966 67198
1385F7198O5798l4067J2986n7674l1494J3693n7486R3902p07j1085j31574n0217
$$ 67198 132996 98929 111915 54241 22747 36440 -21046 72856 72149 61064 -70510 -120727
1373a20727M4436Q4092j3975L2963m298k0252J6055M1277o2406k7233O2389p1270
$$ -120727 -76291 7801 -6174 26789 22491 2239 18294 59571 -2835 -30068 32321 -38949
1361c8949P7632m7183l4302j03804k9002R8678M9565M7547k1608m6113J45590
$$ -38949 38683 -8500 -42802 -146606 -175608 -76930 -27365 20182 -1426 -47539 98051
1350I8051p5119q3848Q7244j9233j7080L9487l2712L7508j11870P3018q3295k9905
$$ 98051 22932 -60916 26328 7095 -9985 29502 -3210 34298 -77572 -4554 -87849 -117754
1338a17754J11277P0686n2643o3260N851J7181L9430l6885m9271O9875j5187p6308
$$ -117754 -6477 64209 11566 -51694 -45843 -28662 10768 -26117 -75388 -5513 -20700 -97008
1326i7008n5510P0623J06755k1000M325o1551J4676K0435L8947j59959J75776
$$ -97008 -152518 -81895 24860 3860 8185 -53366 -38690 -18255 20692 -139267 36509
1315C6509K6398j4649j45997m4924M6572P4528n5615k9522K5967O5905n0871M6797
$$ 36509 62907 48258 -97739 -142663 -96091 -21563 -77178 -106700 -80733 -14828 -65699 -18902
1303a8902p1577M6344M1819j6198n6914k2769N1255N775R5991o4059N0974q177
$$ -18902 -90479 -44135 -2316 -18514 -75428 -98197 -46942 -41167 54824 -9235 41739 33562
1291C3562p1181O4055K6223M6663j7776m5230m2037q6901R000O2566J43517j5243
$$ 33562 -37619 26436 52659 99322 81546 36316 -5721 -92622 -83622 -21056 122461 107218
1279A07218n7642j07053l350l3742Q6768k3699m1996j8831k5335o7141O6073O9130
$$ 107218 49576 -57477 -60827 -94569 -7801 -31500 -73496 -92327 -117662 -184803 -118730 -49600
1267d9600m7823K823r1988J30462P1063j78384M6006j0455k4091Q9856M5234L3751
$$ -49600 -97423 -94600 -186588 -56126 14937 -163447 -117441 -127896 -151987 -62131 -16897 16854
1255A6854m2581j14595J067n5689J8859L3370J20712K7310p8352Q0773j0231J40415
$$ 16854 -25727 -140322 -139255 -194944 -176085 -142715 -22003 5307 -73045 7728 -2503 137912
1243A37912k519j5028j44912k901J2278r9439N6490l8528J08391j9668J06810
$$ 137912 135393 120365 -24547 -27448 -15170 -114609 -58119 -96647 11744 -7924 98886
1232I8886m9851q9401l155o9299n5345L7633q216J27660R2234q7522P0065L5941
$$ 98886 49035 -40366 -43521 -112820 -168165 -130532 -138748 -11088 81146 -6376 63689 99630
1220I9630P2280k6398j55379Q4847O4509j43997j63931K3502K10910j229j578
$$ 99630 171910 145512 -9867 74980 139489 -4508 -168439 -144937 65973 64744 63166
1209F3166j7544n0139r541K7650N4388n4488j09677N4310j3492Q5082o6881N0999
$$ 63166 45622 -4517 -14058 13592 67980 13492 -96185 -41875 -55367 29715 -37166 13833
1197A3833L9916p5958j1007n208J7186n2448p598K8687o9111P0660J05251j23909
$$ 13833 53749 -22209 -33216 -38424 -21238 -73686 -81284 -52597 -121708 -51048 54203 -69706
1185f9706L9954l0238r874n807N3926M0798j6163l7880k4184J7565P8618p2606
$$ -69706 -29752 -59990 -69864 -75671 -21745 19053 2890 -34990 -59174 -41609 37009 -35597
1173c5597j3524M4204q241J9411K2374n912K3155J6285K6692l7710j31985O7915
$$ -35597 -49121 -4917 -13158 6253 28627 22715 45870 62155 88847 51137 -80848 -12933
1161a2933K0163M4779j5364k8340p2996K8670j3312K4337n8609K0685N559p3396
$$ -12933 7230 52009 36645 8305 -64691 -36021 -49333 -24996 -83605 -62920 -57361 -130757
1149a30757J89255P555n2749l0855K6461J04342O145m6839p5266r8666Q9134O448
$$ -130757 58498 66053 13304 -17551 8910 113252 119397 72558 -2708 -101374 -12240 -5792
1137e792K0004L0013Q615k504r4230n7846m361O0130L1353m0514J07620j69261
$$ -5792 14212 44225 52840 50336 -43894 -101740 -106101 -45971 -14618 -55132 52488 -116773
1125a16773Q1894L6715J1908J15926q3372q5031o0906M2127O6315r8905P5127
$$ -116773 -34879 1836 13744 129670 46298 -38733 -99639 -57512 8803 -90102 -14975
1114a4975K3840l8967J29272r9099J0378m457M6572q6574m8320q754M9381Q4630
$$ -14975 8865 -30102 99170 71 10449 5992 52564 -34010 -82330 -91084 -41703 42927
1102D2927j61988k9843K3577L1629O3601n875m1355q752J49648r227k9585J29590
$$ 42927 -119061 -148904 -125327 -93698 -30097 -35972 -77327 -86079 63569 54342 24757 154347
1090A54347j63725k8073J9366j46705J96994n1894K521K09k0102l6859O0847o363
$$ 154347 -9378 -37451 -18085 -164790 32204 -19690 -17169 -16960 -37062 -73921 -13074 -19437
1078a9437O142l3210J5319O5164r0520N858L3434n1128J01979Q9302p7965K7908
$$ -19437 -13295 -46505 -31186 33978 -56542 -50684 -17250 -68378 33601 122903 44938 72846
1066G2846L5304r5562r0184n2337Q8775Q999L4306K1778m7612l042k3832L2083
$$ 72846 108150 12588 -77596 -129933 -41158 -32159 2147 23925 -23687 -26729 -50561 -18478
1054a8478J17333L1299r9383o1375J1880k7367n72l0735j6455J45347k4222j6612
$$ -18478 98855 130154 30771 -30604 -18724 -46091 -46663 -77398 -93853 51494 27272 10660
1042A0660o3779O8348N3232K754o0536m5961O9475n2839O4602M4809o4910k0221
$$ 10660 -53119 15229 68461 71215 10679 -35282 34193 -18646 45956 90765 25855 5634
1030E634Q028j46213n2418J21523L9162J5174k77J1736r4158N5898N4150o1370
$$ 5634 13662 -132551 -184969 -63446 -24284 -9110 -9387 2349 -91809 -35911 18239 -43131
1018d3131q532p2066J185M9316L9854J50934r6002l5822l8740k2189m4446n912
$$ -43131 -51663 -123729 -122544 -73228 -33374 117560 21558 -14264 -53004 -75193 -119639 -125551
1006a25551N9531o102K5273l2350j3088j7650M5831J278o7828Q4149l1468j5499
$$ -125551 -66020 -72122 -46849 -79199 -92287 -109937 -64106 -62828 -130656 -46507 -77975 -93474
994i3474Q0434L0191o8518R5916r3304o2926n2162L1362R3183m7547j0646Q0630
$$ -93474 -13040 17151 -51367 44549 -48755 -111681 -163843 -132481 -39298 -86845 -97491 -16861
982a6861m8605l6351R5780J20344O3117r1036m2533l0536j1597k2849J00127k8251
$$ -16861 -65466 -101817 -6037 114307 177424 86388 43855 13319 1722 -21127 79000 50749
970E0749l7675j19082q4371J79832L5576o1100j10710R6464P0053J3812L8844
$$ 50749 13074 -106008 -190379 -10547 25029 -36071 -146781 -50317 19736 33548 72392
959G2392L8001k4003j01842l7773J0142m520o779k9047Q8096q7198l4271J29048
$$ 72392 110393 86390 -15452 -53225 -43083 -47603 -54382 -83429 4667 -82531 -116802 12246
947A2246l3894L59p1918k6157j0816j1867o5077K23437o0694L506J7492O1912
$$ 12246 -21648 -21289 -93207 -119364 -130180 -142047 -207124 16313 -44381 -40875 -23383 38529
935C8529q4644K837k2464L8567N6757N3191j76547M9381J04140j7545r173p4244
$$ 38529 -46115 -43278 -65742 -27175 29582 82773 -93774 -44393 59747 42202 33029 -41215
923d1215M8276n3921N0360L452J3009k8169K0380j3223K4322L708J5541N8225
$$ -41215 7061 -46860 3500 6952 19961 -8208 12172 -1051 23271 26979 42520 100745
911A00745q6633j48370J09507L0087o7871M960J54714L4276j11469L0399M1972
$$ 100745 14112 -134258 -24751 5336 -62535 -57575 97139 131415 19946 50345 92317
900I2317j14682p6367n6312L9713J08977K1503N6920M6206j20029m8956J5984
$$ 92317 -22365 -98732 -155044 -115331 -6354 15149 72069 118275 -1754 -50710 -34726
889c4726m9849j9253J15J84171j6799n2135L6417j0641p6031Q4677j10031j38638
$$ -34726 -84575 -103828 -103713 80458 63659 11524 47941 37300 -38731 45946 -64085 -202723
877b02723J46433Q1686K6724k8879k3613q9361K3364L0020K560N5071M8450r3972
$$ -202723 -56290 25396 52120 23241 -372 -89733 -66369 -36349 -33789 21282 69732 -24240
865b4240p4342K5502M3013q5716N4083O695p837J4938M5360N3193L255n0260q6032
$$ -24240 -98582 -73080 -30067 -115783 -61700 -55005 -62842 -47904 -2544 50649 53904 3644 -82388
852h2388K732O8140O4184j3844j85336L2288O9746J94626l0551r3808L0314j50377
$$ -82388 -79656 -11516 52668 38824 -146512 -114224 -44478 150148 119597 25789 56103 -94274
840i4274p4310M3549K3970O0307M5043M2317p7035n4073o9426J19853O7727r3455
$$ -94274 -168584 -125035 -101065 -40758 4285 46602 -30433 -84506 -153932 -34079 33648 -59807
828e9807J80263q6491Q8620k6859k13412k9609R7868n3957J41078j9226r9581
$$ -59807 120456 33965 122585 95726 -117686 -147295 -49427 -103384 37694 18468 -81113
817h1113k5134N0943J36784m6608j3951J199l612l2704P9319k5303M1008k008
$$ -81113 -106247 -55304 81480 34872 20921 22120 18508 -14196 65123 39820 80828 78820
805G8820j45266o522N2471L010O6973P3052J4260j25043m8979M2294j389M2154
$$ 78820 -66446 -72968 -20497 -17487 49486 122538 136798 11755 -37224 5070 3681 45835
793D5835J9160q5868O5985K6860l9414j05487J1825J02822k5497m8603j3897K6156
$$ 45835 64995 -20873 45112 71972 32558 -72929 -61104 41718 16221 -32382 -46279 -20123
781b0123q5328R9594L943r967L7881O3747j04821j6105k2331M0124r7014J17117
$$ -20123 -105451 -5857 -1914 -11881 26000 89747 -15074 -31179 -53510 -13386 -110400 6717
769F717k3061J23297q9593p3537Q1501r0656R6722J20039q6738N0391j03278j5944
$$ 6717 -16344 106953 17360 -56177 25324 -65332 31390 151429 64691 115082 11804 -4140
757d140M1841M5101p9789n3710O7752r9813M4994n2260J3922P3853N725q3592
$$ -4140 37701 82802 3013 -50697 17055 -82758 -37764 -90024 -76102 -2249 3476 -80116
745h0116R0880p7517M4595O3443j716q1629r5457j3760R7772R0233k6349m9298
$$ -80116 10764 -66753 -22158 41285 39569 -42060 -137517 -151277 -53505 36728 10379 -38919
733c8919K2502R969N6661j60949k986K8053P8058L2307J1382m0589N4287n5853
$$ -38919 -16417 -6448 50213 -110736 -113722 -85669 -7611 24696 36078 -4511 49776 -6077
721f077l0675q1911L7345M3328J5004P9465p8181J11352k0163j35287Q8780O7054
$$ -6077 -36752 -118663 -81318 -37990 -22986 56479 -21702 89650 69487 -65800 22980 90034
709I0034l8115K1896l6448O7157O3838j56039k9006J660J0128k6873j3734j09735
$$ 90034 51919 73815 37367 104524 168362 12323 -16683 -15023 -4895 -31768 -45502 -155237
697a55237M8348R4334O4565K1855m4443j98935P6551O3772n607M5557p5040R6295
$$ -155237 -106889 -12555 52010 73865 29422 -169513 -92962 -29190 -34797 10760 -64280 32015
685C2015q2830N7509K090k166l5118M1262j28691J17139P3810L4546l380j40513
$$ 32015 -50815 6694 8784 6618 -28500 12762 -115929 1210 75020 109566 106186 -34327
673c4327J10558O3399m3499j07891j2018P2025L8724o1786o993j02723k98O7936
$$ -34327 76231 139630 96131 -11760 -23778 48247 86971 25185 18192 -84531 -84829 -16893
661a6893R8139j3133J3483L2480j77745j26047M6743J15380J2386J3187J40107
$$ -16893 81246 68113 81596 114076 -63669 -189716 -142973 -27593 -15207 -2020 138087
650A38087J5456j15213m5479q6418J0932J820m1255L5283P8977J8071Q8653l9778
$$ 138087 153543 38330 -7149 -93567 -82635 -80815 -122070 -86787 -7810 10261 98914 59136
638E9136o82K473n3002N5749M6728j17865o7584m468J10356M7941n0818J2167
$$ 59136 58454 60927 7925 63674 110402 -7463 -75047 -79515 30841 78782 27964 40131
626D0131Q3815n7725n0547l477R3051L0820k852j5182o3351R450q9859J4572J8343
$$ 40131 123946 66221 15674 12197 105248 136068 133216 118034 54683 64133 -25726 -11154 7189
613G189j2234p6073P809j2454L2018R8748j24902J5126J5396p4336m2210J59637
$$ 7189 -5045 -81118 -73309 -85763 -53745 45003 -79899 -64773 -49377 -123713 -165923 -6286
601f286L622o8747m8349Q0071R7915N8742j11136q0807J6627o4342K9321Q6350
$$ -6286 -2664 -71411 -119760 -39689 58226 116968 5832 -74975 -58348 -122690 -93369 -7019
589g019Q614p8967J29287k34068Q306K13862q090M4000r9190j0152o162N2161
$$ -7019 1595 -77372 51915 -182153 -173847 40015 31925 75925 -23265 -33417 -39579 12582
577A2582L0058j02887k721J41678K3841k25272R2915O1379p6024J0242r103j3443
$$ 12582 42640 -60247 -62968 78710 102551 -122721 -29806 31573 -44451 -34209 -43312 -56755
565e6755Q4634j7208Q2940L5555M6926p4837q6898J8594j224J37422o4771J02865
$$ -56755 27879 10671 93611 129166 176092 101255 14357 32951 31727 169149 104378 207243
553B07243m1715k513K6869o9734o3290n5665R6499K5374N0036J2332k7962L6476
$$ 207243 165528 163015 189884 120150 56860 1195 97694 123068 173104 185436 157474 193950
541A93950n9242o5052p2371j0266M5289n1953j3710J25936r4508o1020J65566
$$ 193950 134708 69656 -2715 -12981 32308 -19645 -33355 92581 -1927 -62947 102619
530A02619o2134J5233k610K1738n075Q3864r4291J3695l5081o8992o2671J5141
$$ 102619 40485 55718 53108 74846 69771 153635 59344 73039 37958 -31034 -93705 -78564
518g8564N4775k3108N5665k950q743M2756N2344J242l8176Q8152m3462j00813
$$ -78564 -23789 -46897 8768 5818 -2925 39831 92175 93417 55241 143393 99931 -882
506h82j0784Q4224m6781q5913k0768k29P9954J54671r6952l4555L095l1478O6690
$$ -882 -11666 72558 25777 -60136 -80904 -81133 -1179 153492 56540 21985 25080 -6398 60292
493F0292p5934Q4798j7051j568n5510J01373J436j553J5033m6854l8551J4569
$$ 60292 -15642 69156 52105 50537 -4973 96400 97836 96283 111316 64462 25911 40480
481D0480k4254K1205p0439p9723j12086J39942R8940q1447J08514n3381j9957
$$ 40480 16226 37431 -33008 -112731 -224817 -84875 14065 -67382 41132 -12249 -32206
470c2206m8007N2924J08879Q8232j59696k4590J23688n7210J268o1360l5851j02334
$$ -32206 -80213 -27289 81590 169822 10126 -14464 109224 52014 53282 -8078 -43929 -146263
458a46263m8050O2794Q9354O7267p8505J02696Q3486L6114M6937j82825K7339
$$ -146263 -194313 -131519 -42165 25102 -53403 49293 132779 168893 215830 33005 60344
447F0344N4497j10719k796P8971o0550n8534k718R0057r045K879Q7348m3448q3469
$$ 60344 114841 4122 1326 80297 19747 -38787 -41505 48552 39507 42386 129734 86286 2817
434B817Q6688q1440q7109J11557j33726M8013J70478n3445j7817J7195M546r5584
$$ 2817 89505 8065 -79044 32513 -101213 -53200 117278 63833 46016 63211 67757 -27827
422b7827j5806L0495J22588j2408l138j461O9683r7554j5114N4555o3452M7796
$$ -27827 -43633 -13138 109450 97042 93904 92443 162126 64572 49458 104013 40561 88357
410H8357J314J6232j85801M6828O8732J4709j08736J597k6306n6024j001K5106
$$ 88357 89671 105903 -79898 -33070 35662 50371 -58365 -56768 -83074 -139098 -140099 -114993
398a14993Q2607r200K2455J62163n9577j15272n9648J9659P9691J46464q4265
$$ -114993 -32386 -41586 -19131 143032 83455 -31817 -91465 -71806 7885 154349 70084
387G0084j0660o788m8360M7567M8806O9860p0182l472q2329J3884Q7009o1688
$$ 70084 59424 52636 4276 51843 100649 170509 100327 96855 14526 28410 115419 53731
375E3731j24523J3189J53383M5378j12482j8906j03982o075J7579k4653N7248
$$ 53731 -70792 -57603 95780 141158 28676 9770 -94212 -100287 -82708 -107361 -50113
364e0113k0626J09682J06233j28888j06536J06537J15156k1261P218j61639Q9098
$$ -50113 -70739 38943 145176 16288 -90248 16289 131445 110184 117402 -44237 44861
353D4861O0200k3397o2625k3973Q177O1195J48577j67441K860N2118m0617N9993
$$ 44861 105061 81664 19039 -4934 3243 64438 213015 45574 48434 100552 59935 119928
341A19928l2262j42694j11078J45554O4073j03094N7842R151m3674J6188J9008
$$ 119928 87666 -55028 -166106 -20552 43521 -59573 -1731 7420 -36254 -20066 -1058
330a058Q280J04723j910n5676o7957R891P5819K4159j21728m717N3462j77746
$$ -1058 7222 111945 110035 54359 -13598 -3707 72112 96271 -25457 -30174 23288 -154458
318a54458N9394J33103J8681o4484P63R7058j25269o3392j0268K6401N4111J3694
$$ -154458 -95064 38039 56720 -7764 -7001 90057 -35212 -98604 -108872 -82471 -28360 -14666
306a4666P3624L0719j36914N5674n5274o0207M4058O9143j52950N7868J34800
$$ -14666 58958 89677 -47237 8437 -46837 -107044 -62986 6157 -146793 -88925 45875
295D5875m1271J2892O2909j49712o1773J97163p8283j4990k5154J43978J1222
$$ 45875 4604 17496 80405 -69307 -131080 66083 -12200 -27190 -52344 91634 102856
284A02856o6208j20011j2173j0469O9967n0517N7641P1081M3889K4825r1117L7887
$$ 102856 36648 -83363 -95536 -106005 -36038 -86555 -28914 42167 86056 110881 19764 57651
272E7651j44610L2303M7414p7624Q4197J36473J62926j33020J6560K1136K906
$$ 57651 -86959 -54656 -7242 -84866 -669 135804 298730 165710 182270 203406 206312
261B06312o1905j25104j52j52959J1579J55779K4114K469L4223k0887j3702J4950
$$ 206312 144407 19303 19151 -133808 -122229 33550 57664 60133 94356 73469 59767 74717
249G4717o4410J620N6394r2458r290J29067K8556j1735j7798k0130k2349k9330
$$ 74717 10307 11927 68321 -24137 -33427 95640 124196 112461 94663 74533 52184 22854
237B2854N35q5071O7186k1427m0810K2082J9787L4613q649j1973K9725r033j240
$$ 22854 23389 -61682 5504 -15923 -56733 -34651 -14864 19749 11100 -873 28852 19819 18579
224A8579P24k7097p4829Q2547O2707o5793K7388N8499k1896k1098o866j9559r8518
$$ 18579 19303 -7794 -82623 -76 62631 -3162 24226 82725 60829 39731 32865 13306 -85212
211h5212O3774m8918L9129r005J53533j3085o6583j7342q3642O767O3961O9355
$$ -85212 -21438 -70356 -31227 -40232 113301 100216 33633 16291 -67351 -60584 3377 72732
199G2732P363M3119k9031j36076K7966Q6940j5660l3496j7904K4558r8591J7886
$$ 72732 80095 123214 94183 -41893 -13927 73013 57353 23857 5953 30511 -68080 -50194
187e0194J20306l4975n3320P1416n9896k6276O3139L342j03644l5923J36095N6222
$$ -50194 70112 35137 -18183 53233 -6663 -32939 30200 33542 -70102 -106025 30070 86292
175H6292M013n1381O4829N9356q6046j27020m0810L8567L8881O9910q2291k595
$$ 86292 90305 38924 103753 163109 77063 -49957 -90767 -52200 -13319 56591 -25700 -28295
163b8295L2961P2983L4503k8950o7435k9112j2133J41059N9334j04562P052m9538
$$ -28295 4666 77649 112152 83202 15767 -13345 -25478 115581 174915 70353 77405 27867
151B7867K0438K9416j17114J26929m9093j6928n2560O7378p151k8372N7456L7362
$$ 27867 48305 77721 -39393 87536 38443 21515 -31045 36333 29182 810 58266 95628
139I5628q8006k9901P1668K4651j10328L5760n078J5441j0022k3179J2690j0130
$$ 95628 7622 -22279 49389 74040 -36288 -528 -5606 9835 -187 -23366 -10676 -20806
127b0806L9012K2300K730J427J11543j16392K7957P0984p9113P1673k9485r1752
$$ -20806 18206 40506 43236 44663 156206 39814 67771 138755 59642 131315 101830 10078
115A0078K5577J8703j7869j04999R7378J9342n3240M431L7388R3580k0758K6154
$$ 10078 35655 54358 36489 -68510 28868 48210 -5030 -599 36789 130369 109611 135765
103A35765l4450l1853J5095P413k2435j6452k7969k7067N893j4788K2003J2660
$$ 135765 101315 69462 84557 91970 69535 53083 25114 -1953 3940 -10848 11155 23815
91B3815J178j9713J5859q7936O5765p090j1345N6863K757k0284L2255r0229k2259
$$ 23815 24993 5280 21139 -66797 -1032 -8122 -19467 37396 40153 19869 52124 -38105 -60364
78f0364Q5586j8616m3582j3964m081M4541M853J8680O4101m9460P43k9001j291
$$ -60364 25222 6606 -36976 -50940 -55021 -10480 -5627 13053 77154 27694 28437 -564 -1855
65a855P6954l4427j8378m745m07j411j6026J6450N6557n4776J0191K4014M8303
$$ -1855 75099 40672 22294 17549 17142 15731 -295 16155 72712 17936 28127 52141 100444
52A00444M3664J7116p7738j05611R920K6614O2004p4124M964N5885l5491L760
$$ 100444 144108 161224 83486 -22125 -12205 14409 76413 2289 7253 63138 27647 31407
40C1407j6592k0487L8865p033N365J5942o424o2453k0376J9255O9374K7019o6557
$$ 31407 14815 -5672 33193 26160 31525 47467 41043 -21410 -41786 -22531 46843 73862 7305
27G305N9634M8513k2999q2329m6274j2753J9594J6410L7909k215P4681o5199M4577
$$ 7305 66939 115452 92453 10124 -36150 -48903 -29309 -12899 25010 22795 97476 32277 76854
14G6854O3390n6569j2520o7890L1529M0199P3010j07902j0395L9795o3740o745
$$ 76854 140244 83675 71155 3265 34794 74993 148003 40101 29706 69501 5761 -984
2i84N4489k4201
$$ -984 53505 29304
0B9304
$$ 29304
$$ Imaginary data points
##PAGE= N=2
##DATA TABLE= (X++(I..I)), XYDATA
16383d111685p9128Q2642J08947J37247P5863J1796K1685P9625K2319P5952M4067
$$ -4111685 -4190813 -4108171 -3999224 -3861977 -3786114 -3774318 -3752633 -3673008 -3650689 -3574737 -3530670
16372c530670L2855J21749M0015O1524J0425L7202O3020R4631R2344P854O3464
$$ -3530670 -3497815 -3376066 -3336051 -3274527 -3264102 -3226900 -3163880 -3069249 -2976905 -2969051 -2905587
16361b905587J8826J35065Q3213o0552R9067J2766O455P1412J03627M5348L5506
$$ -2905587 -2886761 -2751696 -2668483 -2729035 -2629968 -2617202 -2610747 -2539335 -2435708 -2390360 -2354854
16350b354854L7058P6501J29109k2546J1570J01572K1880J41391M9616N5294l5637
$$ -2354854 -2317796 -2241295 -2112186 -2134732 -2123162 -2021590 -1999710 -1858319 -1808703 -1753409 -1789046
16339a789046j8790J16696M9381P5017Q8448o630J8619j5032R8606R770R0460
$$ -1789046 -1807836 -1691140 -1641759 -1566742 -1478294 -1484924 -1466305 -1481337 -1382731 -1372961 -1282501
16328a282501Q7058M7358P5339Q4540N2011M7682K3965m0963P3013O7720M7891
$$ -1282501 -1195443 -1148085 -1072746 -988206 -936195 -888513 -864548 -905511 -832498 -764778 -716887
16317g16887N1616Q4930M9423M8304N8069n3758Q6164J13700J323L0174m9454
$$ -716887 -665271 -580341 -530918 -482614 -424545 -478303 -392139 -278439 -277116 -246942 -296396
16306b96396l2040J59634J03843J00845N8008M4520L676L777J18020L9905P2278
$$ -296396 -328436 -168802 -64959 35886 93894 138414 142090 145867 263887 303792 376070
16295C76070k2648P0615O5173K9248k1999Q9660O8447m3688N9230R0535P9111
$$ 376070 353422 424037 489210 518458 496459 586119 654566 610878 670108 760643 839754
16284H39754k2372P4515k371L2728m7040m0230r701J03582J12160O1131O0676
$$ 839754 817382 891897 889526 922254 875214 834984 825283 928865 1041025 1102156 1162832
16273A162832O1592J59250r123l9103l6405L8589L6995R7869J6467K8011J0937
$$ 1162832 1224424 1383674 1374551 1335448 1299043 1337632 1374627 1472496 1488963 1516974 1527911
16262A527911N1258R0163J3661N2001m9075Q3604P0664q256Q4248K6031N1687
$$ 1527911 1579169 1669332 1682993 1734994 1685919 1769523 1840187 1831931 1916179 1942210 1993897
16251A993897N64J34396p2781K1996Q3164O4967o4267O2425q196K3939J0463p3676
$$ 1993897 1994461 2128857 2056076 2078072 2161236 2226203 2161936 2224361 2216165 2240104 2250567 2176891
16239B176891J17374J14781n6473M8656K5080P4003l7176k7849K4765O9522J09605
$$ 2176891 2294265 2409046 2352573 2401229 2426309 2500312 2463136 2435287 2460052 2529574 2639179
16228B639179J7490J09421Q0283r3090j5387O6926J1198n84Q1181J49699o3160
$$ 2639179 2656669 2766090 2846373 2753283 2737896 2804822 2816020 2815436 2896617 3046316 2983156
16217B983156K9519q8333m4J6333l2479O3492L3430Q9508L3776M7267P728o590
$$ 2983156 3012675 2924342 2924298 2940631 2908152 2971644 3005074 3094582 3128358 3175625 3183353 3176763
16205C176763J7175J0735k2422P9293O217L719P131M6553r786r793K7781q7812
$$ 3176763 3193938 3204673 3182251 3261544 3267761 3271480 3278611 3325164 3315378 3305585 3333366 3245554
16193C245554P1409M6899J59901n9453j24309M7369O2714k1604J5483J22588K7270
$$ 3245554 3316963 3363862 3523763 3464310 3340001 3387370 3450084 3428480 3443963 3566551 3593821
16182C593821L0980J7474j7342K6929K2704K3986j43896P1378J74532p0502l3474
$$ 3593821 3624801 3642275 3624933 3651862 3674566 3698552 3554656 3626034 3800566 3730064 3696590
16171C696590L2078L502J07759o735m2184M3578p915o3213J37990R372n4498N8157
$$ 3696590 3728668 3732170 3839929 3833194 3791010 3834588 3826673 3763460 3901450 3910822 3856324 3914481
16159C914481O568M2061J03349J4466l2735k6738P3686k0848O7390R521p9053
$$ 3914481 3921049 3963110 4066459 4080925 4048190 4021452 4095138 4074290 4141680 4151201 4072148
16148D072148O8278j2671p8570P0260l0077o2617m1099M3055m4695N3027l0103
$$ 4072148 4140426 4127755 4049185 4119445 4089368 4026751 3985652 4028707 3984012 4037039 4006936
16137D006936P0486K6713l036o6280J267Q3154L8364m903N5318P0337j28427R487
$$ 4006936 4077422 4104135 4101099 4034819 4036086 4119240 4157604 4152701 4208019 4278356 4149929 4159416
16125D159416J0356J2671J4411N0065o691J78238k47108l1098N0683M4600Q8808
$$ 4159416 4169772 4182443 4196854 4246919 4240228 4418466 4171358 4140260 4190943 4235543 4324351
16114D324351j42110o1060J59522l7536K407N8641q824K1211j70135Q6450J46587
$$ 4324351 4182241 4121181 4280703 4243167 4245574 4304215 4295391 4316602 4146467 4232917 4379504
16103D379504m7595j16927k3857J50803K2632o7971M0237k4659l5045k4273R9199
$$ 4379504 4331909 4214982 4191125 4341928 4364560 4296589 4336826 4312167 4277122 4252849 4352048
16092D352048q9835k5183J20112j0703k9542o0846K2443N2774k2976O5397n7484
$$ 4352048 4262213 4237030 4357142 4346439 4316897 4256051 4278494 4331268 4308292 4373689 4316205
16081D316205o8963P7985M833N2970q275K6352J23165n1855j8120n0558L4685
$$ 4316205 4247242 4325227 4330060 4383030 4374755 4401107 4524272 4472417 4454297 4403739 4438424
16070D438424Q8770l7630j06999p7453L3285j7148M0534k1248M8593J58549J91847
$$ 4438424 4527194 4489564 4382565 4305112 4338397 4321249 4361783 4340535 4389128 4547677 4739524
16059D739524j09714j80034K784p954j6569J7949j08705m1471L8961j4750L9865
$$ 4739524 4629810 4449776 4452560 4444606 4428037 4445986 4337281 4295810 4334771 4320021 4359886
16048D359886J35284O205J4634k7387J0651k4982J02808J31690j50807j26059
$$ 4359886 4495170 4501375 4516009 4488622 4499273 4474291 4577099 4708789 4557982 4431923
16038D431923m510Q4715m1385K0105Q8565j3746n9622p193k2354K028n7101P7794
$$ 4431923 4427413 4512128 4470743 4490848 4579413 4565667 4506045 4498852 4476498 4478526 4421425 4499219
16026D499219Q3088q9393j2823j8201j855k7933k1804J01257l9476j48387J5178
$$ 4499219 4582307 4492914 4480091 4461890 4460035 4432102 4410298 4511555 4472079 4323692 4338870
16015D338870O6022L6426M9302N9733q2753P1854K0166k2895Q4347n8165p672
$$ 4338870 4404892 4441318 4490620 4550353 4467600 4539454 4559620 4536725 4621072 4562907 4555235
16004D555235j76845m9365N0352N3970J29765k48P241k1943n1780j2698j06714
$$ 4555235 4378390 4329025 4379377 4433347 4563112 4562864 4570105 4548162 4496382 4483684 4376970
15993D376970J10132k1787r7830K14624K7763l1607n1138N6210M0738q3j03942
$$ 4376970 4487102 4465315 4367485 4582109 4609872 4578265 4527127 4583337 4624075 4623992 4520050
15982D520050p5247m1070J10674l4458J9125m168j333P0369k820l6580l0950R266
$$ 4520050 4444803 4403733 4514407 4479949 4499074 4494906 4493573 4563942 4561122 4524542 4493592 4502858
15970D502858m5882L6360P503k6720o4877J22864R2664r207l0179o8520k0207
$$ 4502858 4456976 4493336 4500839 4474119 4409242 4532106 4624770 4615563 4585384 4516864 4496657
15959D496657J2773P9213R6238R029m0280j6774n4293m4828l7155p2303O7906
$$ 4496657 4509430 4588643 4684881 4693910 4653630 4636856 4582563 4537735 4500580 4428277 4496183
15948D496183M9385k5050j3335j08173M063K6651M031R9880K9727l323J5859n6829
$$ 4496183 4545568 4520518 4507183 4399010 4403073 4429724 4433755 4533635 4563362 4560039 4575898 4519069
15936D519069m1928J15168R2908q0711N09n5747j09693M1083o2273J05087L6974
$$ 4519069 4477141 4592309 4685217 4604506 4605015 4549268 4439575 4480658 4418385 4523472 4560446
15925D560446l9687O7732J9092j4632l5061p3701P5107q9631J33071R00q3531
$$ 4560446 4520759 4588491 4607583 4592951 4557890 4484189 4559296 4469665 4602736 4603636 4520105
15914D520105L3415q0412J9680P5496o4303L5710k390M90N5311K5982k4573O0624
$$ 4520105 4553520 4473108 4492788 4568284 4503981 4539691 4537301 4537791 4593102 4619084 4594511 4655135
15902D655135K8993j06937j6123Q8756n1966l5702K920O1500l2240p1796r3267
$$ 4655135 4684128 4577191 4561068 4649824 4597858 4562156 4565076 4626576 4594336 4522540 4429273
15891D429273J15407j1666j03920J14694l2322J54724r688q762n3452o2924L760
$$ 4429273 4544680 4533014 4429094 4543788 4511466 4666190 4656502 4647740 4594288 4531364 4535124
15880D535124L7210j0056j5661M4756J8672O13q6676p987m4728k3571L2029K02063
$$ 4535124 4572334 4562278 4546617 4591373 4610045 4610658 4523982 4515995 4471267 4447696 4479725 4681788
$$ [...]
##END NTUPLES=NMR SPECTRUM
##END=
