##TITLE=1H_CG-1152-A2
 CD2Cl2, 68 sc, 
 31.8.2021
##JCAMPDX= 6.0         $$ Bruker NMR JCAMP-DX V2.0
##DATA TYPE= NMR SPECTRUM
##DATA CLASS= NTUPLES
##ORIGIN= UXNMR, Bruker Analytische Messtechnik GmbH
##OWNER= root
$$ XWIN-NMR		Version 3.5
$$ Wed Sep  1 09:21:09 2021 Russian Standard Time (UT+4h)  she@DPX200
##.OBSERVE FREQUENCY= 200.1312
##.OBSERVE NUCLEUS= ^1H
##.ACQUISITION MODE= SIMULTANEOUS
##.ACQUISITION SCHEME= undefined
##.AVERAGES= 8
##.DIGITISER RES= 18
##SPECTROMETER/DATA SYSTEM= spect
##.PULSE SEQUENCE= zg30
##.SOLVENT NAME= CD2Cl2
##.SHIFT REFERENCE= (INTERNAL, CD2Cl2, 0, 17.8991)
##AUDIT TRAIL= $$ (NUMBER, WHEN, WHO, WHERE, WHAT)
$$ ##TITLE= Audit trail, XWIN-NMR		Version 3.5
$$ ##JCAMPDX= 5.01
$$ ##ORIGIN= Bruker BioSpin GmbH
$$ ##OWNER= she
$$ F:/spectra/data/she/nmr/H-F/1/pdata/1/auditp.txt
$$ ##AUDIT TRAIL=  $$ (NUMBER, WHEN, WHO, WHERE, WHAT)
(   1,<2021-09-01 09:19:28.65 +0400>,<she>,<DPX200>,
      <created by zg, POWCHK disabled, PULCHK disabled
       configuration hash MD5:
       00 E9 B6 7A A2 85 ED C7 34 08 36 98 17 FE 4E 26
       data hash MD5: 16K
       E7 A6 E3 A8 CA 6F 40 AE F4 7F D7 D3 54 6D 6F 90>)
(   2,<2021-09-01 09:19:32.23 +0400>,<she>,<DPX200>,
      <Start of raw data processing
       efp BC_mod = 2 LB = 0.24 FT_mod = 6 PKNL = 1 PHC0 = -13361.04 PHC1 = 13.00097 SI = 16K 
       data hash MD5: 16K
       30 4A 7F 61 5A 1A 55 84 46 6D 69 C0 A3 CC 9A 24>)
(   3,<2021-09-01 09:20:01.12 +0400>,<she>,<DPX200>,
      <pk PHC0 = 2.157578 PHC1 = -2.2 
       data hash MD5: 16K
       BB C8 94 BD CE 4D 97 15 E0 63 0C 5F AF 78 87 69>)
(   4,<2021-09-01 09:20:03.95 +0400>,<she>,<DPX200>,
      <abs ABSG = 5 
       data hash MD5: 16K
       E8 AC AF 53 60 4B 1F FA 92 E5 23 ED 84 6F 3F FD>)
(   5,<2021-09-01 09:20:21.23 +0400>,<she>,<DPX200>,
      <pk PHC0 = 0.5997238 PHC1 = 0 
       data hash MD5: 16K
       C8 63 BA 27 83 EB 8B 00 B8 8E 21 D9 FD 16 53 89>)
(   6,<2021-09-01 09:20:24.20 +0400>,<she>,<DPX200>,
      <abs ABSG = 5 
       data hash MD5: 16K
       41 C5 FD 6E 7C 82 D2 A2 AE F8 E8 CA F2 6E 96 A0>)
$$ ##END=
$$ 
$$ hash MD5
$$ 0C 39 6E D6 85 5B D6 A6 99 EC FF 72 82 D2 4E 3E
##$RELAX= 
##$RELAX= 
##$RELAX= 
##$RELAX= 
##$RELAX= 
##$RELAX= 
$$ Bruker specific parameters
$$ --------------------------
##$DU= <F:/spectra>
##$EXPNO= 1
##$NAME= <H-F>
##$PROCNO= 1
##$TYPE= <nmr>
##$USER= <she>
##$AMP= (0..31)
100 100 100 100 100 100 100 100 100 100 100 100 100 100 100 100 100 100 
100 100 100 100 100 100 100 100 100 100 100 100 100 100 
##$AQSEQ= 0
##$AQ_mod= 1
##$AUNM= <au_zg>
##$AUTOPOS= <>
##$BF1= 200.13
##$BF2= 200.13
##$BF3= 200.13
##$BF4= 200.13
##$BF5= 200.13
##$BF6= 200.13
##$BF7= 200.13
##$BF8= 200.13
##$BYTORDA= 1
##$CFDGTYP= 0
##$CFRGTYP= 5
##$CHEMSTR= <none>
##$CNST= (0..31)
1 1 145 1 1 1 1 1 1 1 1 1 1 1 1 1 1 1 1 1 1 1 1 1 1 1 1 1 1 1 1 1 
##$CPDPRG= <>
##$CPDPRG1= <>
##$CPDPRG2= <>
##$CPDPRG3= <>
##$CPDPRG4= <mlev>
##$CPDPRG5= <mlev>
##$CPDPRG6= <mlev>
##$CPDPRG7= <mlev>
##$CPDPRG8= <mlev>
$$ [...]
##$SUBNAM3= <"">
##$SUBNAM4= <"">
##$SUBNAM5= <"">
##$SUBNAM6= <"">
##$SUBNAM7= <"">
##$SUBNAM8= <"">
##$SUBNAM9= <"">
##$SW= 20.0189188712717
##$SWIBOX= (0..15)
0 0 2 0 0 0 0 0 0 0 0 0 0 0 0 0 
##$SW_h= 4006.41025641026
##$TD= 16384
##$TD0= 1
##$TE= 0
##$TE2= 300
##$TE3= 300
##$TEG= 300
##$TL= (0..7)
0 120 120 120 120 120 120 120 
##$TP= (0..7)
150 150 150 150 150 150 150 150 
##$TP07= 0
##$TPNAME0= <>
##$TPNAME1= <>
##$TPNAME2= <>
##$TPNAME3= <>
##$TPNAME4= <>
##$TPNAME5= <>
##$TPNAME6= <>
##$TPNAME7= <>
##$TPOAL= (0..7)
0.5 0.5 0.5 0.5 0.5 0.5 0.5 0.5 
##$TPOFFS= (0..7)
0 0 0 0 0 0 0 0 
##$TUNHIN= 0
##$TUNHOUT= 0
##$TUNXOUT= 0
##$USERA1= <user>
##$USERA2= <user>
##$USERA3= <user>
##$USERA4= <user>
##$USERA5= <user>
##$V9= 5
##$VALIST= <valist>
##$VCLIST= <CCCCCCCCCCCCCCC>
##$VD= 0
##$VDLIST= <DDDDDDDDDDDDDDD>
##$VPLIST= <PPPPPPPPPPPPPPP>
##$VTLIST= <TTTTTTTTTTTTTTT>
##$WBST= 1024
##$WBSW= 4
##$XGAIN= (0..3)
0 0 0 0 
##$XL= 0
##$YL= 0
##$YMAX_a= 336946
##$YMIN_a= -370596
##$ZGOPTNS= <>
##$ZL1= 120
##$ZL2= 120
##$ZL3= 120
##$ZL4= 120
##$ABSF1= 17.89059
##$ABSF2= -2.128487
##$ABSG= 5
##$ABSL= 3
##$ALPHA= 0
##$AQORDER= 0
##$ASSFAC= 0
##$ASSFACI= 0
##$ASSFACX= 0
##$ASSWID= 0
##$AUNMP= <proc_1d>
##$AZFE= 0.1
##$AZFW= 0.1
##$BCFW= 0
##$BC_mod= 2
##$BYTORDP= 0
##$COROFFS= 0
##$CY= -3
##$DATMOD= 1
##$DC= 0
##$DFILT= <>
##$DTYPP= 0
##$F1P= 0
##$F2P= 0
##$FCOR= 1
##$FTSIZE= 16384
##$FT_mod= 6
##$GAMMA= 0
##$GB= 0
##$INTBC= 1
##$INTSCL= 1.334414e-10
##$ISEN= 128
##$LB= 0.24
##$LEV0= 0
##$LPBIN= 0
##$MAXI= 10000
##$MC2= 0
##$MEAN= 0
##$ME_mod= 0
##$MI= 1.114404
##$NCOEF= 0
##$NC_proc= -8
##$NLEV= 6
##$NOISF1= 3.799351
##$NOISF2= 2.8
##$NSP= 0
##$NTH_PI= 0
##$NZP= 0
##$OFFSET= 17.89914
##$PC= 1
##$PHC0= -13358.28
##$PHC1= 10.80097
##$PH_mod= 1
##$PKNL= yes
##$PPARMOD= 0
##$PSCAL= 0
##$PSIGN= 0
##$REVERSE= no
##$SF= 200.129621057968
##$SI= 16384
##$SIGF1= 3
##$SIGF2= 2
##$SINO= 5.538805
##$SIOLD= 16384
##$SREGLST= <1H.CDCl3>
##$SSB= 0
##$STSI= 16384
##$STSR= 0
##$SW_p= 4006.41025641025
##$SYMM= 0
##$S_DEV= 0
##$TDeff= 16384
##$TDoff= 0
##$TI= <>
##$TILT= no
##$TM1= 0
##$TM2= 0
##$TOPLEV= 0
##$USERP1= <user>
##$USERP2= <user>
##$USERP3= <user>
##$USERP4= <user>
##$USERP5= <user>
##$WDW= 1
##$XDIM= 16384
##$YMAX_p= 377749000
##$YMIN_p= -1517764
$$ End of Bruker specific parameters
$$ ---------------------------------
##NTUPLES= NMR SPECTRUM
##VAR_NAME=  FREQUENCY,     SPECTRUM/REAL,   SPECTRUM/IMAG
##SYMBOL=    X,             R,               I
##VAR_TYPE=  INDEPENDENT,   DEPENDENT,       DEPENDENT
##VAR_FORM=  AFFN,          ASDF,            ASDF
##VAR_DIM=   16384,         16384,           16384
##UNITS=     HZ,            ARBITRARY UNITS, ARBITRARY UNITS
##FACTOR=    0.24454680195387, 1,            1
##FIRST=     3582.14798624568, 0,            0
##LAST=      -424.262270164573, 0,           0
##MIN=       -424.262270164573, -1517764,    0
##MAX=       3582.14798624568, 377749000,    0
$$ Real data points
##PAGE= N=1
##DATA TABLE= (X++(R..R)), XYDATA
$$ [...]
5067C1922441o072753l864266k717976k002534k037635r94525m66762m55275K95723
5058A3606438O188J61360l45416p83033m43715J95647j65137M3708O27435R8525
5048A3002000Q9559n89580p80550j299672p60562p65853m24639n31414l51066
5039G588223m09330o62272K31075j33297n24341k70264R8618J06318l07438R3531
5029E810823m7595j02714K63887J54681m19153K54313j05610O1502O1822j4465
5019E917491J60259p66221L78689k93929j77766J31938K03823K79285q60644K50248
5009E223173M17326o41203j01534j09257L37960L47349K11641r4705k42412J00678
4999E449016l17329j73248L11045j85071M95785n6244K22355M57864o36958K36904
$$ plain form
5067 31922441 25849688 21985422 19267446 17264912 15227277 14232752 13765990 13310715 13606438
5058 13606438 13612626 13773986 13428570 12645537 12201822 12397469 12232332 12276040 12903475 13002000
5048 13002000 13091559 12501979 11721429 10421757 9661195 8895342 8470703 7939289 7588223
5039 7588223 7178893 6516621 6747696 6614399 6090058 5819794 5918412 6024730 5717292 5810823
5029 5810823 5763228 5660514 5924401 6079082 5659929 5914242 5808632 5870134 5931956 5917491
5019 5917491 6077750 5311529 5690218 5396289 5218523 5350461 5554284 5833569 4972925 5223173
5009 5223173 5640499 4999296 4897762 4788505 5126465 5473814 5685455 5590750 5348338 5449016
4999 5449016 5131687 4958439 5269484 5084413 5580198 5523954 5746309 6204173 5567215 5804119
4989E804119O45963M9237l86136k32036l33082j03875l72936l91647O10039K57597
4979E547243j72606P9209k28737J49296l72386l9569l40538L47408M50098L901
4969E423319j00246o2931j09114K42107r6511j49629L95626K7641J69639O71449
4959F411350j39603k12203J19221M62972J4316m74477O9964J94301P620o5449
4949F388012m0095j69383J61846L80506K20744k47973K4722m233K08259L60319
4939G282724L64041L28583N75931J68417L80385O32179J34665k19126L01461L6311
4929I985571n90306K06784P20085L75436K75095N43281N05104j7774J19427p9266
4919A2043437O3094k64076j09494o101l76503J091158M77255N56996L12519O37993
$$ plain form
4989 5804119 6450082 6499319 6113183 5881147 5548065 5444190 5071254 4679607 5289646 5547243
4979 5547243 5374637 5453846 5225109 5374405 5002019 4962450 4621912 4969320 5419418 5423319
4969 5423319 5323073 5260142 5151028 5393135 5296624 5146995 5542621 5570262 5739901 6411350
4959 6411350 6271747 6059544 6178765 6641737 6656053 6181576 6251540 6445841 6453461 6388012
4949 6388012 6347917 6178534 6340380 6720886 6941630 6693657 6718379 6714146 6922405 7282724
4939 7282724 7646765 7975348 8551279 8719696 9100081 9732260 9866925 9647799 9949260 9985571
4929 9985571 9395265 9602049 10322134 10697570 10972665 11515946 12021050 12003276 12122703 12043437
4919 12043437 12106531 11842455 11732961 11726860 11350357 12441515 12918770 13475766 13788285 14426278
4909A4426278J058281N48624N11932R05740O68116l17706k90843N13481O53323
4900A8677226O23472N65905J3531J0166o19807k61384L2743J91895L30856K19038
4890A9783641j1377K01217K335j02849J4522M88624L73357K97633Q79794O89607
4880B2616504R90982O38398O65126J147925J270707J133755O84631Q22507N87747
4871C0558282N63639j16979K30257M49777R78200P78470Q44225P39260L20078
4862C5345209l72289o7257M49896N48190R77160J140419J392311K389328K435637
4853D4238604L152021L252034M237253O179436P676309J0750733J1750083O110955
4845I7347428n447088j1189136j1373806q297579o167102l750312l238783k940896
$$ plain form
4909 14426278 15484559 16033183 16545115 17450855 18118971 17801265 17510422 18023903 18677226
4900 18677226 19300698 19866603 19880134 19890300 19270493 19009109 19041852 19233747 19564603 19783641
4890 19783641 19772264 19973481 19975816 19872967 19887489 20376113 20749470 21047103 21926897 22616504
4880 22616504 23607486 24245884 24911010 26058935 27329642 28463397 29148028 29970535 30558282
4871 30558282 31121921 31004942 31235199 31684976 32663176 33441646 34285871 35025131 35345209
4862 35345209 34972920 34905663 35355559 35903749 36880909 38021328 39413639 41802967 44238604
4853 44238604 47390625 50642659 54879912 61059348 68735657 79486390 91236473 97347428
4845 97347428 91900340 80711204 69337398 61039819 54872717 51122405 47883622 44942726
4837D4942726j726422j552482j267709q59919q53582p92951m50355p9673N2927
4828C7412560r2744K21168Q3435J04280O9520P9751P88378P60937P50002n83501
4818C9593786j581410k135244j399950o88045q9070L34572L20329P3764J3880
4809C4442612N68803P94060M85047K73123j84723j11907N56427J86739K06126
4800C7216307K19551M22848J8233J57272K22432J86611q5094L93624l67612q65827
4790C7518345l88120l55369j89174L69535P2102O91401L48109J96852Q3535J02791
4780C8450007Q61109J169400L47929P60236M31021J40360K94900n58503K09504
4771D2105963N46793J514401J532858J546492J511240N89358J002249M34853M11971
$$ plain form
4837 44942726 43216304 41663822 40396113 39536194 38682612 37889661 37439306 37359633 37412560
4828 37412560 37319816 37540984 37624419 37728699 37798219 37877970 38666348 39427285 40177287 39593786
4818 39593786 38012376 35877132 34477182 33789137 33700067 34034639 34354968 34428732 34442612
4809 34442612 35011415 35805475 36290522 36563645 36378922 36267015 36823442 37010181 37216307
4800 37216307 37435858 37858706 37876939 38034211 38256643 38443254 38358160 38751784 38384172 37518345
4790 37518345 37130225 36774856 36585682 36955217 37027319 37718720 38066829 38263681 38347216 38450007
4780 38450007 39311116 40480516 40828445 41588681 42019702 42160062 42454962 41896459 42105963
4771 42105963 42652756 44167157 45700015 47246507 48757747 49347105 50349354 50784207 51196178
4762E1196178j05682O46517J012793J266494J770855J500013K166580K428129
4754F1881877K652622K332830J707206P06183o72255j553692j532256j832288
4746F3690227j245156l50281p69170o8325P47552J9871N5088M71804O26822Q52436
4736F4030868R68103J219191J791074K710331L860909K359888J255269l78898
4728G7816735j840708l074995l145428k382264j545414j137975j164318j311307
4720F2214326j422467j524692q52958r21412k57130J76766K36454l0017n69133
4711E7049737L98378N49636K90927K03024J57220N50764J311977J150723J216883
4702F2879269Q71779J317226R00636m88334k002780l078382l659387l034756k469409
$$ plain form
4762 51196178 51090496 51737013 52749806 54016300 55787155 57287168 59453748 61881877
4754 61881877 64534499 66867329 68574535 69280718 68608463 67054771 65522515 63690227
4746 63690227 62445071 62094790 61325620 61257295 62004847 62024718 62079806 62551610 63178432 64030868
4736 64030868 64998971 66218162 68009236 70719567 74580476 76940364 78195633 77816735
4728 77816735 75976027 72901032 69755604 67373340 65827926 64689951 63525633 62214326
4720 62214326 60791859 59267167 58414209 57492797 57235667 57412433 57648887 57618870 57049737
4711 57049737 57448115 57997751 58288678 58491702 58648922 59199686 60511663 61662386 62879269
4702 62879269 63751048 65068274 65968910 65480576 63477796 60399414 56740027 53705271 51235862
4693E1235862j996188r44216j628339q67631m16779j122385r71075r07218r58117
4684D1423914p25193p58178n63694o80205l49874K33508j139O08016j05859p33927
4674C8347369j356974k184855j664408j157825r61842k46312l16951j05494o35199
4665B9717509q05468n58561j277403p93232l63303n80075l93093p26012n72041
4656B3648321o26394q59608q6693k8652j06981j89963K55251K7575O63464N61368
4646B3257688N90954O12662M16408L67283k17270k83955q01662l37268l10317
4637B3294523j2333J50504k94593q99711l08129p38640P2275m24612p71950K3311
4627B0090645n05497n61822m88523l7167n92975J60335l05860p20942o04460p90357
$$ plain form
4693 51235862 49239674 48295458 46667119 45799488 45382709 44260324 43289249 42382031 41423914
4684 41423914 40698721 39940543 39376849 38696644 38346770 38580278 38579139 39187155 39081296 38347369
4674 38347369 36990395 34805540 33141132 31983307 31021465 30775153 30458202 30352708 29717509
4665 29717509 28912041 28353480 27076077 26282845 25919542 25339467 24946374 24220362 23648321
4656 23648321 23021927 22162319 22075626 22046974 21939993 21750030 22005281 22032856 22696320 23257688
4646 23257688 23848642 24461304 24877712 25244995 25027725 24743770 23942108 23604840 23294523
4637 23294523 23282190 23432694 23138101 22238390 21930261 21191621 21263896 20839284 20067334 20090645
4627 20090645 19585148 19023326 18534803 18497636 17904661 18064996 17759136 17038194 16433734 15643377
4617A5643377q03844m58835k23411K39098q10958n06413j22706K59104m86300
4608A2729112r1382N29614k28158N9090K86026M77310K7449J51510K98208k72765
4598A3966014m82068j44269l15205n54812p39905m27438k11952n09030n43547
4589A0037788O2456j76974K06851l32758n29564N402M47342o86324n07718J7423
4579H543924O59526L78431l07239n49078M5030J82374M19338K7556k39789K47878
4569I407951J14879N55094J6195M21734J25593K94090P47558J230959O70828J554599
4559A5139480J387610K51513j131495k780822j590400j054275o67718p17538J33552
4550H969907l46489m2076K53272j34463m41204o44343k1665j48158l2516k38929
$$ plain form
4617 15643377 14839533 14380698 14157287 14396385 13585427 13079014 12956308 13215412 12729112
4608 12729112 12637730 13167344 12939186 12998276 13284302 13761612 13789061 13940571 14238779 13966014
4598 13966014 13483946 13339677 13024472 12469660 11729755 11302317 11090365 10581335 10037788
4589 10037788 10100244 9923270 10130121 9797363 9267799 9273201 9720543 9034219 8526501 8543924
4579 8543924 9203450 9581881 9274642 8725564 8770594 8952968 9372306 9399862 9160073 9407951
4569 9407951 9522830 10077924 10094119 10515853 10641446 10935536 11683094 12914053 13584881 15139480
4559 15139480 16527090 16778603 15647108 12866286 11275886 10221611 9553893 8836355 8969907
4550 8969907 8623418 8581342 8834614 8700151 8258947 7614604 7592939 7444781 7412265 7173336
4540G173336L07677l83941m84910K55642K86326r4106n8245K98921j07806l8038
4530G154856L112K63922o48575n94638K20504r6687J80255R4041k23847k00497
4520F152446P0035Q3417p4417j0313L5794J7381k65537J53606J59693J16653N7431
4509F496189L04714k53117l50063O0803j27279l55171k72924J37670j1272J55383
4499E784933J76438l15146m18696k46199k6086L74344j59133K88216m57032Q3308
4489E084947O21230j81214l12742j06520K65214K64669j11798p5561N2145K66875
4479E767245K34410K34395n9800J17730j78800K03162k57024k23712n67995J73654
4469E443265M02186N9346L61174m36519L30159J90217l96072K63874p3889J38694
$$ plain form
4540 7173336 7481013 7097072 6612162 6867804 7154130 7060024 7001779 7300700 7192894 7154856
4530 7154856 7157968 7421890 6773315 6178677 6399181 6302494 6482749 6576790 6352943 6152446
4520 6152446 6222481 6305898 6231481 6221168 6256962 6274343 6008806 6162412 6322105 6438758 6496189
4509 6496189 6800903 6547786 6197723 6258526 6131247 5776076 5503152 5640822 5629550 5784933
4499 5784933 5961371 5646225 5227529 4981330 4955244 5329588 5170455 5458671 5001639 5084947
4489 5084947 5706177 5524963 5212221 5105701 5370915 5635584 5523786 5448225 5500370 5767245
4479 5767245 6001655 6236050 6176250 6293980 6115180 6318342 6061318 5837606 5269611 5443265
4469 5443265 5845451 5904797 6265971 5829452 6159611 6349828 5953756 6217630 6143741 6282435
4459F282435O32757K13040l24398k81866L01971K08045J09470L8352n8990l66926
4449F753890J36149R8968L66315o1406j40341L04235L57751N45278M08787J69414
4439H939040N09375N35503L41450J083146O77223Q72921R15600N09842Q402l18483
4429A4074019j040681r82805p49466o75661o0344m64509o18786p01228R7922j87409
4419H691052R4957K40785m34656q666n30795k71040k1179j65497J22419p2265
4409G645115j20525n55905o5202J83580l49754j81209l88472P1613M0565n01965
4399E777841l95630j9046J62024j09775o6056k44819P873o5853N41565L9159j45095
4388E482188k15812J87039j40632N6043o03387M84759j78819n2823J867K30843
$$ plain form
4459 6282435 6915192 7128232 6803834 6521968 6823939 7031984 7141454 7179806 7120816 6753890
4449 6753890 6890039 6989007 7355322 7293916 7153575 7457810 7815561 8360839 8769626 8939040
4439 8939040 9448415 9983918 10325368 11408514 12085737 12958658 13874258 14384100 14392502 14074019
4429 14074019 13033338 12050533 11301067 10625406 10565062 10100553 9481767 8780539 8878461 8691052
4419 8691052 8786009 9026794 8592138 8583472 8052677 7781637 7760458 7594961 7717380 7645115
4409 7645115 7524590 6968685 6903483 7087063 6737309 6556100 6167628 6239241 6279806 5777841
4399 5777841 5382211 5363165 5525189 5415414 5349358 5104539 5112412 5046559 5588124 5627283 5482188
4388 5482188 5266376 5453415 5312783 5368826 4765439 5250198 5071379 5018556 5020423 5251266
4378E251266R0614k6603J80736m5125K83192L81637m000j28438j50322m22675
4368E410282L95233O7544K90791j78623J7166m74279k43148k30024m90520M4721
4358D609143N4631j89481j49868J7430n56664K78154K33036m38573K71099l71293
4348C757614j29956L4698k1343l70454L51691l23430j41905K63587J27775K4077
4338C572354J71731L8338j49981l56260P43993m27388k41833j79917m28169M64995
4328C207863m86687R909N16550L30050j53352p6283J53677j71349p9441K21805
4318C472742r57K35801k69652K72466M46001l97049R1211l7289m48778l33197
4308C031299L10550L17028k35264L83527J31918k98290J56362M5264r6447R6276
$$ plain form
4378 5251266 5341880 5315277 5496013 5450888 5734080 6115717 6111717 5983279 5832957 5410282
4368 5410282 5805515 5873059 6163850 5985227 6002393 5528114 5284966 5054942 4564422 4609143
4358 4609143 4663774 4474293 4324425 4341855 3785191 4063345 4296381 3857808 4128907 3757614
4348 3757614 3627658 3662356 3641013 3270559 3622250 3298820 3156915 3420502 3548277 3572354
4338 3572354 3744085 3782423 3632442 3276182 4020175 3592787 3350954 3171037 2742868 3207863
4328 3207863 2721176 2731085 3247635 3577685 3424333 3348050 3501727 3330378 3250937 3472742
4318 3472742 3471785 3707586 3437934 3710400 4156401 3759352 3850563 3813274 3364496 3031299
4308 3031299 3341849 3658877 3423613 3807140 3939058 3640768 3797130 3842394 3745947 3842223
4298C842223K05310K69003j88538Q1401k79151n8148K67712N10201m61458J07068
4288D295623Q8249L7878k41128j33824O37571L77595K58933k01440m13611m5899
4278D659947P9480Q867M58477l9523k62617N4991K44409J85207j31927j58321
4268E098990K3790K02301J37757o47960J56409k64519J75542j36455o0698J41294
4258D826451L45225j69608j80040n09058L03520m04959P6563L72087M12260l45798
4248D726643k77974M59931o6122N28212k33641L0736k62902J28327J87346M25056
4238E645612K11815K60053Q4243J99409O53061q4112J44370K00354l03874K17007
4228G227938K47837p3102L6114j89442j43289M79306l26047J78400k55364k11639
$$ plain form
4298 3842223 4047533 4316536 4127998 4209399 3930248 3872100 4139812 4650013 4188555 4295623
4288 4295623 4383872 4421750 4180622 4046798 4684369 5061964 5320897 5119457 4705846 4659947
4278 4659947 4739427 4748294 5206771 5167248 4904631 4959622 5204031 5389238 5257311 5098990
4268 5098990 5122780 5325081 5462838 4814878 4971287 4706768 4882310 4745855 4685157 4826451
4258 4826451 5171676 5002068 4822028 4312970 4616490 4211531 4288094 4660181 5072441 4726643
4248 4726643 4448669 4908600 4842478 5370690 5137049 5167785 4904883 5033210 5220556 5645612
4238 5645612 5857427 6117480 6201723 6401132 7054193 6970081 7114451 7314805 7010931 7227938
4228 7227938 7475775 7402673 7438787 7249345 7106056 7585362 7259315 7437715 7182351 6970712
4218F970712J22435M512o8838K37181j36667J61658l9384o7760l82933J0328K23872
4207G035116m24891p0974K02531J44448M8673O7959J7971l1993J81947J65788
4197G336575J02874l56852P4455l70556j26468N10653j49606j48126m357j75154
4187F693438M20764R7066m39988M7711j204l07096M8468j51637r3672M07085L02543
4176G023478q9701j16942j4954l25345L06759l12242K04425m5345K20218J44079
4166F994430l1685j5635n19849j39845k1377K13785J80780n4575J62170Q4561
4156F852760K66994R1556n52621R4890L13842m91520L18704j79294m39919M08344
4146F683736P07522L78292j30055J17305K90218k03211j13913M6492j46040m1406
$$ plain form
4218 6970712 7093147 7097659 7028821 7266002 7129335 7290993 7251609 7183849 6800916 6811244 7035116
4207 7035116 6610225 6539251 6741782 6886230 6934903 7002862 7020833 6988840 7170787 7336575
4197 7336575 7439449 7082597 7157052 6786496 6660028 7170681 7021075 6872949 6868592 6693438
4187 6693438 7114202 7211268 6771280 6818991 6817787 6510691 6559159 6407522 6313850 6720935 7023478
4176 7023478 6933777 6816835 6801881 6476536 6783295 6471053 6675478 6630133 6850351 6994430
4166 6994430 6962745 6947110 6427261 6287416 6266039 6479824 6660604 6606029 6768199 6852760
4156 6852760 7119754 7211310 6658689 6753579 7067421 6575901 6894605 6715311 6275392 6683736
4146 6683736 7391258 7769550 7639495 7756800 8047018 7843807 7729894 7776386 7630346 7588940
4136G588940K61437m3581k65097K97135L5938n99492O56095m39169k93807Q08811
4126H007210p1813n5153L31282J02023K90969l28460j69588J74407m9166M10635
4116H642346o2015K81150k0054K34648J23128j45629L49162J71529l93L37088
4106I910960j07012N07305J60715r9850P0199k62206J98206N00731O72890K42159
4096A1794097l31849J60307J93990O10365K19793k29011N8528K66794Q3572L49559
4086A3176145M38686m60673L67775M07338k50678k01255j27336K60174N80633
4077A4190809K67470j31685P389M63682j66859k0280n9139J2809J83241M78199
4067A5225636N0328j1049K56560j49188K82279O07039n3217J91997N37563M1976
$$ plain form
4136 7588940 7850377 7806796 7541699 7838834 7874772 7275280 7931375 7492206 7198399 8007210
4126 8007210 7935397 7880244 8211526 8313549 8604518 8276058 8106470 8280877 8231711 8642346
4116 8642346 8580331 8861481 8841427 9076075 9199203 9053574 9402736 9574265 9573872 9910960
4106 9910960 9803948 10311253 10471968 10372118 10442317 10180111 10378317 10879048 11551938 11794097
4096 11794097 11462248 11622555 11816545 12426910 12646703 12417692 12476220 12743014 12826586 13176145
4086 13176145 13614831 13154158 13521933 13929271 13678593 13477338 13350002 13610176 14190809
4077 14190809 14458279 14326594 14333983 14797665 14630806 14610526 14551387 14564196 14747437 15225636
4067 15225636 15275964 15264915 15521475 15372287 15654566 16261605 16208388 16400385 16937948 16979924
4057A6979924l4053K2500R7701p9338J25173N84948J19304M50134J75353L16012
4047A8757658M6492J03871L45731j05000P35319l22452J37689Q4163J78407N28596
4037B0490474l4306N0280K13428m5262K93554p5755K68852m7007J0751K94178
4027B1419187J58049O6866k7719M03362L7618o7471M6603j39452J74997O34700
4017B2706740q9349L4454j52979m5952L29930k12654N93504k87206L59507K94520
4007B3530515j37694m1094k4188R05087k82465k25694J94699L10482L13210l0199
3997B4512659K8421N87430k6821l08629m4634l51808O64050K7554p1615M87720
3987B5504327J1134k71946m00549j55526N7424N40957j32371m6816K81867K45722
$$ plain form
4057 16979924 16945871 16968371 17066072 16986734 17111907 17696855 17816159 18266293 18441646 18757658
4047 18757658 18804150 18908021 19253752 19148752 19884071 19561619 19699308 19783471 19961878 20490474
4037 20490474 20456168 20506448 20719876 20674614 20968168 20892413 21161265 21114258 21125009 21419187
4027 21419187 21577236 21644102 21616383 22019745 22057363 21989892 22036495 21897043 22072040 22706740
4017 22706740 22617391 22651845 22498866 22452914 22782844 22570190 23163694 22876488 23235995 23530515
4007 23530515 23392821 23351727 23327539 24232626 23950161 23724467 23919166 24229648 24542858 24512659
3997 24512659 24541080 25128510 25101689 24793060 24748426 24396618 25060668 25088222 25016607 25504327
3987 25504327 25515461 25243515 24842966 24687440 24744864 25285821 25153450 25106634 25388501 25634223
3977B5634223p4824j36478j51309k15823j94750M41088J8071J67537K5728R5236
3967B5608699J15520l06822j96633k2040l46835q1858M66099M93177J0222o3474
3957B5676055m41437o6291M14739J02452p2385p080L19160L78405O27463m83481
3947B6447600L3342L68714O65539P04631j14131M99451K20061N78413P66431K30827
3937C0400878J68470M03757O11584L48994K35829O11958P44502L96924K05259
3928C4128155K05686N29907O48931N67087J36752K55885P8454M93499O92069O94283
3918C8430708M8366M82714P46379L09098M20763j6893L90838R38584O69374J4608
3908D2434539l7231K11533L39741J4047m39329j2602n12055J55227J06883o76670
$$ plain form
3977 25634223 25559399 25422921 25271612 25055789 24861039 25302127 25320198 25487735 25513463 25608699
3967 25608699 25724219 25417397 25220764 25198724 24851889 24770031 25236130 25729307 25739529 25676055
3957 25676055 25234618 25168327 25583066 25685518 25613133 25606053 25925213 26303618 26931081 26447600
3947 26447600 26480942 26849656 27515195 28219826 28105695 28605146 28825207 29403620 30170051 30400878
3937 30400878 30569348 30973105 31584689 31933683 32169512 32781470 33525972 33922896 34128155
3928 34128155 34333841 34863748 35512679 36079766 36216518 36472403 36550857 37044356 37736425 38430708
3918 38430708 38479074 38961788 39708167 40017265 40438028 40421135 40811973 41750557 42419931 42434539
3908 42434539 42397308 42608841 42948582 42962629 42523300 42510698 41998643 42153870 42260753 41584083
3898D1584083l51997l32556j25175m36946n72244N3023q4241k80649l75619J73915
3888C9251594L97775J09334l95045m10682l73625l48675n01072l1126k26384r77303
3878C6494791o21703l42687j51369m38947J61785k78566m4045l51258O51716J5990
3868C5095707J55026M33608N78036M89410P93325J371674K217927J264338j869917
3859D0529134k390834k043110j546937q79019n99005q64553k26256k00687K30708
3850C2009441n66679Q2382j02550k40897J62974J16632Q69929o2419R7402K64615
3840C2630830L6369K60276n84702r2258n14073k24176n28983m96447Q7489m00390
3830C0173935J86952l88004k48582n26878O292l3880K87250l04589m51371L72416
$$ plain form
3898 41584083 41232086 40899530 40774355 40337409 39765165 39818188 39733947 39453298 39077679 39251594
3888 39251594 39649369 39758703 39363658 38952976 38579351 38230676 37729604 37698478 37472094 36494791
3878 36494791 35873088 35530401 35379032 34940085 35101870 34823304 34779259 34428001 35079717 35095707
3868 35095707 35250733 35684341 36262377 36751787 37545112 38916786 41134713 42399051 40529134
3859 40529134 38138300 36095190 34548253 33669234 33070229 32205676 31979420 31778733 32009441
3850 32009441 31442762 31525144 31422594 31181697 31344671 31461303 32331232 32268813 32366215 32630830
3840 32630830 32667199 32927475 32342773 32250515 31736442 31512266 30983283 30486836 30574325 30173935
3830 30173935 30360887 29972883 29724301 29197423 29203715 29169835 29457085 29152496 28701125 29073541
3820B9073541L93229J39146j28541l11142j56291m0528j06376R44878K03954p3073
3810B9938797j81453M51412o3834L63470j99636j0912L93039P7693k11401j49505
3800C0407670K74612K72218N98053J63069J67207N97194O64433j5160J16693n8311
3790C3187678l96432l59139o49658k53311M73923K39058P7026L7125l32895P0436
3780C2093811J24540L49811j5470K97118N58775l1623j51005N78491L26404J62574
3770C4293426R91224K93812Q347N36856N01794J77736O85511N56990N27701P31304
3760C9304701J069398M12441J344509P16600J344143P42413Q76860J156311R76298
3751D7943674j7359O46096J092280O26503J644988Q64204J079474P79886R03667
$$ plain form
3820 29073541 29466770 29605916 29477375 29166233 29009942 28969414 28863038 29807916 30011870 29938797
3810 29938797 29757344 30208756 30144922 30508392 30308756 30297844 30690883 30768576 30557175 30407670
3800 30407670 30682282 30954500 31552553 31715622 31882829 32480023 33144456 33129296 33245989 33187678
3790 33187678 32791246 32432107 31782449 31529138 32003061 32242119 32319145 32356270 32023375 32093811
3780 32093811 32218351 32568162 32552692 32849810 33408585 33376962 33225957 33804448 34130852 34293426
3770 34293426 35284650 35578462 35586809 36123665 36625459 36803195 37488706 38045696 38573397 39304701
3760 39304701 40374099 40786540 42131049 42847649 44191792 44934205 45811065 46967376 47943674
3751 47943674 47926315 48572411 49664691 50291194 51936182 52800386 53879860 54659746 55563413
3742E5563413J126343M23395P11578Q30094K38713P1233N09926M4610J183391
3733F0702696J515801P45347J266808J236219J823687K060759J899837J733131
3725G2984285K217125K337495K683106K355306K186143L111087K962867K729589
3717I3567003L492423K241811L105072M002624M406318L816454L185932J121782
3709A18939419j640227l004606l915643l069227k789502j539290n16619n2199
3701A02412106J458330K014125K970126K598951j632934m172279n876684n017741
3693I4754000l350840l025591k648286k354824k408911l156895k828175l517101
3685G1463377l384619k950768k777958j939841j865209k050020j986768k131407
$$ plain form
3742 55563413 56689756 57113151 57824729 58654823 58893536 58964769 59474695 59519305 60702696
3733 60702696 62218497 62963844 64230652 65466871 67290558 69351317 71251154 72984285
3725 72984285 75201410 77538905 80222011 82577317 84763460 87874547 90837414 93567003
3717 93567003 97059426 99301237 102406309 106408933 110815251 114631705 117817637 118939419
3709 118939419 117299192 114294586 110378943 107309716 104520214 102980924 102464305 102412106
3701 102412106 103870436 105884561 108854687 111453638 109820704 105648425 99771741 94754000
3693 94754000 91403160 88377569 85729283 83374459 80965548 77808653 74980478 71463377
3685 71463377 68078758 65127990 62350032 60410191 58544982 56494962 54508194 52376787
3677E2376787j116810p74680j223713q72447p99385q05353l35177q13158p93537
3668D4842527p67383k09064q43990k62423j04190j09647m81446o99697m23325
3659D0941362j052923k44692k03038J20655L16469n4476k33570q4076O13789Q5874
3649D0205374m43152o64842Q3157M01846m71585q8488k99895K09210J93590J25571
3639C9250786N79741N7368j20177Q42259L94097L51217N92505n6194k14727Q22118
3629D2498993N83941K98997j7297L82690R0240n21209r2684l47741L09279k23983
3619D2961226k02176q30475K06537K18785j46096L5228L16186N3567J62724R12466
3609D3687972j4913L42178M84748N43764P11864Q25219K44583M36782N64669J40078
$$ plain form
3677 52376787 51259977 50485297 49261584 48389137 47589752 46784399 46449222 45636064 44842527
3668 44842527 44075144 43866080 43022090 42759667 42655477 42545830 42064384 41364687 40941362
3659 40941362 39888439 39643747 39440709 39561364 39877833 39823357 39589787 39505711 40119500 40205374
3649 40205374 39762222 39097380 39180537 39582383 39110798 39022310 38722415 38931625 39125215 39250786
3639 39250786 39830527 39887895 39767718 40609977 41004074 41355291 41947796 41891602 41676875 42498993
3629 42498993 43082934 43381931 43364634 43747324 43837564 43316355 43223671 42875930 43185209 42961226
3619 42961226 42759050 41928575 42135112 42353897 42207801 42243029 42559215 42612782 42775506 43687972
3609 43687972 43673059 44015237 44499985 45043749 45755613 46580832 46825415 47262197 47826866 47966944
3599D7966944N5181M01734j63271K94481M84733J064056M81031l2700K65965Q44048
3589E1662202O05685N24866O25961O23389P21084J326062J086441P56119J31620
3580E8063429K32843K37675L6786j4489L51657L12332J45172k6179j28041N5115
3570E9266300J24404M86823L89112M78158l62076R25910P14279O53523P17553
3561F3393986Q21145R59874M91860J118528J109538R40616K26195R08478N91052
3552G0561272j1524r6769j45869k7966j35548L07925K47641K8914L66871N71297
3542G1666244N08748L03537J99107N26675K89738J222392Q60419J117639J146123
3533G7840622J067612Q77405J082741R28305J496438J004322R40712J141365J689793
$$ plain form
3599 47966944 48022125 48423859 48260588 48555069 49039802 50103858 50584889 50552189 50818154 51662202
3589 51662202 52267887 52792753 53418714 54042103 54763187 56089249 57175690 57931809 58063429
3580 58063429 58296272 58533947 58570733 58556244 58907901 59220233 59365405 59339226 59211185 59266300
3570 59266300 59390704 59877527 60266639 60744797 60382721 61308631 62022910 62676433 63393986
3561 63393986 64215131 65175005 65666865 66785393 67894931 68835547 69061742 69970220 70561272
3552 70561272 70549748 70452979 70307110 70279144 70143596 70451521 70699162 70728076 71094947 71666244
3542 71666244 72174992 72478529 72677636 73204311 73494049 74716441 75576860 76694499 77840622
3533 77840622 78908234 79785639 80868380 81796685 83293123 84297445 85238157 86379522 88069315
3524H8069315J977361K168506K503987L127984L252971L515984L643496M421838
3516A12681442N705887P005231Q146860R773767J2645768J7560306Q184365p232594
3508A74471032r601454q826607m355804o79254K029779L764840O120186Q144915
3500A71067633R479214R739512M166793l750498q513812r136498p767922o518328
3492A58766094m920997l321435k485430j165040K90335O80199J367946L027608
3484A52239280L427818M277539M971659O445200P709506P496986P629161P219396
3476B01416545P649431N785829K169254l198079p983152j1083902j1610606r936070
3468A73209250r211580p871238o233615n896625m892687m069668l567811l884916
$$ plain form
3524 88069315 90046676 92215182 94719169 97847153 101100124 104616108 108259604 112681442
3516 112681442 118387329 125392560 133539420 143313187 155958955 173519261 181703626 174471032
3508 174471032 164869578 156042971 151687167 151007913 153037692 156802532 162922718 171067633
3500 171067633 180546847 190286359 194453152 190702654 182188842 173052344 165284422 158766094
3492 158766094 153845097 150523662 148038232 146873192 147163527 147843726 149211672 152239280
3484 152239280 155667098 159944637 164916296 171361496 179071002 186567988 194197149 201416545
3476 201416545 209065976 214851805 217021059 213822980 205839828 194755926 183145320 173209250
3468 173209250 163997670 156126432 149892817 143996192 139103505 135033837 131466026 127581110
3460A27581110l276837k948396k988619k107289k130828j800095j613543j606111
3452A09109392j845294k039389j563068j116463j368481j522440j619699j861396
3444I6173162j121283j398011j710011q52529q77390q73709j099258r94611r98907
3435H6247453n38379n76941n31983p02180p56439n86895j167918m98975o94465
3426H0193278m54911n39358J74304M4248l8775k40859j82573j73409J79876K07798
3416G9169619K18825j39841r5896N12851Q45582P90866J204133J246982P35086
3407H4488207J366231P56279K98037L92474P72080P90990Q27416K334945K707967
3398I4734626K547021K827424K677781K755099J456066l93074p46249j192084
$$ plain form
3460 127581110 124304273 121355877 118367258 116259969 114129141 112329046 110715503 109109392
3452 109109392 107264098 105224709 103661641 102545178 101176697 99654257 98034558 96173162
3444 96173162 95051879 93653868 91943857 91091328 90213938 89340229 88240971 87246360 86247453
3435 86247453 85709074 85132133 84600150 83897970 83141531 82554636 81386718 80887743 80193278
3426 80193278 79738367 79199009 79373313 79417561 79378786 79137927 78955354 78781945 78961821 79169619
3416 79169619 79388444 79248603 79152707 79665558 80511140 81302006 82506139 83753121 84488207
3407 84488207 85854438 86610717 86908754 87301228 88073308 88864298 89691714 92026659 94734626
3398 94734626 97281647 100109071 102786852 105541951 106998017 106604943 105858694 104666610
3390A04666610j015574l39844K36260Q61209o41754q18621m12063K70051J091024
3381A03897298J885613K473563L729827L743291M390953M351602M371943L661771
3373A32505861L011504K30971k721483n875694o486045o160757n806218n594608
3365A03103531n257667l651996k457345k530911k144691j482149j094342n98676
3357H3885754j985859k387731j964002j738213j015511j152119j367943p52632
3349G1521744l84710k27480j194963l55918J49232K80250m21677J9502O6731n81244
3339F8871467O2392L11144J0186M45793o4268k8181L15580R99515N55907Q02931
3329G2282466R49509J34169k44476o42485j058294j220272k69993m23483P364
$$ plain form
3390 104666610 103651036 103311192 103547452 104408661 103766907 102948286 102536223 102806274 103897298
3381 103897298 105782911 108256474 111986301 115729592 120120545 124472147 128844090 132505861
3373 132505861 135517365 135748336 133026853 127151159 120665114 114504357 108698139 103103531
3365 103103531 97845864 94193868 91736523 89205612 87060921 85578772 84484430 83885754
3357 83885754 81899895 79512164 77548162 75809949 74794438 73642319 72274376 71521744
3349 71521744 71137034 70909554 69714591 69358673 69507905 69788155 69366478 69385980 69452711 68871467
3339 68871467 68933859 69245003 69255189 69700982 69636714 69608533 69924113 70923628 71479535 72282466
3329 72282466 73231975 73366144 73121668 72479183 71420889 70200617 69930624 69507141 69514505
3320F9514505j67141m17226n44340J238P04523N38931K51671n6613P71260K46108
3310G0842916N29671j97486o94237J9193L10452j01134n60675O59334N77520Q71329
3300G2256883O27010J173475J810459J591534J548451R43843J782130J441533
3292H3175318J541835P57998L25040J64293O0174k2143p24165j577877j175910
3283H2524563j073344r71745l59115k37044P09118O50647M50623P48771J014223
3274H3456697J327589J530503J627597K014201K325092J921659J378157J077476
3266I6658971J677640J810048J084495P14599l16155o16575k63250p23130q24946
3257I9201697l10622m08301Q837q02416R3761L30802M44622J056424O97301P99612
$$ plain form
3320 69514505 69347364 68930138 68385798 68387036 69091559 69630490 69882161 69825548 70596808 70842916
3310 70842916 71372587 71175101 70480864 70500057 70810509 70709375 70148700 70808034 71385554 72256883
3300 72256883 72883893 74057368 75867827 77459361 79007812 79951655 81733785 83175318
3292 83175318 84717153 85475151 85800191 85964484 86024658 86002515 85278350 83700473 82524563
3283 82524563 81451219 80479474 80120359 79883315 80592433 81243080 81693703 82442474 83456697
3274 83456697 84784286 86314789 87942386 89956587 92281679 94203338 95581495 96658971
3266 96658971 98336611 100146659 101231154 101945753 101629598 101013023 100749773 100026643 99201697
3257 99201697 98891075 98482774 98491611 97689195 97782956 98113758 98558380 99614804 100312105 101111717
3247A01111717J741666J403052J075481J597636J113482J086744Q70056P27722
3239A10727556Q15390J059240Q24297J101908P56416N58245L58634j0651K89691
3230A16480726R263j85838l5533Q63698O8697J15599K62378j36994J76207L20973
3220A17939176P06981N86584R81805J139512Q42738P40057N02397k22864M8008
3211A23264394m23584k92308j43173l59971k8967j84033m66662r48091k0458j49241
3201A20247906l29009k56698m72427r52641j030028r12960p85486r80665m37365
3192A14090627o67063r05527k52702n71950r32289o16830p49042q25284r56443
3183A07613497p93366K47611l00974r65368k24935l33200m01778M46469K17753
$$ plain form
3247 101111717 102853383 104256435 105331916 106929552 108043034 109129778 109999834 110727556
3239 110727556 111542946 112602186 113426483 114528391 115284807 115843052 116201686 116191035 116480726
3230 116480726 116489989 116304151 116268618 117132316 117201013 117316612 117578990 117441996 117618203 117939176
3220 117939176 118646157 119232741 120214546 121354058 122196796 122936853 123439250 123216386 123264394
3211 123264394 122840810 122548502 122405329 122045358 122016391 121832358 121365696 120417605 120397147 120247906
3201 120247906 119918897 119662199 119189772 118237131 117207103 116294143 115508657 114527992 114090627
3192 114090627 113423564 112518037 112265335 111693385 110761096 110144266 109395224 108569940 107613497
3183 107613497 106820131 107067742 106766768 105801400 105576465 105243265 104841487 105287956 105505709
3174A05505709L36276N19780M18929O24884J411887J235529J322054J099282J041844
3165A13516174J147155J559089J247985J324968Q48551K94308O42323P21176K17937
3156A21519666l49816J58728j26925l39404J88959k69717L10455k02461o21922
3147A20267563l96158l32952r96953j229073j359808j203755m71943j337363j049901
3138A11889657j545156j310521o47960p84716p94674l41118R790J21765L72875
3129A06969942r1757r9903P5799K92134n20127j70170M43569L50821O46515L67249
3119A08264072K53975j84468Q84796Q60287N68451Q31041P49495J132505J402029
3110A14762183J240581J067927J002499J119814J374665J426049J978173J616638
$$ plain form
3174 105505709 105841985 106361765 106780694 107405578 108817465 110052994 111375048 112474330 113516174
3165 113516174 114663329 116222418 117470403 118795371 119643922 119938230 120580553 121301729 121519666
3156 121519666 121169850 121328578 121201653 120862249 121051208 120781491 121091946 120889485 120267563
3147 120267563 119871405 119538453 118541500 117312427 115952619 114748864 114276921 112939558 111889657
3138 111889657 110344501 109033980 108386020 107601304 106806630 106465512 106475302 106597067 106969942
3129 106969942 106878185 106778282 106854081 107146215 106626088 106455918 106899487 107250308 107896823 108264072
3119 108264072 108518047 108333579 109218375 110078662 110647113 111478154 112227649 113360154 114762183
3110 114762183 116002764 117070691 118073190 119193004 120567669 121993718 123971891 125588529
3102A25588529J205292J799024J073974J462669R37249L42260l38902l91983j021070
3093A30657042N86150Q2718M7870O24630P44989R59213L51878K50373L02519N60968
3083A35168350J19059K49567M07893J398660J408186K402304K759288L924630
3075A47837937L547633K810413J011396n31590j512280j918398k208497q79345
3067A48157269l08602o16475J24300n2359K48923N32550O32718P26879M36435
3058A49881638j60170R89277R79852J114708J013749R36356J778520O55483K47746
3049A57437159j027875j876701j813950j647586j650027j767891n87139j451409
3041A45614581r09086r10959o65413n48391p79098o41452o02601l02884j63116
$$ plain form
3102 125588529 126793821 128592845 129666819 131129488 132066737 132408997 132070095 131678112 130657042
3093 130657042 131243192 131325910 131373780 131998410 132743399 133702612 134054490 134304863 134607382 135168350
3083 135168350 135287409 135536976 135944869 137343529 138751715 141154019 143913307 147837937
3075 147837937 151385570 154195983 155207379 154675789 153163509 151245111 149036614 148157269
3067 148157269 147848667 147232192 147356492 147304133 147553056 148085606 148718324 149445203 149881638
3058 149881638 149721468 150710745 151690597 152805305 153819054 154755410 156533930 157189413 157437159
3049 157437159 156409284 154532583 152718633 151071047 149421020 147653129 147065990 145614581
3041 145614581 144705495 143794536 143129123 142580732 141801634 141160182 140557581 140254697 140091581
3032A40091581k18852o75415n9659R6805k07809q90141r28412j598657j468061
3023A34141380j490677j120055j596017j820663j376271j628062j834170k194765
3015A21080700j701701r01572n49632p44717k57927R0138j2578K43804J79380
3006A17425895k6841O01802N92137P5799P9422l95771m54019j179209j427651
2997A15291564r67841j038690j022730j108658j428381j777866j050522o62736
2989A06234140n31093n48448q59285K59965P29451M72468J24838L89792Q12531
2980A07084359J031899J550556Q25475J375250K221271K548473K742270K833033
2972A22212586L596897L402521L308475K768088K347642R47179J122306J677569
$$ plain form
3032 140091581 139872729 139197314 139137655 139234460 139026651 138136510 137208098 135609441 134141380
3023 134141380 132650703 131530648 129934631 128113968 126737697 125109635 123275465 121080700
3015 121080700 119378999 118477427 117927795 117183078 116925151 117015289 117002711 117246515 117425895
3006 117425895 117399054 118000856 118592993 118668792 118748214 118352443 117898424 116719215 115291564
2997 115291564 114323723 113285033 112262303 111153645 109725264 107947398 106896876 106234140
2989 106234140 105703047 105154599 104295314 104555279 105284730 105757198 105882036 106271828 107084359
2980 107084359 108116258 109666814 110492289 111867539 114088810 116637283 119379553 122212586
2972 122212586 125809483 129212004 132520479 135288567 137636209 138583388 139705694 141383263
2964A41383263J278272J556581K028007J756259O78103K34966j609556k719142
2956A44586753l089100k918373k564751k558941j707570k557743k476783j897410
2948A24816082j945007j972828k704336k079964k377660k054586k040871k339446
2940A07301384j854666j272365k063399j912593j420145k256920j361502j290150
2932I3869644j134476p75622j054115l08636l72169j6175L50824J41696J4329
2923I0715300L0836Q82443J025983J25705M12570J192337J665331J042447K027487
2914I9120439J522770J803487J836753K106853K589475K254889M06608Q65282
2906A12506556J644102J208993J530584J426626K460047J555570J371854O35939
$$ plain form
2964 141383263 142661535 144218116 146246123 148002382 148680485 148915451 147305895 144586753
2956 144586753 141497653 138579280 136014529 133455588 131748018 129190275 126713492 124816082
2948 124816082 122871075 120898247 118193911 116113947 113736287 111681701 109640830 107301384
2940 107301384 105446718 104174353 102110954 100198361 98778216 96521296 95159794 93869644
2932 93869644 92735168 91959546 90905431 90596795 90224626 90208451 90559275 90700971 90715300
2923 90715300 90746136 91628579 92654562 92780267 93192837 94385174 96050505 97092952 99120439
2914 99120439 100643209 102446696 104283449 106390302 108979777 111234666 111641274 112506556
2906 112506556 114150658 115359651 116890235 118316861 120776908 122332478 123704332 124340271
2898A24340271n91282n99264j233732p60531J52433o88202j36960j0118j18386
2889A20354229K60723O3389N85646M56938M21195J375633P97097N70894J751941
2880A26637685J722851R90672J712406J650824J857345J560870J509346J709198
2872A39351197J697947J569016J722970J196582J310180J067322O42535Q30875
2864A49388624P41203K84788j99580P734m89943m49252n82725n90285k76008l26756
2854A47507800j01226m57149o84445k95604o64293J90475J22866K58223O10405
2845A46487052P35246O70382Q44201R54129N53984Q10735R67683R22798J267115
2836A54213325J384477J089478Q31624J469378J260494M07579J355037J312848
$$ plain form
2898 124340271 123748989 123149725 121915993 121155462 121307895 120619693 120482733 120472615 120354229
2889 120354229 120614952 120678341 121263987 121720925 122142120 123517753 124314850 124885744 126637685
2880 126637685 128360536 129351208 131063614 132714438 134571783 136132653 137641999 139351197
2872 139351197 141049144 142618160 144341130 145537712 146847892 147915214 148557749 149388624
2864 149388624 150129827 150414615 150215035 150222769 149732826 149283574 148700849 148110564 147834556 147507800
2854 147507800 147406574 146949425 146264980 145969376 145305083 145495558 145618424 145876647 146487052
2845 146487052 147222298 147892680 148736881 149691010 150244994 151055729 152023412 152946210 154213325
2836 154213325 155597802 156687280 157518904 158988282 160248776 160656355 162011392 163324240
2828A63324240J759575J834382K036159J788799J933750K494980K733950K704193
2820A80610028K630539K808464K941684L247871L373396L806977L769470L913730
2812B07102159M692770M120349M499235M939223N184962N636478O278429N449110
2804B47902715N875465O761797P009209P851670Q560391Q612283R302265J0988506
2796C12864301J1255957J1346293R672509P314792M489255k24744l796277o581319
2788C46340767p396878p092401o038175n457859l964132l512458k470344j940318
2780C08468202j704994j356389j664556j673474j848466k066309k432282k143305
2772B93578427k291650j993000k287670k700794j958093j892508k610176k234547
$$ plain form
2828 163324240 165083815 166918197 168954356 170743155 172676905 175171885 177905835 180610028
2820 180610028 183240567 186049031 188990715 192238586 195611982 199418959 203188429 207102159
2812 207102159 211794929 215915278 220414513 225353736 230538698 236175176 242453605 247902715
2804 247902715 253778180 260539977 267549186 275400856 283961247 292573530 301875795 312864301
2796 312864301 324120258 335466551 345139060 352453852 356943107 356718363 352922086 346340767
2788 346340767 338943889 331851488 325813313 320355454 316391322 312878864 310408520 308468202
2780 308468202 306763208 305406819 303742263 302068789 300220323 298154014 295721732 293578427
2772 293578427 291286777 289293777 287006107 284305313 282347220 280454712 277844536 275609989
2764B75609989k449814k551303k536129k309563k760238k717232k994141k816972
2756B54474597l631033k617586j809012j146991K87324J638924K771881K180057
2748B52148161j20589l866818q578181j2596462j3856156j2785747j1566318r253388
2740A79524502q105537o423668n954419n039794m552802m046758l547187l187171
2732A38667166k918333k227739k358416k047566j803724k141794j519079j055814
2724A22594701j301571j087034q80837r85762o40933m55539k00983L81579O29258
2715A18052879J087584J066846J194566J745988J673753K721526K994510L791970
2707A34329622N592788N520446L368185k021245o922152p582983o866052n631299
$$ plain form
2764 275609989 273160175 270608872 268072743 265763180 263002942 260285710 257291569 254474597
2756 254474597 250843564 248225978 246416966 245269975 245557299 247196223 249968104 252148161
2748 252148161 252027572 248160754 239582573 226986111 213129955 200344208 188777890 179524502
2740 179524502 171418965 164995297 159040878 154001084 149448282 145401524 141854337 138667166
2732 138667166 135748833 133521094 131162678 129115112 127311388 125169594 123650515 122594701
2724 122594701 121293130 120206096 119325259 118339497 117698564 117243025 117042042 117423621 118052879
2715 118052879 119140463 120207309 121401875 123147863 124821616 127543142 130537652 134329622
2707 134329622 139922410 145442856 148811041 146789796 139867644 132284661 125418609 119787310
2699A19787310m084837k917273k688138j463161j105898j13070J57137L87478
2691A07959548J142298J681517J180471J519293K169071K771230L101318M302926
2683A25827672N116473N958248O910465O105837J485938l358228n202319m521377
2675A38322709l254023k425610j434623p85457n20864k00488L27702P13236J475576
2666A32218158Q68397N37652J098929J001026J261222J407765J072363Q13429
2658A40278941J616129J184378L58989P19240O63967J8011m40406k25479l25268
2649A43848502j370633m17381q04702j375950j523748j416264o75576j669585
2641A34594663j049595j209951r41996j165532j865353r18531j532916o34540
$$ plain form
2699 119787310 115702473 112785200 110097062 108633901 107528003 107414933 107572070 107959548
2691 107959548 109101846 110783363 111963834 113483127 115652198 118423428 121524746 125827672
2683 125827672 130944145 136902393 143812858 149918695 151404633 148046405 142844086 138322709
2675 138322709 135068686 132643076 131208453 130422996 129902132 129701644 130029346 130742582 132218158
2666 132218158 133086555 133624207 134723136 135724162 136985384 138393149 139465512 140278941
2658 140278941 141895070 143079448 143438437 144157677 144821644 144839655 144399249 144173770 143848502
2649 143848502 142477869 142060488 141255786 139879836 138356088 136939824 136264248 134594663
2641 134594663 133545068 132335117 131393121 130227589 128362236 127443705 125910789 125276249
2633A25276249p08578j486566j394522j348074j349693j527501j657317j914310
2625A13889688j863783j171574k315447j955227j269114j972555j525579k001397
2617I9815012k056659j617268j499170j811627j710123j711013j411249j398648
2609H6599255j157600j001194j075592m22006j34956q88789l36481k46488r52837
2600H0383312m60645n84245j014812m44019j037344r07346j180560o88298j121075
2591G2944968j513027j321665j502514j303923j405549j488166j006213j346317
2583F2057594j668971j154151j424192r97187q95652p91561q99359j134748r00285
2574E2191488o62593n65633q39869j43929p04794j083415l09480o48878m67081
$$ plain form
2633 125276249 124567671 123081105 121686583 120338509 118988816 117461315 115803998 113889688
2625 113889688 112025905 110854331 108538884 106583657 105314543 103341988 101816409 99815012
2617 99815012 97758353 96141085 94641915 92830288 91120165 89409152 87997903 86599255
2609 86599255 85441655 84440461 83364869 82942863 82807907 81919118 81582637 81336149 80383312
2600 80383312 79922667 79338422 78323610 77879591 76842247 75934901 74754341 74066043 72944968
2591 72944968 71431941 70110276 68607762 67303839 65898290 64410124 63403911 62057594
2583 62057594 60388623 59234472 57810280 56813093 55917441 55125880 54226521 53091773 52191488
2574 52191488 51528895 50963262 50123393 49979464 49274670 48191255 47881775 47232897 46765816
2565D6765816n17950p25135o23556n76371m32964m58706l08648p42973l09711
2556D2069802k40039O787q7530m33756n82307J391J4763m25512k01794k86822
2546C9834983J67398j13637J29150n09197N05404j60572N8377p32373m11864m266
2536C8763403p00748J89891n71590J18178k97291k38070J48222K36727k36968
2527C7411754l51373l5084J08962K44311L22795k38579n3120L38142N68719L19419
2517C8635946L78793j7667j12048J04809p1627l20359J31962K97904Q2641J43169
2507C9253523O85397P78781J03302r2473M45758j42763M57269P23153P49130P98563
2497D3759640M14292P79524O44095J118413Q01572P49231L58140M67128P46200
$$ plain form
2565 46765816 46247866 45522731 44899175 44322804 43889840 43431134 43122486 42379513 42069802
2556 42069802 41829763 41836550 41749020 41315264 40732957 40734348 40749111 40323599 40121805 39834983
2546 39834983 40002381 39888744 40017894 39508697 40014101 39853529 39911906 39179533 38767669 38763403
2536 38763403 38062655 38252546 37680956 37799134 37501843 37263773 37411995 37648722 37411754
2527 37411754 37060381 37025297 37134259 37378570 37701365 37462786 37409666 37747808 38316527 38635946
2517 38635946 39014739 38997072 38885024 38989833 38918206 38597847 38729809 39027713 39110354 39253523
2507 39253523 39938920 40717701 40821003 40728530 41174288 41031525 41488794 42211947 42961077 43759640
2497 43759640 44173932 44953456 45597551 46715964 47517536 48266767 48624907 49092035 49838235
2488D9838235R11088M34414P09930R83139J559778M75524N04014J184819J314804
2479E7915745J541042J641556Q40656J117363Q36420J454064J617217J350363
2471F8314426K104547J902920J544871K124189K264625K385307K217552L113404
2463H5971841K870500L490894M149649L669170L533328L273693L237533K943075
2455A13139683L326786L500371L101183K824737K694796K123328L194783L085778
2447A36991445K577779K126052K209898K309124K351646L244033L496314L778573
2439A59084864M889344N146232O994975P941633Q683492J0101656J1432486J2648171
2431B26922853J4163229J5428738J5617829J5467960J6252223J5972863J4419239
$$ plain form
2488 49838235 50749323 51183737 51893667 52876806 54436584 54912108 55416122 56600941 57915745
2479 57915745 59456787 61098343 61938999 63056362 63892782 65346846 66964063 68314426
2471 68314426 70418973 72321893 73866764 75990953 78255578 80640885 82858437 85971841
2463 85971841 88842341 92333235 96482884 100152054 103685382 106959075 110196608 113139683
2455 113139683 116466469 119966840 123068023 125892760 128587556 130710884 133905667 136991445
2447 136991445 139569224 141695276 143905174 146214298 148565944 151809977 155306291 159084864
2439 159084864 163974208 169120440 176115415 184057048 192740540 202842196 214274682 226922853
2431 226922853 241086082 256514820 272132649 287600609 303852832 319825695 334244934
2424C34244934J1471634P553776M030107J564092j301966k541358k553012j320061
2416C51148146L07814J046759J837339K993110L346858L045950J109092j206362
2408C63628706k630129k655499j940654o82776M27035R90865J407207K140308
2400C60685063L079362M301268M853609M072807P56891m307417r529440j1814603
2392C52097540j2224064j1107127q321894o332529l319409k228182o09687J094639
2384C09049287J491081K345671K553969K384130Q31068j319992n028908q721852
2376C03584454j1853753j5296525j4924428j5029601j5054084j3520647j2417202
2369B05488214j1327352j0535953r540915q483400q167135p227640o623683n405356
$$ plain form
2424 334244934 345716568 353270344 357300451 358864543 357562577 355021219 352468207 351148146
2416 351148146 351455960 352502719 354340058 357333168 360680026 363725976 364835068 363628706
2408 363628706 360998577 358343078 356402424 355719648 356146683 357137548 358544755 360685063
2400 360685063 363764425 368065693 372919302 376992109 377749000 373441583 363912143 352097540
2392 352097540 339873476 328766349 320444455 314111926 310792517 308564335 307954648 309049287
2384 309049287 310540368 312886039 315440008 317824138 318655206 317335214 312306306 303584454
2376 303584454 291730701 276434176 261509748 246480147 231426063 217905416 205488214
2369 205488214 194160862 183624909 174083994 165600594 157433459 150205819 143582136 138176780
2361A38176780n000448m691130n260337m792142m197897l705142l991256l195498
2353A03342930m014944l247559k927746k672580k965967k937837k446602k305409
2345G9824286k077806k187989k143540k037960j588640j857018j604361j578159
2337F4748813r10418j434142j000647m42441j031434o25855m28956o30633j83858
2328E8060429O2842N38899J265161R0451o86983o56817j494299k470404k752076
2319E1957203k129211j563714j659735j658004j166814j475053j036637l19085
2311D0948950j191485r07470q02940q19477l60529l40024N1222j199472l89609
2302C4989166m78429o89471k44475o64280q76334j038607j312970q67405p53445
$$ plain form
2361 138176780 133176332 128485202 123224865 118432723 114234826 110529684 106538428 103342930
2353 103342930 99327986 96080427 93152681 90480101 87514134 84576297 82129695 79824286
2345 79824286 77746480 75558491 73414951 71376991 69788351 67931333 66326972 64748813
2337 64748813 63838395 62404253 61403606 60961165 59929731 59303876 58874920 58244287 58060429
2328 58060429 58123271 58662170 59927331 60017782 59330799 58673982 57179683 54709279 51957203
2319 51957203 49827992 48264278 46604543 44946539 43779725 42304672 41268035 40948950
2311 40948950 39757465 38849995 38047055 37227578 36867049 36527025 36578247 35378775 34989166
2302 34989166 34510737 33821266 33576791 32912511 32036177 30997570 29684600 28817195 28063750
2293B8063750o01429j010322m68101l11939m00511m07378p46830j89355j15959
2284B3811926p43258j05268k98783r55294m50210j10526k26077k82531n20384
2275B0119595l44063m89574K7931o62965l28778j90857o72197J38404k11817k52690
2265A7132989p16001m75734K71230p12091l85570K14358q4370l97254j62648k57827
2255A4427082k59919k67078m69657m91165q5678j44547J49196m57027k37773j54834
2245A2008600m41365J93964n83426J44314L69268l90475m89695l00510j35178
2236A0375497m81320k70477K94610N3825k14546l85065j95985k22434l37222n8365
2226H558518K98027k09092r4216J1498j7844j57249l58416k4640L10213o98078
$$ plain form
2293 28063750 27462321 26451999 25983898 25671959 25271448 24864070 24117240 23927885 23811926
2284 23811926 23068668 22963400 22664617 21709323 21259113 21148587 20922510 20639979 20119595
2275 20119595 19775532 19285958 19313889 18650924 18322146 18131289 17459092 17597496 17385679 17132989
2265 17132989 16416988 15941254 16212484 15500393 15114823 15329181 15244811 14847557 14684909 14427082
2255 14427082 14167163 13900085 13430428 12939263 12853585 12709038 12858234 12401207 12163434 12008600
2245 12008600 11567235 11761199 11177773 11322087 11691355 11300880 10811185 10510675 10375497
2236 10375497 9894177 9623700 9918310 9972135 9757589 9372524 9176539 8954105 8616883 8558518
2226 8558518 8856545 8647453 8553237 8564735 8546891 8389642 8031226 8006586 8316799 7618721
2216G618721j75925K97602n63453l60472J16839k60165j78297n5301K85638J78963
2206F904150j63096l86849j5713j9958j39271K1851j44940K2808K2875R2386K7877
2195F222120m54560l27233J67518P4304j02108n9610J80616K39208l44011Q6651
2185E682895m27183o3186o4233k0371K9031j854k89506p5130L10212L77381l19306
2174E138750K3081j51849j24430Q07763O0274l77632m10922M40348R4182l54898
2164E144667p2559K30931j30822J82164k18899j92154q0641l7687J28022J32654
2154E085676m83288k75037L66902m1804q5501q0872m4529k46048K66061K07827
2144D669387J48348J25320P3540m60505K67470r8652p57934k79058P297L74799
$$ plain form
2216 7618721 7442796 7740398 7176945 6816473 6933312 6673147 6494850 6439549 6725187 6904150
2206 6904150 6741054 6354205 6338492 6318534 6179263 6201114 6056174 6078982 6101857 6194243 6222120
2195 6222120 5767560 5440327 5607845 5682149 5580041 5520431 5701047 5940255 5596244 5682895
2185 5682895 5255712 5192526 5128293 5107922 5136953 5135099 4845593 4770463 5080675 5458056 5138750
2174 5138750 5161831 5009982 4885552 5693315 5753589 5375957 4965035 5405383 5499565 5144667
2164 5144667 5072108 5303039 5172217 5354381 5135482 4943328 4862687 4825000 4953022 5085676
2154 5085676 4602388 4327351 4694253 4652449 4566948 4486076 4441547 4195499 4461560 4669387
2144 4669387 4817735 4943055 5016595 4556090 4823560 4724908 3966974 3687916 3695213 4070012
2134D070012n8877j21965m03803L71228j83872k60054K47557R405k22554l0609
2124C416468M1348q8301k87885p908K3804R4641l26026p27442K6326J98014j68537
2113B194502J9270j96837K23195R0144l47889j80697K60372O9422m04739J28741
2103A855484j17161j33207k81987j73385k38291J88914O70775l9491n34809L68421
2093A565263J55284k31892j8296k2411l95531j11990J07089j47669L84486l49596
2083I34737R1770J88586j30970o7388k7627J51955k57777J10378j02753l88709
2073E02202K52785K43691L15403O8150l21228o6897l66660r0069K03072j08212
2063F32237n2922Q0567q0143Q2802r9143j20166K07497j11881K84752k05959k7224
$$ plain form
2134 4070012 4011135 3889170 3485367 3856595 3672723 3412669 3660226 3669631 3447077 3416468
2124 3416468 3457816 3369515 3081630 3073722 3097526 3192167 2866141 2138699 2165025 2363039 2194502
2113 2194502 2213772 2016935 2240130 2330274 1982385 1801688 2062060 2131482 1726743 1855484
2103 1855484 1738323 1605116 1323129 1149744 911453 1100367 1771142 1731651 1196842 1565263
2093 1565263 1720547 1488655 1470359 1447948 1052417 940427 1047516 899847 1284333 934737
2083 934737 1026507 1215093 1084123 1016735 989108 1141063 883286 993664 890911 502202
2073 502202 754987 998678 1314081 1382231 1061003 994106 627446 537377 740449 632237
2063 632237 579315 659882 579739 662541 563398 443232 650729 538848 823600 617641 590417
2052E90417O00187j49511p92819n5492j22667M64643J34984k50408j57675K66884
2042E28543M14441p45120K61168K62056P8273k11245r55453K75044K63542M3062
2032B14311J2190L20206q5923k46975L6184K15706J92737l61085R1387j07873
2022B80865j5118J6877J39652k95257k94331k40991O32032k0031O8932L51949
2012F24579k14682l56272k30888O9882j46562K04605j10179K52775K86745j81835
2002A98168m28217J25349K52446N8783l18475j99669M55619K11588m00426k83462
1992c28296L03025j89041j4859K68560m8274K18580L00442M35391m07394l84376
1982A53758L97019L31872K36950r3284J21750P1589m1049m55294k01626j48467
$$ plain form
2052 590417 1190604 1041093 248274 192782 70115 534758 669742 419334 261659 528543
2042 528543 942984 197864 459032 721088 799361 588116 -367337 -92293 171249 214311
2032 214311 226501 546707 460784 213809 249993 465699 658436 297351 388738 280865
2022 280865 265747 282624 422276 127019 -167312 -408303 223729 203698 272630 624579
2012 624579 409897 53625 -177263 -107381 -253943 -49338 -159517 93258 380003 198168
2002 198168 -230049 -104700 147746 206529 -111946 -311615 144004 355592 -44834 -328296
1992 -328296 -25271 -214312 -229171 39389 -8885 209695 510137 945528 538134 153758
1982 153758 550777 882649 1119599 1026315 1148065 1219654 1178605 723311 521685 373218
1972C73218r3160J50270k31258N13113k512l57497L62563k36032n4382M87829
1962I12152l12818m90487j50753P8154m78069L62744L68240n11654L30489l30607
1952b22609K59240n4566j25493J71848j3834K3047N0930k22948k11977K09201
1942a37161K69254R6331l66287j13692M13393j53244k32261L74329L37412j47502
1932C40572j08771l77209L9886M94896k94551j40086L1350O8136m6525O400J76948
1921A91046j18616q7726k51340r6931K87461L91169L06026l73713O7175j32291
1911A82260p9617m64666O7036J88043L40904J02553m62877j47690K47539J20372
1901I3857n966M52295o55915R3258j42597Q120N89000n6744l49997l62509k72976
$$ plain form
1972 373218 280058 430328 199070 712183 709671 352174 714737 478705 424323 912152
1962 912152 599334 108847 -41906 36248 -441821 -79077 289163 -222491 107998 -222609
1952 -222609 36631 -17935 -143428 28420 14586 37633 88563 -134385 -346362 -137161
1942 -137161 132093 228424 -137863 -251555 161838 8594 -223667 150662 488074 340572
1932 340572 231801 -145408 -105522 389374 94823 -45263 -13913 54223 7698 14098 191046
1921 191046 72430 -15296 -266636 -363567 -76106 315063 621089 247376 314551 182260
1911 182260 102643 -362023 -294987 -106944 233960 336513 -126364 -274054 -26515 93857
1901 93857 87891 540186 -115729 -22471 -165068 -156948 432052 375308 25311 -337198 -610174
1890f10174N1623J80102N21278j57231q2027L0288l12461k32317P92654O19278
1880H01013m75807J87302K37501l35149l21693J31127j19553j51259O1283k81005
1870b66240O07266r5344l41728M35464Q3376J25596R9454J79305N37316k50111
1860A114354p37222k09544M36998J95212j56087K83133m49014l16415J35687R3183
1850C90285J66423j83425N11578l1533m80950l7373L31231K72686K17361K99530
1840A455813k20021L8161J2967O8118j16981j1221l11287L27232L34543L56908
1830A934232k31099l63288J63862L40030l12030J00172q5080K31311q9804P2766
1820A761072M64546J19413J88168L25794k39109j46786M33577L83794k3182J25807
$$ plain form
1890 -610174 -558551 -378449 142829 -14402 -96429 -66141 -378602 -610919 181735 801013
1880 801013 325206 512508 750009 414860 93167 224294 104741 -46518 14765 -266240
1870 -266240 341026 245682 -96046 339418 422794 548390 647844 827149 1364465 1114354
1860 1114354 377132 167588 604586 799798 643711 926844 477830 161415 297102 390285
1850 390285 556708 373283 884861 853328 372378 335005 666236 938922 1156283 1455813
1840 1455813 1235792 1273953 1286920 1355038 1238057 1226836 915549 1242781 1577324 1934232
1830 1934232 1703133 1339845 1503707 1843737 1531707 1631879 1546799 1778110 1688306 1761072
1820 1761072 2225618 2345031 2533199 2858993 2619884 2473098 2906675 3290469 3267287 3393094
1810C393094l151K07728p8051j08433K02006N4044L13865P8289l30210k99274
1800C429907K99942L29360n67861O44930J37998J87458M45774k17224n80205M10686
1790D520765l920k19787O90713L39216L23958J11989N4496R6433M40393J41496
1780F495752M38443k71655J08769J63658K36002J08525N43342M52103J80532L30111
1770H785582M07747J50189j9843P71801N89508L26957P26808P62216K60258J427406
1760A4188629J406256J350578J529287J994523J453760J874897K168706K636005
1752B8602641J873217L088128M416099L666986L734932L880871N260894O066379
1744F0590147P391522Q386430R713892J3048434J7587766K1389813K7387185M0525922
$$ plain form
1810 3393094 3389943 3597671 3519620 3411187 3613193 3667237 3981102 4059391 3729181 3429907
1800 3429907 3729849 4059209 3491348 4136278 4274276 4461734 4907508 4690284 4110079 4520765
1790 4520765 4516845 4297058 4987771 5326987 5650945 5762934 5817430 5913863 6354256 6495752
1780 6495752 6934195 6662540 6771309 6934967 7170969 7279494 7822836 8274939 8455471 8785582
1770 8785582 9193329 9343518 9323675 10095476 10684984 11011941 11738749 12500965 12761223 14188629
1760 14188629 15594885 16945463 18474750 20469273 21923033 23797930 25966636 28602641
1752 28602641 30475858 33563986 37980085 41647071 45382003 49262874 54523768 60590147
1744 60590147 67981669 76368099 86081991 99130425 116718191 138108004 165495189 206021111
1736B06021111M5092073p754086m0171031m2156735l5976834k3357465j8012846
1729H3684187j2272425j0583210p269742o191345m335971l306596j961022k616569
1721C5147307k536580l154949k687949k595591j573865j453988q95437j421720
1713A8827228l62945n54739p08794l13622n40191j142912j296606l90791m15659
1704A3100969n64531q48868q53953K38445m95542q62883l24627m76537k20233
1695H692240k42223m15690l04181o92185m45577m3736k41087k2439k84509l48285
1685E652328m94437k71261p3326j69999l41818J97480N1377k43868k57520r3528
1675C955428M06669k53961n6774n64391k15560j680m1922j32240j89502l64319
$$ plain form
1736 206021111 251113184 243359098 203188067 161031332 125054498 101697033 83684187
1729 83684187 71411762 60828552 53558810 47367465 43031494 39724898 37763876 35147307
1721 35147307 32610727 29455778 26767829 24172238 22598373 21144385 20248948 18827228
1713 18827228 18464283 17909544 17200750 16887128 16346937 15204025 13907419 13516628 13100969
1704 13100969 12536438 11687570 10833617 11072062 10576520 9713637 9389010 8912473 8692240
1695 8692240 8450017 8034327 7730146 7037961 6592384 6548648 6307561 6285122 6000613 5652328
1685 5652328 5157891 4886630 4813304 4643305 4301487 4498967 4550344 4306476 4048956 3955428
1675 3955428 4362097 4108136 4051362 3486971 3271411 3269731 3227809 3095569 2906067 2541748
1665B541748J83259K44504k3222j26966j06439k04009L4214Q7890r5189j06255
1655B429535j89529l25038k72256l24006M03087k23438m6106l80436k29659O39925
1645A482079j11436q8797q0690k94443K911j36795j27037J18716K20649J03113
1635A088270K5979m55481K73501Q0271k09381L5534q5596n27425O2609p2672N94586
1624H10195j87769Q1387L38368m71873j84964P3553J71219K56192K03510k04204
1614H85614P4374n17401k0054j85029p93l20725K39820N6459m10829q7076K82848
1603b792j16735M63809j21935n07091L19156J20699j42990L50847m0093j65584
1593A57291j29112K02083J45851o5771J25493l24270p5671k97324M0047J01268
$$ plain form
1665 2541748 2725007 2969511 2946289 2819323 2712884 2508875 2543089 2630979 2535790 2429535
1655 2429535 2240006 1914968 1642712 1318706 1721793 1498355 1452249 1071813 842154 1482079
1645 1482079 1370643 1281846 1201156 906713 909624 772829 645792 764508 985157 1088270
1635 1088270 1114249 658768 932269 1012540 803159 838693 753097 225672 288281 215609 810195
1624 810195 622426 703813 1042181 570308 385344 458897 630116 886308 1089818 885614
1614 885614 959988 442587 422533 237504 236711 -84014 155806 212265 -198564 -285640 -2792
1603 -2792 -119527 344282 222347 -284744 34412 155111 12121 362968 322875 157291
1593 157291 28179 230262 376113 310342 435835 111565 35894 -261430 -221383 -120115
1583a20115m5513p239N2326N50943n1188J19404l97952l35692R6651m9378R135
1572a78618J37138l67699k28413M73722K30027m53057Q8527M10366O866j03374
1562A5485j93838J24855K77665L04683o09887l11366J69311P9025R5012k18390
1552b67445o2944l70798J68187K82559q4017j83686J15786K95277M25883k00578
1542A18224o23122k5003O9480m52032p3848J67231L48933J49214J60134q8012
1532b48801j21408J65994j6658j96543j10278N61129k40326m70540P3823M31363
1522a72245k04910L03014l73345R2793J01906m26057R0506J1423J34070n9451
1512e02296K07273j76705K0316k18762N44585j30674J89053j5960k00026J37110
$$ plain form
1583 -120115 -165628 -172867 -120541 430402 379214 498618 100666 -235026 -138375 -187753 -178618
1572 -178618 -41480 -409179 -637592 -163870 66157 -386900 -298373 111993 118859 15485
1562 15485 -178353 -53498 224167 528850 -81037 -392403 -223092 -144067 -49055 -267445
1552 -267445 -330389 -701187 -533000 -250441 -334458 -518144 -402358 -107081 318802 118224
1542 118224 -504898 -529901 -460421 -912453 -986301 -819070 -470137 -320923 -160789 -248801
1532 -248801 -370209 -204215 -220873 -417416 -527694 33435 -206891 -677431 -603608 -172245
1522 -172245 -377155 -74141 -447486 -354693 -252787 -678844 -588338 -576915 -442845 -502296
1512 -502296 -295023 -471728 -451412 -670174 -125589 -256263 -67210 -83170 -283196 -146086
1502a46086k68066L1800K88957R8618l54839k5842J11807O15505K54645M3935
1492F50434N04118j58039n40164k02780K54383l56910l65543k16706j29409J24545
1482d36071j35119J30348L27280j13669n38640K10896N47324l37309Q4934k99707
1472e59733n37942P88872J42932K54858m137l14030n43743O7960L66867o1856
1462c99952j27122j216m1895q9516j70592M60274j64993m31754L02472L53960
1452c10334j98449k79117K0528J54452j66719R0168J13651m44688Q2505j74509
1442a112512j12548K41511K75274K80044j53739l89715L7318J63290J90475K93739
1432b86863K58545j00705k66069j54275l12735O612L61262k15933j88378J4042
$$ plain form
1502 -146086 -414152 -382352 -93395 5223 -349616 -375458 -263651 351854 606499 650434
1492 650434 1154552 996513 456349 253569 507952 151042 -214501 -431207 -560616 -436071
1482 -436071 -571190 -440842 -113562 -227231 -765871 -554975 -7651 -344960 -260026 -559733
1472 -559733 -1097675 -308803 -165871 88987 84850 -229180 -772923 -704963 -338096 -399952
1462 -399952 -527074 -528290 -570185 -659701 -830293 -370019 -535012 -966766 -664294 -310334
1452 -310334 -508783 -787900 -767372 -612920 -779639 -689471 -575820 -1020508 -938003 -1112512
1442 -1112512 -1225060 -983549 -708275 -428231 -581970 -971685 -934367 -771077 -580602 -286863
1432 -286863 -28318 -129023 -395092 -549367 -862102 -855490 -494228 -710161 -898539 -884497
1422h84497l98041J28389M66525K63020j78908J31940O3994j01447l98684M52580
1412d55129N23522l01425o05358K0440l07791J94404O7622M21044L88333o65365
1402g19703J93629K63500m45321K01682j23581M2332K236j71307K29223j92509
1392g19819j2674R4193M13532k35731l50319J5821K48957k21216K31908J93201
1382c42147j61032n05920J38646M84518k47630J20067k15836J42553L889l4314
1372f17206J92215l8593K35748n02872J91804L40430m76958j08670L72950m31791
1362h42943Q6329L77631r773k42314r5101M10989N7631j65744J8203J94424j01969
1351c12637K85622o49k99486K97519o19409K52320k86546k28017o2509K44319
$$ plain form
1422 -884497 -1282538 -1154149 -687624 -424604 -603512 -471572 -407578 -509025 -907709 -455129
1412 -455129 68393 -233032 -838390 -817950 -1125741 -931337 -863715 -442671 -54338 -719703
1402 -719703 -526074 -262574 -707895 -506213 -629794 -587462 -585226 -756533 -527310 -719819
1392 -719819 -732493 -638300 -224768 -460499 -810818 -794997 -546040 -767256 -535348 -342147
1382 -342147 -503179 -1009099 -870453 -385935 -633565 -513498 -729334 -586781 -582892 -617206
1372 -617206 -424991 -463584 -227836 -730708 -538904 -198474 -675432 -784102 -411152 -842943
1362 -842943 -756614 -378983 -388756 -631070 -726171 -315182 -257551 -423295 -405092 -210668 -312637
1351 -312637 -27015 -27664 -327150 -29631 -649040 -396720 -683266 -911283 -973792 -729473
1341g29473N8287K84004l545k71441L15898l63316N4430O4935J72815j00764j60643
1330f78813N983k01594M1914K38506J47963m2457N4209p7515J35878K31347o2776
1319b07355K29365L76545l00808l39619m56490k8954m0560K7m9933M41666L7108
1308c39008k35435J18654J55609N80l11744j31227m08353N68800O74850j49727
1298e7001j40037M25591j16983k9074o37412l00460R3427p0599l35491n0475K22018
1287i96496O08364J26953k89910o963Q8253K49546l01864o37422L00844J90310
1277f68385K24908j53581j38172M23949M02125l66656k14300J59046J76716j11879
1267b66229l72707r5467K78436K08395m50489l41650K69140K88384K8861m15018
$$ plain form
1341 -729473 -671186 -387182 -390727 -662168 -346270 -709586 -655156 -590221 -417406 -518170 -678813
1330 -678813 -672830 -874424 -832510 -594004 -446041 -488498 -434289 -511804 -375926 -144579 -207355
1319 -207355 22010 398555 97747 -241872 -698362 -727316 -767876 -767849 -817782 -376116 -339008
1308 -339008 -574443 -455789 -300180 -299600 -611344 -742571 -1150924 -582124 92726 -57001
1298 -57001 -197038 228553 111570 82496 -554916 -855376 -761949 -832548 -1168039 -1218514 -996496
1287 -996496 -388132 -261179 -551089 -558052 -469799 -220253 -522117 -1159539 -858695 -668385
1277 -668385 -443477 -597058 -735230 -311281 90844 -275812 -490112 -331066 -154350 -266229
1267 -266229 -638936 -734403 -455967 -247572 -698061 -1039711 -770571 -482187 -453326 -868344
1257h68344m19131M59242L23257K05116k38187K56638r1283l77363J00176K33528
1247d16351j39662M73999k8724k97220k45277M61963j38935n2359r0546L17524
1237a55588j4091n32450M95947j93020K43843l72930M2840k76007M93844R6967
1227a70645n6512j86327Q1402M5602O7092p1864k36501r9749j07167M28606n17471
1216h23534m4854L09027l8215l48704k78552Q98415K73813p66304k91780L65046
1206g45642O19536j03390o18398k16203J52070p6126k639k53682O42900J1084
1196e90490n54835N67746K44541o23345L07711J52599J33553j52559m18292r592
1186i42963K47159L81585r6005J56288J49721n74125M18431J82346l35636K10837
$$ plain form
1257 -868344 -1287475 -828233 -504976 -299860 -538047 -281409 -372692 -750055 -649879 -416351
1247 -416351 -556013 -82014 -110738 -407958 -653235 -191272 -330207 -382566 -473112 -155588
1237 -155588 -169679 -702129 -206182 -399202 -155359 -528289 -485449 -761456 -267612 -170645
1227 -170645 -227157 -413484 -332082 -286480 -219388 -291252 -527753 -627502 -734669 -306063 -823534
1216 -823534 -868388 -559361 -597576 -946280 -1224832 -326417 -52604 -818908 -1110688 -745642
1206 -745642 -126106 -229496 -847894 -1064097 -912027 -988153 -990792 -1244474 -601574 -590490
1196 -590490 -1145325 -577579 -333038 -956383 -648672 -496073 -362520 -515079 -933371 -942963
1186 -942963 -695804 -314219 -410224 -253936 -104215 -678340 -259909 -77563 -413199 -202362
1176b02362j62274J7776k20541j59589L97201J81284J27157k12946l85494j25211
1166g44999L85219j60638L38398j75313k82214M47342l52406R9569j1938k35882
1156f92862L92693K93727o43587K40551j7655J91303m46460K85868M4067j36484
1146d88839n0152j47586l375J09114Q445p1959r640k18282K91059J98959K71143
1135a11113l027k8725k84932J73377j032k48428o0848N43250L92395n84497o2592
1124b76172k47240j02370P336R1352L90214J30394n25457j27691K14558j17616
1114e62692J96325j84313K02649L56454l02628j95860n2110K66363J03228k04534
1104c77118j32983N50864l36024r9m3538R3973J29122k44389R3269Q8220K57363
$$ plain form
1176 -202362 -364636 -346860 -567401 -726990 -329789 -148505 -21348 -234294 -619788 -744999
1166 -744999 -359780 -520418 -182020 -357333 -639547 -192205 -544611 -445042 -456980 -692862
1156 -692862 -300169 -6442 -650029 -409478 -427133 -235830 -682290 -396422 -352355 -488839
1146 -488839 -538991 -686577 -689952 -580838 -572393 -644352 -653992 -872274 -581215 -382256 -111113
1135 -111113 -114140 -142865 -427797 -254420 -255452 -503880 -564728 -21478 370917 -213580 -276172
1124 -276172 -523412 -625782 -618446 -527094 -136880 -6486 -531943 -659634 -445076 -562692
1114 -562692 -366367 -550680 -348031 8423 -294205 -490065 -542175 -275812 -172584 -377118
1104 -377118 -510101 40763 -295261 -295360 -338898 -244925 -115803 -360192 -266923 -178703 78660
1093G8660J44058J21612l91606m48140n9597L05635L74898k98690n02269M70467
1083b04972J09133n89744L9477N20169P144l28310K09624M02343o69509J47313
1073c57332k31624K03852l29383K49551J52166j12890J12220K78752j22451L76700
1063B19561m91169j94108j22571m5339N9359j44553L08994k6543K8312J488L1639
1052c74930k61928o8554r1245j54106K69918L25200M25412J56506l01432m01253
1042d76412j01137M75823n93760j58666M99122K19604l35066k62859R0033K95879
1032c47439M14986r2470n82268J22604j95132Q7093J24482j04359K76403q8244
1022c84344R9364J4060N3494m45723m2929K5192Q8745L18335J7636o2292Q6204
$$ plain form
1093 78660 222718 344330 -47276 -495416 -555013 -249378 125520 -173170 -675439 -204972
1083 -204972 -95839 -685583 -646106 -125937 -118793 -447103 -237479 164864 -504645 -357332
1073 -357332 -588956 -385104 -714487 -464936 -312770 -425660 -313440 -34688 -157139 219561
1063 219561 -271608 -465716 -588287 -633626 -574267 -718820 -409826 -436369 -408057 -406569 -374930
1052 -374930 -636858 -705412 -796657 -950763 -680845 -355645 69767 226273 -75159 -476412
1042 -476412 -577549 -101726 -695486 -854152 -355030 -135426 -470492 -733351 -643318 -347439
1032 -347439 67547 -24923 -607191 -484587 -679719 -592626 -468144 -572503 -296100 -384344
1022 -384344 -284980 -270920 -217426 -663149 -706078 -680886 -592141 -273806 -256170 -318462 -232258
1011b32258q1774k35159N14661m54493J67664M87252n23937k35254Q4376k78112
1001g87034L00272L95493q2186l99871L35265K68639p1359j62944k75718J15301
991c64142l06963j5201K19686N925O80435L99594o09650J52399k91611k11360
981c40888K42693l98016M18314l12697J17271k58714O7919j26756N2236M49883
971h8755m41306m04580L23570K38419L73630k25664K22508m60111J53663O25873
961C17247J30551j68841k38046o45786K7714k8063r7343K27999J52870k43403
951e65101O44673M84371o40679l37929k73423M41634n83562K60662N47154k12624
941b34824q4206O69485j86517J24244P939k0005q8486k98203K12408l37166l71230
$$ plain form
1011 -232258 -314032 -549191 -34530 -489023 -321359 165893 -358044 -593298 -508922 -787034
1001 -787034 -486762 -91269 -173455 -573326 -238061 30578 -40781 -203725 -479443 -364142
991 -364142 -671105 -686306 -466620 -460695 219740 619334 9684 162083 -129528 -340888
981 -340888 -98195 -496211 -77897 -390594 -273323 -532037 -464118 -590874 -538638 -88755
971 -88755 -530061 -934641 -611071 -372652 978 -224686 -2178 -462289 -308626 317247
961 317247 447798 278957 40911 -604875 -577161 -605224 -702567 -474568 -321698 -565101
951 -565101 79572 563943 -76736 -414665 -688088 -246454 -830016 -569354 -22200 -234824
941 -234824 -319030 350455 163938 288182 296121 276116 187630 -110573 101835 -235331 -606561
930f06561o0818k09462J40343P23326K27375m52467J21705k7604P514k26629L12744
919e0534n55860K68496L40194j88641j53807j40891L40930j38982j03647m28141
909h10883K32248M81618J36834k27717k04358N5856L36956J01370l96447J6404
899b78119k58703J35087l9840K98626J31823J0288K10843K03078k12631L30206
889E30658k81293j94198P4442k34337j49424k92235J28156J54989l05210Q6529
879d81923q5446L17893M05078k2572J18255j61319k01726J85906Q2887K79197
869D36230M7695k68187K90924k98629l74692J54743k91667K41750J45159k72776
859a89450J42642M94933n85178R8303M13215k89403P9562n6219L5186J34925q3984
$$ plain form
930 -606561 -667379 -876841 -736498 -13172 214203 -238264 -116559 -144163 -136649 -363278 -50534
919 -50534 -606394 -337898 2296 -186345 -340152 -481043 -140113 -279095 -382742 -810883
909 -810883 -578635 -97017 39817 -187900 -392258 -336402 554 101924 -294523 -278119
899 -278119 -536822 -401735 -441575 -142949 -11126 -838 210005 413083 200452 530658
889 530658 249365 55167 129609 -104728 -254152 -546387 -418231 -263242 -568452 -481923
879 -481923 -567369 -249476 155602 133030 251285 89966 -111760 74146 157033 436230
869 436230 483925 215738 506662 208033 -166659 -11916 -303583 -61833 83326 -189450
859 -189450 -46808 448125 -137053 -38750 374465 85062 164624 108405 143591 278516 194532
848A94532k02983O9387n43192N799L60928J88364m26759J14819K6416J11320m66365
837e67734L42480K97215l73185J62734K92092m86776q167K74202J87620J13461
827B33942j70291J46825L1604N4986n88321J21741m8597O9691L38918l98997L29869
816A21370L35413k11250q62811M56577L33167o78199K75281J33159l41293l2751
806d71337M6189j80j70549M79347O931l50081K11859Q68642o47008m20503K62142
795a84548j27766J06150j02943J60596O28312N6900K32884k61714m55203m94866
785d42198k38597K28685L93541L57265l5769l1597n6712J86565J98451l37359
775B22275n73172R2063l99678J53001J36347J28343K70881j23051m8644j22275
$$ plain form
848 194532 -8451 60936 -482256 -476457 -115529 72835 -353924 -239105 -212689 -101369 -567734
837 -567734 -225254 71961 -301224 -138490 153602 -333174 -341341 -67139 120481 233942
827 233942 63651 210476 242080 297066 -291255 -169514 -218111 -148420 190498 -208499 121370
816 121370 456783 245533 -617278 -160701 172466 -505733 -230452 -97293 -438586 -471337
806 -471337 -425148 -425328 -595877 -116530 -109599 -459680 -247821 620821 -26187 -446690 -184548
795 -184548 -312314 -206164 -309107 -148511 479801 536701 769585 507871 52668 -442198
785 -442198 -680795 -452110 -58569 298696 262927 231330 174618 361183 559634 222275
775 222275 -350897 -258834 -658512 -505511 -369164 -240821 30060 -92991 -141635 -263910
765b63910M93801O3897n98084j15188m595K79239J43865m3338K40468k64498J51464
754H3121J41130R8941k70207J423Q6667k80401P0043L28792J31731k47688J14708
743B58260j71670j00070J75762J12604L73796l03729q91564P9131j49721L36908
733b80293M04658L03662j36706l31184j86417J15256q2136J36362j71543J71303
723e7038n06001M06889N57106l06562n71780K34206L83308R0165j48214k4933
713E7146R8869l9677l41104j84449N8649P3712M20799N6497k56288k40369j74756
702d70971K18195k0592j75244P11352j15936J24453L92023n38425j18322N26830
692E33363q9436R9289j90240k12553k6951j96188J13767l13499N0156K94617l45672
$$ plain form
765 -263910 229891 293788 -304296 -419484 -424079 -144840 -975 -44313 196155 -68343 83121
754 83121 224251 323192 52985 54408 141075 -139326 -69283 259509 391240 143552 258260
743 258260 86590 -13480 162282 274886 648682 344953 -546611 -467480 -617201 -280293
733 -280293 124365 428027 291321 -39863 -226280 -111024 -193160 -56798 -228341 -57038
723 -57038 -563039 -156150 400956 94394 -477386 -243180 140128 230293 82079 57146
713 57146 156015 116338 -224766 -409215 -350566 -276854 143945 200442 -55846 -296215 -470971
702 -470971 -252776 -273368 -448612 262740 146804 271257 663280 124855 6533 533363
692 533363 443927 543216 352976 140423 113472 -82716 31051 -282448 -232292 62325 -283347
681b83347k47696L10860J36432j01050J62074J61059J97287K64331j61632l10391
671A27927R4868M15320L2611j3347k20813l81607K4559m17235j29228J56544M03125
660I2724k68977K56579J19399J24834L15843q7281n36933k04832N71070k25075
650A57351K03429O0321n06382J48780J8315M7970j61660M6622q6103l09333J85911
639a94779P80182k16000k33362k15738j24943K89835J56157J49482l98310k697
629a0173M1788k6304m05529J74950K74638k00828L61040j83330J36500L91907
619E54659m27237L30006j41523l01344k04944P9819K1541L14758K9249p9042L6449
608B12391Q4857L50016q92275K18090k5063N04828m5566K25555j33607l62362
$$ plain form
681 -283347 -531043 -220183 -83751 -184801 -22727 138332 335619 599950 438318 127927
671 127927 222795 638115 670726 657379 436566 54959 79518 -337717 -466945 -310401 92724
660 92724 -176253 80326 199725 324559 640402 553121 16188 -188644 382426 157351
650 157351 360780 421101 -85281 63499 81814 129784 -31876 14746 -71357 -380690 -194779
639 -194779 585403 369403 136041 -79697 -204640 85195 241352 390834 -7476 -10173
629 -10173 31615 5311 -400218 -225268 49370 -151458 209582 26252 162752 554659
619 554659 127422 457428 315905 14561 -190383 -110564 -89023 225735 254984 175942 212391
608 212391 297248 647264 -245011 -26921 -51984 452844 407278 632833 499226 136864
598A36864J24844j41680J85235l27786Q8461P6598k634J56889n8731l19356o3042
587a44338J41244J04547M1837M54056k31015l06756k19142M67326J60316n07697
577c9622J78826j32206K11203J69263O3014l11237q5983q0354J08K67957j10666
566A30303k07627J97655j70896L63857J30156l95082J31986L00231k33058m08692
556a61167L71959L00418j003k63931L53347j25535n07850j48105j70085R5951
546b56001M11065J27321J44155m08928K46844n0725m46559j60541J70630O48337
536D25598K98744n21540o0962p3009k59756N88625K18681m64252Q75419k74302
526G53246n41440l0152j66701J32939L20425L9627m42560k63719O6234M10945
$$ plain form
598 136864 261708 120028 305263 -22523 65938 142536 139902 296791 238060 -81296 -144338
587 -144338 -3094 101453 143290 597346 366331 59575 -159567 307759 468075 -39622
577 -39622 139204 6998 218201 387464 450478 139241 53258 -27096 -26988 240969 130303
566 130303 -77324 120331 -50565 313292 443448 48366 180352 480583 247525 -161167
556 -161167 210792 511210 510207 246276 599623 474088 -33762 -181867 -351952 -256001
546 -256001 155064 282385 426540 17612 264456 213731 -232828 -393369 -222739 425598
536 425598 724342 202802 141840 68831 -190925 397700 616381 152129 1027548 753246
526 753246 211806 181654 14953 147892 468317 507944 65384 -198335 -132101 278844
516B78844O7080K67011n9110j87181m67888j5056N44848J54792k91591l43877
506e2128p4578J97556N05840J39530m01296R7375j85010r7433O9357k64500M22970
495C57683n7491r6232J91013j44933P2751m45926Q887L12070n9649K8521l1278
484A35416K50508j86493K15705N1274j50282k53666J53957N1597J46805J65195
474E80016l27476K51831J18644r1824r2610L99744k75847k44331L76739o8071
464F26815l40104J46465j33492j36666L3144q8781N62980K8132k72240J15545
454E41798k17577l3708j74786k31995M10782K50692P735j83655k53687K37022
444C52621p6339p3846M66659K8479j37351l0059K5131j41444j29299N44556o31154
$$ plain form
516 278844 345924 612935 553825 366644 -101244 -116300 428548 583340 291749 -52128
506 -52128 -126706 70850 576690 716220 314924 412299 227289 129856 199213 -65287 357683
495 357683 300192 203960 394973 250040 322791 -123135 -114248 197822 138173 166694 135416
484 135416 385924 199431 415136 466410 316128 62462 216419 268016 414821 580016
474 580016 252540 504371 623015 531191 438581 838325 562478 318147 694886 626815
464 626815 286711 433176 299684 163018 196162 107381 670361 698493 426253 541798
454 541798 324221 290513 115727 -116268 294514 545206 552941 369286 115599 352621
444 352621 276282 202436 669095 697574 560223 530164 555295 413851 284552 829108 197954
433A97954k76248M19035M06600k97541j4859p2610q6049M5010k30258k593J73955
422B62396m15292P69271L51764l55063k14259J19149l16966J42326O78723l53985
412F68064l07788J0902O7561k09610j93972q537K34796K18657R4239n03012J88415
401B59715K00644J8868K22988j95918j35391r5587m924J51593l22838j90331J75381
390H4200M43539l19238j71675K30716M61222j20882j55842M3108j86247j52294
380A56607K98786j90673J72652l10767j76595P2101L44397J75895l30869J76734
370C88268j36916k55958m17227O80793P32582m92347k21566K67421j6808j66549
360C61693k51941L10197q8310K99079P2298m01665K65596k26599M82221K75455
$$ plain form
433 197954 -78294 340741 747341 449800 434941 362331 276282 321292 91034 88441 262396
422 262396 -152896 616375 968139 613076 398817 517966 201000 343326 1022049 668064
412 668064 360276 371178 438739 229129 35157 26620 261416 480073 574312 71300 259715
401 259715 460359 479227 702215 506297 370906 275319 270395 421988 99150 -91181 84200
390 84200 527739 208501 36826 267542 728764 607882 452040 495148 308901 156607
380 156607 455393 264720 437372 126605 -49990 22111 366508 542403 211534 388268
370 388268 251352 -4606 -421833 258960 991542 499195 277629 545050 528242 361693
360 361693 109752 419949 331639 630718 703016 301351 566947 340348 822569 1098024
350A098024k85954l73043j87246N23231L51486m88234k01437N1090j943J00389
340E86363l8602k58497j00159j64521J00634J65259K17146k73257K73298Q1919
330E89583j65345K98011l61656k61747q4702M33927J34203m69645O1645O55879
320H30153l18476m3361J16710l8959j30606n97646j16662L25338K73375k04253
310I5613N39389k01654n33712J15397R7679M27874l8250J2056j87033k6368j13402
299A87589N05293r3858j99662q6304L16589K04146o0791L37479l02737J25782
289I33526p3146j60390k3286m20069n3561k61470l27343L27069P31833r6001O7022
278F44184m4180k78872j3879n581k46161P4980J65116m9097J8913r2429J80737
$$ plain form
350 1098024 812070 439027 251781 775012 1126498 638264 436827 487917 485974 586363
340 586363 547761 289264 189105 24584 125218 290477 507623 234366 507664 589583
330 589583 424238 722249 360593 98846 14144 448071 582274 112629 174274 830153
320 830153 511677 468316 585026 546067 415461 -182185 -298847 26491 299866 95613
310 95613 635002 433348 -100364 15033 112712 540586 502336 514392 327359 300991 187589
299 187589 692882 599024 399362 313058 629647 833793 773002 1110481 807744 933526
289 933526 860380 699990 676704 256635 203074 -58396 -385739 -58670 673163 577162 644184
278 644184 600004 321132 307253 301672 55511 130491 295607 246510 265423 172994 353731
267C53731j91722k5636N47822l1082p51680M71988j54170j45762j05227K5975
257e763K65625J6288K2222l57046L92534R2318L04772o6342j38552K27660l30370
246D23346l49927J40657O1371L647m6721m4222J25498m06985K67751j21520M85318
235E38213k11927m84307N66641l50460K34373p3440P5330L91706m77337p5339
225A33453k06874k520L71403R4419K97704o08494l6246j08435n4011Q4317J92325
214A57041M8853K10435N63399k00613k10196j07360K86815m04945l67225M83825
204D60029J4587n7550p0158k71833r2503K23087j42029J48648M92922l96137Q4063
193C93126k31779L16600K2765j75646J54794j57385q9469L27817n32498q0767
$$ plain form
267 353731 162009 136373 684195 653113 -98567 373421 219251 73489 -31738 -5763
257 -5763 259862 276150 298372 -58674 333860 426178 730950 664608 526056 753716 423346
246 423346 73419 214076 275447 279094 232373 188151 313649 -93336 174415 52895 538213
235 538213 326286 -158021 408620 58160 292533 219093 294423 686129 208792 133453
225 133453 -73421 -75941 295462 389881 687585 79091 42845 -65590 -119601 -35284 157041
214 157041 205894 416329 979728 779115 568919 461559 748374 343429 -23796 460029
204 460029 474616 417066 346908 75075 -17428 205659 63630 212278 705200 309063 393126
193 393126 161347 477947 500712 325066 479860 322475 233006 560823 28325 -52442
183e2442N11704l19131k3007J71981M62378j1353K13388l56396m11266J36943
173C22799k75229L72631l9761j96811J29647n8011R635k02952M79517k9032j8372
162D94061K25992j93529J98377k38070n69416j1860K98382m11179Q4147J95204
152G2109K07849k08536j22515L63303O3771j33712p0933j57769L78022M08571
142H00160K19794l70298j95842j72544j32832J20487k91197O2386K14217Q6783
132C41114n7466M1090r1272J2990Q608J94930n99430j95001J28607K7895K63429
121G5494j47098N0712K79147k43388J51975p4311O7217Q3088Q9225j8824K5038
110C38275k81488J40774j81935K7086J30264j65100L19994K558k64185K17949
$$ plain form
183 -52442 459262 140131 117124 289105 751483 740130 953518 597122 185856 322799
173 322799 47570 420201 380440 183629 313276 255265 264900 61948 541465 512433 494061
162 494061 720053 526524 724901 486831 -82585 -94445 203937 -207242 -123095 72109
152 72109 279958 71422 -51093 312210 375981 242269 171336 13567 391589 800160
142 800160 1019954 649656 453814 281270 148438 268925 -22272 40114 254331 341114
132 341114 283648 324738 233466 246456 255064 449994 -149436 -344437 -215830 -187935 75494
121 75494 -71604 -20892 258255 14867 166842 92531 159748 242836 332061 313237 338275
110 338275 56787 197561 15626 42712 172976 7876 327870 330428 66243 284192
100B84192j38766j76339p9925j7721M24340p1111j10519j66981Q8825q8185k31085
89b83275m4809J25914J9967m35398J33612O79959J31287k83330N3989j81357n6131
78a39572k77783n1914L60308k62759O5545L9650q1991l4867J93822J28218j44804
67b06147o7880J98225k00920P0385J35519J22839j55138k14318l6541K2084K94898
56c6994J80376r5534M1448j79194m8520l4326L04530m77890J78719L20250k55606
45a02741l19057M08834Q659K3353l6540l15914J74761K3187l33841l7371l1160
34e37830j1084n12Q438K63718P9527J58632k37082J89945K4924k98107k08332
23e67763P7724O6178L2365p9648j07609L5319L0821j98063J76589k20935L08008
$$ plain form
100 284192 145426 -30913 -110838 -128559 295781 224670 114151 -52830 35995 -52190 -283275
89 -283275 -328084 -202170 -182203 -617601 -483989 195970 327257 43927 97916 -83441 -139572
78 -139572 -417355 -469269 -108961 -371720 -306175 -266525 -348516 -383383 -189561 -61343 -206147
67 -206147 -274027 -75802 -276722 -206337 -70818 52021 -103117 -317435 -353976 -331892 -36994
56 -36994 143382 47848 89296 -89898 -138418 -172744 131786 -346104 -167385 152865 -102741
45 -102741 -421798 -12964 -4305 19048 -17492 -333406 -158645 -135458 -469299 -506670 -537830
34 -537830 -548914 -549426 -540988 -277270 -197743 -39111 -276193 -86248 -61324 -359431 -567763
23 -567763 -490039 -423861 -391496 -471144 -578753 -543434 -512613 -710676 -534087 -755022 -447014
12d47014K19322M357l50876o2456K86048m3230l20763Q2671O2312q7826m2058
1f99513J73588
0e25925
$$ plain form
12 -447014 -227692 -223335 -574211 -636667 -350619 -393849 -714612 -631941 -569629 -657455 -699513
1 -699513 -525925
0 -525925
$$ Imaginary data points
##PAGE= N=2
##DATA TABLE= (X++(I..I)), XYDATA
16383h477865Q0199N6994J40761k5824M4631J81093K92149K80208p5259K23582
16373g279331P2035j32121N274M835N21953Q8264j33779j69866K97834J78371
16363f546531P0210J63791J14873j57400L4044L13756K08511P0224J49738K5000
16353e553784L27663j73438K05186L8993N7841M45999r9051j07259J15243K20435
16343d522172K74083l786N223M01676J07210K20973j14761J7919j68211N0042
16333c731804r5994L77737M4822j8574J76945M51321K48915j55656N5445M20653
16323b226190Q201L2790J75311J41082J44093j06387k32033M40082J34535J15988
16313a372528q2203j18307L55924k45337Q4808P9464K20803K22868J91554k34555
$$ plain form
16383 -8477865 -8397666 -8340672 -8199911 -8225735 -8181104 -8000011 -7707862 -7427654 -7502913 -7279331
16373 -7279331 -7207296 -7339417 -7334143 -7329308 -6807355 -6719091 -6852870 -7022736 -6724902 -6546531
16363 -6546531 -6476321 -6312530 -6197657 -6355057 -6321013 -6007257 -5798746 -5728522 -5578784 -5553784
16353 -5553784 -5226121 -5399559 -5194373 -5155380 -5097539 -4651540 -4750591 -4857850 -4742607 -4522172
16343 -4522172 -4248089 -4251875 -4246652 -3844976 -3737766 -3516793 -3631554 -3613635 -3781846 -3731804
16333 -3731804 -3827798 -3450061 -3405239 -3423813 -3246868 -2795547 -2546632 -2702288 -2646843 -2226190
16323 -2226190 -2217989 -2185199 -2009888 -1868806 -1724713 -1831100 -2063133 -1623051 -1488516 -1372528
16313 -1372528 -1454731 -1573038 -1217114 -1462451 -1377643 -1298179 -1077376 -854508 -662954 -897509
16303h97509L92690P0723J50929j97097K7701P3585P8191j09614j23868M41257
16293i3012j32553m6830M04300L29893K12938q7456j27914J12877L09711m6595
16283H35359R6530j67955L06470K03513j07344O9164K09122q9604J04042n7402
16273A401895L49798K66141k72979J22670L91765k34982M1504K5635M7724L35303
16263B474474l37932L37467j3371q5912j4232Q3463L71178j39462n27271K95985
16253B444387J2991L08178J61295J19067J08430j21826J5264L71964J6311k1264
16243C414797j80200M22130j10688p1929K34416L53631L731l52399K61795K533
16233C977817L40183j665R4885M08219q17870J4109O46632j25855l5430J1881
$$ plain form
16303 -897509 -504819 -434096 -283167 -480264 -452563 -378978 -300787 -410401 -534269 -93012
16293 -93012 -225565 -272395 131905 461798 674736 587280 459366 572243 881954 835359
16283 835359 931889 763934 1070404 1273917 1166573 1235737 1444859 1355255 1459297 1401895
16273 1401895 1751693 2017834 1744855 1867525 2259290 2024308 2065812 2091447 2139171 2474474
16263 2474474 2136542 2474009 2460638 2374726 2360494 2443957 2815135 2675673 2148402 2444387
16253 2444387 2457378 2765556 2926851 3045918 3154348 3032522 3047786 3419750 3436061 3414797
16243 3414797 3234597 3656727 3546039 3474110 3708526 4062157 4065888 3713489 3975284 3977817
16233 3977817 4318000 4316335 4411220 4819439 4001569 4015678 4662310 4536455 4501025 4512906
16223D512906J9152k73736J64418L7151j53385L42772K35963L6525j16471L7191
16213D842486K08962K5139Q3319p1329j05695J83733j31439m7354N63806k12796
16203E338832o1196N10483M3628K01531k95273L8452P2065M0785j58499K47554
16193E978362k00959J33337j21372l56995L84626N28486j67588J26102M27058
16184F731057m66688M4985j49093L76608L74087k33310q4909k30768k35203N73860
16174F700626k62037j91520n8502J80070P0661R2360J39577K05965k52392j09236
16164F515572J20888K13995J6124m28722n7749L60271K76096k65787O467O3277
16154F820432m5462K06063j78438N72526o9945l30331k72317P0404R0018j07140
$$ plain form
16223 4512906 4532058 4258322 4422740 4459891 4306506 4649278 4885241 4921766 4805295 4842486
16213 4842486 5051448 5076587 5159906 5088577 4982882 5166615 5035176 4987822 5551628 5338832
16203 5338832 5277636 5788119 5831747 6033278 5738005 5776457 5848522 5889307 5730808 5978362
16193 5978362 5777403 5910740 5789368 5432373 5816999 6345485 6177897 6303999 6731057
16184 6731057 6264369 6309354 6160261 6536869 6910956 6677646 6592737 6361969 6126766 6700626
16174 6700626 6438589 6247069 6188567 6368637 6439298 6531658 6671235 6877200 6624808 6515572
16164 6515572 6636460 6850455 6866579 6437857 6380108 6740379 7016475 6750688 6757155 6820432
16154 6820432 6774970 6981033 6802595 7375121 7305176 6974845 6702528 6772932 6862950 6755810
16144F755810J96536J12913N1408j64653l80379L23775K37165k27458M01853q7959
16134G219011N90800J80813n53772K51371P4712n32477J93392k37003j20845O9054
16124G135056j07415J5431Q90097K04858m79802R618m86340j3858M62924j25301
16114G505268m73541K24836L04861M48300J3977J05788j4987k97602j69846j84469
16104G462585L33867n10353j74735M44938k69206m2295M25750j40365K41128p3717
16094G697597K21803j54857k03790L58257O5738L7198m18598K66860r5474K03182
16084G977916K4852M0661k04379l06473j63334M03954m74295r7146K33606L27347
16074G762709L8640k85209J16145k23706L20350l22897O21430k16583J70995N3193
$$ plain form
16144 6755810 6952346 7065259 7116667 6952014 6571635 6895410 7132575 6905117 7306970 7219011
16134 7219011 7809811 7990624 7436852 7688223 7762935 7230458 7423850 7186847 7066002 7135056
16124 7135056 7027641 7043072 7933169 8138027 7658225 7667843 7181503 7167645 7630569 7505268
16114 7505268 7031727 7256563 7561424 8009724 8023701 8129489 8114502 7816900 7647054 7462585
16104 7462585 7796452 7286099 7111364 7556302 7287096 7244801 7670551 7530186 7771314 7697597
16094 7697597 7919400 7764543 7560753 7919010 7984748 8021946 7603348 7870208 7774734 7977916
16084 7977916 8002768 8043429 7839050 7532577 7369243 7773197 7298902 7201756 7435362 7762709
16074 7762709 7801349 7516140 7632285 7408579 7728929 7406032 8027462 7810879 7981874 8035067
16064H035067J63283J21499r7075l74716P8152j28415k04056k54923J73061P09989
16054H221866r7150l39245j5102O806l11193O7213M35349j33276q9959L65010
16044H110319j41988m75654j95998J86919J54935L07236K4658o3059O5898J18822
16034H092088n6572m29533N322J54116l94296O0743j1551M38321p8531J15362
16024G895469N74627m93664q9629J29815m6218J820o4398K35875l4747P7646k02265
16013G984331R1257o04988q7940N28693m9736J46182K87451j61373L21460J0507
16003H465844k74042n43547j24800J91223j31985N00754m55478j05690J48336
15994G670615m39113j39284j19398J59238N46440K5997J73212j31007l97718N08399
$$ plain form
16064 8035067 8198350 8319849 8222774 7848058 7926210 7797795 7593739 7338816 7511877 8221866
16054 8221866 8124716 7785471 7770369 7777175 7465982 7533195 7968544 7835268 7745309 8110319
16044 8110319 7968331 7492677 7296679 7483598 7638533 7945769 7970427 7907368 7973266 8092088
16034 8092088 8035516 7605983 7611305 7765421 7371125 7431868 7420317 7858638 7780107 7895469
16024 7895469 8470096 7976432 7886803 8016618 7970400 7972220 7907822 8143697 8108950 8186596 7984331
16013 7984331 8075588 7470600 7382660 7911353 7861617 8007799 8295250 8133877 8455337 8465844
16003 8465844 8191802 7648255 7523455 7714678 7582693 8083447 7627969 7522279 7670615
15994 7670615 7231502 7092218 6972820 7132058 7678498 7704495 7877707 7746700 7348982 7857381
15984G857381J79342j01458O2063j6475R9943k29942k60916L50648l60725M83364
15974H063225P315r7401o17504l36256L0658K59966M18378J49051M710n67541
15964G314601k3878l8768K04763K21320L6637L0380K549j08960J34056Q3071M02789
15953H258560R2302j08233l72822M0984j6994j40112k61247Q2591L5591K88118
15943G898738q0999j39356K90925J68475k76694L9944j77814j26038J55144K34409
15933G986734L0860n3111J40393n41596j92201K40863k65984M69544K67076o829
15923H075749L24514L09842p0464j00192n20025m73739K08444L12919j74644J31623
$$ plain form
15984 7857381 8036723 7935265 7997328 7980853 8080796 7850854 7589938 7940586 7579861 8063225
15974 8063225 8070540 7973139 7355635 7019379 7050037 7310003 7728381 7877432 7882142 7314601
15964 7314601 7290723 7251955 7456718 7678038 7714675 7745055 7747604 7638644 7772700 7855771 8258560
15953 8258560 8350862 8242629 7869807 7910791 7893797 7753685 7492438 7575029 7610620 7898738
15943 7898738 7817739 7678383 7969308 8137783 7861089 7901033 7723219 7597181 7752325 7986734
15933 7986734 8017594 7964483 8104876 7563280 7371079 7611942 7345958 7815502 8082578 8075749
15923 8075749 8400263 8710105 8639641 8539449 8019424 7545685 7754129 8067048 7892404 8024027
$$ [...]
##END NTUPLES=NMR SPECTRUM
##END=
