##TITLE=1H_CG-1152-A
 CD2Cl2, 68 sc, 
 31.8.2021
##JCAMPDX= 6.0         $$ Bruker NMR JCAMP-DX V2.0
##DATA TYPE= NMR SPECTRUM
##DATA CLASS= NTUPLES
##ORIGIN= UXNMR, Bruker Analytische Messtechnik GmbH
##OWNER= root
$$ XWIN-NMR		Version 3.5
$$ Wed Sep  1 09:13:39 2021 Russian Standard Time (UT+4h)  she@DPX200
##.OBSERVE FREQUENCY= 200.1312
##.OBSERVE NUCLEUS= ^1H
##.ACQUISITION MODE= SIMULTANEOUS
##.ACQUISITION SCHEME= undefined
##.AVERAGES= 15
##.DIGITISER RES= 18
##SPECTROMETER/DATA SYSTEM= spect
##.PULSE SEQUENCE= zg30
##.SOLVENT NAME= CD2Cl2
##.SHIFT REFERENCE= (INTERNAL, CD2Cl2, 0, 17.8906)
##AUDIT TRAIL= $$ (NUMBER, WHEN, WHO, WHERE, WHAT)
$$ ##TITLE= Audit trail, XWIN-NMR		Version 3.5
$$ ##JCAMPDX= 5.01
$$ ##ORIGIN= Bruker BioSpin GmbH
$$ ##OWNER= she
$$ F:/spectra/data/she/nmr/H-F/1/pdata/1/auditp.txt
$$ ##AUDIT TRAIL=  $$ (NUMBER, WHEN, WHO, WHERE, WHAT)
(   1,<2021-09-01 09:12:01.87 +0400>,<she>,<DPX200>,
      <created by zg, POWCHK disabled, PULCHK disabled
       terminated by command 'halt'
       configuration hash MD5:
       00 E9 B6 7A A2 85 ED C7 34 08 36 98 17 FE 4E 26
       data hash MD5: 16K
       4D D8 D8 8E 84 BA 8E 1F FB F9 05 D8 C3 D6 54 22>)
(   2,<2021-09-01 09:12:08.12 +0400>,<she>,<DPX200>,
      <Start of raw data processing
       efp BC_mod = 2 LB = 0.24 FT_mod = 6 PKNL = 1 PHC0 = -13365.79 PHC1 = 26.20097 SI = 16K 
       data hash MD5: 16K
       2F AE 90 AE DA 30 6F BB 07 39 F9 5E 9C 41 9A 16>)
(   3,<2021-09-01 09:12:38.79 +0400>,<she>,<DPX200>,
      <pk PHC0 = 4.744868 PHC1 = -13.2 
       data hash MD5: 16K
       0A AC DD 74 F8 3B 1E D9 93 84 24 54 56 9D 75 D8>)
(   4,<2021-09-01 09:12:42.23 +0400>,<she>,<DPX200>,
      <abs ABSG = 5 
       data hash MD5: 16K
       28 11 F3 3C 3A B4 19 4B 99 62 C3 F9 C6 72 75 C9>)
$$ ##END=
$$ 
$$ hash MD5
$$ 7D A2 12 5D BA 0C 0F 4A 1E 7B 96 39 0E 7C 6D 3E
##$RELAX= 
##$RELAX= 
##$RELAX= 
##$RELAX= 
##$RELAX= 
##$RELAX= 
$$ Bruker specific parameters
$$ --------------------------
##$DU= <F:/spectra>
##$EXPNO= 1
##$NAME= <H-F>
##$PROCNO= 1
##$TYPE= <nmr>
##$USER= <she>
##$AMP= (0..31)
100 100 100 100 100 100 100 100 100 100 100 100 100 100 100 100 100 100 
100 100 100 100 100 100 100 100 100 100 100 100 100 100 
##$AQSEQ= 0
##$AQ_mod= 1
##$AUNM= <au_zg>
##$AUTOPOS= <>
##$BF1= 200.13
##$BF2= 200.13
##$BF3= 200.13
##$BF4= 200.13
##$BF5= 200.13
##$BF6= 200.13
##$BF7= 200.13
##$BF8= 200.13
##$BYTORDA= 1
##$CFDGTYP= 0
##$CFRGTYP= 5
##$CHEMSTR= <none>
##$CNST= (0..31)
1 1 145 1 1 1 1 1 1 1 1 1 1 1 1 1 1 1 1 1 1 1 1 1 1 1 1 1 1 1 1 1 
##$CPDPRG= <>
##$CPDPRG1= <>
##$CPDPRG2= <>
##$CPDPRG3= <>
##$CPDPRG4= <mlev>
##$CPDPRG5= <mlev>
##$CPDPRG6= <mlev>
##$CPDPRG7= <mlev>
##$CPDPRG8= <mlev>
##$CPDPRGB= <>
##$CPDPRGT= <>
##$D= (0..31)
0 1.2 0 0 0 0 0 0 0 0.06 0 0.03 0 0 0 0 0.0002 0 0 0 0 0 0 0 0 0 0 0 0 
0 0 0 
##$DATE= 1630473121
##$DBL= (0..7)
120 120 120 120 120 120 120 120 
##$DBP= (0..7)
150 150 150 150 150 150 150 150 
##$DBP07= 0
##$DBPNAM0= <>
##$DBPNAM1= <>
##$DBPNAM2= <>
$$ [...]
##$SUBNAM3= <"">
##$SUBNAM4= <"">
##$SUBNAM5= <"">
##$SUBNAM6= <"">
##$SUBNAM7= <"">
##$SUBNAM8= <"">
##$SUBNAM9= <"">
##$SW= 20.0189188712717
##$SWIBOX= (0..15)
0 0 2 0 0 0 0 0 0 0 0 0 0 0 0 0 
##$SW_h= 4006.41025641026
##$TD= 16384
##$TD0= 1
##$TE= 0
##$TE2= 300
##$TE3= 300
##$TEG= 300
##$TL= (0..7)
0 120 120 120 120 120 120 120 
##$TP= (0..7)
150 150 150 150 150 150 150 150 
##$TP07= 0
##$TPNAME0= <>
##$TPNAME1= <>
##$TPNAME2= <>
##$TPNAME3= <>
##$TPNAME4= <>
##$TPNAME5= <>
##$TPNAME6= <>
##$TPNAME7= <>
##$TPOAL= (0..7)
0.5 0.5 0.5 0.5 0.5 0.5 0.5 0.5 
##$TPOFFS= (0..7)
0 0 0 0 0 0 0 0 
##$TUNHIN= 0
##$TUNHOUT= 0
##$TUNXOUT= 0
##$USERA1= <user>
##$USERA2= <user>
##$USERA3= <user>
##$USERA4= <user>
##$USERA5= <user>
##$V9= 5
##$VALIST= <valist>
##$VCLIST= <CCCCCCCCCCCCCCC>
##$VD= 0
##$VDLIST= <DDDDDDDDDDDDDDD>
##$VPLIST= <PPPPPPPPPPPPPPP>
##$VTLIST= <TTTTTTTTTTTTTTT>
##$WBST= 1024
##$WBSW= 4
##$XGAIN= (0..3)
0 0 0 0 
##$XL= 0
##$YL= 0
##$YMAX_a= 503548
##$YMIN_a= -422995
##$ZGOPTNS= <>
##$ZL1= 120
##$ZL2= 120
##$ZL3= 120
##$ZL4= 120
##$ABSF1= 16.00562
##$ABSF2= -4.01342
##$ABSG= 5
##$ABSL= 3
##$ALPHA= 0
##$AQORDER= 0
##$ASSFAC= 0
##$ASSFACI= 0
##$ASSFACX= 0
##$ASSWID= 0
##$AUNMP= <proc_1d>
##$AZFE= 0.1
##$AZFW= 0.1
##$BCFW= 0
##$BC_mod= 2
##$BYTORDP= 0
##$COROFFS= 0
##$CY= -3
##$DATMOD= 1
##$DC= 0
##$DFILT= <>
##$DTYPP= 0
##$F1P= 0
##$F2P= 0
##$FCOR= 1
##$FTSIZE= 16384
##$FT_mod= 6
##$GAMMA= 0
##$GB= 0
##$INTBC= 1
##$INTSCL= 1.334414e-10
##$ISEN= 128
##$LB= 0.24
##$LEV0= 0
##$LPBIN= 0
##$MAXI= 10000
##$MC2= 0
##$MEAN= 0
##$ME_mod= 0
##$MI= 1.114404
##$NCOEF= 0
##$NC_proc= -4
##$NLEV= 6
##$NOISF1= 3.799351
##$NOISF2= 2.8
##$NSP= 0
##$NTH_PI= 0
##$NZP= 0
##$OFFSET= 17.89058
##$PC= 1
##$PHC0= -13361.04
##$PHC1= 13.00097
##$PH_mod= 1
##$PKNL= yes
##$PPARMOD= 0
##$PSCAL= 0
##$PSIGN= 0
##$REVERSE= no
##$SF= 200.129622768258
##$SI= 16384
##$SIGF1= 3
##$SIGF2= 2
##$SINO= 5.538805
##$SIOLD= 16384
##$SREGLST= <1H.CDCl3>
##$SSB= 0
##$STSI= 16384
##$STSR= 0
##$SW_p= 4006.41025641025
##$SYMM= 0
##$S_DEV= 0
##$TDeff= 16384
##$TDoff= 0
##$TI= <>
##$TILT= no
##$TM1= 0
##$TM2= 0
##$TOPLEV= 0
##$USERP1= <user>
##$USERP2= <user>
##$USERP3= <user>
##$USERP4= <user>
##$USERP5= <user>
##$WDW= 1
##$XDIM= 16384
##$YMAX_p= 276440587
##$YMIN_p= -94391
$$ End of Bruker specific parameters
$$ ---------------------------------
##NTUPLES= NMR SPECTRUM
##VAR_NAME=  FREQUENCY,     SPECTRUM/REAL,   SPECTRUM/IMAG
##SYMBOL=    X,             R,               I
##VAR_TYPE=  INDEPENDENT,   DEPENDENT,       DEPENDENT
##VAR_FORM=  AFFN,          ASDF,            ASDF
##VAR_DIM=   16384,         16384,           16384
##UNITS=     HZ,            ARBITRARY UNITS, ARBITRARY UNITS
##FACTOR=    0.24454680195387, 1,            1
##FIRST=     3580.43487113127, 0,            0
##LAST=      -425.975385278981, 0,           0
##MIN=       -425.975385278981, -94391,      0
##MAX=       3580.43487113127, 276440587,    0
$$ Real data points
##PAGE= N=1
##DATA TABLE= (X++(R..R)), XYDATA
$$ [...]
6455B19753L4405j59l5451L4533K0594K5263m539J7324o626j9101N4133M2158
6443C82287j5124M9473Q3532J5751K7847Q9407Q7426R5667R3407R1711J44153
6432A145537J88062J67637J34786O009k04846l10293k00757j03725p2175m0231
6422G10004k9892P874N0223L2058K6038O0106K8435J19501R8868J30981K00558
6411A434754K07858M2400j49715l06720k52404k01607j65201r4486n596n353n3987
6400D49943m1191n6955j9466J3590j2924m6126k5735j0828L0931J6170o1540o965
6388B28904q598l425M4909p1789k0262k1854k4004R009J9910K4024j5828R623
6376A70619K0811m5041M459j1474K2896L4828J534m1279l378J8442j047J6866
$$ y = [219753, 254158, 253999, 218548, 253081, 273675, 298938, 294399, 311723, 305097, 285996, 340129, 382287, 367163, 416636, 500168, 515919, 543766, 633173, 720599, 816266, 909673, 1001384, 1145537, 1333599, 1501236, 1636022, 1642031, 1437185, 1126892, 926135, 822410, 750235, 710004, 680112, 687986, 738209, 770267, 796305, 856411, 884846, 1004347, 1103215, 1234196, 1434754, 1642612, 1685012, 1535297, 1228577, 976173, 774566, 609365, 514879, 509283, 503930, 449943, 408752, 351797, 332331, 345921, 332997, 286871, 261136, 250308, 281239, 297409, 235869, 228904, 220306, 216881, 261790, 190001, 169739, 147885, 123881, 132890, 152800, 176824, 160996, 170619, 191430, 146389, 150848, 139374, 162270, 197098, 198632, 157353, 153975, 172417, 171370, 188236]
6364A88236m796J556k6149j127J6232M9978L3445N625N462K6263J2319k3505k8798
6351B54741j8056j6796m4971m0867j1585J7859J2035P89j9255m674j7189J414
6339A13445K476j4033o740J1854q228J1104O71r794n508K4996L3784j5412K761
6326A41376k4545j1481N584R880K2360L0623l3728J1485J8648l2667N046K1088
6314A63669k1091J5292o2978l5358M0725J8887Q451n108j4476k3579k0344L472
6302F7562J5901P773j1966N1889k9136o2466M2194K6387j0783k8110l0676J8707
6290E7276K4099j9486J1916j4190K296K9414O330r08r560K5286J5218k321m064
6277A21306m0097J5536q709j6389L6171K4731j7743J7190k8637K1051L0188m0902
$$ y = [188236, 183440, 184996, 158847, 157720, 173952, 223930, 257375, 263000, 268462, 294725, 307044, 283539, 254741, 236685, 219889, 174918, 134051, 122466, 140325, 152360, 153149, 133894, 129220, 112031, 113445, 115921, 101888, 95148, 107002, 98774, 109878, 110549, 100755, 95247, 120243, 154027, 138615, 141376, 116831, 105350, 110934, 120814, 143174, 173797, 140069, 151554, 170202, 137535, 142581, 163669, 142578, 157870, 94892, 59534, 100259, 119146, 127597, 122489, 108013, 84434, 64090, 67562, 83463, 91236, 79270, 131159, 102023, 39557, 81751, 108138, 97355, 69245, 38569, 57276, 81375, 61889, 73805, 59615, 61911, 91325, 97655, 96747, 87187, 112473, 127691, 125370, 121306, 81209, 96745, 88036, 71647, 107818, 132549, 114806, 131996, 103359, 124410, 154598, 113696]
6265A13696J9389R768j0595l9835M644J0039k3346K1401J3804k897k467m4542
6253F9059j9499J7663K8914k3880j343k532j0500J6704R401M8715k0638j8870
6241I3194j2423J7507J8309R127m305k4848J4467p593Q195Q34l5551J8659M2936
6228A38508J2279l7556r879J737N416J5470K2791m4079L279r192k4913K8043r382
6215I2522J7158L2624j8422k6110k0733K214J2050P457j6519M817K3376p176m359
6202I8899j0040R834l2801k5656r59L0708L991K5092Q742Q613J79k6702O59j5571
6188G4988K3979K5583m7208j9115J0045R993N1672J7800k9441r03o073P827M4697
6175A63844j7765k6984k1751q35M4714N5977K4648m5833l860K0833q216K2786
$$ y = [113696, 133085, 142853, 132258, 92423, 97067, 107106, 83760, 105161, 118965, 116068, 113601, 69059, 49560, 67223, 96137, 72257, 70914, 68382, 57882, 74586, 83987, 132702, 112064, 93194, 80771, 98278, 116587, 125714, 121409, 96561, 111028, 103435, 111630, 112464, 76913, 95572, 138508, 150787, 113231, 103352, 105089, 110505, 125975, 148766, 104687, 107966, 98774, 73861, 101904, 92522, 109680, 142304, 123882, 97772, 77039, 79253, 91303, 98760, 82241, 87058, 110434, 103258, 98899, 88859, 98693, 65892, 40236, 39277, 69985, 73976, 99068, 107810, 116423, 116602, 89900, 90559, 74988, 98967, 124550, 77342, 58227, 68272, 78265, 129937, 147737, 118296, 117393, 111320, 119147, 163844, 146079, 119095, 97344, 96509, 141223, 197200, 221848, 176015, 172155, 192988, 184772, 207558]
6163B07558l171k5269k5424J147J1932K5019M587p263o22j6742M783J114L8683
6150B16332j6801j098K9225J2867r828K51p174J6278L3338l4678l1619O506K8283
6137B41882K6034p366q301k4029J3892J787N574R633k1041k2692J692p585j1479
6124A98001J6730j5237j2617n4131O2509k4136k5364M0513k535m0695R273R19
6112A53230J0298N426o3924M8870j1653J6066L4466n2289L8918K0665n6623l052
6100A40398L984Q957J4454j6719K2982l0833j131j2196j7361L9068J6657M974
6088A73234m6774l2256o411K9604M669k1730K7500J6318m0562k2711R261k4002
6076F6140M718M9476K892j8284q962J4983L415L066J0843N551k8951O2325K820
$$ y = [207558, 204387, 179118, 153694, 154841, 166773, 191792, 196379, 189116, 188494, 171752, 176535, 177649, 216332, 199531, 198433, 227658, 240525, 230697, 230948, 223774, 240052, 273390, 238712, 207093, 213599, 241882, 267916, 260550, 252249, 228220, 242112, 243899, 249473, 259106, 238065, 215373, 217065, 209480, 198001, 214731, 199494, 186877, 132746, 195255, 171119, 145755, 186268, 183733, 143038, 152311, 153230, 163528, 168954, 105030, 153900, 142247, 158313, 192779, 140490, 179408, 200073, 143450, 140398, 144382, 153339, 167793, 151074, 174056, 143223, 142092, 129896, 112535, 151603, 168260, 173234, 126460, 94204, 87793, 117397, 122066, 100336, 127836, 144154, 103592, 80881, 90142, 66140, 70858, 120334, 123226, 104942, 95980, 110963, 114378, 117444, 128287, 133838, 104887, 167212, 170032]
6063A70032n5509m1331L6174L3533j2827k3068n231L227o893J8281P626n252M165
6050A22927r614K1740j0890j6289M8091j5339k0540j1933J1503K6795J5640j3742
6038A48349q077j7569p258M672L599K769j6026K0591J0603j1947L6954k6313j9487
6025A20860M386j9909N2370K219K8172J265m5466q793k1813N8698k3264q487o645
6012A33593j812J9805j1136l461J7813o277l0657l6594L0742J953K9338J8335
6000A61642k9983M812p211Q456L4662K131J9437N052l9723J3521j4705Q121K7329
5987A93541j604j9682J7736L827P591M294J595r565Q798M076J7173M3181J4191
5974B85152m433j9823l738J6530j6224J0904J0986n027O669j5950m3472m70O7281
$$ y = [170032, 114523, 73192, 109366, 142899, 130072, 107004, 101773, 105000, 98107, 116388, 124014, 118762, 122927, 113313, 135053, 124163, 107874, 155965, 140626, 120086, 108153, 119656, 146451, 162091, 148349, 140272, 122703, 115445, 120117, 123716, 126485, 110459, 131050, 141653, 129706, 166660, 140347, 120860, 125246, 105337, 157707, 159926, 188098, 189363, 143897, 135104, 113291, 171989, 148725, 140238, 133593, 131781, 151586, 140450, 136989, 154802, 148525, 117868, 81274, 112016, 113969, 143307, 161642, 131659, 136471, 129260, 137716, 172378, 174509, 193946, 198998, 159275, 172796, 158091, 166212, 193541, 191937, 172255, 189991, 193818, 201409, 205703, 207298, 197733, 206531, 210607, 227780, 270961, 285152, 280719, 260896, 257158, 273688, 257464, 268368, 279354, 274327, 280996, 265046, 221574, 221104, 288385]
5961B88385J982m5348p452M218J8731K1505j3877L6588J6933M2919j205j9397
5949C43982j1894l163L7122j6573J6769L1726J3467K6391M7445n1206J9440K1171
5937D74677M384N1732L8838J1683j0003O7837P0731K0319J9639J1968O002K0227
5925G88034M3872Q403j0265L2904J2531J4301j0350k3164K5686r804m6557j8404
5913H07187m1859o0341j7163j0523m0621m0550j4696j5837m8905p359r7105l2363
5901C79865K0224r979j7776l1437K9976N096n3811o788j0445K352p13R951j2767
5888C03748l6444j3555k5549L1663l8127j1396M0830l3533l490R260j0530M4221
5876B57098k6131R031J3602o6550r118K9532q883M893K4128j6539L1659l7923
$$ y = [288385, 290367, 245019, 237567, 241785, 260516, 282021, 268144, 304732, 321665, 364584, 363379, 343982, 332088, 328925, 366047, 349474, 366243, 397969, 411436, 437827, 485272, 434066, 453506, 474677, 479061, 530793, 569631, 581314, 571311, 639148, 709879, 730198, 749837, 761805, 767807, 788034, 831906, 840309, 830044, 862948, 875479, 889780, 879430, 856266, 881952, 872148, 825591, 807187, 765328, 704987, 687824, 677301, 636680, 596130, 581434, 565597, 516692, 509333, 412228, 379865, 400089, 390110, 372334, 340897, 370873, 375969, 322158, 315370, 304925, 307277, 306564, 316515, 303748, 267304, 253749, 228200, 259863, 221736, 210340, 251170, 217637, 214147, 223407, 212877, 257098, 230967, 239998, 253600, 187050, 177932, 207464, 198581, 203474, 227602, 211063, 242722, 204799]
5864B04799k7381P984J3835o737J421j847j7569L2958j5841J4563k4838j4010
5852A67337M9553K4830k7149k8454J0116r68j3857L1756r329n1760J0948J0111
5840A73134j4950M906k2125l8003p744m19K3489K6597l5224r707L3128m6080J6128
5827A03130J3662K5881j4288P199P978n5741J2799n127K102J7887M0988k1035
5815A35435j0339p168l247m290K520m1829k1853K8903L7579J4372k8320k5509
5803G6254N6313k6405p591j6241K184L8479M633j0180j8711K0184Q671j4023j1828
5790A01739p334L6038m10k3031k2145l25n867J3248J0759j5670k913k5063Q916
5777F7942r403K8272L9911k2817l609k4594R664l67J5174J9718k2340n036j3547
$$ y = [204799, 177418, 185402, 199237, 192500, 193921, 192074, 174505, 207463, 191622, 206185, 181347, 167337, 216890, 241720, 214571, 186117, 196233, 195265, 181408, 213164, 203835, 152075, 163023, 173134, 158184, 163090, 140965, 102962, 95218, 94799, 118288, 144885, 109661, 99954, 133082, 87002, 103130, 116792, 142673, 128385, 135584, 143562, 87821, 100620, 95493, 97595, 115482, 156470, 135435, 125096, 117928, 114681, 110391, 112911, 71082, 49229, 78132, 115711, 130083, 101763, 76254, 132567, 106162, 98571, 82330, 84514, 122993, 127626, 117446, 98735, 118919, 127590, 113567, 101739, 94405, 130443, 130033, 107002, 84857, 84532, 78665, 91913, 102672, 87002, 84089, 59026, 67942, 58539, 86811, 126722, 103905, 100296, 75702, 85366, 84999, 100173, 119891, 97551, 92515, 78968]
5764G8968K4170k5930k1168j0936N8272j4912k919O616Q382j9248J8146J0335
5752A09776p3371L3101K4246r33K3869k373j7135Q174n581k8776J6789k1558J5249
5739H1477l8638K0156K5693j4717j1319L1338j5152J3442J371l0890K38J3569
5727G6568J1722K0614k1304j9266r306K8541K5602p9492O2910j2282R604K081
5715I5992j8409o0397n805M8110N227J2160k7380K0139k0251J9308j8614L0619
5703H0699l6073k9959J4291J9333K8186k0752M2381J4411m0824n101J607k9984
5691C8215M3708q656n414M3938j1695m558Q245m1873J0847J5034l4882J5876L718
5678G2503j5364K9479k7952j0348M736J2653k38j9516k377J4608L8991l4327q778
$$ y = [78968, 103138, 77208, 56040, 45104, 103376, 88464, 85545, 92161, 100543, 81295, 99441, 109776, 36405, 69506, 93752, 92819, 116688, 114315, 97180, 105354, 99773, 70997, 87786, 66228, 81477, 42839, 62995, 88688, 73971, 62652, 93990, 78838, 92280, 93651, 62761, 62999, 76568, 88290, 108904, 87600, 68334, 59028, 87569, 113171, 33679, 96589, 84307, 93911, 95992, 77583, 17186, 11381, 59491, 64718, 76878, 49498, 69637, 49386, 68694, 50080, 80699, 44626, 14667, 28958, 48291, 76477, 55725, 98106, 112517, 71693, 66592, 68199, 38215, 81923, 73267, 67853, 111791, 100096, 95538, 103783, 61910, 72757, 87791, 52909, 68785, 72503, 57139, 86618, 58666, 48318, 53054, 65707, 65469, 45953, 43576, 58184, 97175, 62848, 54070]
5665E4070K2886J0427J639k3744j2193k587O0430Q98l8421q813j8192O250L087
5652E5737P016M4279l0262q095q344l856J0765k5110M744K6733m3510L375N7118
5639I0590N970j974j1797r821l201n447J4243J7966J7035k9414o283J4044j2076
5626G9835K907l7690l571J4601M8019K3855j376k2784l7320K3734l612l0660j9537
5613C6401L5193M08K1200j7654K0176l346l1132K0485J8221j4875K8126l7676
5601G5527J4142L7894n0724k8725K7652K9239q266j9313K9284j1504q329J6706
5589A03583J2630L1895j7028K0205M4642j9858m7799K6517j9806l519j611k0107
5577A09744j9579N9536m514l0226j8919J1784K3277J548k9981N559J5626K7506
$$ y = [54070, 76956, 87383, 89022, 65278, 53085, 50498, 110928, 111826, 73405, 64592, 46400, 52650, 55737, 62753, 107032, 76770, 68675, 60331, 56475, 67240, 42130, 46874, 73607, 30097, 33472, 90590, 96560, 94586, 82789, 72968, 69767, 64320, 78563, 96529, 113564, 84150, 77867, 91911, 79835, 82742, 45052, 41481, 56082, 104101, 127956, 126580, 103796, 66476, 90210, 86598, 55938, 36401, 71594, 72002, 93202, 75548, 95724, 92378, 61246, 81731, 99952, 85077, 113203, 75527, 89669, 127563, 76839, 48114, 75766, 105005, 96739, 77426, 106710, 95206, 86877, 103583, 116213, 148108, 131080, 151285, 195927, 176069, 128270, 154787, 134981, 131462, 129851, 109744, 90165, 149701, 145187, 114961, 96042, 107826, 131103, 132651, 102670, 108229, 123855, 151361]
5565A51361K0294N14n6360J7748K6363k5457n8091p781M4067P444n129L487j9802
5552I8658J527O998L909l875j6339K3921L1724j9650j2134N892N0990Q12p8799
5539I3634j6912N6851J1176L133P900k5943k7637j2418M9837m7621j6667J2849
5527H8182P615K1861p268J9852k3548P630M1659n8904R959J6503Q200j9053M5333
5514A58021J3930k1084j5882j4146j8041j2947K1070P896l8837P100L7874j2008
5502A12946K4741J7537j9918M821j0955J22L8782l3017k8821J6376J2224m3419
5490I1419J0228K1821M8K6339J4820l4860k8225J1839j8940J4693M9240m7531
5478A10891l8999N5138J8738k0266j2169J2169J0651k667m7393K4757n215R098
$$ y = [151361, 171655, 172169, 115809, 133557, 159920, 134463, 76372, 68591, 112658, 120102, 114973, 118460, 98658, 100185, 107183, 111092, 107217, 90878, 114799, 146523, 126873, 114739, 120631, 171621, 172433, 93634, 76722, 133573, 144749, 147882, 155782, 129839, 102202, 89784, 139621, 92000, 75333, 88182, 95797, 117658, 110390, 130242, 106694, 114324, 155983, 97079, 107038, 123541, 131741, 112688, 158021, 171951, 150867, 134985, 120839, 102798, 89851, 110921, 118817, 79980, 87080, 124954, 112946, 137687, 155224, 135306, 140127, 129172, 129294, 168076, 135059, 106238, 122614, 134838, 91419, 101647, 123468, 123516, 149855, 164675, 129815, 101590, 113429, 94489, 109182, 158422, 110891, 71892, 127030, 145768, 125502, 113333, 125502, 136153, 133486, 86093, 110850, 105635, 114733]
5466A14733J8012j8353j3675j2041K2544j0777K1417L156j9297J8822P769k340
5454A29970j7645J6646J4696k9858K5152l7053L5665J6651L0866m8956j2680j3244
5442A10210l0667N2662L2598j0439l0044L2427k8242L3608l9899o082K5582j1770
5430A29944l6396j3164M3102M1480k0104j027K8583j5632P334r634K5380j160
5418A78706l8431J8200J1201K339J8695r068q230n7648J649L3145N111K81K9465
5405A85415r784j7822K8536j3894J1973K2450m5474j548K469J6004J0569k428
5393A86466P447m3028j7434L7128p422M0922J1648m7800J4375j1047R474l094
5381A77635k2266q207O101R066K9308m8624L7147J59l9027R571p944M64R449n919
$$ y = [114733, 132745, 114392, 100717, 88676, 111220, 100443, 121860, 125016, 105719, 124541, 132310, 129970, 112325, 128971, 143667, 113809, 138961, 101908, 137573, 154224, 185090, 136134, 123454, 110210, 79543, 132205, 164803, 154364, 124320, 156747, 128505, 162113, 122214, 116132, 141714, 129944, 93548, 80384, 123486, 164966, 144862, 143835, 172418, 156786, 164120, 154486, 179866, 178706, 140275, 158475, 169676, 172015, 190710, 181642, 173412, 115764, 117413, 150558, 155669, 155950, 185415, 175631, 157809, 186345, 172451, 184424, 206874, 161400, 159852, 162321, 178325, 188894, 186466, 193913, 150885, 133451, 170579, 163157, 204079, 215727, 167927, 182302, 171255, 180729, 177635, 155369, 147162, 153263, 162329, 191637, 143013, 180160, 180319, 141292, 150863, 142919, 143383, 152832, 146913]
5367A46913k7517K1825K0637j3973j0556L1276J9508J5184j658k9298J085K9137
5355B02563N340R67j7800l0081M2169K969J7743l5059j3624M027J642K5595J9776
5342B26227j5941m2997K18N1323P277k4136k128m76J9422M588k4339K7818n305
5329B21551j0143K9160p731K7967O080N390l4093J7620j3605J2155N5911k9236
5317B81026M5565j4789K612j6560J3160k0282L1250P525M3742M0637j8067M200
5305D00019k308L4567O9795M9242P372J9251n096r379k1856L6232j5348Q475J5292
5292E86258L5600J3798M3539j0644n061N9275O2582o0153M7584L5119J7325O5170
5280H90392M0655R635L461P126L9104n232J7922k3776k7043j1106j1210N2405
$$ y = [146913, 119396, 141221, 161858, 147885, 137329, 168605, 188113, 203297, 201639, 172341, 173426, 202563, 207903, 208870, 191070, 160989, 203158, 206127, 223870, 188811, 175187, 179214, 180856, 206451, 226227, 210286, 167289, 167507, 218830, 226107, 201971, 199843, 199367, 218789, 223377, 199038, 226856, 221551, 211408, 240568, 232837, 260804, 266884, 272274, 238181, 255801, 242196, 254351, 310262, 281026, 326591, 311802, 314414, 297854, 311014, 290732, 321982, 329507, 373249, 413886, 395819, 400019, 397711, 432278, 502073, 551315, 558687, 577938, 572842, 563463, 541607, 577839, 562491, 570966, 586258, 621858, 635656, 679195, 668551, 663490, 722765, 785347, 725194, 772778, 807897, 825222, 890392, 931047, 940682, 944143, 951269, 990373, 985141, 1003063, 979287, 952244, 941138, 929928, 982333]
5268I82333l7596p6441j3030p155L963k2685R352l1426M3882N2489M6489M5720
5256I95895l6921K6021j0299m3672K1143n407m9902J0182M0897K2928k8739l7801
5244I04325l2202o9667m5629L933m1644j5968j4917K9197l9991o4962q545L3966
5232F37896R920j2699N3342K5302J8506L8265P118l2295r0708j00755k2726n136
5220E26030m4303J6634L280J6045m271L2669L4725P726J5192K2598o747K5223
5208F44801l4538k9557k4159k3289M3526j1778j6390J9958j953l7094l3855l591
5196D92081o580n3892q796L3138l997m914o965J4384K92L5339K9007N585J7284
5183E41966M105k7272J3693m9151k3592O132K8101j6095m7991m7578j2897m7280
$$ y = [982333, 944737, 868296, 855266, 848111, 852074, 829389, 838741, 807315, 851197, 903686, 950175, 995895, 958974, 984995, 974696, 931024, 952167, 946760, 896858, 907040, 947937, 970865, 942126, 904325, 872123, 802456, 756827, 760760, 719116, 703148, 688231, 717428, 677437, 612475, 603930, 637896, 647816, 635117, 688459, 713761, 732267, 770532, 777650, 745355, 654647, 553892, 531166, 526030, 481727, 498361, 501641, 517686, 513415, 546084, 580809, 588535, 603727, 626325, 619578, 644801, 610263, 580706, 556547, 533258, 576784, 565006, 548616, 568574, 566621, 529527, 495672, 492081, 485501, 431609, 422813, 455951, 451954, 447040, 440075, 454459, 454751, 490090, 519097, 524682, 541966, 546071, 518799, 532492, 483341, 459749, 465881, 493982, 477887, 429896, 382318, 369421, 322141]
5171C22141R175J9932J176j4308j5551J584j2739P627j1623J5613Q61L2226r118
5158C46996m3030N519P8044j6953l600Q372l0166n176J4906j5804k0489J6863
5146C35482l0904L8207N0554m5147l198l7208J638K7344K0393j814j6189j0194
5134C28964p839J1289M8320n8995J3534K1873O99M154K4600r265k2614L9421j1839
5121C82302J221L5295r247j049l6135K3466K9281K8288p922R884j465k793O1659
5108E12785l5453o509M6925M1892K9611O266l0513J1029L3138m12K3428K4978
5096F57165P931P4902J2468O7143L7400J06193O9346P1340J63122J17152J81649
5085A565811K03227K43309K91826L81641L50742K68274j5749l81564n70179n00481
$$ y = [322141, 331316, 351248, 352424, 338116, 322565, 324149, 311410, 319037, 307414, 323027, 323888, 356114, 346996, 303966, 309485, 387529, 370576, 366976, 375348, 345182, 340006, 354912, 339108, 318619, 335482, 304578, 342785, 393339, 348192, 344994, 307786, 309424, 336768, 357161, 355347, 339158, 328964, 321125, 332414, 380734, 321739, 335273, 357146, 357845, 361999, 386599, 377334, 354720, 394141, 382302, 383523, 418818, 409571, 408522, 372387, 395853, 425134, 453422, 445500, 455384, 453919, 451126, 512785, 477332, 470823, 517748, 559640, 589251, 595517, 565004, 576033, 609171, 608759, 632187, 657165, 665096, 739998, 752466, 819609, 857009, 963202, 1032548, 1103888, 1267010, 1384162, 1565811, 1769038, 2012347, 2304173, 2685814, 3036556, 3304830, 3289081, 2907517, 2337338, 1836857]
5075A836857l17226j79205j33579r9536o0030j1774j9350m8651j7990m3516L7243
5064I43243j4145n388n7289m5740o7162m6459L9096J1067K2524p662l0416R312
5052G50981k717k8490l3915o491m4245K412L1322J1648N545m9448k6360K8173
5040F38415J2808q447k4915n57K4799k0657M2930K1967J2755L4791M7680R13r001
5027G73481M7781L5397P5089M9720M9161J2309O350M4501k3131m4563n1091l9132
5015I35872j2042k9541Q255J8728k6644j1336L9001L8123J9908M675O2269n032
5003A042236m4495K9860K4876N1219J9146N3441L4237Q194J7312Q2221N3945N2039
4991A424231O2393M7550J8473n1825k9457J2112j5485q46n7467l0846n8395k0315
$$ y = [1836857, 1519631, 1340426, 1206847, 1107311, 1047281, 1035507, 1016157, 967506, 949516, 906000, 943243, 929098, 923710, 866421, 820681, 753519, 707060, 746156, 757223, 779747, 772085, 741669, 750981, 748264, 719774, 685859, 679368, 635123, 637535, 668857, 680505, 686050, 636602, 610242, 638415, 651223, 642776, 617861, 617304, 642103, 621446, 664376, 686343, 699098, 733889, 781569, 782482, 773481, 821262, 856659, 931748, 981468, 1030629, 1042938, 1049288, 1093789, 1070658, 1026095, 975004, 935872, 923830, 894289, 902544, 921272, 894628, 883292, 922293, 960416, 980324, 984999, 1047268, 1042236, 997741, 1027601, 1052477, 1103696, 1122842, 1176283, 1210520, 1218714, 1236026, 1318247, 1372192, 1424231, 1486624, 1534174, 1552647, 1500822, 1471365, 1483477, 1467992, 1467146, 1409679, 1378833, 1320438, 1300123]
4979A300123n6758m1774l3010k0110o868J6707N4613j3247m654n220M4698k893
4967A231607M7834R6920L8181L7235J7226l7625j7331j6299k7824J9739k4255
4956A365408l3854R144m3266J0460l2767p0338L3716m5720p9742k8662k538k0275
4944A061566J4094q867l3286L3184N7352N017r8J5521L303K3207j8303o9850o1370
4931A021470n0488n2196Q930p290r136j3445n601J2772J4554n076j4230j6822
4919H83442K660k0930K6873n737m571m1225J0302p649K4153j6065k9852o570j0285
4906H04546O779Q075K2453L800j1873j1234r889M2921o2669k7282O422L4510M7008
4893H53567j5383O5217K4342J0291L2081M3774k0746K8950l5210J8961k4637K716
$$ y = [1300123, 1243365, 1201591, 1168581, 1148471, 1141603, 1158310, 1212923, 1199676, 1195022, 1189802, 1234500, 1231607, 1279441, 1376361, 1414542, 1451777, 1469003, 1431378, 1414047, 1397748, 1369924, 1389663, 1365408, 1331554, 1340698, 1297432, 1307892, 1275125, 1204787, 1238503, 1192783, 1113041, 1084379, 1081841, 1061566, 1075660, 1066793, 1033507, 1066691, 1124043, 1129060, 1128962, 1144483, 1147786, 1170993, 1152690, 1082840, 1021470, 970982, 918786, 927716, 920426, 911290, 897845, 892244, 905016, 919570, 914494, 900264, 883442, 886102, 865172, 892045, 886308, 881737, 840512, 850814, 843165, 867318, 851253, 821401, 814831, 804546, 811325, 819400, 841853, 845653, 833780, 822546, 812657, 855578, 792909, 765627, 772049, 806559, 853567, 838184, 903401, 927743, 938034, 970115, 1013889, 993143, 1022093, 986883, 1005844, 981207, 983923]
4881I83923M6769M96k3919K6848O3846K5705O8032N6302R3157M8851P7638N0560
4869A518208J07497J17209J73417K13980J90182K43614K86793L47435M11937N20585
4859D130857O19938M67480J38140l88953q64657q05540n16912k67059k19146j38696
4849B155452q0889o8609k4309m4106k5507K7562L1308K6912N1203O9633J03722
4838B222372O9542J32288J80946R5763L0714r9876p7592n3015j5505l9824J8546
4827B464359K5935M3601M7364Q7462L9881O7847Q5381Q5357P6373R4304P0781
4816C188645Q3681R1431J01457J78799K29206J80978J77010K07220J24184k9359
4806D533252k68503l49058k56879j91507j60546j53343p6823n9627l2578o4479
$$ y = [983923, 1030692, 1031188, 1007269, 1034117, 1097963, 1123668, 1191700, 1248002, 1341159, 1390010, 1467648, 1518208, 1625705, 1742914, 1916331, 2130311, 2320493, 2564107, 2850900, 3198335, 3610272, 4130857, 4750795, 5218275, 5356415, 4967462, 4102805, 3297265, 2780353, 2513294, 2294148, 2155452, 2074563, 2005954, 1981645, 1937539, 1912032, 1939594, 1970902, 1997814, 2049017, 2118650, 2222372, 2291914, 2424202, 2605148, 2700911, 2731625, 2631749, 2554157, 2501142, 2485637, 2445813, 2464359, 2490294, 2533895, 2581259, 2668721, 2708602, 2776449, 2861830, 2947187, 3023560, 3117864, 3188645, 3272326, 3363757, 3465214, 3644013, 3873219, 4054197, 4231207, 4438427, 4562611, 4533252, 4264749, 3915691, 3658812, 3467305, 3306759, 3153416, 3076593, 3016966, 2984388, 2919909]
4796B919909j32944p1610r4306o7449p5710L256l3768l5834n2894O224M7408K3315
4784B435597K6906K8693k2189j6710o8689k13799j93848j68163j27060n0995J0633
4773A640376q7677q1818p1041o0053K846j7014l3466o9526O388l132n2722m1057
4761A132104m184r258m4810R626L2129k0160p356K905K5813M0824Q6384N1402
4749A295419O6796K8617P8051Q9620L2592N688J7220q4748r6663l8070r5494m2521
4737A256507o1083k5556l3794K7325K0484j3407K6899Q000L8120L2497N0034M6082
4725A372108O4434O9771J09461J26264J32558J61958J74191Q5248Pj43138k21713
4714A931149j91569k03244r6956j04869o7712m5280k7228m8206M814m3220l4204
$$ y = [2919909, 2786965, 2715355, 2621049, 2553600, 2477890, 2481146, 2447378, 2411544, 2358650, 2364874, 2412282, 2435597, 2462503, 2491196, 2469007, 2452297, 2383608, 2169809, 1975961, 1807798, 1680738, 1629743, 1640376, 1552699, 1470881, 1399840, 1339787, 1342633, 1325619, 1292153, 1222627, 1229015, 1225883, 1173161, 1132104, 1127920, 1118662, 1073852, 1083478, 1115607, 1095447, 1088091, 1090996, 1116809, 1157633, 1244017, 1295419, 1362215, 1390832, 1468883, 1558503, 1591095, 1596783, 1614003, 1529255, 1432592, 1394522, 1299028, 1256507, 1195424, 1169868, 1136074, 1163399, 1183883, 1170476, 1197375, 1205375, 1243495, 1275992, 1326026, 1372108, 1436542, 1506313, 1615774, 1742038, 1874596, 2036554, 2210745, 2295993, 2296000, 2152862, 1931149, 1739580, 1536336, 1439380, 1334511, 1266799, 1221519, 1194291, 1146085, 1150899, 1107679, 1073475]
4703A073475m062j5080M0362M3001L3917N6140L3618M4949J05248N9020O5504
4692A536092P6303L0342j7473p4364j29054j14015j01559q0198p6644n0355n3130
4681I45945M236k5970m6143l4977j7043j3029N4346p199m6699O474O860K5050
4669H51851J2385K7255J1586p62j4135r381m3232l7747k0034k4518k0121j3162
4657G19985k3800k2576K541k4310L741M101q638k2843j4538M7648k3597K3562
4645F61276J8703j7464J2691l7412M727P781l083K599j4530L6190l3859P974O558
4632F52151m008K1963l4697l2056k4932k400l7643j0887O575N025J5335k962J3426
4619E64890P870J0097l6083K1313J8764p659j4737M8008l9763M919j4557o715
$$ y = [1073475, 1069413, 1054333, 1094695, 1137696, 1171613, 1227753, 1261371, 1306320, 1411568, 1470588, 1536092, 1612395, 1642737, 1625264, 1550900, 1421846, 1307831, 1206272, 1126074, 1049430, 999075, 945945, 950181, 924211, 878068, 843091, 826048, 813019, 867365, 860166, 813467, 819941, 826801, 851851, 864236, 891491, 903077, 902315, 888180, 878799, 835567, 797820, 777786, 753268, 733147, 719985, 696185, 673609, 676150, 651840, 655581, 659682, 651044, 628201, 613663, 661311, 637714, 661276, 679979, 662515, 675206, 637794, 642521, 650302, 647219, 649818, 635288, 671478, 637619, 645593, 652151, 648143, 670106, 635409, 603353, 578421, 576021, 538378, 527491, 534066, 539091, 554426, 551464, 564890, 572760, 582857, 546774, 568087, 586851, 579192, 564455, 612463, 572700, 577619, 563062, 556347]
4607E56347j6146o540J0600L4275J1121J8512j929j2166N6106j4736l7199J6125
4595F14370j2545n98O2318k5024N647l453L2839m886K6506L7197M1323M6852M9675
4582H70221L4003P4604N1824O2958O0907J10974Q3566J33909O8191K2464q1364
4571A492257j46745j20633j11298O239J5483o3092J3306q860l4739N4637N5887
4560A152442L0538M5024L0676O7460J49726J49197J06430J24672J50293K00262
4550B206720K00286K04772R4331j17212k85041l57060k17265j39317n4461p7031
4540A458722m3504O685k7242l6583n1194l0411N935j384R93M3391L3922M9632
4528A408962K6417O0604R8547Q9622P3292O423k6982j11004j47433r3031r0682
$$ y = [556347, 540201, 533661, 544261, 578536, 589657, 608169, 606240, 594074, 650180, 635444, 598245, 614370, 601825, 601227, 663545, 638521, 644168, 640715, 673554, 668668, 695174, 732371, 773694, 820546, 870221, 904224, 978828, 1030652, 1093610, 1154517, 1265491, 1349057, 1482966, 1551157, 1573621, 1492257, 1345512, 1224879, 1113581, 1119820, 1135303, 1072211, 1085517, 1076657, 1041918, 1096555, 1152442, 1182980, 1228004, 1258680, 1326140, 1475866, 1625063, 1731493, 1856165, 2006458, 2206720, 2407006, 2611778, 2706109, 2588897, 2303856, 1946796, 1729531, 1590214, 1535753, 1458722, 1415218, 1421903, 1394661, 1358078, 1306884, 1276473, 1282408, 1281024, 1282017, 1325408, 1359330, 1408962, 1435379, 1495983, 1594530, 1684152, 1757444, 1763867, 1736885, 1625881, 1478448, 1385417, 1294735]
4517A294735m6356k8102m592O765M63O742n3731R681K9002q035n6858J1115j0620
4504A150209L3045k9738L6186L7174N6894P5525P7971O3285P9910J20821J87337
4493A888619J63366K17288K61618K92599M20473N40941N63091M97214R6990n16503
4483D425696q55928o71206l98280k59736j36354n9214k2988k888n9158n2116o1544
4472A846284j01177l940n8261j7341Q175o7839l0539n5146o7547O12l8142j30114
4460A285025q7093j07635n8382n9083q2374m6180l7523n1543k8292K2484j1608
4449G37796M4467k4804k7074J0786L0274m0942m8Q530L7004j4362K570N561m025
4436G65733J2968j1909m4506q692l8582O576K4953J2530q424R071k7269N4605
$$ y = [1294735, 1248379, 1220277, 1215685, 1222450, 1222913, 1229655, 1175924, 1185605, 1214607, 1206572, 1149714, 1160829, 1150209, 1183254, 1153516, 1189702, 1226876, 1283770, 1359295, 1437266, 1500551, 1580461, 1701282, 1888619, 2051985, 2269273, 2530891, 2823490, 3243963, 3784904, 4347995, 4845209, 4942199, 4425696, 3569768, 2898562, 2500282, 2240546, 2104192, 2044978, 2021990, 2019102, 1959944, 1907828, 1846284, 1745107, 1741167, 1682906, 1665565, 1673740, 1605901, 1575362, 1520216, 1452669, 1453281, 1415139, 1285025, 1197932, 1090297, 1031915, 972832, 890458, 844278, 806755, 755212, 726920, 749404, 737796, 782263, 757459, 730385, 741171, 771445, 730503, 730455, 738985, 775989, 761627, 764197, 769758, 765733, 778701, 766792, 722286, 713594, 675012, 681588, 706541, 719071, 710647, 719718, 692449, 747054]
4424G47054n009J9213K9663q82L1372j3757l4752l2571q7693m5852j4209m924
4412E87653j5665j2662k0199q644o639k7603k8978R999q204K6063m2668j1833
4400D40620r1m6853L8275Q179J1571J2296j1076j290K5838n460m4545J3146L1264
4387D71874K7964M1624l7672j7811l8585K6191N2550k5818p057m8463k0889O894
4375D30802O730K9680J2061j1434l6926R705J7238K7082m0206l866l2336k8756
4363C79774n4846K6047N610o70M5856n217J296k145J7523J8494m1832J8395L699
4350D11984j6888j9540n124m319L3884O218k442l1443k7964K8197K2685k1967
4338C73281p876J7757l9438o532j1218m3062N916L8342o298R515J8490l0530j130
$$ y = [747054, 742045, 761258, 790921, 790039, 821411, 807654, 772902, 740331, 652638, 606786, 592577, 587653, 571988, 559326, 539127, 530483, 523844, 496241, 467263, 477262, 469058, 495121, 452453, 440620, 440529, 393676, 431951, 440130, 451701, 463997, 452921, 451631, 477469, 472009, 427464, 440610, 471874, 499838, 541462, 503790, 485979, 447394, 473585, 526135, 500317, 493260, 444797, 423908, 430802, 437532, 467212, 479273, 467839, 430913, 440618, 457856, 484938, 444732, 440866, 408530, 379774, 324928, 350975, 356585, 355915, 401771, 396554, 397850, 395705, 413228, 431722, 389890, 408285, 411984, 395096, 375556, 370432, 366113, 399997, 406215, 403773, 372330, 344366, 372563, 395248, 373281, 365405, 383162, 343724, 337192, 325974, 282912, 288828, 327170, 320872, 330387, 348877, 318347, 317217]
4325C17217N023L2232k6511Q871m748m835J4804n642l0590K3842J3030L7595K3356
4312D03644k5834k2859j7612L8571n2705o653J0721o710l429l038j0181P259L2143
4299C43317m1247L1196r952k1232L8512J1242L046J7820j1954q510K5240R815
4287C87293M458j7458l5254K1717J2045j1774L8387K778k4049N54J2802L1396
4275D22895k9202J751J714j2256J9391l9869m93j5048M3126k0068k2873K731L256
4262C55055j1478N369J2873K2757N524n427L7890K9441Q305k6393j4420j0607
4250D08889J8745l0096j9228N031j3460M8453j3410n0380J5845O7547n0819l738
4238C83379L3226K5590m7385Q014r127l5547K1047N455K151n075L7005l3223j899
$$ y = [317217, 322240, 354472, 327961, 336832, 332084, 327249, 342053, 336411, 305821, 329663, 342693, 380288, 403644, 377810, 354951, 337339, 375910, 323205, 316552, 327273, 320563, 317134, 314096, 303915, 311174, 343317, 302070, 333266, 323314, 302082, 340594, 351836, 354882, 372702, 360748, 352238, 377478, 387293, 391751, 374293, 339039, 360756, 372801, 361027, 399414, 402192, 378143, 378697, 391499, 422895, 393693, 395444, 397158, 384902, 404293, 364424, 363931, 348883, 392009, 371941, 349068, 351799, 355055, 343577, 348946, 361819, 384576, 390100, 384673, 422563, 452004, 460309, 433916, 419496, 408889, 427634, 397538, 378310, 383341, 369881, 418334, 404924, 354544, 370389, 437936, 387117, 383379, 416605, 442195, 394810, 402824, 393697, 358150, 379197, 384652, 386803, 381728, 418733, 385510, 383611]
4225C83611L2081L2090k6201l3602j2933j2104K4818K1878J080K0765j6112r776
4213D05595m170k5164N3068m0402j1696L7780N2240J964r056K2400j9636J9799
4201D82722K1563n52l1457m823K0976j824j524k6413L6735K7165j3910k0895j1162
4188D76601j9506J2284j0997K2376K0047l3794J8979M0087l1449Q776p713j8813
4176D76878L677o640j44J7603J7771L272N025J3378M154m107J5566L2573l7723
4163E41283K8514O2288r676n086K8910L5009L290L2096O776L1507N0481L7860
4151H43252M2051N2181K2057p8780k4172m9335o3732J6744j8453k3525k7726k504
4139F88058k548j818l9345j2048j4743K5081k1393J2640J1809j700n56J9798O266
$$ y = [383611, 415692, 447782, 421581, 387979, 375046, 362942, 387760, 409638, 410718, 431483, 415371, 405595, 401425, 376261, 429329, 388927, 377231, 415011, 467251, 469215, 460159, 482559, 462923, 482722, 504285, 503733, 472276, 467453, 488429, 486605, 485081, 458668, 495403, 522568, 508658, 487763, 476601, 457095, 469379, 458382, 480758, 500805, 467011, 485990, 526077, 494628, 503404, 495691, 476878, 480555, 473915, 473771, 491374, 509145, 512417, 517442, 530820, 534974, 530867, 546433, 579006, 541283, 569797, 632085, 622409, 617323, 646233, 681242, 684532, 716628, 723404, 754911, 805392, 843252, 885303, 937484, 959541, 880761, 856589, 807254, 743522, 760266, 741813, 718288, 690562, 688058, 685510, 683692, 644347, 632299, 617556, 642637, 621244, 633884, 645693, 643993, 643437, 663235, 669501]
4126F69501m005O057L739l532l894j2087p822L4777L2877k3142K5155j2260k6810
4113F78554n764N9479r607l0960M3074J9071j9695L2850J5027M910k212L4320
4101H19047O80j7554L3473M8105k3093K3816Q9909J408N3950O2873M7067N1748
4089A191429K2064l7797n6327q6748l6117j9707j6776K5032l0584n199L1265M9490
4077A030025R731N4919N2357K3488P3637M3489L8139M9115J05992R8223P3184
4066A652299J50086J89595K03735J23992k9852k02198k81550k04795j22464j24626
4056A354222l8284m7992l1032k7980k2390J2056k5122l0681q460j3853j3433j8250
4044A088801j7633K4952K0144J6513m9530l8248N7766L167j6762M3029J2797Q063
$$ y = [669501, 665496, 671553, 675292, 671760, 667866, 655779, 647957, 682734, 715611, 692469, 717624, 705364, 678554, 672790, 732269, 722662, 691702, 734776, 753847, 734152, 767002, 782029, 786939, 784727, 819047, 819727, 802173, 835646, 883751, 860658, 884474, 974383, 975791, 1029741, 1092614, 1139681, 1191429, 1213493, 1175696, 1119369, 1032621, 996504, 976797, 960021, 985053, 954469, 949270, 980535, 1030025, 1039756, 1094675, 1147032, 1170520, 1244157, 1287646, 1325785, 1374900, 1480892, 1579115, 1652299, 1802385, 1991980, 2195715, 2319707, 2289855, 2087657, 1806107, 1601312, 1478848, 1354222, 1315938, 1267946, 1236914, 1208934, 1186544, 1198600, 1173478, 1142797, 1134337, 1120484, 1107051, 1088801, 1071168, 1096120, 1116264, 1132777, 1083247, 1044999, 1102765, 1105932, 1089170, 1132199, 1144996, 1153059]
4032A153059m2214K498M7369P291l316m452J9339L0400k5376J3680K3476M4236
4020A265990J9635N596J2000K4297j7142M8220j5329L6966Q596J3831K023p882
4008A396801J1285n103L9009M3878L7571K2688Q005N8685N3950M3559J8630L0546
3996A759504N1527J11190R3127P2565J28016J58601P3940J3483l0817p9516o7092
3985B284528q0437L884J5396j9682K5679l559j7194l528L6921k5194N614K7175
3973B249603L3531J07042N3063K7092N7093O0891r87M9851M9245J1655P2297M1625
3961B812001L6013O5550M8252j235R377n221o6772m5750o939L3173R755N4993
3949B943197P037J9580K5271r953K3310O3614J3621j6465N9434Q4049m372K981
$$ y = [1153059, 1110845, 1113343, 1160712, 1168003, 1164687, 1160235, 1179574, 1209974, 1184598, 1198278, 1221754, 1265990, 1285625, 1291221, 1303221, 1327518, 1310376, 1358596, 1343267, 1380233, 1388829, 1402660, 1404683, 1396801, 1408086, 1402983, 1441992, 1485870, 1523441, 1546129, 1554134, 1612819, 1666769, 1710328, 1728958, 1759504, 1811031, 1922221, 2015348, 2087913, 2215929, 2374530, 2448470, 2461953, 2431136, 2351620, 2284528, 2204091, 2207975, 2223371, 2203689, 2229368, 2225809, 2208615, 2205087, 2242008, 2216814, 2222428, 2249603, 2283134, 2390176, 2443239, 2470331, 2527424, 2588315, 2587328, 2637179, 2686424, 2698079, 2770376, 2812001, 2848014, 2913564, 2961816, 2960581, 2969958, 2964737, 2897965, 2852215, 2845276, 2878449, 2888204, 2943197, 2950234, 2969814, 2995085, 2985132, 3008442, 3072056, 3085677, 3069212, 3128646, 3212695, 3208323, 3211304]
3937C211304R6996L5239L8210Q5150K7316O0962R3987J14048J31832J33766J63566
3926D192376J40122P0348K3867r2334j22787r3063n4546J4164n1843M4914O5234
3915D136452J0995N3647L3351O3527M3358L3841M3444P0938K7790N9704R2312
3904D669359J3158O5971L8219M6502P6633K6704Q3106O7222M9056N0437O1025
3893E247392R2981O1435L9093P6789N6140J08184O8118K6694M7294M0075J7462
3882E881657n143O3457K6477K5496M9473j5191L6362M6401K2997n0893N9772j785
3870F139080k1795m937m1913j0998k5804L878l2148j8472o0970m0431m7830p7343
3858E760317K1264n1164n5458k8699l6838o9756R46p0181o0190j5823m1415p4740
$$ y = [3211304, 3308300, 3343539, 3381749, 3466899, 3494215, 3555177, 3649164, 3763212, 3895044, 4028810, 4192376, 4332498, 4402846, 4426713, 4334379, 4211592, 4118529, 4063983, 4078147, 4026304, 4071218, 4136452, 4147447, 4201094, 4234445, 4297972, 4341330, 4375171, 4418615, 4489553, 4517343, 4577047, 4669359, 4682517, 4748488, 4786707, 4833209, 4909842, 4936546, 5019652, 5086874, 5135930, 5186367, 5247392, 5340373, 5401808, 5440901, 5517690, 5573830, 5682014, 5750132, 5776826, 5824120, 5864195, 5881657, 5876514, 5939971, 5966448, 5991944, 6041417, 6026226, 6062588, 6108989, 6131986, 6081093, 6140865, 6139080, 6117285, 6112348, 6070435, 6059437, 6033633, 6037511, 6005363, 5986891, 5925921, 5885490, 5837660, 5760317, 5781581, 5730417, 5674959, 5646260, 5609422, 5539666, 5540612, 5470431, 5410241, 5394418, 5353003, 5278263]
3846E278263q2648n314l9535o2847m9121o7156n9301r2660L481l8459p3401p3505
3834D637797o4281n7846q0253q5010o2906p8324n3688n5930k5300l9321o0259
3823C974679l7288n6725j5437m3701j1711k1426o4401l5570k6134k5445n4338
3812C582503j06956j4875m0172m9939n0134l0659j8953m5755j4216o4867o8149
3801C077828j5418k1833O3105K4876k4870n2649K947l9226o9954l2750O973J4094
3789B933123k1474R441k5564o2789L0290r19q15n8471M493m9047o9969L8841J8830
3776B745970m0234m6762j3812O589k7623m5379m3909K2612m6388p3733k1488N369
3764B421212j6912M945r478J0900K5649M621m4719j0341K774r734p1034k2263
$$ y = [5278263, 5195615, 5190301, 5150766, 5087919, 5038798, 4971642, 4912341, 4819681, 4823162, 4784703, 4711302, 4637797, 4573516, 4515670, 4435417, 4350407, 4287501, 4209177, 4155489, 4099559, 4074259, 4034938, 3974679, 3937391, 3880666, 3865229, 3821528, 3809817, 3788391, 3723990, 3688420, 3662286, 3636841, 3582503, 3475547, 3460672, 3420500, 3370561, 3320427, 3289768, 3270815, 3225060, 3210844, 3145977, 3077828, 3062410, 3040577, 3103682, 3128558, 3103688, 3051039, 3053986, 3014760, 2944806, 2912056, 2919029, 2933123, 2911649, 2921090, 2895526, 2832737, 2863027, 2862108, 2861293, 2802822, 2807315, 2758268, 2688299, 2727140, 2745970, 2705736, 2658974, 2645162, 2651751, 2624128, 2578749, 2534840, 2557452, 2511064, 2437331, 2415843, 2421212, 2404300, 2409245, 2399767, 2410667, 2436316, 2440937, 2396218, 2385877, 2388651, 2378917, 2307883, 2285620]
3752B285620O221j486l7824k2995K8508M1840k5786L2057l4641n3283J5699J2695
3740B246625l5674m5303k6192M663k7846l8342K5938j9283K8079j7206j2888l993
3728B078578J5886L4841L629L7743M149j9045L3099n0905j6780N1725l5922L2375
3716B169373N567K2432k7768p637m0101k2978J7563J2943j6783o052r525l6690
3704B060344L3868k8334J7562K325J2545M1718L3788m717O702q269K3123k4300
3692B166355K5823k178L840p606k802k5832K096K17J0734K0145K7594K2192M2376
3679B282954N3722P9390O4719R5148R2497J28895O8720J62632J73290K07973K01432
3668C611372L00568L17071L68355M77437M96005O01057P82427O93943N13518j90308
$$ y = [2285620, 2291841, 2290355, 2252531, 2229536, 2258044, 2299884, 2274098, 2306155, 2271514, 2218231, 2233930, 2246625, 2210951, 2165648, 2139456, 2144119, 2116273, 2077931, 2103869, 2084586, 2112665, 2095459, 2082571, 2078578, 2094464, 2129305, 2132934, 2170677, 2174826, 2155781, 2188880, 2137975, 2121195, 2172920, 2136998, 2169373, 2174940, 2197372, 2169604, 2161967, 2121866, 2098888, 2116451, 2129394, 2112611, 2106559, 2097034, 2060344, 2094212, 2065878, 2083440, 2085765, 2098310, 2140028, 2173816, 2169099, 2175801, 2167532, 2190655, 2166355, 2192178, 2190000, 2193840, 2186234, 2183432, 2157600, 2159696, 2159913, 2170647, 2190792, 2218386, 2240578, 2282954, 2336676, 2416066, 2480785, 2575933, 2668430, 2797325, 2866045, 3028677, 3201967, 3409940, 3611372, 3911940, 4229011, 4597366, 5074803, 5570808, 6171865, 6954292, 7648235, 8161753, 7971445]
3658G971445q40077j116243r36366o19362m09394l04046k61563j76840j57026
3649C150528p4291j04811q3938p4458p2783o5559m9974m5743k6256r5872q1150
3638B375693l4214k8694k7043j7220P945j3503n5586l6273l9122K6015J8077l0022
3626B146053j6402r174R45J4271l0788m699J9037l9941K9327N0026l883K0252
3614B175024J7270J1382N056K1596K5585R17O498M929j6092K1401J5825M6368
3602B335759L1096O6861K7476j7575j5198l2932p4794o2385p5427j1031k6035
3591B145815n565m628n3821K1895o212K5064M2594K8697N79N8684O5324l2995
3579B285431R158J103k268N0188K7652M1097K4452L3714r31M753P3837L9807P0054
$$ y = [7971445, 7131368, 6015125, 5078759, 4459397, 4050003, 3745957, 3484394, 3307554, 3150528, 3076237, 2971426, 2887488, 2813030, 2740247, 2674688, 2624714, 2578971, 2552715, 2456843, 2375693, 2341479, 2312785, 2285742, 2268522, 2276467, 2262964, 2207378, 2171105, 2131983, 2157998, 2176075, 2146053, 2129651, 2120477, 2121422, 2135693, 2104905, 2100206, 2119243, 2079302, 2108629, 2158655, 2154772, 2175024, 2192294, 2203676, 2208732, 2230328, 2255913, 2256830, 2263328, 2268257, 2252165, 2273566, 2289391, 2335759, 2366855, 2433716, 2461192, 2443617, 2428419, 2395487, 2320693, 2258308, 2182881, 2171850, 2145815, 2140250, 2135622, 2081801, 2103696, 2097484, 2122548, 2165142, 2193839, 2194418, 2253102, 2318426, 2285431, 2294589, 2295692, 2293424, 2343612, 2371264, 2412361, 2436813, 2470527, 2469596, 2474349, 2548186, 2587993, 2658047]
3566B658047P6292O4428N6065p994j03018n6995j03472m9821J1073l8394m511
3555B501700J9791N5234R1448J3280M1734L2991N6720J2257J04427k6220m764
3544B898598J741j796k3514Q263M3098P3962N5665M0637J2289K537J9518j2075
3532C118923R085K2135L9710J3530j7263j7832k6485J8291L3287m6727K6260K1682
3520C194596q698M0210M6193p354n032N8997L3270L5268N8117M5756L7195O0232
3508C588750R9750O9674J9763j6759n4509k6112p9741p3090l048O480K9411J2747
3496C573316j3896J0355p881J1585m9470o8167J0352q199q3M844K5834O0778O8360
3483C617728N6746O1880J06091O9913k460K1500N6637Q6515O5957N9385M1244
$$ y = [2658047, 2734339, 2798767, 2854832, 2846838, 2743820, 2686825, 2583353, 2533532, 2544605, 2506211, 2501700, 2521491, 2576725, 2668173, 2681453, 2723187, 2756178, 2812898, 2825155, 2929582, 2903362, 2898598, 2900339, 2898543, 2875029, 2883292, 2926390, 3000352, 3056017, 3096654, 3108943, 3111480, 3130998, 3118923, 3128008, 3150143, 3189853, 3203383, 3186120, 3168288, 3141803, 3160094, 3193381, 3146654, 3172914, 3194596, 3185898, 3226108, 3272301, 3264947, 3259915, 3318912, 3352182, 3387450, 3445567, 3491323, 3528518, 3588750, 3688500, 3758174, 3777937, 3761178, 3706669, 3680557, 3600816, 3527726, 3524678, 3531158, 3560569, 3573316, 3559420, 3569775, 3561894, 3573479, 3524009, 3455842, 3466194, 3457995, 3457912, 3462756, 3488590, 3549368, 3617728, 3674474, 3736354, 3842445, 3912358, 3909898, 3931398, 3988035, 4074550, 4140507, 4199892, 4241136]
3472D241136L0234l120N855k7859N556k7551l6549o5081p4880l8665J5491m3006
3460C981561m299k32J6973N3813O5294O579j1497j7937K2078j3761j3068n42J9853
3447D104815L6331L7388N6055O6064N0827M4458k9488L66L1772Q4763J09870K0310
3435D613531j4484j2940j45673p7525j6307m1485j2194m804J2577o866p604L4318
3423D320544J1066K4328K5653l74m4390L731j2705Q314r1418j6647M8299J4218
3411D290619j11304r7550o1474r724q053p793k1375J0445L5472k3538J3471o962
3399D002234j8094J6840J4839Q4663J01166J45869J49901J51814J76564J02533
3389D928329J23157N1584Q6589K4707P535q6335n1831j05189r4059q2187q7698
$$ y = [4241136, 4271370, 4268250, 4274105, 4246246, 4251802, 4224251, 4187702, 4122621, 4047741, 4009076, 4024567, 3981561, 3977262, 3977030, 3994003, 4047816, 4113110, 4119689, 4108192, 4090255, 4112333, 4098572, 4085504, 4084962, 4104815, 4141146, 4178534, 4234589, 4300653, 4351480, 4395938, 4366450, 4366816, 4398588, 4483351, 4593221, 4613531, 4599047, 4586107, 4440434, 4362909, 4346602, 4305117, 4292923, 4288119, 4300696, 4293830, 4286226, 4320544, 4331610, 4355938, 4381591, 4381217, 4336827, 4340558, 4327853, 4336167, 4244749, 4228102, 4276401, 4290619, 4179315, 4081765, 4020291, 4010567, 4002514, 3994721, 3973346, 3983791, 4019263, 3995725, 4009196, 4002234, 3984140, 4000980, 4015819, 4100482, 4201648, 4347517, 4497418, 4649232, 4825796, 4928329, 5051486, 5103070, 5189659, 5214366, 5221901, 5135566, 5083735, 4978546, 4884487, 4802300, 4714602]
3378D714602o4533j24140j01745q3270k1909J0953M0156P3512m1571L2730J19328
3367D554113R5286J23334O2074Q3194J26401J18784J87517J20553J67701J35510
3357E774467Q0433P8713P6237j8876j06468j71798k34900k01568j19111j39299
3347E017830r8030l4036m7211m0538l7593n089l7113m7688J5197J0189l0623n112
3335D660183K453O5917J02517L3069O827J028n771O18J0428p2758p9705q5212
3323D639594n0714m9876Q577K2843L0731P779J4202j0642J3734k0574K0505M1437
3311D667596J2243M0228n570j3992l563j2835N6610j5009N2081q005n463j6576
3299D747745l1934L9572R0903M2733R4698J11472J54497J50551J20910J33439
$$ y = [4714602, 4650069, 4525929, 4424184, 4340914, 4319005, 4329958, 4370114, 4443626, 4402055, 4434785, 4554113, 4649399, 4772733, 4834807, 4918001, 5044402, 5163186, 5350703, 5471256, 5638957, 5774467, 5854900, 5933613, 6009850, 5990974, 5884506, 5712708, 5477808, 5276240, 5157129, 5017830, 4919800, 4885764, 4838553, 4798015, 4760422, 4755333, 4718220, 4670532, 4685729, 4695918, 4665295, 4660183, 4662636, 4728553, 4831070, 4864139, 4870966, 4871994, 4866223, 4866841, 4877269, 4804511, 4724806, 4639594, 4588880, 4539004, 4547581, 4570424, 4601155, 4608934, 4623136, 4612494, 4626228, 4605654, 4626159, 4667596, 4679839, 4720067, 4714497, 4700505, 4696942, 4684107, 4740717, 4725708, 4777789, 4769784, 4764321, 4747745, 4715811, 4755383, 4846286, 4889019, 4983717, 5095189, 5249686, 5400237, 5521147, 5654586]
3289E654586P7736J44524K48321J48531Q0180o9342n1511l5973p289l0563O1088
3278F220288P2953J13091J37455J71579J69135J79105J24800R5217N4476K5604
3268G363703N5448N8647L3365J16227J51747J19541K43945K91633L09251K06319
3258H949826M4188l34465m87414m25917k82384j53142j086K1872O3500O4748K9776
3247G489502p531o5325j572l5523q6283r1427j52437o3367n9601J0235L0997O0245
3235G027913P2802R0380M9398M7527q7841j85815j44057j50175j00410J7286n5864
3224F581144n7898j11600o9041o1478n8429l4015l1887q0872j9783l1147j7262
3213F007732k0567L9592k5998L6241O4368P3231R4109O4725K9752P1050M5192
$$ y = [5654586, 5732322, 5876846, 6125167, 6273698, 6353878, 6284536, 6233025, 6197052, 6189763, 6159200, 6220288, 6293241, 6406332, 6543787, 6715366, 6884501, 7063606, 7188406, 7283623, 7338099, 7363703, 7419151, 7477798, 7511163, 7627390, 7779137, 7898678, 8142623, 8434256, 8743507, 8949826, 8994014, 8659549, 8172135, 7746218, 7463834, 7310692, 7309606, 7331478, 7394978, 7459726, 7489502, 7481971, 7416646, 7415074, 7379551, 7293268, 7201841, 7049404, 6986037, 6926436, 6936671, 6967668, 7027913, 7100715, 7191095, 7240493, 7288020, 7200179, 7014364, 6870307, 6720132, 6619722, 6637008, 6581144, 6523246, 6411646, 6342605, 6281127, 6222698, 6188683, 6156796, 6075924, 6056141, 6024994, 6007732, 5987165, 6026757, 6000759, 6037000, 6101368, 6174599, 6268708, 6333433, 6363185, 6434235, 6479427]
3202F479427N498j7236P969n6072L966J4708N3019p990J06742L1917Q4604M3351
3190F749903R1714N6330J31076J02690J20415J50458J00651O0934J82860J52495
3180G899526J81199J48822K85141K51418L25574K82391K89206K39674K65253L07387
3170A0475591L31453K16667K23122J75433J77492Q4644O7398J22908J43456R8467
3160A2116631J61081J03932P8888O8636O9869J01244M6486l0386L431j8213n212
3149A2696387P0453M0461Q7552O1390J38888J21712K01615J56224J54779K17627
3139A3947088J36989J22046J03777J23078J53063J59470K53307K49343L93175
3130A5641336L82377M60063N20664N97828N67745O79979O44884Q28003P76818
$$ y = [6479427, 6484925, 6467689, 6475658, 6419586, 6423552, 6438260, 6491279, 6483289, 6590031, 6621948, 6706552, 6749903, 6841617, 6897947, 7029023, 7131713, 7252128, 7402586, 7503237, 7564171, 7747031, 7899526, 8080725, 8229547, 8514688, 8766106, 9091680, 9374071, 9663277, 9902951, 10168204, 10475591, 10807044, 11023711, 11246833, 11422266, 11599758, 11684402, 11751800, 11874708, 12018164, 12116631, 12277712, 12381644, 12460532, 12529168, 12599037, 12700281, 12746767, 12716381, 12719812, 12701599, 12696387, 12766840, 12807301, 12894853, 12956243, 13095131, 13216843, 13418458, 13574682, 13729461, 13947088, 14084077, 14206123, 14309900, 14432978, 14586041, 14745511, 14998818, 15248161, 15641336, 16023713, 16483776, 17004440, 17602268, 18170013, 18849992, 19494876, 20322879, 21099697]
3121B1099697Q20963O96687P69507P44106J030891J053768J281918J378876J690275
3112C0566688J648844K076877K184363K761544L082456M051561M578646N690817
3104E6641796O381323P675335Q554635J1018354J1765400J3864732J6253204K1194328
3096A53349107K4474260L3548331L4168437K7670664L229788m0755522n7161787
3089A78523278m3778697k6018458j7229043j0972097q176518n818039n307703
3082F1222723n095088n484651m725304m088633k906681k595287k154688k024623
3074C2147768j670141j728987j385687j440089j208708j168699r36949r67680
3066B1640828q08029q70475o42949n87196m28141m48328l90164n19019m25145
$$ y = [21099697, 21920660, 22617347, 23386854, 24130960, 25161851, 26215619, 27497537, 28876413, 30566688, 32215532, 34292409, 36476772, 39238316, 42320772, 46372333, 50950979, 56641796, 63023119, 70698454, 79253089, 90271443, 102036843, 115901575, 132154779, 153349107, 177823367, 211371698, 245540135, 273210799, 276440587, 235685065, 178523278, 134744581, 108726123, 91497080, 80524983, 72348465, 66530426, 61222723, 56127635, 50642984, 45917680, 41829047, 38922366, 36327079, 34172391, 32147768, 30477627, 28748640, 27362953, 25922864, 24714156, 23545457, 22608508, 21640828, 20832799, 19962324, 19319375, 18732179, 18304038, 17855710, 17465546, 16946527, 16521382]
3057A6521382m28036l62601m53726m40297m57701l47201l59027l63653l77287
3048A2931853k68265l34142k01316k11514j70397j65226j59879k07163j78955
3039A1034996j71478j67041k33745j73081j78208j04233q9130j50517p8978o3316
3029I625269j8346p1809J065M4103K9467J9339R2374J25327J84265J30074J35947
3018A0297075J35519K15088J35619K01536J83772J78149J38220J39232Q1051O5999
3008A1771260q801L942j05843j68623k72560k75607l90971l37553l10777k75496
2998I628971k82349k34784l11036k20612k44632k42829k11567k40366j87223j59558
2988G294015j60990j15061j18344o0765j19304n9639p7288k4478o3193K7660n3417
$$ y = [16521382, 16093346, 15730745, 15277019, 14836722, 14379021, 14031820, 13672793, 13309140, 12931853, 12663588, 12329446, 12128130, 11916616, 11746219, 11580993, 11421114, 11213951, 11034996, 10863518, 10696477, 10462732, 10289651, 10111443, 10007210, 9918080, 9767563, 9688585, 9625269, 9606923, 9535114, 9536179, 9580282, 9609749, 9629088, 9721462, 9846789, 10031054, 10161128, 10297075, 10432594, 10647682, 10783301, 10984837, 11168609, 11346758, 11484978, 11624210, 11705261, 11771260, 11762459, 11766401, 11660558, 11491935, 11219375, 10943768, 10552797, 10215244, 9904467, 9628971, 9346622, 9111838, 8800802, 8580190, 8335558, 8092729, 7881162, 7640796, 7453573, 7294015, 7133025, 7017964, 6899620, 6838855, 6719551, 6659912, 6582624, 6558146, 6494953, 6522613, 6469196]
2977F469196l7531p2990o9905o611k3412m3121j4758q6173j5153j2594J1146K782
2965F100876j9502q012K0745k6381K632m5719L1656l074o902j5120n2504p4145
2953E904550k2602m3602l2044l5531L2946o0731k2387L730j9450K3516N9670J0454
2941E798519l1374j1200N9547j4656L3350K4460O5153N1374K5195P5077J04998
2930F180443Q7638J13010J00076J51542J76556J57609J10955J41014J68562J77633
2920G565038L11364L86335M26427N06626N96454N99960O22704M12191K23536J79777
2910A1830412L58813N56986P45744J017087J265751J351487J179673M53893q50489
2901A7909357j907459k060397j583454j094511p81306n69231m74999l28486l23840
$$ y = [6469196, 6431665, 6358675, 6288770, 6282159, 6258747, 6215626, 6200868, 6114695, 6099542, 6086948, 6098094, 6100876, 6081374, 6073362, 6094107, 6067726, 6070358, 6024639, 6056295, 6053221, 6046319, 6031199, 5978695, 5904550, 5881948, 5838346, 5806302, 5770771, 5803717, 5742986, 5720599, 5724329, 5704879, 5728395, 5788065, 5798519, 5767145, 5755945, 5815492, 5800836, 5834186, 5858646, 5923799, 5975173, 6000368, 6075445, 6180443, 6268081, 6381091, 6481167, 6632709, 6809265, 6966874, 7077829, 7218843, 7387405, 7565038, 7876402, 8262737, 8689164, 9195790, 9792244, 10392204, 11014908, 11427099, 11650635, 11830412, 12189225, 12746211, 13491955, 14509042, 15774793, 17126280, 18305953, 18759846, 17909357, 16001898, 13941501, 12358047, 11263536, 10482230, 9912999, 9438000, 9109514, 8785674]
2892H785674k89083k80974j81336j50743r9436q0509n2481j9456n2463j9217r190
2881G550786j0158K8208M6207Q9089N9375L8772M5613J21150O0948P4391O0894
2870H165275R796Q9399O9961R816M2361L8146M3785L9113O9018O6877P5482M1056
2858H760085N4467O2976O9738N5256R1413N7804J38380N9781J19007J17646J20063
2847I706616J07004J60015J88270J72574J39565J23243J25344J42860J74383K28834
2837A1268708K08634K42116K67046L27632L70553L96712M06364L76081L82674
2828A4246520L20413K43995K08368J62481J48010J57495J58010J78301J65253
2819A5988846K30007K00244K44721K12619K53562K20228K10491K06918K02314
$$ y = [8785674, 8496591, 8215617, 8034281, 7883538, 7784102, 7703593, 7651112, 7631656, 7579193, 7559976, 7550786, 7540628, 7568836, 7615043, 7704132, 7763507, 7802279, 7847892, 7969042, 8029990, 8104381, 8165275, 8175071, 8264470, 8334431, 8344247, 8386608, 8424754, 8468539, 8507652, 8576670, 8643547, 8719029, 8760085, 8814552, 8877528, 8947266, 9002522, 9093935, 9151739, 9290119, 9349900, 9468907, 9586553, 9706616, 9813620, 9973635, 10161905, 10334479, 10474044, 10597287, 10722631, 10865491, 11039874, 11268708, 11477342, 11719458, 11986504, 12314136, 12684689, 13081401, 13487765, 13863846, 14246520, 14566933, 14810928, 15019296, 15181777, 15329787, 15487282, 15645292, 15823593, 15988846, 16218853, 16419097, 16663818, 16876437, 17129999, 17350227, 17560718, 17767636, 17969950]
2810A7969950K51157K37785K94296L02316K83906K69629K69119K35433K84524
2801B0398115K58389L06036K52545K69964K63925K66101K75637L17959K95923
2792B2904594L99414M47002M99845N20998O26292P31906P63830Q30784Q95434
2783B8620099J035288J172244J309510J399235J616258J825041J993768K150399
2775D1121842K286143K389948K393336K314068J966888J253066J70537j198718
2767E2697110k447011l321699l455197k995703k362948j728178j259772q96326
2759C4230276n81443n01893l40445j24898L00400O57983J126104J498990J888840
2750C8153914K356710K931186L359303L909091M722249N874141P128618Q591248
$$ y = [17969950, 18221107, 18458892, 18753188, 19055504, 19339410, 19609039, 19878158, 20113591, 20398115, 20656504, 20962540, 21215085, 21485049, 21748974, 22015075, 22290712, 22608671, 22904594, 23304008, 23751010, 24250855, 24771853, 25398145, 26130051, 26893881, 27724665, 28620099, 29655387, 30827631, 32137141, 33536376, 35152634, 36977675, 38971443, 41121842, 43407985, 45797933, 48191269, 50505337, 52472225, 53725291, 53895828, 52697110, 50250099, 46928400, 43473203, 40477500, 38114552, 36386374, 35126602, 34230276, 33648833, 33146940, 32806495, 32681597, 32981997, 33639980, 34766084, 36265074, 38153914, 40510624, 43441810, 46801113, 50710204, 55432453, 61306594, 68435212, 77026460]
2742G7026460Q331831N259825k166947j0714429j3625772j1207027p719264n402551
2734C9782126l764377k804488k272873k089573j962218j873313j659227j374691
2726B1981366j142456j019047r02023q06341p75169p00364o47960n85692n54731
2717A4847583m79131m55610l57459m14950l71432l29081k45775j93461k17881
2708A1782803j95490k17259j48574k05538k26624j98404k14017j61190k00660
2699A0015047k03826j40597j73652j25856j09086p9054p0674p3060p7643q3678
2689H877921r6913r7686m6600j23503p6763o6981m6220p8220j25589n4940l7935
2678H026571J3101J5697l1548O56J727P7498J49602J75652J26104R9172j0835
$$ y = [77026460, 85358291, 90618116, 88451169, 77736740, 64110968, 52903941, 45184677, 39782126, 36017749, 33213261, 30940388, 28850815, 26888597, 25015284, 23356057, 21981366, 20838910, 19819863, 18917840, 18111499, 17336330, 16635966, 15988006, 15402314, 14847583, 14368452, 13912842, 13555383, 13140433, 12769001, 12439920, 12194145, 12000684, 11782803, 11587313, 11370054, 11221480, 11015942, 10789318, 10590914, 10376897, 10215707, 10015047, 9811221, 9670624, 9496972, 9371116, 9262030, 9182976, 9112302, 9039242, 8961599, 8877921, 8781008, 8683322, 8636722, 8513219, 8436456, 8369475, 8323255, 8245035, 8119446, 8064506, 8026571, 8039672, 8055369, 8023821, 8024477, 8026204, 8103702, 8253304, 8428956, 8555060, 8654232, 8643397]
2667H643397q0907n0871O426L7913M3170P7709R8099R8796Q4428l927L1751j9400
2655H966584r9598j12417j82122k18481k22469k63352k85179k41902k10637j65766
2645F964661k21851j36773j01483j20159j02429j4792m7298r9388j75597j91029
2635E753862k02664j78847j42664j00945j13292q7415l7219r2485q5837l4259
2625D678235r8510o1604r3515k8200p7369n7418k4699r0274l7795q739p7200k7666
2613C995246l5814O960j0752j6472k3853K451m9674l4014m4698m542m2352l9002
2601C703484k2235m8235l6530j2007p828J3391N0691k024l2728k1652k4902k6799
2589C532626m958n6561l0866J6545m350j8186r226k1601l8440k463k1181m001
$$ y = [8643397, 8562490, 8511619, 8518045, 8555958, 8599128, 8676837, 8774936, 8873732, 8958160, 8954233, 8985984, 8966584, 8866986, 8754569, 8572447, 8353966, 8131497, 7868145, 7582966, 7341064, 7130427, 6964661, 6742810, 6606037, 6504554, 6384395, 6281966, 6267174, 6219876, 6120488, 5944891, 5753862, 5551198, 5372351, 5229687, 5128742, 5015450, 4928035, 4890816, 4798331, 4712494, 4678235, 4579725, 4518121, 4424606, 4396406, 4319037, 4261619, 4236920, 4146646, 4108851, 4100112, 4022912, 3995246, 3959432, 3966392, 3955640, 3939168, 3915315, 3917766, 3868092, 3834078, 3789380, 3784838, 3742486, 3703484, 3681249, 3633014, 3596484, 3584477, 3576649, 3590040, 3640731, 3638707, 3605979, 3584327, 3559425, 3532626, 3527668, 3471107, 3440241, 3456786, 3452436, 3434250, 3425024, 3403423, 3364983, 3362520, 3341339, 3337338]
2577C337338j6204j3894J8745q2206k6763k4710J2661k7539k7922J3181k2391
2566C140296P438M0301j0722L1913J8740L2976P4282L1595P2660Q4763M3299Q6452
2554C653993M4074M2082K439q967O461J531M2315L8636L8787R1718N7930K8043
2542D039042Q2277M8873j1474O8963M0397M1533Q464O8552J1277k9768L4753Q5388
2530D488277N5575J5981O4905L1948K4054K1028P7486O5608O2446O7208J02229
2519E076745Q3931O4377n7341j01140o8823m6953J3753M3905J3583L1846L7059
2508E090942N8939O7769P6950J07186P1517P5698J15353J46498J67535J54320
2498F132707J65021J84087K16848K62602J37239J67529J73050J09034J33219J77531
$$ y = [3337338, 3321134, 3307240, 3325985, 3243779, 3217016, 3192306, 3204967, 3177428, 3149506, 3162687, 3140296, 3147734, 3188035, 3177313, 3209226, 3227966, 3260942, 3335224, 3366819, 3439479, 3524242, 3567541, 3653993, 3698067, 3740149, 3742588, 3733621, 3740082, 3741613, 3783928, 3822564, 3861351, 3953069, 4010999, 4039042, 4121319, 4170192, 4158718, 4227681, 4268078, 4309611, 4318075, 4386627, 4397904, 4368136, 4402889, 4488277, 4543852, 4559833, 4624738, 4656686, 4680740, 4701768, 4779254, 4844862, 4907308, 4974516, 5076745, 5160676, 5225053, 5167712, 5066572, 4997749, 4950796, 4964549, 5008454, 5022037, 5053883, 5090942, 5149881, 5217650, 5294600, 5401786, 5473303, 5549001, 5664354, 5810852, 5978387, 6132707, 6297728, 6481815, 6698663, 6961265, 7098504, 7266033, 7439083, 7548117, 7681336, 7858867]
2488G858867J27648J59046J21531Q0926J18962R3557L7304N9531R2644N6391N6562
2477H862969Q5518P6166J78727K00668J51863J40808K00000K80836L42927L20943
2467A0841425L84166M11903L95023M20224L57702J98345J651j62456k79314k67654
2457A2301015j34260l2902P7791J75782K56654J98611J60859J22886J47776K41765
2447A3515977L26591L83394K73182J81775P4052k2022r3554j80634j70236j57220
2437A4131305q2143o4915k8136p6640r7026j36758k60745k84121l33416j93212
2427A2574193r5767k8832Q5766J68052K23704L05770L44280M25785M68110N46434
2417A5017495O09481P19341P62856P69799N52976K1530p39847j441202j647678
$$ y = [7858867, 7986515, 8145561, 8267092, 8348018, 8466980, 8560537, 8597841, 8657372, 8750016, 8806407, 8862969, 8948487, 9024653, 9203380, 9404048, 9555911, 9696719, 9896719, 10177555, 10520482, 10841425, 11225591, 11637494, 12032517, 12452741, 12810443, 13008788, 13010439, 12847983, 12568669, 12301015, 12166755, 12133853, 12211644, 12387426, 12644080, 12842691, 13003550, 13126436, 13274212, 13515977, 13842568, 14225962, 14499144, 14680919, 14754971, 14732949, 14639395, 14458761, 14288525, 14131305, 14049162, 13984247, 13956111, 13879471, 13782445, 13645687, 13384942, 13100821, 12767405, 12574193, 12478426, 12449594, 12535360, 12703412, 12927116, 13232886, 13577166, 14002951, 14471061, 15017495, 15626976, 16346317, 17109173, 17878972, 18431948, 18453478, 17713631, 16272429, 14624751]
2408A4624751j544981j226269r88321q05437n63820m86119l90758m47149l84763
2399G787134l69113l23857k74338k53581k06934k43073k08258j34217k02540k34831
2389E336392j76941j27829j78895j57386j01553p0314o7515j21391r7319m9336
2379D187913o8064n0438m3412n1600l4178o4612o1547n9737p3518o7630j01811
2368C511366o8931l6359o179l4652n1433j2596n5521n0366o2799p3878q2875j05274
2356B870503j25408r5105q2058q2755n5258p2463j4289l9680l4127o7805q5033
2345B116522q2524o2281o2854j6526n372l8144o7749m8754l4804m444l1894p1692
2333A589484n8825k0602K1080l8085q178K277k8626o2620n224k7414k7929m1515
$$ y = [14624751, 13079770, 11853501, 10865180, 10059743, 9495923, 9009804, 8619046, 8171897, 7787134, 7418021, 7094164, 6819826, 6566245, 6359311, 6116238, 5907980, 5773763, 5571223, 5336392, 5159451, 5031622, 4852727, 4695341, 4593788, 4523474, 4455959, 4334568, 4237249, 4187913, 4119849, 4069411, 4025999, 3974399, 3940221, 3875609, 3814062, 3754325, 3680807, 3613177, 3511366, 3442435, 3406076, 3399897, 3365245, 3313812, 3301216, 3245695, 3195329, 3132530, 3058652, 2975777, 2870503, 2745095, 2649990, 2567932, 2485177, 2429919, 2357456, 2343167, 2303487, 2269360, 2201555, 2116522, 2033998, 1971717, 1908863, 1892337, 1886965, 1848821, 1781072, 1732318, 1697514, 1693070, 1661176, 1589484, 1530659, 1510057, 1531137, 1493052, 1484874, 1487151, 1458525, 1395905, 1390681, 1363267, 1335338, 1293823]
2321A293823k8612k5313l5315k1688k275k5631k7049k4193K2374k2923J5157l1188
2309A087167m1890q058k1455k0622l0564j6743L1126j6995m9485j1557l8105m5762
2297H17057L3544O246j7670l3722l9412k0658M4167l5182m1645L4613k5900j1694
2285G09744m9962L1414O35o220P128k3344j5789P000j9575n3592L46m449j5954
2272E67382l054J7928K8467l7405k7443M794n20M4221o211j9038m3209q564K5915
2259E43263j1889k4240k1466J0537P094m3675L084k9495m067k5559K615K0735
2247D26937O011M4990m0525m4092m2393j812P763K0990j9210k2551M4052j6700
2235C63460m907Q064k1318k2601P511M509j1567L497J6181r576K6381j8245J0429
$$ y = [1293823, 1265211, 1239898, 1204583, 1182895, 1180620, 1154989, 1127940, 1103747, 1126121, 1103198, 1118355, 1087167, 1045277, 1037219, 1015764, 995142, 964578, 947835, 978961, 961966, 912481, 900924, 862819, 817057, 850601, 856847, 839177, 805455, 766043, 745385, 789552, 754370, 712725, 747338, 721438, 709744, 659782, 691196, 691831, 685611, 692739, 669395, 653606, 660606, 641031, 587439, 587785, 583336, 567382, 564328, 582256, 610723, 573318, 545875, 550669, 550149, 594370, 588159, 569121, 525912, 517348, 543263, 531374, 507134, 485668, 496205, 503299, 459624, 462708, 433213, 429146, 403587, 406202, 426937, 432948, 477938, 437413, 393321, 350928, 349116, 356879, 377869, 358659, 336108, 380160, 363460, 358553, 366617, 345299, 322698, 330209, 334718, 323151, 326648, 342829, 333253, 359634, 341389, 351818]
2222C51818J571l3890J3916J0094k3803L6903N5215o1269k1085K2704J8278j4620
2210C55832j304J2177l2916r6N9018m6262k3722k3838J8611J0457l474j1699j4442
2197B98342j3252J2378J795L7819j7611m5933L3039j2361J3287K382J5595j8374
2185C07106j4441Q915O790j8536K8267O517N909J8919l1622K756j480m0281j2175
2172B66644k396m6664L0798L2377k3351m0932L9157J4945K5374j3483k8337J3697
2160B67829J192j0395L3277R917l5325j6787k7418J1676P323K4554q971m1789
2148B15083j9084M724l7977O4298N933l5821K7904k8908l4574K1073L190o6085
2136A19756N2093l6649M3855K5676n3802J5174J5519Q17n2874l8731M6373j1057
$$ y = [351818, 353389, 319499, 333415, 343509, 319706, 356609, 411824, 350555, 329470, 352174, 370452, 355832, 354528, 366705, 333789, 333693, 392711, 346449, 322727, 298889, 317500, 327957, 324483, 312784, 298342, 285090, 297468, 299263, 337082, 319471, 273538, 306577, 294216, 307503, 309885, 325480, 307106, 292665, 301580, 308370, 289834, 318101, 324618, 330527, 349446, 317824, 320580, 319100, 278819, 266644, 264248, 217584, 248382, 280759, 257408, 216476, 255633, 270578, 295952, 282469, 254132, 267829, 269021, 258626, 291903, 301820, 266495, 249708, 222290, 233966, 241289, 265843, 256872, 215083, 195999, 200723, 162746, 227044, 232977, 197156, 225060, 196152, 161578, 182651, 185841, 119756, 171849, 135200, 179055, 204731, 150929, 166103, 181622, 182439, 129565, 90834, 137207, 126150]
2124A26150K9809j6415j3280j904j7741J8688Q46L0950j1800n7878J2239J8045
2112A17709l7802L9855j2863j3482K5663J680r272j2918k6949J689j2603L1032
2100I1739P061k120m718J2949K6237j7470o9296J2103K8939j6093J0920J5155
2088I5406K5312l2581j5789j6319P208J6205J4258k6810j1308N215l1339P550
2076C7008K7623K028k0928K080Q55p25j1990L2479L2925l4704q504J5877l2169
2063D1855K0060l52N113j7571j5661j0335K9658p580K4956l0772k0801L3349M092
2050E6011j3937j5934J6904L8082k7023q568K9553o946P016j8747n694j717L026
2037E2026J1940K068j7529O630L296k0322r466l1253J3568N9019n384k4107k8340
$$ y = [126150, 155959, 139544, 126264, 124360, 106619, 125307, 126153, 157103, 145303, 87425, 99664, 117709, 79907, 119762, 106899, 93417, 119080, 120760, 111488, 98570, 71621, 73310, 60707, 91739, 98800, 96680, 91962, 104911, 131148, 113678, 44382, 56485, 85424, 69331, 80251, 95406, 120718, 88137, 72348, 56029, 63237, 79442, 93700, 66890, 55582, 60797, 29458, 37008, 64631, 66659, 45731, 47811, 48666, 47941, 35951, 68430, 101355, 66651, 58147, 74024, 41855, 61915, 61563, 66676, 49105, 33444, 23109, 52767, 45187, 70143, 39371, 18570, 51919, 56011, 42074, 26140, 43044, 81126, 54103, 45535, 75088, 68142, 75158, 56411, 50717, 49000, 52026, 63966, 66034, 48505, 55135, 58431, 38109, 28643, -2610, 10958, 69977, 64593, 40486, 12146]
2024A2146n877K4531J1201J915K9594k4975m0123N5416L5871l4716j0475l4054
2012B0454N415L1970m393Q140J6416m458p955j0940J4439k2175M808L5841J0836
1999I8398R531m0711m688k4935L4425K7750j4204O75K8180o627R358K3485o529
1986A34108J1875N0657K9470m6299J1185J0113Q627n8608o8935r561o408K8150
1974I4374J7595o0325L350N381N6084J3637k7982j9606k901K2761r307j7675K9084
1961A04470l060k9510r411O115J7078N893j1943K323k558k9720j4852j5271N8070
1948G7624L860p001R306o076k1300j5728K6870l1352L9883q215p288j4421o111
1935D0051R290K8836k3802k7093K6137J8773l5094J7359K4898L0229R664k3536
$$ y = [12146, 6269, 30800, 42001, 43916, 73510, 48535, 8412, 63828, 99699, 64983, 54508, 20454, 25869, 57839, 53446, 61586, 78002, 73544, 65589, 54649, 69088, 46913, 51721, 87562, 98398, 107929, 67218, 62530, 37595, 72020, 99770, 85566, 86241, 114421, 107794, 117152, 140637, 134108, 145983, 196640, 226110, 179811, 190996, 201109, 209736, 151128, 82193, 72632, 66224, 94374, 111969, 51644, 54994, 60375, 116459, 130096, 102114, 82508, 79607, 102368, 93061, 75386, 104470, 101410, 71900, 62489, 68604, 85682, 91575, 79632, 81955, 79397, 49677, 34825, 19554, 77624, 81484, 74483, 83789, 77713, 56413, 40685, 67555, 36203, 76086, 67871, 60583, 46162, 40051, 49341, 78177, 54375, 27282, 53419, 72192, 37098, 54457, 79355, 109584, 119248, 95712]
1923I5712l100m1824K401J9024j5804L3993M57k6070J2624K5080j2056K1435j2468
1910I9404l1692N609k3091Q873r662L4042K6327j1048n944L0896l86j9962K838
1897A06204J9445j7736L8139o045L781m2752k4053q628L6476k6565O98q62J7204
1884I5306O614n475J8662J1636J376J4985L655n620j3179M7488O350p909L3298
1871B07187k3133Q270l1360j8266M6854j8839o517n335j3093J6687l6021L1146
1859A57580j824l4682K0593o802L1836L8334m2126J6312K7571K282K658k9439
1847A82293J8555j2049k5993O9811k2274l0106L4697j9672J5102p387Q346j4266
1835A97057O4913j660J2197l77j1068O942Q486M5206r882L9074K8410j8437K6184
$$ y = [95712, 92612, 50788, 53189, 72213, 56409, 90402, 90859, 64789, 77413, 102493, 90437, 111872, 99404, 67712, 73321, 50230, 59103, 49441, 83483, 109810, 98762, 92818, 123714, 123328, 103366, 106204, 125649, 107913, 146052, 140007, 143788, 101036, 76983, 68355, 104831, 78266, 78964, 78102, 95306, 101920, 96445, 115107, 126743, 128119, 143104, 146759, 141139, 127960, 175448, 181798, 173889, 207187, 184054, 192324, 160964, 142698, 189552, 170713, 164196, 158861, 145768, 162455, 126434, 157580, 155756, 121074, 141667, 134865, 166701, 205035, 162909, 179221, 206792, 209074, 211732, 182293, 200848, 188799, 162806, 232617, 210343, 180237, 214934, 195262, 210364, 202977, 211323, 197057, 261970, 260310, 272507, 272130, 261062, 268004, 276490, 321696, 311814, 350888, 379298, 360861, 387045]
1822C87045O3659K9136J0870m100J248N6419J4228j2740K3163O0171L2296j9931
1810F41464j9540K6627N6935l0223K4103L1105K9313r150J7753k2262J9587J805
1798G67517p226J3666p438M031N7183n1386M3811L4814K2997J8955M6667J8031
1786I61622M827K1533N2417J6694R069L941N0207P4280Q5755M6356K8251K9376
1774A384328R3819O5651P6220O3164J34042O4081Q0880J19604J14417J04838K03748
1763B504792J99099J88025K13984K39442K85820L11379M17275N09032N21253N59874
1753E949975N23552O11751P92002J174730J314808J504209J778483K269764K680112
1744A8599386L423363M241507L755382J535646l568530o422882n600447l368294
$$ y = [387045, 450704, 479840, 490710, 486610, 487858, 544277, 558505, 545765, 568928, 629099, 661395, 641464, 621924, 648551, 705486, 675263, 699366, 730471, 759784, 750634, 768387, 746125, 765712, 767517, 760291, 773957, 766519, 770550, 827733, 776347, 820158, 854972, 877969, 896924, 943591, 961622, 966449, 987982, 1040399, 1057093, 1066162, 1070103, 1120310, 1194590, 1280345, 1326701, 1354952, 1384328, 1478147, 1543798, 1620018, 1683182, 1817224, 1881305, 1962185, 2081789, 2196206, 2301044, 2504792, 2703891, 2891916, 3105900, 3345342, 3631162, 3942541, 4359816, 4868848, 5390101, 5949975, 6473527, 7085278, 7877280, 9052010, 10366818, 11871027, 13649510, 15919274, 18599386, 22022749, 26264256, 30019638, 31555284, 27986754, 21563872, 15963425, 12595131]
1736A2595131k160462j405127j089033p73555n56010m70025m68732l98878l67105
1727D906204l23004l54429m32608l12582k54067k13465j94750j83011j68541j44484
1717B325263j26326j43483j00504p5838q7714m5858n3976j8280n0633o3386o1862
1706A497403r5955p1838j4733n9578l6668q4389r2129q840n3654l5228j8838k7886
1694H97667l5792p922J0329m7972L2113k1409o0618n2503P346q9465o899K9742
1682F54617j166m1902n4646k6212k156k7649J1376J026l7200k2321J8047P286
1670D79100K47k8744j2296l0227K6570j449j5975l5417K870Q127n898j2751l0858
1657C43299m1738K0346k1276Q100j2043l0654K6765p010l9914l972J3485L7301
$$ y = [12595131, 10434669, 9029542, 7940509, 7166954, 6610944, 6140919, 5672187, 5273309, 4906204, 4583200, 4228771, 3796163, 3483581, 3229514, 3016049, 2821299, 2638288, 2469747, 2325263, 2198937, 2055454, 1954950, 1879112, 1791398, 1745540, 1691564, 1673284, 1622651, 1559265, 1497403, 1401448, 1329610, 1314877, 1255299, 1218631, 1134242, 1042113, 1033273, 979619, 944391, 925553, 897667, 861875, 853953, 864282, 816310, 848423, 827014, 766396, 713893, 721239, 631774, 624875, 654617, 653451, 611549, 556903, 530691, 528535, 500886, 512262, 513288, 476088, 453767, 471814, 479100, 479347, 450603, 438307, 408080, 434650, 433201, 417226, 381809, 384679, 392806, 386908, 374157, 343299, 301561, 321907, 300631, 308731, 296688, 266034, 292799, 285789, 245875, 241903, 255388, 292689]
1645B92689l2741l5544L0841N605r622j8108M098k5409k9918k267N2877j6997
1633B15504p313k9013L6792r43k9876k7672m47K5237k8943m8970K5704L1428l8818
1620A22670O715l0411r63L1369l8840k3916O497M6689j0750m335L7310j4206j2568
1607A15261j3006j5835j3402o921K258L423J1501O557k2881L9950K2558Q361k5101
1594A12723l6993L9994L1513j6427j9205j5790n07m5861P964J5310L0075J667
1582A04463l4698N127j2489K4480n7186L7942M7520o170k7020l1161O392n905
1570E1295K0501O511n678L0655m6409l3494L6504m7005J9852J7471p511j4758
1558B7934R497L142k8497P646M0837j5751R74J5337r07m2374K9800j8611k3099
$$ y = [292689, 259948, 224404, 255245, 260850, 251228, 233120, 237218, 211809, 181891, 179624, 232501, 215504, 208191, 179178, 215970, 215027, 185151, 157479, 157032, 182269, 153326, 104356, 130060, 161488, 122670, 129385, 98974, 98011, 129380, 90540, 66624, 73121, 119810, 109060, 104725, 142035, 127829, 115261, 102255, 86420, 73018, 66097, 68355, 71778, 83279, 89836, 66955, 106905, 129463, 137824, 112723, 75730, 115724, 147237, 130810, 111605, 95815, 95308, 49447, 57411, 72721, 102796, 104463, 69765, 74892, 62403, 86883, 29697, 67639, 115159, 108989, 81969, 50808, 57200, 51295, 71796, 78307, 72629, 103284, 56875, 23381, 59885, 12880, 32732, 50203, 42692, 27934, 37431, 40573, 12076, 19722, 60559, 44808, 45782, 61119, 60212, 17838, 47638, 29027, 5928]
1545E928O7742r593P016J6375j0305o0532r251J7021m462M413P014j0613n801
1532A4952l300N704L7428m2644N819J2006k380K7014j6010l6843j6971L3840k4951
1519f336N8896M7683m2587p744K4303k8963L9218o5886J0672k5319K7919Q11J5001
1506D7668L9076k0632n81L4956K4289K8190K4073K4600J3257m3532k9381j9958
1494A22025k4785J1117j4290j7649N509k0978l7905L6237q559j696r856k2309
1482A6861L3830r178m1949n630L3944k5399J8965p409L4195j0916O003k8723J591
1469A6185L541J0779k7676m66J6599O754k5750j3713K406K614j0411K7984J1621
1456B0467j8281L4344k3209k8168N2620M024j8413q323K6940k0415P457K1837
$$ y = [5928, 73670, 64077, 71093, 87468, 77163, 16631, 7380, 24401, 19939, 24352, 31366, 20753, 14952, 11652, 17356, 54784, 12140, 17959, 29965, 27585, 54599, 38589, 1746, -15225, 18615, -6336, 52560, 100243, 57656, 49912, 74215, 45252, 84470, 18584, 29256, 3937, 31856, 32667, 47668, 86744, 66112, 65531, 100487, 124776, 152966, 177039, 201639, 214896, 171364, 141983, 122025, 97240, 108357, 94067, 76418, 81927, 60949, 23044, 59281, 50722, 49026, 39170, 16861, 50691, 41513, -436, -6066, 27878, 2479, 21444, 14035, 48230, 37314, 43317, 14594, 16185, 19726, 30505, 2829, 2363, 18962, 25716, -34, -13747, -11341, -8727, -19138, 8846, 20467, 2186, 36530, 13321, -14847, 37773, 41797, 23384, 15061, 42001, 21586, 29043, 50880]
1444E0880l1222P386m5709K2244j3317k3088K4443K3000j2079k5939n412P694
1432b1119n89M154K1482N343q941j81K1425M805J56k4088k8525J6708J2277J7963
1418B0870O741K212L047k1812N136k496j9048k7362L414M061M3173K821k0603
1405A54L5756j0477j0262J2264j8382k6045R28J6362k4413j1122j5019L2726J5580
1392a950n349M9877l9655p514J2275k7857K0792L707k0696l718K6823O453J1776
1379B4964J2986J3607o5270K3815r662n139J7590Q537j3582k532j74O137j5391
1366d114J3511J9935m0317k0943j4241j7507K0295n174K1726L7600l7054J1353
1354a4930L702o768j922K6843l6655J2400J5077J9506j784M1341l6279j54R129
$$ y = [50880, 19658, 27044, -18665, 3579, -9738, -32826, -8383, 14617, 2538, -23401, -28813, -21119, -21708, -17554, 3928, 9271, 330, 149, 21574, 26379, 26535, 2447, -26078, -9370, 2907, 20870, 27611, 29823, 32870, 11058, 16194, 13698, -5350, -32712, -29298, -25237, 17936, 20757, 154, 35910, 25433, 15171, 27435, 9053, -16992, -16064, 298, -24115, -35237, -50256, -17530, -1950, -7299, 42578, 2923, -4591, 7684, -20173, 619, 4326, -16370, -20088, 6735, 13188, 24964, 37950, 51557, -13713, 10102, 440, -4699, 12891, 21428, 7846, 5314, 5140, 11277, -4114, 9397, 29332, -10985, -31928, -46169, -63676, -43381, -48555, -26829, 10771, -26283, -14930, -11228, -17996, -19918, 6925, -29730, -17330, -2253, 17253, 15469, 56810, 20531, 20377, 29506]
1341B9506k7129l683o875J6127K838m0362j7042j590N9768M658j7427M287N558
1328H634L1313l8077J8972K5286l6409j5555r069J2635J3J2336j3032M343m8880
1315d7490n468l995K7817J5416L7676l039l0262L128K9702n1140K136M0569q823
1302F227K3243k3933j3503j0651J4676n294J0638K731K1455l4895k5024J0535
1290b3795M7548L908l6106l975K3806m3569J4018q2l888k0359k9170J5308P8593
1277B2237j0962k2051r028L759k663m839N223k2193J6473K0410Q075k2227K884
1264a4902R943L516j3421K4135J5133J2292k197j8312l944m1354j0864M7722J6979
1251B4726k991j2130j5019J0796j2210n341k2331J015R471N7995J4551m4181l7968
$$ y = [29506, 2377, -1306, -8181, 7946, 10784, -29578, -46620, -48210, 11558, 16216, -1211, 3076, 8634, 39947, 1870, 20842, 46128, 9719, -5836, -14905, -2270, -2257, 10079, -2953, 1390, -47490, -52958, -56953, -29136, -13720, 23956, 20917, -9345, -6217, 23485, -27655, -25519, 15050, 6227, 29470, 5537, -7966, -18617, -3941, -9235, 1403, 4134, 25589, -9306, -34330, -23795, 23753, 27661, -8445, -12420, 11386, -32183, -18165, -18247, -22135, -42494, -71664, -56356, 22237, 11275, -10776, -19804, -16045, -18708, -23547, -18324, -40517, -24044, -3634, 4441, -17786, -14902, -4959, -1443, -14864, 9271, 24404, 36696, 34499, 16187, 12243, -29111, -39975, 7747, 24726, 21735, 9605, -5414, 5382, -6828, -12169, -34500, -33485, -24014, 33981, 48532, 4351, -33617]
1238c3617J6575L8209j1748k3371j4886J5529K3889r392o692L750k3217J9832
1226e139K3205k1055j5321k9150J9711K2386j3887M73K2245J2787j6662J1636
1214A1229J7578J3731j7476j7284l7133N9877p540J33j7276l3099M0641R65k3569
1201i223k3568j483L317J2056K2483l9023O152j2133O238R105J6743l265K966
1188i635K0182l1372R301K9465j2710J0038j2068K0000k2972k610j2834j0696
1176b5911K6698R598O000m7831j9800M6930m531J4928m854n502M2892m7887L650
1163e620j2307j601R606K632n70N3481j622n1482j9081M2272k849l3465j7910
1150c8516J3785l5981K9975J4166L6097m4393j4941L5516K6552j6167L652j0010
$$ y = [-33617, -17042, 21167, 9419, -13952, -28838, -13309, 10580, 1188, -5504, -1754, -24971, -5139, 18066, -2989, -18310, -47460, -27749, -5363, -19250, -18777, 3468, 16255, -407, 11229, 28807, 42538, 25062, 7778, -29355, 30522, 22982, 23115, 5839, -27260, 13381, 14346, -9223, -32791, -34274, -30957, -18901, 3582, -35441, -29289, -41422, -35184, -26079, -9336, -12601, -9635, 10547, -20825, -11524, 17941, 5231, 15269, 3201, 23201, 229, -2381, -15215, -25911, 787, 10385, 16385, -31446, -51246, -4316, -8847, 6081, 1227, -4275, 38617, -9270, -5620, -17927, -19528, -9922, -7290, -7860, 45621, 43999, -7483, -26564, 15708, 12859, -20606, -38516, -24731, -60712, -30737, -16571, 19526, -24867, -39808, -4292, 22260, 6093, 9745, -265]
1138b65m098j2633p884m395J8640n968n648L2663k3083m5111k7535L1142M3300
1125a0875J495K5432j1530J8199J3683j3030j1475o6770P207L6615o685j826k462
1112b2022L4891O986j3182m0222j7781J9348j8181J9829k079L6937J0777M0800
1100E6101j3164j4552l8734K3577l4367J72j8821K7765j082J8249J8217L245l3869
1087g263L203J3890J0275K6310k8255n288q335P269k6946o303N970J0995K3386
1074A8908R271k9153k1549K021K4634j2085K418j4271L203L2188K3517k9808j1805
1061b511k1366j9190L5451K2935L0788j3265j3779l9095J3224m707O595j0527
1049a5447k7057N212N575J8374J2592j11p923Q761K177J3669k83j3015o99j8451
$$ y = [-265, -4363, -16996, -24880, -29275, -10635, -16603, -22251, 10412, -12671, -57782, -85317, -54175, -10875, -9380, 16052, 4522, 22721, 36404, 23374, 11899, -54871, -47664, -11049, -17734, -19560, -22022, 12869, 19855, 6673, -33549, -51330, -31982, -50163, -30334, -32413, 4524, 15301, 56101, 42937, 28385, -10349, 13228, -21139, -20967, -39788, -12023, -13105, 5144, 23361, 26606, -7263, -4060, 9830, 20105, 46415, 18160, 12872, 4537, 11806, -15140, -21443, -15473, -4478, 18908, 28179, -974, -22523, -20502, 4132, -7953, -5535, -19806, -16603, 15585, 39102, 9294, -2511, -23877, -43067, -7616, 15319, 46107, 32842, 19063, -20032, -6808, -11515, -4920, -15447, -42504, -37292, -31717, -13343, -751, -862, -8785, -24, 2153, 15822, 15539, 2524, 1825, -16626]
1035a6626m267L753k3370J1642Q675J4140J024L8705R279j6211j771l4098k8614
1022c7739J1069N740K9020P698k0293j8730l2527J7317J8691k3581J7350N776
1010b0209K0542J5086q772O037j6266k8795J4073k9347R01N374J1386L3458l6407
997c2939L0287q842j0744Q878k830j4758l160j3649L7891k0891K8568K4914k0449
984B276m0899l4848L0457O2878m0547J9998N7322n031m3100n979l381j7194j1680
971b9728J0565L870M7370r586o0645L6680r615L1346m2479k002J1835m326k0609
958c7324j4651N6352J5461j1266K5422n426m5243R57J2972j0618J8135j9031K6796
945A2536K616M3090l8067l4600M5900L014m8464K0436j9292k697K388O113k3765
$$ y = [-16626, -20893, -17140, -40510, -28868, -20193, -6053, -5029, 33676, 42955, 26744, 24973, -9125, -37739, -26670, -20930, 8090, 15788, -4505, -23235, -55762, -38445, -19754, -43335, -25985, -20209, 333, 15419, 6647, 12684, -3582, -32377, -18304, -47651, -46750, -41376, -29990, 3468, -32939, -2652, -11494, -22238, -13360, -16190, -30948, -34108, -47757, -9866, -30757, -2189, 22725, 2276, -38623, -73471, -43014, 19864, -20683, -685, 56637, 51606, 8506, 2527, -854, -18048, -29728, -19163, -15293, 32077, 22491, -38154, -1474, -11089, 20257, -22222, -24224, -12389, -16715, -37324, -51975, 4377, 19838, 8572, 33994, 28568, -16675, -15718, -2746, -13364, 4771, -14260, 12536, 15152, 58242, 20175, -14425, 31475, 34489, -13975, 6461, -12831, -15528, -13140, -7027, -30792]
932c0792L7599m8794M0185L53r127N4143n785n8765o246K4503K137K8532j0505
919A7438O6N81K0213k2120K0386l38m6164q526p113j4851Q513J9711o740J7283
905a661K7662k7131R171K3183P977n2633M94l488J9678j0406r560l298K5307J4042
891A9337p446n72K1413M749k5895j7293K6029k3122n983J9659k3244j0520N158
878a7730J9930L4120k3036n7663J3524j0695L1798K2619k5815J3146r067L9689
866C0820K0511j06j6690K4469K0574j5863m7292l0295o01M237J5970M4723k5954
853B4503l2720j7866K7364K3825N601r98J4955J1711k305l1707l6161L5542k191
840A9553n0754k3429K9272J6980K02R334J4415l1525J5748q650k0836k4760q744
$$ y = [-30792, 6807, -41987, -1802, -1449, -10576, 43567, 37782, -20983, -27229, -2726, -589, 27943, 17438, 17504, 18085, 38298, 16178, 36564, 36226, -9938, -18464, -25577, -40428, -31915, -12204, -18944, -1661, 26001, -1130, 8041, 31224, 39201, -13432, -12938, -16426, 3252, -7154, -16714, -20012, 5295, 19337, 11891, 11319, 32732, 37481, 11586, -5707, 20322, -2800, -8783, 10876, -12368, -22888, -17730, 2200, 36320, 13284, -44379, -30855, -41550, -9752, 12867, -12948, 198, -8869, 30820, 51331, 51225, 34535, 59004, 79578, 63715, 16423, -13872, -14473, -10236, 5734, 50457, 24503, -8217, -26083, 1281, 25106, 30707, 29709, 44664, 56375, 54070, 22363, -13798, 21744, 19553, -31201, -54630, -25358, -8378, -8176, 1158, 15573, -15952, -204, -8854, -29690, -54450, -63194]
827f3194K2226Q424Q258j5812N3634r530L518j5672J770K4765j7819k2861J2354
814i939P345N031r023J213n307j1585N0627k703N008l1418L4410j7947l000k0443
800g731K1641K8254k9038L675j3816m071r151j7788m3617N3680M5086n6013Q87
787b8002J1643j2104p833k1883J1062L3273J8814N8344j3912m647k5137r255l337
774G026o981L877J2234j9159j0427M6428m4481r359L8468k5814k9642L1350k1948
761b8428L1781J4040j2896K1017j1660R045l7977J3908M695N267J3087k2505L236
748B610Q834J0119k8186J2599K001o151q159L0113n652r282J6143j6420J1462
735B0031j0878L793k4732k7351L595J682J7107p507J5070K7676N328J3771l1476
$$ y = [-63194, -40968, -32544, -24286, -40098, 13536, 4006, 7524, -8148, -6378, 18387, 568, -22293, -9939, -2594, 2437, -6586, -5373, -10680, -22265, 28362, 25659, 30667, -751, 33659, 15712, 12712, -7731, 13910, 42164, 13126, 16801, 2985, -1086, -10237, -28025, -71642, -17962, 27124, -28889, -28002, -16359, -28463, -36296, -58179, -47117, -13844, 4970, 63314, 49402, 44755, 19618, 10363, 7026, 45, 3922, 16156, -3003, -13430, 32998, -11483, -20842, 17626, -8188, -37830, -6480, -28428, 3353, 17393, 4497, 25514, 13854, 22899, -15078, -1170, 3525, 8792, 21879, -626, 2610, 11444, 21563, -6623, 5976, 7977, 1826, -6333, 23780, 18128, 8846, 24989, 8569, 20031, 9153, 12946, -11786, -39137, -35542, -33860, -16753, -24260, -9190, 18486, 23814, 37585, 6109]
722F109j1780K4703N084l7569r265L7553k4251j7012J1309j105r224P476l725
709b1697K9982J6235k4702p473j6786K466K8716p775m0805K2666K1854j2263j6325
696b5907L4976N767J3692j0474o144j2640r419K1661k8356k236M0944Q057q292
683B1629R02O988J9287k1111j5370O920J7485l3797j0382l723n02L1286m3436
670b3824R492n815M60l8958j6668L7752M4383K1651k7470O139M705m0446J2669
657a5930L8369k2853L0893R982K852o488l4415L9590k5300L4327N609m2562l006
644A1068J9468j0927k3558J177j0123J1313K3606L8168n1662k9438j5852R17N168
631c0675L4518k2042J2919l120R469K3837L1693o5910l260L261q242k1520j4912
$$ y = [6109, -5671, 19032, 24116, -13453, -22718, 14835, -9416, -26428, -15119, -16224, -25448, -17972, -21697, 8285, 24520, -182, -7655, -24441, -21975, 6741, -1034, -41839, -19173, 2681, -9582, -25907, 9069, 14836, 28528, 18054, 11910, -730, -10149, 11512, -16844, -19080, 21864, 29921, 21629, 22531, 29519, 48806, 27695, 12325, 19245, 36730, 2933, -7449, -11172, -11674, 19612, -23824, -14332, -20147, -19687, -58645, -75313, -37561, 6822, 28473, 1003, 7142, 11847, -28599, -15930, 22439, -414, 30479, 40461, 43313, 36825, 2410, 42000, 16700, 51027, 56636, 14074, 11068, 30536, 19609, -3949, -2772, -12895, -1582, 22024, 60192, 8530, -20908, -36760, -35843, -30675, 3843, -18199, -5280, -8400, 1069, 24906, 56599, -9311, -12571, -9310, -17552, -39072, -53984]
618e3984L7918J8211J3943M8027k0400m5078K4057Q736N965l9118j7204J2283
606f644J7545k5602M949k704L535n464k3866P426K9140k414L0717J7380l4830
593I168J2021L2348l9985k1264l035K6607L867J1617l4496k2953L5047K8291r245
580B7988p8647O872M3849l0537K5162j1876l300L2289L7923l170j3801o929l0923
567e100O2276m2026R860m0911L4999j2599K5410M5880k8571o359j0675o945N744
554C0983K225m594l9331k9147J7473J2875L1770j1468j8324Q690J6569p564q402
541A755l8000o42O2607j1607m4309N391J0792j4479J0481J9371k885Q200K5956
528C2631L1199l6842j1247L380m6283M9295J3031k9662J7705k1883N5265l7382
$$ y = [-53984, -16066, 2145, 16088, 64115, 43715, -1363, 22694, 31430, 37395, -1723, -18927, -6644, 10901, -14701, -9752, -12456, -8921, -14385, -38251, -30825, -1685, -4099, 26618, 43998, 9168, 21189, 53537, 13552, -7712, -10747, 15860, 19727, 31344, -3152, -26105, 8942, 37233, 27988, -50659, -43787, 62, -30475, -5313, -17189, -20489, 11800, 49723, 46553, 32752, 25823, -5100, 57176, 15150, 25010, -15901, 19098, 6499, 31909, 77789, 49218, 42859, 32184, 25239, 30983, 33208, 28614, -10717, -39864, -22391, -9516, 22254, 10786, -7538, 1152, 17721, 10157, 1755, -36245, -36887, 25720, 14113, -30196, -24805, -14013, -28492, -18011, 1360, -1525, 6675, 32631, 63830, 26988, 15741, 19121, -27162, 22133, 35164, 5502, 23207, 1324, 56589, 19207]
516A9207K1148k7626J9491K0093j7999l1784N375j7452l305K6487q194J897j9106
503a1768K5802l121R22K487r52j2196Q815o468n841M0494k7719K3372J5743k2129
489B7441j6777K9236m900k6614K3344J7995k9912k7946J8606r186J8367m016l1533
476a5895L9486J3611N427m584l4074K1416k7140M210j0870L757M801n152J1720
463F713K0499k5251j3903L5081J408J5462k9048r99J9672K8198l9170P739l369
450B3032n285l264j3475p317j5871P2511j2792l7760K5420M2325m8500Q523l2670
437e123M321L7489n563o0889L5741M7188m1114l9028L423O388J6371Q813l3691
424b5674K4057k0414k7631O0605j4628R644M606K7020J5238l2175p763R609J9512
$$ y = [19207, 40355, 12729, 32220, 52313, 34314, 2530, 7905, -9547, -12852, 13635, 5441, 7338, -11768, 14034, 10913, 11835, 14322, 13370, 1174, 9989, 3521, -2320, 38174, 10455, 33827, 49570, 27441, 10664, 39900, 35000, 8386, 31730, 49725, 19813, -8133, 10473, 1287, 19654, 15638, -15895, 23591, 37202, 42629, 38045, 3971, 25387, -1753, 2457, -8413, -4656, 145, -5007, 6713, 27212, 1961, -11942, 23139, 24547, 40009, 10961, 9962, 29634, 57832, 18662, 26401, 23032, 17747, 14483, 1008, -6309, -22180, 50331, 37539, -221, 25199, 67524, 19024, 27547, -5123, -802, 36687, 31124, -29765, 5976, 53164, 12050, -26978, -23555, -17167, -796, 8017, -25674, -1617, -22031, -49662, 10943, -3685, 5959, 10565, 37585, 52823, 20648, 12885, 22494, 42006]
411D2006J89M8346o5825l5908q508Q797L3105K2014p945j6952J0915L500Q581
398D2315k9243k6012Q438L3383J6887j8657K0837j3044N773p992m4502j1082n523
385b8422m623J1579J911N2234p441k3516K4519l2043J0676n48J8245q084N99m126
371A0960k9826N244n469K6594L0915N227N200o061J4796j7271k3302m5097J1598
358a6492K9314K729J3354K5196k923n6500j8204K6345j8679n940M6201J7740j6635
345B5506J9104m3981k2504K1016K4575j6196N045L2881m3731j0032K3118k166
333A2635j8516n557j2204J2885R618j8926j0411J9410j7599J5983p353K23R656
320a0156K6743k434O053n7074m385M0513M414k996N4939k752l9959K0906j1025
$$ y = [42006, 42195, 90541, 24716, -11192, -19700, -10903, 22202, 44216, 36271, 19319, 30234, 33734, 42315, 13072, -12940, -4502, 28881, 45768, 27111, 47948, 34904, 40677, 32685, -11817, -22899, -28422, -33045, -21466, -19555, 32679, 25238, 1722, 26241, -5802, 4874, 4326, 22571, 14487, 15086, 10960, -18866, -13622, -19091, 7503, 38418, 43645, 48845, 42784, 57580, 40309, 17007, -28090, -16492, 12822, 15551, 28905, 54101, 51178, -5322, -23526, 2819, -15860, -21800, 24401, 42141, 25506, 44610, 629, -21875, -859, 23716, 7520, 12565, 45446, 1715, -8317, 14801, 12635, -5881, -11438, -23642, -10757, -1139, -20065, -30476, -11066, -28665, -12682, -20035, -19812, -10156, 16587, 14153, 20206, -36868, -41253, -740, 3674, 678, 55617, 52865, 12906, 33812, 22787]
307B2787r339k4873K2282O216k2495J6563J2251q287M192J6931j665j5444l2886
294a3767L8495M700J0167j6580j5403k1746K074N1774J0153L659l7446l1799q823
281b4542P5762R010Q133k7986m2613p001R683k0857M0463m877j0892j4840j4057
268b4614K4223k1296O4406l7617o4903M5154J733j1410N9602j9342l7475M5422
256B3883k2159J2076J1887k6496m519M5779o518m9319j8627K8192L1652k3279
244B552R434j521J7934j3322J3681Q058l3441n754J6884P580J2187J9148L24K337
230E6081j6745j527j9023k9625O533K1932k3716j3446L868k660R433j4496J8224
217e167j8687j4067L3578m0829K6625L5494m1854K405R91L388J3519P863l9806
$$ y = [22787, 13448, -11425, 10857, 17073, -5422, 11141, 23392, 15105, 19297, 36228, 34563, 19119, -13767, 24728, 29428, 39595, 23015, 7612, -14134, -12060, 39714, 49867, 53526, 16080, -15719, -24542, 51220, 60230, 68363, 40377, -2236, -9237, 446, -20411, 20052, 15175, 4283, -10557, -24614, -391, -21687, 42719, 5102, -59801, -14647, -12914, -24324, 35278, 15936, -21539, 23883, 1724, 13800, 25687, -809, -5328, 40451, 33933, -15386, -34013, -5821, 25831, 2552, 11986, 10465, 28399, 15077, 28758, 36816, 3375, -2379, 14505, 22085, 34272, 53420, 53744, 56081, 39336, 37809, 18786, -10839, -4306, 17626, -6090, -19536, -15668, -18328, -8895, -23391, -5167, -23854, -37921, -4343, -45172, -18547, 16947, -24907, -22502, -21511, -18123, -4604, 3259, -36547]
204c6547M106L6936m678J0055O228k6021j4610J266J5990j2298n894L5760k581
191G712j8705K8518J608R147k0896j6681J2023N743k1578j6354K8683m467Q861
178C614J4383m3945P719N514K2119m724r125J6644j01K0374L328k3575l2347J8160
164a962J8291M167n705j7940O50n907K2712J5663n0126J352J7745j3260R058k2194
150b7456L749J4021j6835L0939l7679r35L613J1827K267J9220o184k5516K5079
137c890O702R662N820j9536j6571j561J51L5301M180j0195k1758L129O429l0984
123c3121J4825K3220r711k6495J6347J4401n181k1838J5494j3934j5614L1165
111a0442J3630l2644J0170j8722J9363k7518J0190j1149m3363L5800K0173j0868
$$ y = [-36547, -32441, 4495, -183, 9872, 16100, -9921, -24531, -23265, -7275, -19573, -25467, 10293, 7712, -10993, 17525, 19133, 28280, 7384, -9297, 2726, 8469, -13109, -29463, -780, -5247, 3614, 17997, -25948, -18229, -12715, 9404, 4680, -4445, 12199, 12098, 32472, 35800, 12225, -20122, -1962, 16329, 20496, 14791, -3149, -2499, -8406, 14306, 29969, -20157, -18805, -1060, -14320, -5262, -27456, -23707, -9686, -26521, 4418, -33261, -34196, -30583, -18756, -16489, 2731, -3453, -28969, -3890, 2812, 12474, 18294, -1242, -17813, -19374, -19223, 16078, 20258, 10063, -11695, -8566, -2137, -33121, -18296, 4924, -4787, -31282, -14935, -534, -5715, -27553, -12059, -25993, -41607, -10442, 3188, -29456, -19286, -38008, -18645, -46163, -35973, -47122, -90485, -54685, -34512, -45380]
99d5380R688k893K3515j0076l0966K4359K444J1741k799J2335j0044j5666Q717
86b5025J5894n786j8962J876p969J5923P936l9852K4518J2404p365r822p826l052
72d7108l454m319J2639j172K6221K191P082j0030r581j204J1329l7396j981K4183
58c2600J5404r379P391o614j5830J6488k2049j1071p587K8269j5228j3926K0192
45d6540k2709k0337M2532M736m595k433j7472L2689J2123j6393l2902K1479K1259
32b8563j6192K3170J6328l7901r795j032j7442k2964L0578j592j6488J3588R385
19e8920n272M464N399R073j1967J210R168l1074R903K5375r782M007k412O300
5d4528r946l4409K0965K8763k8077
$$ y = [-45380, -35692, -38585, -15070, -25146, -56112, -31753, -29309, -17568, -20367, -8032, -18076, -33742, -25025, -9131, -14917, -33879, -32003, -39972, -24049, -16113, -55965, -31447, -19043, -26408, -36230, -44056, -47108, -50562, -54881, -42242, -43414, -17193, -15002, -7920, -17950, -27531, -28735, -17406, -54802, -56783, -32600, -17196, -26575, -19184, -25798, -41628, -25140, -47189, -58260, -65847, -37578, -52806, -66732, -46540, -69249, -89586, -47054, -42318, -46913, -49346, -66818, -34129, -22006, -38399, -71301, -49822, -28563, -44755, -21585, -5257, -43158, -52953, -53985, -71427, -94391, -63813, -65405, -81893, -68305, -58920, -64192, -59728, -54329, -45256, -57223, -56013, -46845, -77919, -68016, -42641, -52423, -48416, -50828, -44528, -54474, -88883, -67918, -39155, -67232]
0f7232
$$ y = [-67232]
$$ Imaginary data points
##PAGE= N=2
##DATA TABLE= (X++(I..I)), XYDATA
16383g20333R742j2934L42J0741q947J005P973K8513Q493L6770k351m45J8331
16370f23100q083k7820L1438K9841J8847J958J0752J616J9031K896j2282J6101
16358e38805Q459N159K5830j3766j0402K6314L2979N539j5081k8447K1767K6776
16346d53678M5568k0750P751j0607j6398M3409J7721K2884k7515K6870J164J614
16334c61967L5718O463j1599M415J1412k9064j0050K9960K4040J7637P221J8317
16322b57497k9365M584J3549K90L0325j539J3696K0181K2390l0850m437J4411
16310b04262K4005J255K3644J3202M502J817J5320J682j8093P399j8428K1196
16298a26761J0508K9489J2360K537J8159R721n645K9983m439J3447k5431N581
$$ y = [-720333, -710591, -723525, -723183, -712442, -721389, -720384, -712411, -683898, -675405, -638635, -640986, -641431, -623100, -631183, -659003, -627565, -597724, -578877, -576919, -566167, -564551, -545520, -542624, -554906, -538805, -530346, -525187, -499357, -513123, -523525, -497211, -464232, -458693, -473774, -502221, -480454, -453678, -408110, -428860, -421109, -431716, -448114, -404705, -386984, -364100, -391615, -364745, -363581, -361967, -326249, -319786, -331385, -326970, -315558, -344622, -354672, -324712, -300672, -283035, -275814, -257497, -286862, -282278, -268729, -268439, -238114, -239653, -225957, -205776, -183386, -214236, -218673, -204262, -180257, -179002, -155358, -142156, -137654, -135837, -120517, -118835, -136928, -129529, -147957, -126761, -116253, -86764, -74404, -71867, -53708, -43987, -49632, -19649, -24088, -10641, -36072, -30491]
16286c0491Q677K8383j4991J7577K1273j2306J6256k645M979J0581j2121K5178
16274F0350K0874N553k9174k78K1965m83j7401N692Q444J1881K2749j629J5095
16261A23638N710l4448L5283M9311j5188Q551q03R644j2361M407K4739N451K80
16248B04214J1382J6789j0266j6436O587J2760J3725q241j5362K3937j149k1033
16236B16907r91m616Q284J1621q349L8237J0615j0880n723M229l595K1410j2173
16223B64976j8301N7823L5004K438k8205L0899j0282o523j2139l617N79K4254
16211C36906J9737k4952J5378J9722l9149q321J3395L6313P030m6736k9907N355
16199C04771K8315J9170M299L6673J5572k6206J1210k5016k492n450M5966O572
$$ y = [-30491, -21814, 6569, -8422, 9155, 30428, 18122, 34378, 31733, 36712, 47293, 35172, 60350, 81224, 86777, 57603, 57325, 79290, 78807, 61406, 67098, 75542, 87423, 110172, 108543, 123638, 129348, 94900, 130183, 179494, 164306, 172857, 172054, 181698, 169337, 173744, 198483, 203934, 204214, 215596, 232385, 222119, 205683, 212270, 225030, 238755, 230514, 215152, 239089, 237940, 216907, 215916, 211300, 219584, 231205, 222856, 261093, 271708, 260828, 255105, 259334, 255739, 277149, 264976, 246675, 304498, 339502, 341940, 313735, 344634, 334352, 327829, 315690, 312073, 312652, 336906, 356643, 331691, 347069, 366791, 327642, 319321, 332716, 369029, 376059, 329323, 299416, 304771, 333086, 352256, 356555, 393228, 408800, 382594, 393804, 368788, 366296, 360846, 406812, 413384]
16187D13384J3934k6162l5123O1970j205R855n782j4016L7008N947m8624K7999
16175D39185J6293j0424n192K2484o455K50J635l2897j6382J0831J7124j5167
16163D21285K0446O6488l6048K752o345j3253r863L1548J6096k4743l2588K0640
16151D56415N422P890j181l5691Q954j6297J5831q682P3486j619j3563j777R839
16138D99027K7534k4689L4752P72l709l784n148O866l1696j9072l08n763O231
16125D81013O303K6290q030q853J9017K7608l2641j0720L5396j6778m2988k2736
$$ y = [413384, 427318, 401156, 366033, 428003, 426798, 436653, 430871, 416855, 453863, 459810, 411186, 439185, 455478, 445054, 439862, 462346, 455891, 456141, 457776, 424879, 408497, 419328, 436452, 421285, 441731, 508219, 472171, 474923, 468578, 455325, 445462, 477010, 493106, 468363, 435775, 456415, 461837, 469727, 468546, 432855, 441809, 425512, 441343, 432661, 506147, 504528, 490965, 489188, 499027, 526561, 501872, 536624, 537396, 533687, 529903, 524755, 531621, 499925, 480853, 480545, 474782, 481013, 487316, 513606, 505576, 496723, 515740, 543348, 510707, 499987, 535383, 518605, 475617, 452881]
$$ [...]
##END NTUPLES=NMR SPECTRUM
##END=
