##TITLE=1H_CG-1152-3
 CDCl3, 8 sc, 
 24.08.2021
##JCAMPDX= 6.0         $$ Bruker NMR JCAMP-DX V2.0
##DATA TYPE= NMR SPECTRUM
##DATA CLASS= NTUPLES
##ORIGIN= UXNMR, Bruker Analytische Messtechnik GmbH
##OWNER= root
$$ XWIN-NMR		Version 3.5
$$ Tue Aug 24 11:34:34 2021 Russian Standard Time (UT+4h)  she@DPX200
##.OBSERVE FREQUENCY= 200.131506
##.OBSERVE NUCLEUS= ^1H
##.ACQUISITION MODE= SIMULTANEOUS
##.ACQUISITION SCHEME= undefined
##.AVERAGES= 8
##.DIGITISER RES= 18
##SPECTROMETER/DATA SYSTEM= spect
##.PULSE SEQUENCE= zg30
##.SOLVENT NAME= D2O
##.SHIFT REFERENCE= (INTERNAL, D2O, 0, 17.5264)
##AUDIT TRAIL= $$ (NUMBER, WHEN, WHO, WHERE, WHAT)
$$ ##TITLE= Audit trail, XWIN-NMR		Version 3.5
$$ ##JCAMPDX= 5.01
$$ ##ORIGIN= Bruker BioSpin GmbH
$$ ##OWNER= she
$$ F:/spectra/data/she/nmr/H-F/1/pdata/1/auditp.txt
$$ ##AUDIT TRAIL=  $$ (NUMBER, WHEN, WHO, WHERE, WHAT)
(   1,<2021-08-24 11:33:18.48 +0400>,<she>,<DPX200>,
      <created by zg, POWCHK disabled, PULCHK disabled
       configuration hash MD5:
       00 E9 B6 7A A2 85 ED C7 34 08 36 98 17 FE 4E 26
       data hash MD5: 16K
       8F D7 43 EE 9A C5 A0 73 1C 1C D7 7F A2 EF EC 99>)
(   2,<2021-08-24 11:33:21.84 +0400>,<she>,<DPX200>,
      <Start of raw data processing
       efp BC_mod = 2 LB = 0.24 FT_mod = 6 PKNL = 1 PHC0 = -13358.57 PHC1 = 16.401 SI = 16K 
       data hash MD5: 16K
       97 AF FB 6A B0 B1 97 D1 A8 D1 05 35 CA 7F 1E 1D>)
(   3,<2021-08-24 11:33:45.68 +0400>,<she>,<DPX200>,
      <pk PHC0 = -156.7777 PHC1 = -2.6 
       data hash MD5: 16K
       85 AC FF 4C 78 82 48 C0 C4 08 67 72 DB 6B 20 FE>)
(   4,<2021-08-24 11:33:49.12 +0400>,<she>,<DPX200>,
      <abs ABSG = 5 
       data hash MD5: 16K
       8A 8D 28 EF 41 C9 CF 37 F6 E0 2C 69 20 83 03 28>)
$$ ##END=
$$ 
$$ hash MD5
$$ 08 CE 1F 35 44 9B FE 9C 47 5B 35 CA 93 D2 D0 F2
##$RELAX= 
##$RELAX= 
##$RELAX= 
##$RELAX= 
##$RELAX= 
##$RELAX= 
$$ Bruker specific parameters
$$ --------------------------
##$DU= <F:/spectra>
##$EXPNO= 1
##$NAME= <H-F>
##$PROCNO= 1
##$TYPE= <nmr>
##$USER= <she>
##$AMP= (0..31)
100 100 100 100 100 100 100 100 100 100 100 100 100 100 100 100 100 100 
100 100 100 100 100 100 100 100 100 100 100 100 100 100 
##$AQSEQ= 0
##$AQ_mod= 1
##$AUNM= <au_zg>
##$AUTOPOS= <>
##$BF1= 200.13
##$BF2= 200.13
##$BF3= 200.13
##$BF4= 200.13
##$BF5= 200.13
##$BF6= 200.13
##$BF7= 200.13
##$BF8= 200.13
##$BYTORDA= 1
##$CFDGTYP= 0
##$CFRGTYP= 5
##$CHEMSTR= <none>
##$CNST= (0..31)
1 1 145 1 1 1 1 1 1 1 1 1 1 1 1 1 1 1 1 1 1 1 1 1 1 1 1 1 1 1 1 1 
##$CPDPRG= <>
##$CPDPRG1= <>
##$CPDPRG2= <>
##$CPDPRG3= <>
##$CPDPRG4= <mlev>
##$CPDPRG5= <mlev>
##$CPDPRG6= <mlev>
##$CPDPRG7= <mlev>
##$CPDPRG8= <mlev>
##$CPDPRGB= <>
##$CPDPRGT= <>
##$D= (0..31)
0 1.2 0 0 0 0 0 0 0 0.06 0 0.03 0 0 0 0 0.0002 0 0 0 0 0 0 0 0 0 0 0 0 
0 0 0 
##$DATE= 1629790397
##$DBL= (0..7)
120 120 120 120 120 120 120 120 
##$DBP= (0..7)
150 150 150 150 150 150 150 150 
##$DBP07= 0
##$DBPNAM0= <>
##$DBPNAM1= <>
##$DBPNAM2= <>
##$DBPNAM3= <>
##$DBPNAM4= <>
##$DBPNAM5= <>
$$ [...]
##$SUBNAM3= <"">
##$SUBNAM4= <"">
##$SUBNAM5= <"">
##$SUBNAM6= <"">
##$SUBNAM7= <"">
##$SUBNAM8= <"">
##$SUBNAM9= <"">
##$SW= 20.0188882624521
##$SWIBOX= (0..15)
0 0 2 0 0 0 0 0 0 0 0 0 0 0 0 0 
##$SW_h= 4006.41025641026
##$TD= 16384
##$TD0= 1
##$TE= 0
##$TE2= 300
##$TE3= 300
##$TEG= 300
##$TL= (0..7)
0 120 120 120 120 120 120 120 
##$TP= (0..7)
150 150 150 150 150 150 150 150 
##$TP07= 0
##$TPNAME0= <>
##$TPNAME1= <>
##$TPNAME2= <>
##$TPNAME3= <>
##$TPNAME4= <>
##$TPNAME5= <>
##$TPNAME6= <>
##$TPNAME7= <>
##$TPOAL= (0..7)
0.5 0.5 0.5 0.5 0.5 0.5 0.5 0.5 
##$TPOFFS= (0..7)
0 0 0 0 0 0 0 0 
##$TUNHIN= 0
##$TUNHOUT= 0
##$TUNXOUT= 0
##$USERA1= <user>
##$USERA2= <user>
##$USERA3= <user>
##$USERA4= <user>
##$USERA5= <user>
##$V9= 5
##$VALIST= <valist>
##$VCLIST= <CCCCCCCCCCCCCCC>
##$VD= 0
##$VDLIST= <DDDDDDDDDDDDDDD>
##$VPLIST= <PPPPPPPPPPPPPPP>
##$VTLIST= <TTTTTTTTTTTTTTT>
##$WBST= 1024
##$WBSW= 4
##$XGAIN= (0..3)
0 0 0 0 
##$XL= 0
##$YL= 0
##$YMAX_a= 387591
##$YMIN_a= -336288
##$ZGOPTNS= <>
##$ZL1= 120
##$ZL2= 120
##$ZL3= 120
##$ZL4= 120
##$ABSF1= 17.52032
##$ABSF2= -2.498718
##$ABSG= 5
##$ABSL= 3
##$ALPHA= 0
##$AQORDER= 0
##$ASSFAC= 0
##$ASSFACI= 0
##$ASSFACX= 0
##$ASSWID= 0
##$AUNMP= <proc_1d>
##$AZFE= 0.1
##$AZFW= 0.1
##$BCFW= 0
##$BC_mod= 2
##$BYTORDP= 0
##$COROFFS= 0
##$CY= -3
##$DATMOD= 1
##$DC= 0
##$DFILT= <>
##$DTYPP= 0
##$F1P= 0
##$F2P= 0
##$FCOR= 1
##$FTSIZE= 16384
##$FT_mod= 6
##$GAMMA= 0
##$GB= 0
##$INTBC= 1
##$INTSCL= 1.334414e-10
##$ISEN= 128
##$LB= 0.24
##$LEV0= 0
##$LPBIN= 0
##$MAXI= 10000
##$MC2= 0
##$MEAN= 0
##$ME_mod= 0
##$MI= 1.114404
##$NCOEF= 0
##$NC_proc= -6
##$NLEV= 6
##$NOISF1= 3.799351
##$NOISF2= 2.8
##$NSP= 0
##$NTH_PI= 0
##$NZP= 0
##$OFFSET= 17.52643
##$PC= 1
##$PHC0= -13515.35
##$PHC1= 13.801
##$PH_mod= 1
##$PKNL= yes
##$PPARMOD= 0
##$PSCAL= 0
##$PSIGN= 0
##$REVERSE= no
##$SF= 200.130001639937
##$SI= 16384
##$SIGF1= 3
##$SIGF2= 2
##$SINO= 5.538805
##$SIOLD= 16384
##$SREGLST= <1H.CDCl3>
##$SSB= 0
##$STSI= 16384
##$STSR= 0
##$SW_p= 4006.41025641026
##$SYMM= 0
##$S_DEV= 0
##$TDeff= 16384
##$TDoff= 0
##$TI= <>
##$TILT= no
##$TM1= 0
##$TM2= 0
##$TOPLEV= 0
##$USERP1= <user>
##$USERP2= <user>
##$USERP3= <user>
##$USERP4= <user>
##$USERP5= <user>
##$WDW= 1
##$XDIM= 16384
##$YMAX_p= 364105645
##$YMIN_p= -225666
$$ End of Bruker specific parameters
$$ ---------------------------------
##NTUPLES= NMR SPECTRUM
##VAR_NAME=  FREQUENCY,     SPECTRUM/REAL,   SPECTRUM/IMAG
##SYMBOL=    X,             R,               I
##VAR_TYPE=  INDEPENDENT,   DEPENDENT,       DEPENDENT
##VAR_FORM=  AFFN,          ASDF,            ASDF
##VAR_DIM=   16384,         16384,           16384
##UNITS=     HZ,            ARBITRARY UNITS, ARBITRARY UNITS
##FACTOR=    0.24454680195387, 1,            1
##FIRST=     3507.56449066012, 0,            0
##LAST=      -498.845765750141, 0,           0
##MIN=       -498.845765750141, -225666,     0
##MAX=       3507.56449066012, 364105645,    0
$$ Real data points
##PAGE= N=1
##DATA TABLE= (X++(R..R)), XYDATA
$$ [...]
$$ plain form
6510 1373009 1474208 1618897 1729942 1678595 1725650 1740884 1636354 1645085 1633451 1492980 1446395
6499 1446395 1337268 1179156 1078495 1027411 959755 914761 938605 856911 857834 913232 943224
6488 943224 876817 841354 808474 796665 725873 787490 616175 638751 581422 540734 505123
6477 505123 552780 453698 506697 401476 469804 406717 435368 483000 378165 480214 468313
6466 468313 395218 439016 452847 430858 513970 434312 465798 403168 466992 474051 379754 388455
6454 388455 377720 333562 351689 323706 385353 359332 316760 325093 297753 370452 361366 321388
6442 321388 432214 394379 398367 382499 367682 383018 424871 414026 398530 370771 394235 391720
6430 391720 383583 340214 371647 345762 312701 353807 348607 335988 383062 336086 380950 334040
$$ packed form
6510A373009J01199J44689J11045n1347M7055J5234j04530Q731j1634j40471m6585
6499A446395j09127j58112j00661n1084o7656m4994K3844q1694R23N5398K9992
6488I43224o6407l5463l2880j1809p0792O1617j71315K2576n7329m0688l5611
6477E05123M7657r9082N2999j05221O8328o3087K8651M7632j04835J02049j1901
6466D68313p3095M3798J3831k1989Q3112p9658L1486o2630O3824P059r4297Q701
6454C88455j0735m4158J8127k7983O1647k6021m2572Q333k7340P2699r086l9978
6442C21388J10826l7835L988j5868j4817J5336M1853j0845j5496k7759K3464k515
6430C91720q137m3369L1433k5885l3061M1106n200j2619M7074m6976M4864m6910
$$ plain form
6418 334040 341050 333817 318372 314146 356101 319708 427310 344148 404982 443604 437491 427128
6406 427128 463024 449854 515194 448924 542447 541309 458574 602922 464714 473514 458609 395549
6394 395549 387949 395849 371911 423863 345035 433303 369583 390926 453214 434856 417664 416750
6382 416750 460978 472731 445177 439057 372100 334270 349196 280851 257417 247158 202326 184336
6370 184336 226656 168751 146968 219925 124569 191569 157935 131657 187979 170326 210468 170934
6358 170934 134238 212067 173178 163495 226074 188314 190333 214964 185244 192328 165829 184445
6346 184445 199750 195615 194467 221587 171060 272269 264989 295030 289940 299484 294303 373426 289755
6333 289755 369789 275611 369056 372133 344481 435666 389770 416437 489442 483137 550127 545026
$$ packed form
6418C34040P010p233j5445m226M1955l6393J07602q3162O0834L8622o113j0363
6406D27128L5896j3170O5340o6270R3523j138q2735J44348j38208Q800j4905o3060
6394C95549p600P900k3938N1952p8828Q8268o3720K1343O2288j8358j7192r14
6382D16750M4228J1753k7554o120o6957l7830J4926o8345k3434j0259m4832j7990
6370A84336M2320n7905k1783P2957r5356O7000l3634k6278N6322j7653M0142l9534
6358A70934l6696P7829l8889r683O2579l7760K019K4631k9720P084k6499J8616
6346A84445J5305m135j148K7120n0527J01209p280L0041n090R544n181P9123q3671
6333B89755Q0034r4178R3445L077k7652R1185m5896K6667P3005o305O6990n101
$$ plain form
6321 545026 557452 668714 656440 805335 759652 839963 878953 1004960 1062495 1166092 1168453
6310 1168453 1217040 1181235 1180876 1131460 1182299 1145730 1145715 1091069 1083272 1056840 951051 873585
6298 873585 768013 677592 667679 550810 490891 450930 310059 424432 359125 318407 340885
6287 340885 251888 258549 301382 204029 246046 267300 229483 234656 227754 253746 211396 242303
6275 242303 312813 248050 207587 294189 196874 207976 241829 179535 227714 257091 264491 271319
6263 271319 306714 359340 316095 344649 422732 371951 457847 476677 458045 492373 502210 537896
6251 537896 513204 546519 523758 466122 502153 452725 412762 382869 392307 343049 325689 308778
6239 308778 291448 274121 319761 249655 269300 176620 224505 202440 146588 187911 116558 132869
$$ packed form
6321E45026J2426J11262j2274J48895m5683Q0311L8990J26007N7535J03597K361
6310A168453M8587l5805l59m9416N0839l6569j5n4646p797k6432j05789p7466
6298H73585j05572r0421r913j16869n9919l9961j40871J14373o5307m0718K2478
6287C40885q8997O661M2833r7353M2017K1254l7817N173o902K5992m2350L0907
6275B42303P0510o4763m0463Q6602r7315J1102L3853o2294M8179K9377P400O828
6263B71319L5395N2626m3245K8554P8083n0781Q5896J8830j8632L4328R837L5686
6251E37896k4692L3315k2761n7636L6031m9428l9963k9893R438m9258j7360j6911
6239C08778j7330j7327M5640p0106J9645r2680M7885k2065n5852M1323p1353J6311
$$ plain form
6227 132869 192784 120579 156754 88946 66973 93293 25845 111543 87650 101027 116068 56967
6215 56967 102498 85126 50475 86516 61953 78784 42666 44643 62985 55263 68018 60007
6203 60007 47857 98567 32976 56726 -2071 104084 53772 47797 49473 -2969 -12685 72197
6191 72197 20195 36986 3365 -2868 3083 42727 -2886 7200 20417 73913 11720 24539
6179 24539 100702 34715 79310 55046 -16801 58425 37903 40054 48033 46456 69635 -57570
6167 -57570 41982 53959 32898 75062 -29384 -3704 141637 6243 73310 36568 66436
6156 66436 79601 32838 61551 17508 40983 34931 -32085 47823 8076 -31090 74234 14313
6144 14313 51615 10484 5410 51584 11058 90189 -16589 -23753 10228 -7276 -5008 -10672
$$ packed form
6227A32869N9915p2205L6175o7808k1973K6320o7448Q5698k3893J3377J5041n9101
6215E6967M5531j7372l4651L6041k4563J6831l6118J977J8342p722J2755q011
6203F0007j2150N0710o5591K3750n8797J06155n0312n975J676n2442r716Q4882
6191G2197n2002J6791l3621o233N951L9644m5613J0086J3217N3496o2193J2819
6179B4539P6163o5987M4595k4264p1847P5226k0522K151P979j577K3179j27205
6167e7570R9552J1977k1061M2164j04446K5680J45341j35394O7067l6742K9868
6156F6436J3165m6763K8713m4043K3475o052o7016P9908l9747l9166J05324n9921
6144A4313L7302m1131n074M6174m0526P9131j06778p164L3981j7504K268n664
$$ plain form
6132 -10672 -2475 86639 2567 61032 50144 35874 124617 84825 134339 99226 79528 146137
6120 146137 130232 114929 141553 104031 199556 87690 137424 181812 141006 193420 191755 159360
6108 159360 143826 146359 187084 245029 266830 292801 229012 283359 287342 387938 382690 397983
6096 397983 401893 449143 461404 525723 562475 614210 628954 667988 636717 599283 605595 538804
6084 538804 474151 488692 402005 352151 351175 318969 279424 237246 259611 206931 209769 282560
6072 282560 170484 176568 205728 94530 175395 105335 174274 102453 123991 176808 52299
6061 52299 116422 219587 60865 194184 132288 111832 159083 86655 116522 76731 109083
6050 109083 77706 112929 183511 152777 84128 101619 36369 73817 59468 82844 49893 17911
$$ packed form
6132a0672Q197Q9114q4072N8465j0888j4270Q8743l9792M9514l5113j9698O6609
6120A46137j5905j5303K6624l7522R5525j11866M9734M4388m0806N2414j665l2395
6108A59360j5534K533M0725N7945K1801K5971o3789N4347L983J00596n248J5293
6096C97983L910M7250J2261O4319L6752N1735J4744L9034l1271l7434O312o6791
6084E38804o4653J4541q6687m9854r76l2206l9545m2178K2365n2680K838P2791
6072B82560j12076O084K9160j11198Q0865p0060O8939p1821K1538N2817j24509
6061E2299O4123J03165j58722J33319o1896k0456M7251p2428K9867l9791L2352
6050A09083l1377L5223P0582l0734o8649J7491o5250L7448j4349K3376l2951l1982
$$ plain form
6038 17911 66666 50056 71692 46052 -26000 6657 -9357 -22544 23385 -14133 10265 -32764
6026 -32764 -30027 20774 -37632 36578 -5755 6507 5850 -5911 33930 6587 -81013 22556
6014 22556 -71016 -50897 -13796 -56635 17014 -35619 3588 -9876 -54606 225 -66373 -78147
6002 -78147 68364 -86065 -672 53249 -27636 -14433 -19606 -68294 -75910 -30749 14376 -82127
5990 -82127 48370 18050 -105365 32637 19666 -63157 34414 14243 10292 -12929 60030
5979 60030 -7247 15010 51251 -33224 -4691 76979 -20352 6784 33629 -3969 -40689 -39931
5967 -39931 -58475 -32807 14891 -12837 -56605 -8422 -19007 -23339 33076 -23565 -32692 -5032
5955 -5032 9238 12224 -21066 -19193 -25550 9952 39685 -51741 15456 10043 -53797 369 19741
$$ packed form
6038A7911M8755j6610K1636k5640p2052L2657j6014j3187M5929l7518K4398m3029
6026c2764K737N0801n8406P4210m2333J2262o57j1761L9841k7343q7600J03569
6014B2556r3572K0119L7101m2839P3649n2633L9207j3464m4730N4831o6598j1774
6002g8147J46511j54429Q5393N3921q0885J3203n173m8688p616M5161M5125r6503
5990h2127J30497l0320j23415J38002j2971q2823R7571k0171l951k3221P2959
5979F0030o7277K2257L6241q4475K8533Q1670r7331K7136K6845l7598l6720P58
5967c9931j8544K5668M7698k7728m3768M8183j0585m332N6415n6641r127K7660
5955e032J4270K986l3290J873o357L5502K9733r1426O7197n413o3840N4166J9372
$$ plain form
5942 19741 -2608 58873 22211 15622 24676 26121 45034 54053 31354 19799 13897 94981 15934
5929 15934 28337 14898 -38559 48521 15618 4879 31537 -21356 37231 4160 8936 98010
5917 98010 43112 39548 58674 -1312 73820 9846 24622 45072 24597 11738 49224 -8022
5905 -8022 44823 4640 45933 17853 4831 136800 78540 90237 152805 84678 63872 107955
5893 107955 27671 84992 20000 135700 24627 58415 78025 34563 99666 99407 64679 108313
5881 108313 136858 157068 146655 108572 208319 86474 126050 53703 85206 81098 42979 97989
5869 97989 107921 75638 160004 80136 17713 104310 64720 89453 111463 150876 143947 185926
5857 185926 171570 105053 135437 216938 149589 114781 218710 131624 154104 128333 156131
$$ packed form
5942A9741k2349O1481l6662o589R054J445J8913R019k2699j1555n902Q1084p9047
5929A5934J2403j3439n3457Q7080l2903j0739K6658n2893N8587l3071M776Q9074
5917I8010n4898l564J9126n9986P5132o3974J4776K0450k0475j2859L7486n7246
5905h022N2845m0183M1293k8080j3022J31969n8260J1697O2568o8127k0806M4083
5893A07955q0284N7321o4992J15700j11073L3788J9610m3462O5103k59l4728M3634
5881A08313K8545K0210j0413l8083R9747j21845L9576p2347L1503m108l8119N5010
5869I7989R932l2283Q4366p9868o2423Q6597l9590K4733K2010L9413o929M1979
5857A85926j4356o6517L0384Q1501o7349l4808J03929q7086K2480k5771K7798
$$ plain form
5846 156131 118277 145490 176458 114444 129888 161596 99052 134674 164745 130768 182464 153320
5834 153320 169616 100444 174646 119397 69951 157478 138223 164771 163359 154579 134179 94442
5822 94442 121542 88520 52683 152754 109482 135733 141731 92470 140941 173160 176250 111958
5810 111958 161539 175060 145327 153862 157682 103488 154628 168131 81822 111775 152429 138357
5798 138357 141683 224935 164171 131343 127874 143670 87620 146356 179817 90230 127442 144237
5786 144237 145657 183031 211888 60347 123427 136064 110848 57887 170743 77188 88450
5775 88450 112466 152737 87017 157902 138760 135213 206861 178727 122674 204246 197534 138525
5763 138525 135644 150517 136978 127066 205968 135575 122971 187419 186925 198776 188823 155153 208408
$$ packed form
5846A56131l7854K7213L0968o2014J5444L1708o2544L5622L0071l3977N1696k9144
5834A53320J6296o9172P4202n5249m9446Q7527j9255K6548j412q780k0400l9737
5822I4442K7100l3022l5837J00071m3272K6251N998m9261M8471L2219L090o4292
5810A11958M9581J3521k9733Q535L820n4194N1140J3503q6309K9953M0654j4072
5798A38357L326Q3252o0764l2828l469J5796n6050N8736L3461q9587L7212J6795
5786A44237J420L7374K8857j51541O3080J2637k5216n2961J12856r3555J1262
5775H8450K4016M0271o5720P0885j9142l547P1648k8134n6053Q1572o712n9009
5763A38525k881J4873j3539r912P8902p0393j2604O4448m94J1851r953l3670N3255
$$ plain form
5750 208408 187801 184686 181349 131958 192268 175019 152677 197068 109376 141585 210671 175072
5738 175072 185058 208020 191648 225188 253160 276045 236092 227101 263777 187783 249142 223279
5726 223279 165376 181570 194015 197230 236343 197255 209799 179636 235936 250929 197465 239256
5714 239256 167198 201313 187415 168666 221129 276902 154040 207652 169320 251073 158992
5703 158992 249237 205759 215225 188176 232251 162490 261004 214705 227304 234355 254011 281050
5691 281050 236161 264484 245295 244960 276178 313746 233931 257786 242849 277082 238255 259913
5679 259913 220393 214724 284718 231145 202183 279836 321330 223375 301381 306282 303677 320914
5667 320914 310066 291029 308466 320461 282727 294669 306264 324195 187043 295594 276092
$$ packed form
5750B08408k0607l115l337m9391O0310j7249k2342M4391q7692L2209O9086l5599
5738A75072R986K2962j6372L3540K7972K2885l9953q991L6676p5994O1359k5863
5726B23279n7903J6194J2445L215L9113l9088J2544l0163N6300J4993n3464M1791
5714B39256p2058L4115j3898j8749N2463N5773j22862N3612l8332Q1753r2081
5703A58992R0245m3478R466k7049M4075o9761R8514m6299J2599P051J9656K7039
5691B81050m4889K8323j9189l35L1218L7568p9815K3855j4937L4233l8827K1658
5679B59913l9520n669O9994n3573k8962P7653M1494r7955P8006M901k605J7237
5667C20914j0848j9037J7437J1995l7734J1942J1595J7931j37152J08551j9502
$$ plain form
5656 276092 225676 232395 350228 228011 303456 283734 321274 299572 368002 306318 248061
5645 248061 330055 322405 259037 325917 308632 237419 349556 257355 260334 223884 223222 243260
5633 243260 243370 302663 274359 263637 351873 271722 310635 319623 281263 305768 321825 314250
5621 314250 290168 259388 338622 285328 307644 290838 247953 303641 363734 292108 329856 337790
5609 337790 361206 345519 355938 388492 356576 398391 386458 390551 350829 382191 387188 354233
5597 354233 368276 318844 290679 390183 343105 355884 381656 384206 397989 379778 432613 464583
5585 464583 411956 504183 407387 367468 481120 408925 474973 437969 438111 451178 415582 416969
5573 416969 447125 399359 495967 416186 411275 452161 424439 457597 466226 452469 458528 496334
$$ packed form
5656B76092n0416O719J17833j22217P5445j9722L7540k1702O8430o1684n8257
5645B48061Q1994p650o3368O6880j7285p1213J12137r2201K979l6450o62K0038
5633B43260J10N9293k8304j0722Q8236q0151L8913Q988l8360K4505J6057p575
5621C14250k4082l0780P9234n3294K2316j6806m2885N5688O0093p1626L7748P934
5609C37790K3416j5687J0419L2554l1916M1815j1933M093l9722L1362M997l2955
5597C54233J4043m9432k8165R9504m7078J2779K5772K550J3783j8211N2835L1970
5585D64583n2627R2227r6796l9919J13652p2195O6048l7004J42J3067l5596J387
5573D16969L0156m7766R6608p9781m911M0886k7722L3158Q629j3757O059L7806
$$ plain form
5561 496334 450771 487556 457141 524346 470388 521581 467962 526113 527862 630033 534658 626878
5549 626878 647029 662021 696342 723807 734137 791970 780257 755066 805293 799169 881872 896054
5537 896054 865601 904613 851075 824095 832090 695861 813602 728518 751608 723553 667409
5526 667409 663585 624380 586250 683120 601218 663925 586705 586828 638293 566242 626209 605874
5514 605874 629996 641022 627831 590484 590767 593316 626872 555528 615160 577738 557599 634259
5502 634259 649627 602534 651344 688468 632768 683030 636322 627353 679635 663868 617287 680720
5490 680720 717278 674856 704915 732292 672355 660878 711829 644256 713517 742789 696982 745163
5478 745163 779581 712681 719512 764640 713385 731132 757281 715982 719652 794667 811499 727447
$$ packed form
5561D96334m5563L6785l0415O7205n3958N1193n3619N8151J749J02171r5375R2220
5549F26878K0151J4992L4321K7465J0330N7833j1713k5191N0227o124Q2703J4182
5537H96054l0453L9012n3538k6980P995j36229J17741q5084K3090k8055n6144
5526F67409l824l9205l8130R6870q1902O2707p7220J23N1465p2051N9967k0335
5514F05874K4122J1026j3191l7347K83K549L3556p1344N9632l7422k0139P6660
5502F34259J5368m7093M8810L7124n5700N0262m6708q969N2282j5767m6581O3433
5490F80720L6558m2422L0059K7377n9937j1477N0951o7573O9261K9272m5807M8181
5478G45163L4418o6900O831M5128n1255J7747K6149m1299L670P5015J6832q4052
$$ plain form
5466 727447 809045 809176 763402 853211 867633 827558 840395 830130 829725 915018 889387 845665
5454 845665 808050 957101 844373 865930 936999 884285 867998 967631 894804 931712 918447
5443 918447 933468 912533 961233 998654 937646 1033389 1063160 1032349 1097847 1133257 1129128 1154040
5431 1154040 1185653 1168309 1122511 1212060 1223618 1179194 1251272 1300583 1277005 1264217 1356753
5420 1356753 1302598 1284566 1360335 1298609 1368595 1333266 1370327 1339567 1380715 1451658 1450000 1420958
5408 1420958 1529365 1497806 1538533 1624369 1650075 1685618 1700428 1760575 1663467 1769278 1824277
5397 1824277 1777510 1788412 1910074 1839235 1867002 1857420 1777687 1727667 1837587 1807437 1726197
5386 1726197 1783004 1785164 1755161 1748999 1863656 1797993 1802461 1859321 1823658 1834321 1960162 1960061
$$ packed form
5466G27447Q1598J31m5774Q9809J4422m0075J2837j0265m05Q5293k5631m3722
5454H45665l7615J49051j12728K1557P1069n2714j6287R9633p2827L6908j3265
5443I18447J5021k0935M8700L7421o1008R5743K9771l0811O5498L5410m129K4912
5431A154040L1613j7344m5798Q9549J1558m4424P2078M9311k3578j2788R2536
5420A356753n4155j8032P5769o1726O9986l5329L7061l0760M1148P0943j658k9042
5408A420958J08407l1559M0727Q5836K5706L5543J4810O0147r7108J05811N4999
5397A824277m6767J0902J21662p0839K7767r582p9733n0020J09920l0150q1240
5386A726197N6807K160l0003o162J14657o5663M468N6860l5663J0663J25841j01
$$ plain form
5374 1960061 2041363 2051348 2121336 2116075 2140908 2171318 2148618 2116428 2183829 2100200 2084523 2129797
5362 2129797 2108536 2114677 2112778 2133656 2093688 2077297 2166583 2180472 2165136 2300585 2284544 2258425
5350 2258425 2375378 2333317 2400589 2453729 2528464 2482561 2516563 2586929 2591171 2511606 2700784
5339 2700784 2621002 2649633 2723680 2637876 2736026 2745306 2831428 2849784 2951144 2982483 3046870
5328 3046870 3086090 3196939 3082710 3297068 3279178 3353822 3484403 3511367 3578857 3648804 3701967
5317 3701967 3738134 3796005 3827346 3865399 3857720 3966146 3950844 4067165 4068771 4131249 4108014
5306 4108014 4210061 4218401 4184982 4209416 4185817 4185390 4145651 4122222 4181966 4230465 4186613 4278337
5294 4278337 4253448 4338357 4380368 4429369 4554510 4629636 4702762 4726931 4769420 4792277 4845299
$$ packed form
5374A960061Q1302R985O9988n261K4833L0410k2700l2190O7401q3629j5677M5274
5362B129797k1261O141j899K0878l9968j6391Q9286J3889j5336J35449j6041k6119
5350B258425J16953m2061O7272N3140P4735m5903L4002P0366M242p9565J89178
5339B700784p9782K8631P4047q5804R8150R280Q6122J8356J01360L1339O4387
5328C046870L9220J10849j14229K14358j7890P4644J30581K6964O7490O9947N3163
5317C701967L6167N7871L1341L8053p679J08426j5302J16321J606O2478k3235
5306D108014J02047Q340l3419K4434k3599m27l9739k3429N9744M8499m3852R1724
5294D278337k4889Q4909M2011M9001J25141P5126P3126K4169M2489K2857N3022
$$ plain form
5283 4845299 4852986 4915830 4818854 4868762 4918225 4837753 4867814 4893901 4749813 4776753 4767971 4729761
5271 4729761 4734069 4717973 4713649 4619232 4720890 4661554 4534091 4630606 4567110 4468860 4542319
5260 4542319 4454389 4446066 4488387 4538376 4486782 4527450 4598574 4622554 4681250 4765567 4769209 4887456
5248 4887456 4922966 5006036 4917283 4962280 4945970 4866461 4841687 4834775 4731092 4727995 4717586 4755699
5236 4755699 4743016 4811823 4856868 4826735 4947546 4874218 4885184 4935474 4931936 4959610 4952089 4967094
5224 4967094 5002287 4986992 5100166 5166792 5273199 5382968 5465694 5446535 5564670 5619192 5606506
5213 5606506 5690015 5704203 5701287 5711967 5703547 5648294 5580927 5557671 5547926 5476059 5550555 5553243
5201 5553243 5556728 5587374 5613896 5605776 5779837 5856611 5914057 5963557 6148667 6211516 6237861
$$ packed form
5283D845299P687O2844r6976M9908M9463q0472L0061K6087j44088K6940q782l8210
5271D729761M308j6096m324r4417J01658n9336j27463R6515o3496r8250P3459
5260D542319q7930q323M2321M9989n1594M0668P1124K3980N8696Q4317L642J18247
5248D887456L5510Q3070q8753M4997j6310p9509k4774o912j03683l097j0409L8113
5236D755699j2683O8807M5045l0133J20811p3328J0966N0290l538K7674p521J5005
5224D967094L5193j5295J13174O6626J06407J09769Q2726j9159J18135N4522j2686
5213E606506Q3509J4188k916J0680q420n5253o7367k3256r745p1867P4496K688
5201E553243L485L0646K6522q120J74061P6774N7446M9500J85110O2849K6345
$$ plain form
5190 6237861 6466133 6499616 6507608 6566692 6552157 6493179 6603830 6567208 6595425 6469719 6506266
5179 6506266 6485743 6447170 6453231 6413672 6318513 6463673 6328221 6336954 6399534 6351839 6427846
5168 6427846 6442037 6446057 6469698 6511058 6597597 6606370 6681353 6817611 6785967 6939496 7062871
5157 7062871 6987087 7071490 7004697 6946548 6902961 6820619 6794141 6714898 6727922 6741806 6752463
5146 6752463 6823000 6840162 6808207 6893910 6976282 7047920 7098091 7202399 7193522 7263707 7318239
5135 7318239 7352608 7411464 7465043 7587781 7670484 7723705 7803259 7857674 7897545 7888216 7833901
5124 7833901 7887279 7895831 7881199 7893437 7860019 7902176 7842209 7917121 8012826 7989698 7991639 8055611
5112 8055611 8056945 8149299 8150960 8119063 8203614 8178487 8254895 8198862 8239489 8194478 8182535 8157448
$$ packed form
5190F237861K28272L3483P992N9084j4535n8978J10651l6622K8217j25706L6547
5179F506266k0523l8573O061l9559r5159J45160j35452Q733O2580m7695P6007
5168F427846J4191M020K3641M1360Q6539Q773P4983J36258l1644J53529J23375
5157G062871p5784Q4403o6793n8149m3587q2342k6478p9243J3024J3884J0657
5146F752463P0537J7162l1955Q5703Q2372P1638N0171J04308q877P0185N4532
5135G318239L4369N8856N3579J22738Q2703N3221P9554N4415L9871r329n4315
5124G833901N3378Q552j4632J2238l3418M2157n9967P4912R5705k3128J941O3972
5112H055611J334R2354J661l1897Q4551k5127P6408n6033M0627m5011j1943k5087
$$ plain form
5100 8157448 8125896 8069543 8076958 8019258 8011781 8022278 8002184 8044445 7973751 8058996 8014593 8022363
5088 8022363 8033535 8027728 7851195 7825502 7682601 7595126 7477905 7428809 7243785 7091379 7057972
5077 7057972 6890442 6824128 6798493 6735453 6642131 6687283 6653608 6578478 6554080 6508997 6398371
5066 6398371 6384504 6473982 6377856 6364426 6329448 6204429 6143800 6070120 5970526 5858557 5820102
5055 5820102 5771689 5674954 5561353 5515177 5297001 5228820 5214698 5198510 5131878 5171686 5146600
5044 5146600 5138111 5177439 5201170 5173879 5076923 5057120 4897707 4780402 4750888 4651374 4554694
5033 4554694 4633584 4515515 4445236 4430214 4386677 4300433 4203674 4230374 4165502 4136141 4154105
5022 4154105 4085817 3985045 4085292 3985630 4005931 4005621 4051196 3958605 3977380 4078514 3935063
$$ packed form
5100H157448l1552n6353P415n7700p477J0497k0094M2261p0694Q5245m4403P770
5088H022363J1172n807j76533k5693j42901q7475j17221m9096j85024j52406l3407
5077G057972j67530o6314k5635o3040r3322M5152l3675p5130k4398m5083j10626
5066F398371j3867Q9478r6126j3430l4978j25019o0629p3680r9594j11969l8455
5055E820102m8413r6735j13601m6176k18176o8181j4122j6188o6632L9808k5086
5044E146600q489L9328K3731k7291r6956j9803j59413j17305k9514r9514r6680
5033D554694P8890j18069p0279j5022m3537q6244r6759K6700o4872k9361J7964
5022D154105o8288j00772J00247r9662K0301l10M5575r2591J8775J01134j43451
$$ plain form
5011 3935063 3852283 3822267 3666581 3543680 3527187 3443953 3383910 3360057 3412333 3266953 3294241
5000 3294241 3312288 3260495 3222950 3232165 3162581 3124563 3122961 3095644 3039467 3038446 3005476 2895687
4988 2895687 2907091 2969975 2877236 2813435 2823516 2827608 2756261 2695935 2589293 2538657 2547522 2514751
4976 2514751 2454123 2437919 2423395 2371394 2325830 2332919 2308152 2272970 2353158 2284503 2195889 2211613
4964 2211613 2182588 2097367 2119511 2074572 2042329 2016347 2069912 2015179 1925723 1957331 1845268
4953 1845268 1844635 1877015 1847007 1817512 1818239 1748968 1752708 1707601 1739172 1678409 1695079 1675162
4941 1675162 1653556 1653513 1650613 1640585 1601742 1620398 1634582 1562032 1553916 1580140 1510228 1544698
4929 1544698 1456399 1484859 1440369 1496658 1507541 1424314 1384929 1433925 1399629 1428019 1467052
$$ packed form
5011C935063q2780l0016j55686j22901j6493q3234o0043k3853N2276j45380K7288
5000C294241J8047n1793l7545R215o9584l8018j602k7317n6177j021l2970j09789
4988B895687J1404O2884r2739o3801J0081M092p1347o0326j06642n0636Q865l2771
4976B514751o0628j6204j4524n2001m5564P089k4767l5182Q0188o8655q8614J5724
4964B211613k9025q5221K2144m4939l2243k5982N3565n4733q9456L1608j12063
4953A845268o33L2380l0008k9495P27o9271L740m5107L1571o0763J6670j9917
4941A675162k1606m3k900j0028l8843J8656J4184p2550q116K6224o9912L4470
4929A544698q8299K8460m4490N6289J0883q3227l9385M8996l4296K8390L9033
$$ plain form
4918 1467052 1440839 1380873 1382620 1377025 1349234 1329231 1412263 1345061 1314754 1293050 1278103 1260244
4906 1260244 1299657 1208583 1254428 1242999 1233595 1170516 1212622 1185729 1133445 1203378 1222339 1198006
4894 1198006 1161515 1213485 1125650 1199758 1156498 1149966 1106814 1177726 1110758 1066015 1091265 1076724
4882 1076724 1065584 1125870 1052398 1006142 1096025 1067166 1088001 1049726 1119610 1002216 1102774
4871 1102774 1091175 927126 985763 993930 959218 973571 1032520 949463 1025095 972547 979043 917731
4859 917731 1051353 940799 988802 1020728 1006295 947105 1057351 1019568 989671 1013753 1032985
4848 1032985 980069 973784 1022275 930311 1007903 1037416 967323 984865 1039522 939867 980089 1008048
4836 1008048 937117 904824 1009097 936332 929795 1008757 1003846 913959 969126 902440 913666 952114
$$ packed form
4918A467052k6213n9966J747n595k7791k0003Q3032o7202l0307k1704j4947j7859
4906A260244L9413r1074M5845j1429r404o3079M2106k6893n2284O9933J8961k4333
4894A198006l6491N1970q7835P4108m3260o532m3152P0912o6968m4743K5250j4541
4882A076724j1140O0286p3472m6256Q9883k8859K0835l8275O9884j17394J00558
4871A102774j1599j64049N8637Q167l4712J4353N8949q3057P5632n2548O496o1312
4859I17731J33622j10554M8003L1926j4433n9190J10246l7783k9897K4082J9232
4848A032985n2916o285M8491r1964P7592K9513p0093J7542N4657r9655M0222K7959
4836A008048p0931l2293J04273p2765o537P8962m911q9887N5167o6686J1226L8448
$$ plain form
4824 952114 989432 928019 1008482 1024218 1006675 1010859 1094028 1060919 1151580 1216424 1245279 1216533
4812 1216533 1290765 1395541 1360053 1454197 1444724 1412022 1314768 1211741 1126355 1071297 1046200
4801 1046200 997570 940333 985034 944231 886480 909508 887631 848304 866326 836757 835533 839267
4789 839267 846497 778077 766656 827762 787361 789797 855558 809525 772152 819223 757409 800511
4777 800511 837348 866300 851487 873702 908223 837149 884653 863566 841090 874260 882981 861115
4765 861115 943060 887250 991834 959456 997190 937025 938005 981705 909696 995726 987908 936751
4753 936751 982344 1007695 991946 1058503 1043034 1157071 1121796 1190333 1201357 1230807 1311388
4742 1311388 1346885 1455653 1519841 1563734 1667581 1630635 1711957 1742894 1666219 1675060 1608322
$$ packed form
4824I52114L7318o1413Q0463J5736j7543M184Q3169l3109R0661O4844K8855k8746
4812A216533P4232J04776l5488R4144r473l2702r7254j03027q5386n5058k5097
4801A046200m8630n7237M4701m0803n7751K3028k1877l9327J8022k9569j224L734
4789H39267P230o8420j1421O1106m0401K436O5761m6033l7373M7071o1814M3102
4777H00511L6837K8952j4813K2215L4521p1074M7504k1087k2476L3170Q721k1866
4765H61115Q1945n5810J04584l2378L7734o0165R80M3700p2009Q6030p818n1157
4753I36751M5593K5351j5749O6557j5469J14037l5275O8537J1024K9450Q0581
4742A311388L5497J08768O4188M3893J03847l6946Q1322L0937p6675Q841o6738
$$ plain form
4731 1608322 1560106 1552157 1545227 1541878 1510524 1515155 1583086 1563006 1670438 1727639 1712596 1794564
4719 1794564 1886955 1815463 1882359 1870911 1822237 1773688 1798958 1696792 1635134 1658649 1664747
4708 1664747 1599382 1683588 1723852 1708901 1782290 1798996 1804417 1833401 1937346 1875522 1858846
4697 1858846 1831774 1765602 1727488 1802275 1771231 1709893 1708065 1737073 1621058 1674966 1681447 1642264
4685 1642264 1707785 1713467 1660438 1641709 1616039 1607115 1551587 1478081 1427883 1300157 1312935 1205235
4673 1205235 1124220 1143475 1037720 976082 958145 923836 903655 844784 906443 784888 789293
4662 789293 794020 705213 728959 776436 724590 697023 738915 741702 704724 705383 743994 686232
4650 686232 734882 676798 658729 642528 690285 675347 628183 635011 620837 611395 642019 617408
$$ packed form
4731A608322m8216p949o930l349l1354M631O7931k0080J07432N7201j5043Q1968
4719A794564R2391p1492O6896j1448m8674m8549K5270j02166o1658K3515O098
4708A664747o5365Q4206M0264j4951P3389J6706N421K8984J03945o1824j6676
4697A858846k7072o6172l8114P4787l1044o1338j828K9008j16015N3908O481l9183
4685A642264O5521N682n3029j8729k5670q924n5528p3506n0198j27726J2778j07700
4673A205235q1015J9255j05755o1638j7937l4309k0181n8871O1659j21555M405
4662G89293M727q8807K3746M7477n1846k7567M1892K787l6978O59L8611n7762
4650F86232M8650n8084j8069j6201M7757j4938m7164O828j4174r442L0624k4611
$$ plain form
4638 617408 607886 614733 627220 582140 621745 595845 658413 611794 642241 600072 619276 588844
4626 588844 588405 580661 586061 597433 601628 559000 562881 618814 533262 528728 470398 549592 494213
4613 494213 579147 561397 642345 591275 590247 545538 564828 556355 530903 558006 579643 558575
4601 558575 471958 515498 509991 529011 550846 503169 442437 511792 509783 467574 504887 530320
4589 530320 552313 527948 609815 525632 564754 561938 564749 580817 649292 576965 577156 553909
4577 553909 540193 600130 558714 612696 500821 559020 519831 544001 542834 582000 524204 583002
4565 583002 607095 611409 582630 583903 565195 597922 638923 573270 640344 619654 625482 634587
4553 634587 604359 627906 574967 591166 619062 579692 658233 667896 607798 682391 642534 681373
$$ packed form
4638F17408r522O847J2487m5080L9605k5900O2568m6619L0447m2169J9204l0432
4626E88844m39p744N400J1372M195m2628L881N5933q5552m534n8330P9194n5379
4613D94213Q4934j7750Q0948n1070j028m4709J9290q473k5452K7103K1637k1068
4601E58575q6617M3540n507J9020K1835m7677o0732O9355k009m2209L7313K5433
4589E30320K1993k4365Q1867q4183L9122k816K811J6068O8475p2327J91k3247
4577E53909j3716N9937m1416N3982j11875N8199l9189K4170j167L9166n7796N8798
4565E83002K4093M314k8779J273j8708L2727M1001o5653O7074k0690N828R105
4553F34587l0228K3547n2939J6199K7896l9370P8541R663o0098P4593l9857L8839
$$ plain form
4541 681373 642890 650154 638129 609797 695504 655450 679393 725146 668663 705062 713558 705878
4529 705878 738117 698048 688724 684761 728947 736562 689107 756383 780222 720533 810542 796662
4517 796662 870254 766970 797848 784888 797433 820284 862282 795690 920923 879250 888746
4506 888746 916192 855502 932484 932358 904264 981818 944577 972501 1009752 961395 1104766 1039453
4494 1039453 1019209 1072360 1030764 1120384 1099011 1122066 1152166 1076600 1156267 1138616 1112414
4483 1112414 1159191 1110527 1223866 1247706 1219773 1367572 1268744 1343932 1344022 1418854 1389133 1451363
4471 1451363 1475369 1483636 1488619 1560027 1507657 1600369 1581950 1608059 1658340 1668987 1740924 1735856
4459 1735856 1848166 1827380 1896021 2049094 2020801 2031274 2178035 2188519 2291170 2425855
$$ packed form
4541F81373l8483P264j2025k8332Q5707m0054K3943M5753n6483L6399Q496p680
4529G05878L2239m0069r324l963M4186P615m7455O7276K3839n9689R0009j3880
4517G96662P3592j03284L0878j2960J2545K2851M1998o6592J25233m1673R496
4506H88746K7446o0690P6982j26k8094P7554l7241K7924L7251m8357J43371o5313
4494A039453k0244N3151m1596Q9620k1373K3055L0100p5566P9667j7651k6202
4483A112414M6777m8664J13339K3840k7933J47799r8828P5188R0P4832k9721O2230
4471A451363K4006Q267M983P1408n2370R2712j8419K6109N0281J0647P1937n068
4459A735856J12310k0786O8641J53073k8293J0473J46761J0484J02651J34685
$$ plain form
4449 2425855 2470674 2521486 2626731 2779298 2745397 2962962 3094529 3087203 3108370 3211918 3152186
4438 3152186 3364226 3556310 3645048 3880085 4170912 4379572 4610503 5082895 5470368 5964042
4428 5964042 6594954 7181317 7543581 8258267 8763741 9170567 9077512 8567323 7616857 6630129
4418 6630129 5953812 5331830 4908514 4744160 4468850 4298957 4276739 4142773 4078787 3979792
4408 3979792 3959721 3861371 3816275 3844860 3687952 3686911 3638424 3581005 3555024 3564766 3511376 3527948
4396 3527948 3451567 3512604 3465212 3457099 3525954 3505930 3550047 3521194 3570549 3564223 3645279 3657010
4384 3657010 3659285 3692157 3777922 3760991 3762129 3822146 3797825 3843223 3892723 3920062 3916379 4079360
4372 4079360 4162397 4210697 4377537 4594385 4739490 4970504 5345831 5634624 6132780 6660769
$$ packed form
4449B425855M4819N0812J05245J52567l3901K17565J31567p326K1167J03548n9732
4438C152186K12040J92084Q8738K35037K90827K08660K30931M72392L87473M93674
4428E964042O30912N86363L62264P14686N05474M06826r3055n10189r50466r86728
4418F630129o76317o21982m23316j64354k75310j69893k2218j33966o3986r8995
4408C979792k0071r8350m5096K8585j56908j041m8487n7419k5981R742n3390J6572
4396C527948p6381O1037m7392q113O8855k0024M4117k8853M9355o326Q1056J1731
4384C657010K275L2872Q5765j6931J138O0017k4321M5398M9500K7339l683J62981
4372D079360Q3037M8300J66840K16848J45105K31014L75327K88793M98156N27989
$$ plain form
4362 6660769 7105628 7550345 8111951 8551318 8970345 9051409 8800716 8142525 7412404 6515705
4352 6515705 5722352 5258887 4902415 4595907 4361508 4195400 3957224 3775811 3704944 3614934
4342 3614934 3466515 3400949 3327765 3189300 3141508 3033206 3013005 2955825 2914012 2880323 2860187
4331 2860187 2747887 2767137 2671357 2699100 2655982 2599219 2635359 2593603 2502085 2541006 2489069
4320 2489069 2450947 2392352 2376205 2306864 2237930 2223903 2152058 2176199 2119828 2084591 2060911
4309 2060911 2048929 2010827 1980250 1947350 2006556 1877451 1992906 1874570 1870379 1804221 1783609
4298 1783609 1756616 1714972 1642169 1780848 1546400 1597715 1547900 1474145 1537688 1499849 1494871
4287 1494871 1462482 1440118 1454639 1396644 1428532 1506677 1381429 1497878 1433069 1415776 1452784
$$ packed form
4362F660769M44859M44717N61606M39367M19027Q1064k50693o58191p30121q96699
4352F515705p93353m63465l56472l06508k34399j66108k38176j81413p0867r0010
4342C614934j48419o5566p3184j38465m7792j08302k0201n7180m1813l3689k0136
4331B860187j12300J9250r5780K7743m3118n6763L6140m1756r1518L8921n1937
4320B489069l8122n8595j6147o9341o8934j4027p1845K4141n6371l5237k3680
4309B060911j1982l8102l0577l2900N9206j29105J15455j18336m191o6158k0612
4298A783609k6993m1644p2803J38679k34448N1315m9815p3755O3543l7839m978
4287A494871l2389k2364J4521n7995L1888P8145j25248J16449o4809j7293L7008
$$ plain form
4276 1452784 1374287 1351774 1382314 1385328 1358969 1351329 1354612 1358640 1314759 1393681 1327133 1385289
4264 1385289 1450765 1356090 1373498 1382869 1374104 1438210 1440880 1434406 1425032 1436134 1509274 1441406
4252 1441406 1516694 1526301 1505290 1496101 1504093 1508625 1513738 1579979 1589432 1566416 1661758 1655525 1674134
4239 1674134 1756225 1716013 1775176 1777633 1824036 1835404 1832599 1895040 1875337 2021331 1973465 2001037
4227 2001037 2100896 2068524 2068017 2195175 2171854 2246891 2245583 2362321 2329724 2411360 2410298 2384452
4215 2384452 2517811 2547883 2508182 2646525 2709265 2772243 2774417 2891834 2905564 2974514 3124459
4204 3124459 3089300 3191989 3271060 3242757 3342318 3460836 3537014 3623216 3809024 3931107 3998709
4193 3998709 4273771 4395557 4524281 4793420 5074001 5265432 5675314 6057655 6531528 7002779
$$ packed form
4276A452784p8497k2513L0540L014k6359p640L283M028m3881P8922o6548N8156
4264A385289O5476r4675J7408R371q765O4106K670o474r374J1102P3140o7868
4252A441406P5288R607k1011r189P992M532N113O6241R453k3016R5342o233J8609
4239A674134Q2091m0212N9163K457M6403J1368k805O2441j9703J45994m7866K7572
4227B001037R9859l2372n07J27158k3321P5037j308J16738l2597Q1636j062k5846
4215B384452J33359L0072l9701J38343O2740O2978K174J17417J3730O8950J49945
4204C124459l5159J02689P9071k8303R9561J18518P6178Q6202J85808J22083O7602
4193C998709K75062J21786J28724K69139K80581J91431M09882L82341M73873M71251
$$ plain form
4183 7002779 7626715 8261856 9116232 10077330 11217545 12453104 13836882 15264137 16729843
4174 16729843 18213802 19271525 19993536 20041603 19269614 17977178 16295364 14440686 12716112
4165 12716112 11268709 10158539 9186630 8546662 7990700 7460495 7125818 6841616 6634133
4156 6634133 6483754 6370645 6233279 6099248 6087012 6017890 5930632 6010616 5950687 5914916 5972265
4145 5972265 5992514 5937382 6029419 6052034 5998395 6076107 6204052 6171447 6242821 6385156 6468083
4134 6468083 6502180 6680743 6851662 6958246 7214640 7403566 7513351 7798064 8041809 8169326
4124 8169326 8387736 8644094 8854122 8959235 9426918 9624912 9912232 10373380 10666207 10960191
4114 10960191 11405671 11745866 12109373 12490490 12954809 13240663 13535557 14009517 14205174
$$ packed form
4183G002779O23936O35141Q54376R61098J140215J235559J383778J427255J465706
4174A6729843J483959J057723P22011M8067p71989j292436j681814j854678j724574
4165A2716112j447403j110170r71909o39968n55962n30205l34677k84202k07483
4156F634133j50379j13109j37366j34031j2236o9122q7258P9984n9929l5771N7349
4145E972265K0249n5132R2037K2615n3639P7712J27945l2605P1374J42335Q2927
4134F468083L4097J78563J70919J06584K56394J88926J09785K84713K43745J27517
4124H169326K18410K56358K10028J05113M67683J97994K87320M61148K92827K93984
4114A0960191M45480L40195L63507L81117M64319K85854K94894M73960J95657
$$ plain form
4105 14205174 14524782 14906954 15154522 15371062 15799615 16010283 16243792 16630799 16977049
4096 16977049 17210110 17610593 17963785 18298451 18661221 19169636 19431608 19757279 20161948
4087 20161948 20354366 20665644 20964370 21193182 21409254 21542304 21730200 21848243 21991136
4078 21991136 22202920 22254620 22419807 22572308 22690601 22810051 22949284 23026611 23053473 23107007
4068 23107007 23158649 23111812 23050120 23008814 22877170 22769655 22703764 22550731 22335454 22186330
4058 22186330 21875788 21548391 21305562 20913796 20550852 20070780 19696816 19151017 18574479
4049 18574479 18140545 17664148 17072292 16746522 16177791 15796367 15388101 15059715 14671770
4040 14671770 14361246 14147895 13764717 13613130 13399685 13156114 12980889 12831646 12559125
$$ packed form
4105A4205174L19608L82172K47568K16540M28553K10668K33509L87007L46250
4096A6977049K33061M00483L53192L34666L62770N08415K61972L25671M04669
4087B0161948J92418L11278K98726K28812K16072J33050J87896J18043J42893
4078B1991136K11784N1700J65187J52501J18293J19450J39233P7327K6862N3534
4068B3107007N1642m6837o1692m1306j31644j07515o5891j53033k15277j49124
4058B2186330l10542l27397k42829l91766l62944m80072l73964n45799n76538
4049A8574479m33934m76397n91856l25770n68731l81424m08266l28386l87945
4040A4671770l10524k13351l83178j51587k13445k43571j75225j49243k72521
$$ plain form
4031 12559125 12373424 12160139 12021018 11802878 11725404 11603629 11509213 11490084 11457246 11430964
4021 11430964 11464159 11542132 11564126 11626462 11797162 11804395 11957533 12133607 12269946 12388253
4011 12388253 12539756 12682572 12866400 12949548 13133575 13233778 13437707 13686273 13903226 14117951
4001 14117951 14388444 14709512 15014299 15394508 15772921 16231547 16577974 17026239 17442896
3992 17442896 17885090 18252328 18728328 18990659 19363271 19709427 19944953 20176049 20368924
3983 20368924 20562200 20713878 20845247 20974858 21074590 21145034 21211011 21219679 21229669 21226701 21194063
3972 21194063 21179961 21183307 21065810 21145891 21183578 21164482 21212077 21291739 21320376 21365919 21457159
3961 21457159 21563492 21609479 21787188 21926201 21944336 22122413 22223906 22299720 22341502 22415885
$$ packed form
4031A2559125j85701k13285j39121k18140p7474j21775r4416j9129l2838k6282
4021A1430964L3195P7973K1994O2336J70700P233J53138J76074J36339J18307
4011A2388253J51503J42816J83828Q3148J84027J00203K03929K48566K16953K14725
4001A4117951K70493L21068L04787L80209L78413M58626L46427M48265M16657
3992A7442896M42194L67238M76000K62331L72612L46156K35526K31096J92875
3983B0368924J93276J51678J31369J29611R9732P0444O5977Q668R990k968l2638
3972B1194063j4102L346j17497Q0081L7687j9096M7595P9662K8637M5543R1240
3961B1457159J06333M5987J77709J39013J8135J78077J01493P5814M1782P4383
$$ plain form
3951 22415885 22369862 22403288 22211684 21787011 21060962 20544513 19984301 19524882 19142973 18734482
3941 18734482 18293852 17997390 17653267 17296749 16986145 16665617 16374117 16027013 15862113
3932 15862113 15569602 15307436 15061645 14860524 14584767 14478704 14213015 14003798 13901504
3923 13901504 13711702 13492889 13379101 13191745 13032788 12862620 12693112 12461474 12180376
3914 12180376 12085880 11865339 11634870 11649832 11439867 11400600 11345704 11333063 11315822 11351239 11442559
3903 11442559 11455796 11572819 11743821 11772670 11901462 12103544 12076127 12133368 12130646 12137731 12011659
3892 12011659 11959935 11820646 11660473 11613648 11560452 11411154 11366553 11369457 11328670 11339055 11425186
3881 11425186 11435842 11511789 11730097 11771019 11968946 12212602 12369613 12469749 12599562 12744539
$$ packed form
3951B2415885m6023L3426j91604m24673p26049n16449n60212m59419l81909m08491
3941A8734482m40630k96462l44123l56518l10604l20528k91500l47104j64900
3932A5862113k92511k62166k45791k01121k75757j06063k65689k09217j02294
3923A3901504j89802k18813j13788j87356j58957j70168j69508k31638k81098
3914A2180376r4496k20541k30469J4962k09965l9267n4896j2641j7241L5417R1320
3903A1442559J3237J17023J71002K8849J28792K02082k7417N7241k722P085j26072
3892A2011659n1724j39289j60173m6825n3196j49298m4601K904m0787J0385Q6131
3881A1425186J0656P5947K18308M0922J97927K43656J57011J00136J29813J44977
$$ plain form
3871 12744539 12747612 12816641 12777349 12644003 12622880 12642384 12697432 12754827 12842013 12935294 13077767
3860 13077767 13256658 13399516 13583400 13846943 14079019 14325274 14518528 14782643 14983493
3851 14983493 15175650 15312765 15307140 15404040 15327077 15262980 15252383 15185576 15255560 15337850 15431654
3840 15431654 15649831 15780571 15938870 16167416 16235396 16393664 16428331 16483512 16581591 16741190
3830 16741190 16943048 17192469 17470987 17860045 18203185 18651290 19099524 19559833 20105873
3821 20105873 20638671 21211700 21798908 22441647 23065125 23734949 24492294 25497933 26505805
3812 26505805 27701166 29225383 31004233 33180428 35889781 38856672 42140770 45556846
3804 45556846 49083007 52137874 54407491 55159713 53986999 51571587 48855373 46517026
$$ packed form
3871A2744539L073O9029l9292j33346k1123J9504N5048N7395Q7186R3281J42473
3860A3077767J78891J42858J83884K63543K32076K46255J93254K64115K00850
3851A4983493J92157J37115n625R6900p6963o4097j0597o6807O9984Q2290R3804
3840A5431654K18177J30740J58299K28546O7980J58268L4667N5181R8079J59599
3830A6741190K01858K49421K78518L89058L43140M48105M48234M60309N46040
3821B0105873N32798N73029N87208O42739O23478O69824P57345J005639J007872
3812B6505805J195361J524217J778850K176195K709353K966891L284098L416076
3804D5556846L526161L054867K269617P52222j172714k415412k716214k338347
$$ plain form
3796 46517026 45062269 44030242 42903767 41682263 40231961 38596796 37053278 35792621
3788 35792621 34977316 34444093 34206261 34192683 34341504 34581078 35009642 35420182 35963859 36632511
3778 36632511 37198380 37952355 38793472 39664424 40712286 41793767 43029061 44413305 45956704
3769 45956704 47768161 49655357 51889416 54434234 57188668 60371318 63820649 67388879
3761 67388879 71100405 74648311 78271139 81826219 84781143 86156679 86019034 85301398
3753 85301398 84730500 84608212 84877727 85340431 85740610 85941048 85933462 85466308 84590345 83237214
3743 83237214 81324209 79033767 76393636 73514807 70561363 67430447 64463790 61547392
3735 61547392 58878425 56264954 53845293 51561826 49398665 47343078 45475923 43593664
$$ packed form
3796D6517026j454757j032027j126475j221504j450302j635165j543518j260657
3788C5792621q15305n33223k37832j3578J48821K39574M28564M10540N43677O68652
3778C6632511N65869P53975Q41117Q70952J047862J081481J235294J384244J543399
3769D5956704J811457J887196K234059K544818K754434L182650L449331L568230
3761F7388879L711526L547906L622828L555080K954924J375536j37645p17636
3753H5301398n70898j22288K69515M62704M00179K00438p586m67154q75963j353131
3743H3237214j913005k290442k640131k878829k953444l130916k966657k916398
3735F1547392k668967k613471k419661k283467k163161k055587j867155j882259
$$ plain form
3727 43593664 41927781 40255766 38612333 37129311 35688286 34362135 33005547 31860927
3719 31860927 30678771 29579105 28551094 27607504 26688317 25855635 24945009 24185924 23416134
3710 23416134 22710649 22123240 21478207 20923051 20419187 19905689 19476343 19069322 18613069
3701 18613069 18244753 17884448 17441078 17110563 16712871 16383776 16044768 15804522 15492084
3692 15492084 15155027 14915006 14651342 14371104 14186470 13956221 13792928 13649556 13475066
3683 13475066 13341074 13221264 13172520 13007829 13000996 12968535 12934537 12993857 13102062 13240420
3673 13240420 13386857 13540043 13706324 13813674 13895394 13920355 13612751 13306052 12662347 12167770
3663 12167770 11744073 11375951 11050867 10770770 10596001 10452421 10262604 10205443 10142229 10058285
$$ packed form
3727D3593664j665883j672015j643433j483022j441025j326151j356588j144620
3719C1860927j182156j099666j028011r43590r19187q32682r10626p59085p69790
3710B3416134p05485n87409o45033n55156n03864n13498m29346m07021m56253
3701A8613069l68316l60305m43370l30515l97692l29095l39008k40246l12438
3692A5492084l37057k40021k63664k80238j84634k30249j63293j43372j74490
3683A3475066j33992j19810m8744j64691o833l2461l3998N9320J08205J38358
3673A3240420J46437J53186J66281J07350Q1720K4961l07604l06699o43705m94577
3663A2167770m23697l68122l25084k80097j74769j43580j89817n7161o3214q3944
$$ plain form
3653 10058285 10065337 9936388 9953012 9794376 9724410 9592663 9581725 9445602 9416923 9294532
3643 9294532 9224234 9103155 9057910 8960093 8840863 8835565 8844274 8772874 8870010 8951947 8944485 9076278
3631 9076278 9143837 9228517 9420108 9633200 9651215 9844941 10072916 10219868 10372926 10606478
3621 10606478 10629310 10646887 10627430 10478766 10266815 10214435 10034462 9852239 9812337 9771534
3611 9771534 9663379 9677699 9654972 9584637 9632666 9633996 9697176 9672279 9806819 9841767 9920735
3600 9920735 10156932 10285231 10375391 10556553 10713244 10792896 10826996 10739601 10788393 10722578 10725611
3589 10725611 10607871 10452203 10317243 10242324 10105220 10093845 10036195 10036234 10116038 10126510 10290743
3578 10290743 10352427 10600013 10798219 10969371 11176918 11397073 11515749 11722217 11807670 11886625
$$ packed form
3653A0058285P052j28949J6624j58636o9966j31747j0938j36123k8679j22391
3643I294532p0298j21079m5245r7817j19230n298Q709p1400R7136Q1937p462J31793
3631I076278O7559Q4680J91591K13092J8015J93726K27975J46952J53058K33552
3621A0606478K2832J7577j9457j48664k11951n2380j79973j82223l9902m0803
3611I771534j08155J4320k2727p0335M8029J330O3180k4897J34540L4948P8968
3600I920735K36197J28299R0160J81162J56691P9652L4100q7395M8792o5815L033
3589A0725611j17740j55668j34960p4919j37104j1375n7650L9P9804J0472J64233
3578A0290743O1684K47586J98206J71152K07547K20155J18676K06468Q5453P8955
$$ plain form
3568 11886625 11971455 11998610 11949179 11878135 11904924 11834565 11790745 11847313 11784396 11676105 11767208
3557 11767208 11849419 11874262 12030883 12117689 12229203 12377353 12616597 12699167 12880710 13003726
3547 13003726 13015572 13025542 13077166 13060350 13046090 13099853 13063006 13037519 13042228 13033197 12954468 13033176
3535 13033176 13003453 13160597 13226276 13334665 13439877 13645661 13813182 13940131 14216965 14510037
3525 14510037 14624087 14963360 15275848 15565759 15993378 16399263 16853890 17265831 17875565
3516 17875565 18435512 19056877 19809564 20492588 21173279 21996637 22763543 23633286 24492271
3507 24492271 25297921 26107520 26927343 27701592 28273363 28954611 29521698 30003992 30584105
3498 30584105 30965768 31288802 31696318 31986309 32203722 32468661 32671304 32813813 32812068 32932562
$$ packed form
3568A1886625Q4830K7155m9431p1044K6789p0359m3820N6568o2917j08291R1103
3557A1767208Q2211K4843J56621Q6806J11514J48150K39244Q2570J81543J23016
3547A3003726J1846R970N1624j6816j4260N3763l6847k5487M709r031p8729P8708
3535A3033176k9723J57144O5679J08389J05212K05784J67521J26949K76834K93072
3525A4510037J14050L39273L12488K89911M27619M05885M54627M11941O09734
3516A7875565N59947O21365P52687O83024O80691Q23358P66906Q69743Q58985
3507B4492271Q05650Q09599Q19823P74249N71771O81248N67087M82294N80113
3498C0584105L81663L23034M07516K89991K17413K64939K02643J42509j745J20494
$$ plain form
3488 32932562 32927810 32927042 33036233 33043588 33056893 33192279 33335712 33681576 34069121 34526809 35107337
3477 35107337 35647583 36435498 37185203 37917533 38728046 39487096 40138704 40864776 41297887
3468 41297887 41740700 41995004 42225173 42298288 42285789 42255350 42079137 41831395 41549151 41125398
3458 41125398 40659622 40231732 39632113 38961190 38113609 37251212 36180223 35151114 34020130
3449 34020130 32843382 31701067 30618868 29486290 28483006 27558830 26688853 25811751 25132705
3440 25132705 24453686 23771417 23332168 22927233 22476527 22182955 21931484 21654434 21421740
3431 21421740 21401841 21286092 21177014 21204433 20999284 20837383 20781341 20681178 20610848 20620520
3421 20620520 20732001 20720898 20865986 21127566 21270909 21559053 21882726 22065724 22395465 22705180
$$ packed form
3488C2932562m752p68J09191P355J3305J35386J43433L45864L87545M57688N80528
3477C5107337N40246P87915P49705P32330Q10513P59050O51608P26072M33111
3468D1297887M42813K54304K30169P3115j2499l0439j76213k47742k82244m23753
3458D1125398m65776m27890n99619o70923q47581q62397j070989j029109j130984
3449C4020130j176748j142315j082199j132578j003284r24176q69977q77102o79046
3440B5132705o79019o82269m39249m04935m50706k93572k51471k77050k32694
3431B1421740j9899j15749j09078K7419k05149j61901n6042j00163p0330R672
3421B0620520J11481j1103J45088K61580J43343K88144L23673J82998L29741L09715
$$ plain form
3411 22705180 23024048 23366983 23851787 24227446 24496952 24990849 25357950 25747696 26235086
3402 26235086 26703950 27116432 27799788 28407864 29086646 29780167 30679785 31432579 32523584
3393 32523584 33578518 34528039 35494218 36579107 37581157 38733822 39992413 41242840
3385 41242840 42700693 44356882 46165459 48073291 50343439 52762814 55530260 58893424
3377 58893424 62810607 67086257 72026865 77836306 84525187 92729380 102276539 113035000
3369 113035000 125296584 139860538 157213049 178250397 203499707 232202961 260245480
3362 260245480 285837857 310137876 340354468 364105645 350213798 303066565 250364789
3355 250364789 209333452 180774196 161112318 146952638 136386634 128404794 121952745
$$ packed form
3411B2705180L18868L42935M84804L75659K69506M93897L67101L89746M87390
3402B6235086M68864M12482O83356O08076O78782O93521Q99618P52794J091005
3393C2523584J054934R49521R66179J084889J002050J152665J258591J250427
3385D1242840J457853J656189J808577J907832K270148K419375K767446L363164
3377E8893424L917183M275650M940608N809441O688881Q204193R547159J0758461
3369A13035000J2261584J4563954J7352511K1037348K5249310K8703254K8042519
3362B60245480K5592377K4300019L0216592K3751177j3891847m7147233n2701776
3355B50364789m1031337k8559256j9661878j4159680j0566004p981840o452049
$$ plain form
3348 121952745 116479630 111927881 108424570 105839379 103608484 101546399 99516577 97309689
3340 97309689 95076693 92532223 89808083 86838183 83762514 80756952 77812092 75088435
3332 75088435 72378325 69682415 67316323 65162598 63338073 61826812 60352332 59199236
3324 59199236 58220830 57516530 57031116 56553305 56347926 56246413 56393068 56726067 57276103
3315 57276103 58048389 58824844 59944377 61113126 62372807 63766018 65066978 66299271
3307 66299271 67487796 68521577 69401848 69934358 70310964 70428578 70382101 70160951 69762469
3298 69762469 69162112 68386119 67436427 66369930 65332949 64168868 62981586 61757232 60511836
3289 60511836 59170983 57839882 56411207 54993497 53415321 51828014 50162181 48465285
$$ packed form
3348A21952745n473115m551749l503311k585191k230895k062085k029822k206888
3340I7309689k232996k544470k724140k969900l075669l005562k944860k723657
3332G5088435k710110k695910k366092k153725j824525j511261j474480j153096
3324E9199236r78406p04300m85414m77811k05379j01513J46655L32999N50036
3315E7276103P72286P76455J119533J168749J259681J393211J300960J232293
3307F6299271J188525J033781Q80271N32510L76606J17614m6477k21150l98482
3298F9762469o00357p75993r49692j066497j036981j164081j187282j224354j245396
3289F0511836j340853j331101j428675j417710j578176j587307j665833j696896
$$ plain form
3281 48465285 46772583 45022696 43246775 41567454 39775018 38073951 36425434 34939283
3273 34939283 33457221 32043866 30871746 29623308 28574943 27556048 26594983 25720723
3265 25720723 25007026 24296560 23602024 22968235 22410997 21852859 21390908 20905570 20397873
3256 20397873 19991980 19619925 19310194 18875618 18738547 18436454 18321313 18236745 18125737 17988515
3246 17988515 17914675 17821589 17761734 17623227 17608219 17339081 17199794 17134883 16829213 16579094
3236 16579094 16331460 16060971 15712577 15503921 15236615 14930126 14710482 14491034 14097356
3227 14097356 13922516 13666823 13394766 13136063 13048590 12805213 12621850 12583846 12328647 12247588
3217 12247588 12235506 12004564 11962778 11938509 11901639 11855384 11762389 11810499 11655267 11710449 11728724
$$ packed form
3281D8465285j692702j749887j775921j679321j792436j701067j648517j486151
3273C4939283j482062j413355j172120j248438j048365j018895r61065q74260
3265B5720723p13697p10466o94536o33789n57238n58138m61951m85338n07697
3256B0397873m05893l72055l09731m34576j37071l02093j15141q4568j11008j37222
3246A7988515p3840r3086n9855j38507j5008k69138j39287o4911l05670k50119
3236A6579094k47634k70489l48394k08656k67306l06489k19644k19448l93678
3227A4097356j74840k55693k72057k58703q7473k43377j83363l8004k55199q1059
3217A2247588j2082k30942m1786k4269l6870m6255r2995M8110j55232N5182J8275
$$ plain form
3206 11728724 11616481 11599812 11591601 11465010 11592464 11600478 11640128 11575990 11650077 11703186 11744109
3195 11744109 11812275 11979711 12000304 12068496 12162368 12157973 12282715 12337023 12408356 12492033 12694125
3184 12694125 12859055 12998962 13129814 13477742 13492273 13776271 13922704 14049602 14196714 14320512
3174 14320512 14423862 14538533 14614983 14731355 14756438 14974586 15166454 15229233 15516888 15688087
3164 15688087 15811878 16096263 16282966 16476628 16684770 16969605 17072554 17288931 17604851
3155 17604851 17841576 18069652 18489291 18749982 19078758 19479030 19885224 20216193 20680849
3146 20680849 21071369 21420400 21809127 22261269 22696987 23151704 23678322 24169043 24795040
3137 24795040 25476179 26143075 26944003 27793894 28626949 29535973 30449778 31453007 32467677
$$ packed form
3206A1728724j12243j6669q211j26591J27454Q014L9650o4138P4087N3109M0923
3195A1744109O8166J67436K0593O8192R3872m395J24742N4308P1333Q3677K02092
3184A2694125J64930J39907J30852L47928J4531K83998J46433J26898J47112J23798
3174A4320512J03350J14671P6450J16372K5083K18148J91868O2779K87655J71199
3164A5688087J23791K84385J86703J93662K08142K84835J02949K16377L15920
3155A7604851K36725K28076M19639K60691L28776M00272M06194L30969M64656
3146B0680849L90520L49031L88727M52142M35718M54717N26618M90721O25997
3137B4795040O81139O66896Q00928Q49891Q33055R09024R13805J003229J014670
$$ plain form
3128 32467677 33485605 34518460 35522914 36420817 37453229 38277830 39176863 39876189 40793931
3119 40793931 41597160 42530334 43452689 44462831 45466528 46558967 47632534 48826311 50050038
3110 50050038 51342561 52636066 54057949 55568921 57117095 58777562 60527518 62244184
3102 62244184 63929621 65767255 67435428 69058047 70539990 71886719 73042087 74059763
3094 74059763 74912784 75693027 76262150 76945259 77402212 77934254 78428109 78753399 79003128
3085 79003128 79134719 79036281 78793595 78383764 77787709 77013422 76195103 75296588 74322395 73426131
3075 73426131 72389668 71495136 70555255 69678683 68704671 67737927 66751091 65710906 64594668
3066 64594668 63481613 62265077 61298042 60389469 59730001 59484995 59335717 59731230 60524330
$$ packed form
3128C2467677J017928J032855J004454Q97903J032412Q24601Q99033O99326R17742
3119D0793931Q03229R33174R22355J010142J003697J092439J073567J193777J223727
3110E0050038J292523J293505J421883J510972J548174J660467J749956J716666
3102F2244184J685437J837634J668173J622619J481943J346729J155368J017676
3094G4059763Q53021P80243N69123O83109M56953N32042M93855L25290K49729
3085G9003128J31591r8438k42686m09831n96055p74287q18319q98515r74193q96264
3075G3426131j036463q94532r39881q76572r74012r66744r86836j040185j116238
3066F4594668j113055j216536r67035r08573o59468k45006j49278L95513P93100
$$ plain form
3057 60524330 61926899 63965770 66674108 70314915 74406433 78449176 82459702 86502173
3049 86502173 89584150 88312166 81400785 72117401 63510228 56941476 52078352 48323083
3041 48323083 45452369 43046417 40907516 39046705 37264513 35755536 34509851 33431026
3033 33431026 32584472 31756521 30941717 30254607 29608158 29013178 28445059 27867068 27356145
3024 27356145 26837539 26416163 25934154 25488773 25005486 24397356 23941899 23459316 23001494
3015 23001494 22688272 22324311 21932733 21596973 21341269 21012635 20508683 20008301 19329481
3006 19329481 18793747 18444608 17968554 17647632 17356779 17094884 16951733 16802147 16659822
2997 16659822 16540729 16519231 16506813 16423884 16567281 16586569 16711062 16826891 16903573 17080489
$$ packed form
3057F0524330J402569K038871K708338L640807M091518M042743M010526M042471
3049H6502173L081977j271984o911381r283384q607173o568752m863124l755269
3041D8323083k870714k405952k138901j860811j782192j508977j245685j078825
3033C3431026q46554q27951q14804o87110o46449n94980n68119n77991n10923
3024B7356145n18606m21376m82009m45381m83287o08130m55457m82583m57822
3015B3001494l13222l63961l91578l35760k55704l28634n03952n00382o78820
3006A9329481n35734l49139m76054l20922k90853k61895j43151j49586j42325
2997A6659822j19093k1498j2418q2929J43397J9288J24493J15829P6682J76916
$$ plain form
2987 17080489 17289453 17502626 17712685 18026607 18366375 18691447 19109597 19527848 19852544
2978 19852544 20327898 20889300 21506223 22290983 23230977 24191636 25298247 26637573 27886560
2969 27886560 29305871 30825407 32319115 33793114 35329909 36679993 37971780 39129654
2961 39129654 40060440 40748539 41279686 41555578 41555828 41453856 41234094 40900252 40556012 40362407
2951 40362407 40125431 40174152 40353420 40702831 41273988 41962759 42868349 43976680 45026153
2942 45026153 46199295 47348353 48443566 49431440 50121048 50627130 50652615 50447842 49775998
2933 49775998 48737736 47388348 45649514 43699700 41651030 39459010 37301080 35121588
2925 35121588 33085452 31102455 29268574 27635129 26039533 24673799 23358988 22195650
$$ packed form
2987A7080489K08964K13173K10059L13922L39768L25072M18150M18251L24696
2978A9852544M75354N61402O16923P84760R39994R60659J106611J339326J248987
2969B7886560J419311J519536J493708J473999J536795J350084J291787J157874
2961C9129654R30786O88099N31147K75892K50j01972k19762l33842l44240j93605
2951D0362407k36976M8721J79268L49411N71157O88771R05590J108331J049473
2942D5026153J173142J149058J095213R87874O89608N06082K5485k04773o71844
2933D9775998j038262j349388j738834j949814k048670k192020k157930k179492
2925C5121588k036136j982997j833881j633445j595596j365734j314811j163338
$$ plain form
2917 22195650 21165152 20175033 19286108 18488602 17723280 17030700 16360436 15786718 15202534
2908 15202534 14709121 14239209 13795186 13372071 13026634 12598722 12301569 12031027 11673468
2899 11673468 11405465 11190632 10910155 10683727 10470414 10250283 10035495 9855088 9648115
2890 9648115 9383340 9186291 9015747 8711690 8588721 8447526 8224574 8091519 7914389 7778293
2880 7778293 7636892 7493560 7350018 7172778 7170447 7055710 6914459 6822838 6726713 6595132
2870 6595132 6458642 6358569 6216188 6074905 6039015 5953981 5812177 5815463 5742185 5620421
2860 5620421 5585354 5625694 5508946 5534640 5581485 5463911 5456982 5495828 5420773 5391210 5427545
2849 5427545 5377834 5290493 5301555 5309051 5197250 5241926 5224083 5123380 5261631 5310369 5264259
$$ packed form
2917B2195650j030498r90119q88925p97506p65322o92580o70264n73718n84184
2908A5202534m93413m69912m44023m23115l45437m27912k97153k70542l57559
2899A1673468k68003k14833k80477k26428k13313k20131k14788j80407k06973
2890I648115k64775j97049j70544l04057j22969j41195k22952j33055j77130j36096
2880G778293j41401j43332j43542j77240k331j14737j41251r1621r6125j31581
2870F595132j36490j00073j42381j41283l5890q5034j41804L286p3278j21764
2860E620421l5067M0340j16748K5694M6845j17574o929L8846p5055k9563L6335
2849E427545m9711q7341J1062P496j11801M4676j7843j00703J38251M8738m6110
$$ plain form
2838 5264259 5289930 5370846 5345189 5408144 5499450 5508140 5447571 5599086 5633184 5582129 5771765
2827 5771765 5762533 5734674 5836972 5842814 5872305 5992496 5973988 6039276 6040362 6197085 6122930
2816 6122930 6182411 6290864 6295691 6378274 6435730 6519579 6571785 6648461 6677258 6780345 6812695
2805 6812695 6933665 6896866 7154407 7156888 7276367 7374216 7532809 7639814 7797142 7945022
2795 7945022 8084761 8283766 8497648 8687707 8841158 9015695 9065525 9306962 9428666 9538668
2785 9538668 9654161 9784439 9891693 10038129 10165397 10369265 10538772 10696283 10965808 11125340
2775 11125340 11404071 11683627 11992450 12282321 12574612 12969957 13317891 13706055 14212592
2766 14212592 14620619 15051208 15500176 15884441 16356765 16695630 17176614 17493185 17893109
$$ packed form
2838E264259K5671Q0916k5657O2955R1306Q690o0569J51515L4098n1055J89636
2827E771765r232k7859J02298N842K9491J20191j8508O5288J086J56723p4155
2816F122930N9481J08453M827Q2583N7456Q3849N2206P6676K8797J03087L2350
2805F812695J20970l6799K57541K481J19479R7849J58593J07005J57328J47880
2795G945022J39739J99005K13882J90059J53451J74537M9830K41437J21704J10002
2785I538668J15493J30278J07254J46436J27268K03868J69507J57511K69525J59532
2775A1125340K78731K79556L08823K89871K92291L95345L47934L88164N06537
2766A4212592M08027M30589M48968L84265M72324L38865M80984L16571L99924
$$ plain form
2757 17893109 18320384 18558706 19016295 19552923 19927947 20561313 21128538 21851449 22548785
2748 22548785 23249311 24083264 24891891 25786886 26745806 27624931 28703258 29754381 30881529
2739 30881529 32039765 33346404 34766737 36316570 38032165 39926126 41983657 44354552
2731 44354552 47004563 49935308 53329879 57131941 61336170 66114290 71529749 77348874
2723 77348874 83904502 90734249 97810948 104997296 111951023 118067041 122670950 125092328
2715 125092328 125546799 124562106 122569021 119594835 115873121 112187359 108928471 106618744
2707 106618744 105553641 105645463 106828277 109231072 112681247 117100124 122532999 128783745
2699 128783745 135800434 143192176 150808934 157871046 163952553 168406575 170337606 169067807
$$ packed form
2757A7893109M27275K38322M57589N36628L75024O33366N67225P22911O97336
2748B2548785P00526Q33953Q08627Q94995R58920Q79125J078327J051123J127148
2739C0881529J158236J306639J420333J549833J715595J893961K057531K370895
2731D4354552K650011K930745L394571L802062M204229M778120N415459N819125
2723G7348874O555628O829747P076699P186348O953727O116018M603909K421378
2715A25092328M54471r84693j993085k974186l721714l685762l258888k309727
2707A06618744j065103R1822J182814K402795L450175M418877N432875O250746
2699A28783745P016689P391742P616758P062112O081507M454022J931031j269799
$$ plain form
2691 169067807 164443474 156405682 146128366 134864976 123571141 112962714 103263089
2684 103263089 94767579 87157919 80474421 74637354 69393501 64773644 60812618 57108797
2676 57108797 53894388 51072306 48480184 46074366 43998657 42008100 40245322 38617097
2668 38617097 37136882 35777878 34434801 33276129 32027653 30776287 29574318 28287598
2660 28287598 27083339 25954855 24750892 23801420 22861799 21996593 21133927 20360161 19683043
2651 19683043 18936636 18248558 17716612 17049002 16535629 16006821 15572871 15101516 14663501
2642 14663501 14325125 13940451 13658411 13378666 13010835 12698806 12474371 12127026 11872092
2633 11872092 11486923 11203310 10898573 10639314 10290165 10005891 9738813 9479762 9188560
$$ packed form
2691A69067807m624333q037792j0277316j1263390j1293835j0608427r699625
2684A03263089q495510p609660o683498n837067n243853m619857l961026l703821
2676E7108797l214409k822082k592122k405818k075709j990557j762778j628225
2668C8617097j480215j359004j343077j158672j248476j251366j201969j286720
2660B8287598j204259j128484j203963r49472r39621q65206q62666p73766o77118
2651A9683043p46407o88078n31946o67610n13373n28808m33950m71355m38015
2642A4663501l38376l84674k82040k79745l67831l12029k24435l47345k54934
2633A1872092l85169k83613l04737k59259l49149k84274k67078k59051k91202
$$ plain form
2624 9188560 8950947 8721915 8482960 8283323 8104983 7909976 7699490 7562148 7355727 7208790
2614 7208790 7029374 6917602 6748544 6603848 6461687 6272884 6141031 6013241 5902649 5755669
2604 5755669 5657130 5459489 5403127 5349879 5260161 5188227 5077424 4971514 4910854 4862321 4776745
2593 4776745 4789524 4650294 4689944 4574914 4582073 4430956 4411986 4402188 4265837 4229319 4154365
2582 4154365 4019008 4001678 3934367 3847203 3861747 3701929 3736710 3619312 3666239 3548555 3495052
2571 3495052 3459240 3389567 3283566 3304521 3213646 3145071 3105855 3044926 3050515 3007156 3039563
2560 3039563 2894256 2919462 2891720 2881045 2868112 2834567 2815426 2788734 2766880 2734120 2758448
2549 2758448 2721566 2688326 2661445 2654478 2580445 2567759 2524343 2497047 2452145 2418675 2395651 2319450
$$ packed form
2624I188560k37613k29032k38955j99637j78340j95007k10486j37342k06421j46937
2614G208790j79416j11772j69058j44696j42161j88803j31853j27790j10592j46980
2604E755669r8539j97641n6362n3248q9718p1934j10803j05910o0660m8533q5576
2593D776745J2779j39230L9650j15030P159j51117j8970r798j36351l6518p4954
2582D154365j35357j7330o7311q7164J4544j59818L4781j17398M6927j17684n3503
2571C495052l5812o9673j06001K0955r0875o8575l9216o0929N589m3359L2407
2560C039563j45307K5206k7742j0675j2933l3545j9141k6692k1854l2760K4328
2549B758448l6882l3240k6881o967p4033j2686m3416k7296m4902l3470k3024p6201
$$ plain form
2537 2319450 2325241 2281572 2171598 2180981 2150494 2114578 2082420 2112396 2076337 2050421 2011379 2033448
2525 2033448 2007155 1978076 1925729 1906249 1857161 1915670 1837422 1856946 1828883 1767174 1811172
2514 1811172 1756213 1734941 1729742 1677179 1667726 1627415 1553262 1608323 1470609 1515657 1479153 1495139
2502 1495139 1456369 1478766 1371191 1386449 1346121 1363116 1308266 1388420 1305774 1337969 1348563
2491 1348563 1341302 1265958 1299063 1252507 1197269 1272778 1215641 1202669 1199072 1256119 1189497 1246195
2479 1246195 1238956 1245605 1205813 1247649 1208988 1211854 1276388 1230062 1264006 1261561 1309069 1281569
2467 1281569 1306605 1348979 1344341 1318449 1432699 1367329 1414747 1452151 1403624 1423707 1405868
2456 1405868 1397888 1313778 1398249 1351075 1357623 1355759 1418324 1286422 1338611 1358920 1334888 1321645
$$ packed form
2537B319450N791m3669j09974R383l0487l5916l2158K9976l6059k5916l9042K2069
2525B033448k6293k9079n2347j9480m9088N8509p8248J9524k8063o1709M3998
2514A811172n4959k1272n199n2563r453m0311p4153N5061j37714M5048l6504J5986
2502A495139l8770K2397j07575J5258m0328J6995n4850Q0154q2646L2195J0594
2491A348563p261p5344L3105m6556n5238P5509n7137j2972l597N7047o6622N6698
2479A246195p239O649l9792M1836l8661K866O4534m6326L3944k445M7508k7500
2467A281569K5036M2374m638k5892J14250o5370M7418L7404m8527K0083j7839
2456A405868p980q4110Q4471m7174O548j864O2565j31902N2189K0309k4032j3243
$$ plain form
2444 1321645 1456887 1389564 1434100 1446164 1418818 1400235 1446011 1481011 1422052 1412175 1406821 1280409
2432 1280409 1268573 1236259 1118525 1194226 1102266 947563 976340 899671 864477 860106 825740
2421 825740 813225 743834 808869 771370 696786 747797 728347 657687 715869 629843 664790 651153
2409 651153 646961 634413 599010 604225 593982 511512 573691 503729 462859 534035 494110 422541
2397 422541 486572 449278 422011 406853 428530 427884 389222 481012 440107 431571 532334 476221
2385 476221 443941 522189 453979 419821 447587 425815 388091 392419 440930 345740 349879 413362
2373 413362 361209 321127 383173 364619 311371 315303 334232 300375 298473 311191 283474 277269
2361 277269 346770 289865 275747 351857 271348 241492 312401 327908 202595 273271 299184
$$ packed form
2444A321645J35242o7323M4536J2064k7346j8583M5776L5000n8959r877n354j26412
2432A280409j1836l2314j17734P5701r1960j54703K8777p6669l5194m371l4366
2421H25740j2515o9391O5035l7499p4584N1011j9450p0660N8182q6026L4947j3637
2409F51153m192j2548l5403N215j0243q2470O2179o9962m0870P1176l9925p1569
2397D22541O4031l7294k7267j5158K1677o46l8662R1790m0905q536J00763n6113
2385D76221l2280P8248o8210l4158K7766k1772l7724M328M8511r5190M139O3483
2373D13362n2153m0082O2046j8554n3248L932J8929l3857j902J2718k7717o205
2361B77269O9501n6905j4118P6110q0509k9856P0909J5507j25313P0676K5913
$$ plain form
2350 299184 238771 225961 262349 217205 257210 271746 219858 211068 280666 220173 249440 255967
2338 255967 184288 174072 256367 164935 124652 191561 143482 135638 189964 196229 141686 207335
2326 207335 206565 183603 208410 215249 184007 265117 168251 183323 177646 247836 195464 201090 164608
2313 164608 75432 194654 170280 145326 145384 194385 155223 185857 172397 154615 143970 193258
2301 193258 114090 130731 190914 133728 115651 174364 143382 138078 161831 160235 122527 154988
2289 154988 167087 168275 190367 195286 150043 197060 243143 217354 260946 271474 192637 231518
2277 231518 193894 179831 209625 173505 206965 134426 148876 136854 119110 163003 162032 109290
2265 109290 155179 115188 140558 147533 130931 140678 141298 111179 105738 109639 80506 133810 78800
$$ packed form
2350B99184o0413j2810L6388m5144M0005J4536n1888q790O9598o0493K9267O527
2338B55967p1679j0216Q2295r1432m0283O6909m8079p844N4326O265n4543O5649
2326B07335p70k2962K4807O839l1242Q1110r6866J5072n677P0190n2372N626l6482
2313A64608q9176J19222k4374k4954N8M9001l9162L0634j3460j7782j0645M9288
2301A93258p9168J6641O0183n7186j8077N8713l0982n304K3753j596l7708L2461
2289A54988J2099J188K2092M919m5243M7017M6083k5789M3592J0528p8837L8881
2277B31518l7624j4063K9794l6120L3460p2539J4450j2022j7744M3893r71n2742
2265A09290M5889l9991K5370O975j6602R747O20l0119n441L901k9133N3304n5010
$$ plain form
2252 78800 77984 61512 33469 87080 54587 70975 78981 84262 116252 114332 102870 148616 68849
2239 68849 130462 70971 61330 139172 40250 85102 134388 58995 59879 50579 73900 19320 22467
2226 22467 53550 70279 41138 107374 62935 22916 70736 88005 71423 129441 64401 62161
2214 62161 93992 109982 90718 92195 150740 26744 68176 99100 29605 16099 93635 25058
2202 25058 56390 35694 75967 7884 53031 63858 6172 36178 97103 90535 83939 105997
2190 105997 43705 59437 74418 2347 35844 111676 41508 11352 -2954 3734 72209 48736
2178 48736 132807 89430 86874 92559 52191 98421 104746 78550 91616 69963 91228 142492
2166 142492 42866 76486 77567 98575 32484 97115 132257 57012 58360 111986 99393 94751
$$ packed form
2252G8800q16j6472k8043N3611l2493J6388Q006N281L1990j920j1462M5746p9767
2239F8849O1613n9491r641P7842r8922M4852M9286p5393Q84r300K3321n4580L147
2226B2467L1083J6729k9141O6236m4439m0019M7820J7269j6582N8018o5040k240
2214F2161L1831J5990j9264J477N8545j23996M1432L0924o9495j3506P7536o8577
2202B5058L1332k0696M0273o8083M5147J0827n7686L0006O0925o568o596K2058
2190A05997o2292J5732J4981p2071L3497P5832p0168l0156j4306O688O8475k3473
2178D8736Q4071m3377k556N685m0368M6230O325k6196J3066k1653K1265N1264
2166A42492r9626L3620J081K1008o6091O4631L5142p5245J348N3626j2593m642
$$ plain form
2154 94751 110473 54120 127516 110068 135174 71323 123506 123569 65980 98986 145511 97094
2142 97094 99831 82919 94014 161271 104187 123702 54469 101186 109604 129111 189665 138376
2130 138376 107371 170192 157070 164986 172340 133704 183994 111339 188088 165868 119066 216920
2118 216920 157813 156101 234894 227578 233562 284445 216681 273891 274910 380607 263079 254852
2106 254852 285928 279508 299626 357431 245849 270043 365272 327760 372411 393078 441461 441867
2094 441867 469066 467026 445697 420295 516173 406286 521649 528994 455049 512962 537197 529559
2082 529559 511961 539808 616502 628064 664786 810903 656041 789897 849770 848547 934109
2071 934109 947766 945220 1035223 1049175 1093613 1092322 1180165 1308093 1227228 1455629 1516857 1577437
$$ packed form
2154I4751J5722n6353P3396j7448K5106o3851N2183O3n7589L3006M6525m8417
2142I7094K737j6912J1095O7257n7084J9515o9233M6717Q418J9507O0554n1289
2130A38376l1005O2821j3122P916P354l8636N0290p2655P6749k2220m6802R7854
2118B16920n9107j712P8793p316N984N0883o7764N7210J019J05697j17528q227
2106B54852L1076o420K0118N7805j11582K4194R5229l7512M4651K0667M8383M06
2094D41867K7199k040k1329k5402R5878j09887J15363P345p3945N7913K4235p638
2082E29559j7598K7847P6694J1562L6722J46117j54862J33856N9873j223Q5562
2071I34109J3657k546R0003J3952M4438j291Q7843J27928q0865K28401O1228O0580
$$ plain form
2059 1577437 1707073 1961323 2069324 2345739 2490497 2835336 3049667 3375904 3724700 4015186
2049 4015186 4601662 5242669 5965121 6989344 8181746 9650849 11222082 12633716 14080459
2040 14080459 15624588 14835934 11766310 9185074 7439482 6160661 5127911 4530575
2032 4530575 4013484 3540443 3248011 2959933 2701544 2567210 2506635 2249388 2039637 1984083
2022 1984083 1806841 1658318 1589154 1506923 1297754 1314581 1190829 1100593 1071060 1054181 941018
2011 941018 979196 845542 767625 734202 788679 741166 704474 704692 664509 606315 630982 610426
1999 610426 568150 517427 468935 453531 468361 452022 454941 406233 399600 357669 394692 417386
1987 417386 388896 326943 364815 319615 316204 328134 290518 325862 293477 294626 250707 257637
$$ packed form
2059A577437J29636K54250J08001K76415J44758L44839K14331L26237L48796K90486
2049D015186N86476O41007P22452J024223J192402J469103J571233J411634J446743
2040A4080459J544129p88654l069624k581236j745592j278821j032750n97336
2032D530575n17091m73041k92432k88078k58389j34334o0575k57247k09751n5554
2022A984083j77242j48523o9164q2231k09169J6827j23752r0236k9533j6879j13163
2011I41018L8178j33654p7917l3423N4477m7513l6692K18m0183n8194K4667k0556
1999F10426m2276n0723m8492j5404J4830j6339K919m8708o633m1931L7023K2694
1987D17386k8490o1953L7872m5200l411J1930l7616L5344l2385J149m3919O930
$$ plain form
1975 257637 213370 226957 190831 193709 151586 200553 177115 235225 168467 217558 152420 197476
1963 197476 174916 121566 217320 135580 117993 128786 109992 68907 105828 104447 129998 103013
1951 103013 189689 80785 133636 160808 105086 96721 117705 110344 46080 84813 97629 79071
1939 79071 150843 174940 30469 104207 39804 65128 31700 84413 48755 69535 13345 58395
1927 58395 34797 90277 17303 14085 64559 43124 49710 71363 82986 72961 75789 4320
1915 4320 44870 39861 29449 55973 60661 17591 -1450 17329 41581 -40128 77540 47363
1903 47363 23235 100099 85297 63736 112444 67024 65020 9279 67717 50211 -7324 61619
1891 61619 60401 -14780 92823 33589 154 -7747 26468 -28247 18403 16182 26049 4563
$$ packed form
1975B57637m4267J3587l6126K878m2123M8967k3438N8110o6758M9091o5138M5056
1963A97476k2560n3350R5754q1740j7587J0793j8794m1085L6921j381K5551k6985
1951A03013Q6676j08904N2851K7172n5722q365K0984p361o4264L8733J2816j8558
1939G9071P1772K4097j44471P3738o4403K5324l3428N2713l5658K0780n6190M5050
1927E8395k3598N5480p2974l218N0474k1435O586K1653J1623j0025K828p1469
1915D320M0550n009j0412K6524M688m3070j9041J8779K4252q1709J17668l0177
1903D7363k4128P6864j4802k1561M8708m5420k004n5741N8438j7506n7535O8943
1891F1619j218p5181J07603n9234l3435p901L4215n4715M6650k221R867k1486
$$ plain form
1879 4563 80752 51458 -30445 97109 80182 -20815 68400 67411 -47317 70175 19599 22017
1867 22017 -43833 28230 -18204 -46291 18485 48520 -48017 96926 -16745 9646 82785
1856 82785 27354 23142 16518 14733 6492 -172 61674 17219 9317 35779 -18726 14995 56628
1843 56628 10302 1531 67732 -715 -2475 42345 11281 -17432 -7731 -32257 2669 -27096
1831 -27096 57642 9123 -23829 18234 -28739 -35044 20882 -10923 -9966 19005 -32384 13324
1819 13324 -29603 13557 -35939 4577 -29706 21047 1419 65255 -15876 29816 59840 -20883
1807 -20883 23194 25184 24902 -12222 30707 22628 23702 -24490 114429 46503 105455 62555 2395
1794 2395 21502 38772 44974 15387 5485 58439 -22518 11153 -21597 -35574 43532 10318
$$ packed form
1879D563P6189k9294q1903J27554j6927j00997Q9215r89j14728J17492n0576K418
1867B2017o5850P2063m6434k8087O4776L0035r6537J44943j13671K6391P3139
1856H2785n5431m212o624j785q241o664O1846m4455p902K6462n4505L3721M1633
1843E6628m6326q771O6201o8447j760M4820l1064k8713R701k4526L4926k9765
1831b7096Q4738m8519l2952M2063m6973o305N5926l1805R57K8971n1389M5708
1819A3324m2927M3160m9496M0516l4283N0753j9628O3836q1131M5692L0024q0723
1807b0883M4077J990k82l7124M2929q079J074m8192J38919o7926N8952m2900o0160
1794B395J9107J7270O202k9587r902N2954q0957L3671l2750j3977P9106l3214
$$ plain form
1782 10318 -21598 -54554 -50687 -56022 -55462 -9524 -49004 -69828 -44884 -26814 -49163 -69842 -44558
1769 -44558 -48441 -36258 9247 -66854 25184 27056 -42874 -18716 -25955 -60145 -13115 -16155 24061
1756 24061 -51321 -35501 -57570 -24276 -25166 -9446 -93314 -67327 7157 -62032 -42411 -39925
1744 -39925 -18024 -35477 -6338 -28708 -48063 -15018 -11371 -62286 38663 -35128 -68987 -37184
1732 -37184 -14251 -33245 -60172 -28443 -7083 -24108 74371 4915 -4993 35264 11357 9884
1720 9884 -13496 -10332 -20835 -55611 -34503 -60573 -50840 -69329 -90727 -54108 -41069 -37483 -37823
1707 -37823 -34253 -35294 -24142 -29327 -19099 16814 15381 -38620 -25596 -24102 -35902 5089 4201
1694 4201 -43968 -38547 -15317 -42659 -16855 8849 -63224 -106659 -6379 -72289 -47901 14240
$$ packed form
1782A0318l1916l2956L867n335N60M5938l9480k0824K4944J8070k2349k0679K5284
1769d4558l883J2183M5505p6101R2038J872o9930K4158p239l4190M7030l040M0216
1756B4061p5382J5820k2069L3294q90J5720q3868K5987P4484o9189J9621K486
1744c9925K1901j7453K9139k2370j9355L3045L647n0915J00949p3791l3859L1803
1732c7184K2933j8994k6927L1729K1360j7025R8479o9456r908M0257k3907j473
1720I884k3380L164j0503l4776K1108k6070R733j8489k1398L6619J3039L586l40
1707c7823L570j041J1152n185J0228L5913j433n4001J3024J494j1800M0991q88
1694D201m8169N421K3230k7342K5804K5704p2073m3435J00280o5910K4388O2141
$$ plain form
1682 14240 -75833 -47714 6502 -37731 -57694 -26815 24453 -88001 3849 72541 -39445
1671 -39445 21896 86108 -100407 -12174 -24685 -26846 12236 -29748 13688 -83290 -30647 5626
1659 5626 -100309 -28451 2894 -101208 43442 -2842 -50273 -26 -47737 23581 -19271
1648 -19271 2873 -49365 -74822 -69073 -43683 -139330 -44962 -30232 -56681 -43707 -46683 -52413
1636 -52413 -61749 -23003 -39296 -31562 -16713 33742 -63846 323 -47793 -27199 -73388 -14967
1624 -14967 -54633 -98874 -8398 -40990 -75641 -46535 -25093 -103674 -33838 -4429 -57291 -60143
1612 -60143 -8807 -61116 -60558 19254 -72045 -70619 -33294 -58804 -39633 2236 -49981 -21907
1600 -21907 -23070 -20605 -52039 -19680 -59249 -92378 -35636 -46013 -88611 -18946 8812 -35217
$$ packed form
1682A4240r0073K8119N4216m4233j9963L0879N1268j12454R1850O8692j11986
1671c9445O1341O4212j86515Q8233j2511k161L9082m1984M3436r6978N2643L6273
1659E626j05935P1858L1345j04102J44650m6284m7431N0247m7711P1318m2852
1648a9271K2144n2238k5457N749K5390r5647R4368J4730k6449J2974k976n730
1636e2413r336L8746j6293P734J4849N0455r7588O4169m8116K0594m6189N8421
1624a4967l9666m4241R0476l2592l4651K9106K1442p8581O9836K9409n2862k852
1612f0143N1336n2309N58P9812r1299J426L7325k5510J9171M1869n2217K8074
1600b1907j163K465l1434L2359l9569l3129N6742j0377m2598O9665K7758m4029
$$ plain form
1588 -35217 8453 36097 -55527 -5762 -46904 21717 -41595 23543 -60763 -9647 -68107 -12845
1576 -12845 -111804 -20691 -29568 -56084 -3812 -82029 -84350 -61111 -39684 -11357 28783 14651
1564 14651 51712 -75753 77312 -44499 -23714 17252 -15193 -51476 -12508 -97288 -65489
1553 -65489 -100209 -67786 -42600 -69386 -36491 -16384 -52949 -43232 -16987 7307 -50401 -49878
1541 -49878 -45613 -46230 -12221 41649 -22371 -34499 -664 -38418 -16929 23330 -37424 11041
1529 11041 -24064 -80949 -71179 -35869 -65462 -21920 -6547 16147 -42401 18604 -9087 -33971
1517 -33971 16234 -17758 -51115 14354 -40821 -20048 -27785 -55090 -10158 -57122 -54917 -60600
1505 -60600 -79075 -35009 16965 -23488 -1980 -2783 -35898 -4231 -32072 498 -56527 -54411
$$ packed form
1588c5217M3670K7644r1624M9765m1142O8621o3312O5138q4306N1116n8460N5262
1576a2845r8959R1113q877k6516N2272p8217k321K3239K1427K8327M0140j4132
1564A4651L7061j27465J53065j21811K0785M0966l2445l6283L8968q4780L1799
1553f5489l4720L2423K5186k6786L2895K0107l6565R717K6245K4294n7708N23
1541d9878M265o17L4009N3870o4020j2128L3835l7754K1489M0259o0754M8465
1529A1041l5105n6885R770L5310k9593M3542J5373K2694n8548O1005k7691k4884
1517c3971N0205l3992l3357O5469n5175K0773p737k7305M4932m6964K205n683
1505f0600j8475M4066N1974m0453K1508q03l3115L1667k7841L2570n7025K116
$$ plain form
1493 -54411 -27576 -57964 -17926 -5886 -57148 -58164 -79228 -83439 36297 -38332 5112 -91020
1481 -91020 83217 -63945 -11796 -39628 4763 -44912 32753 -74201 -24634 -81414 -11749
1470 -11749 -64916 -20653 29116 -60870 25725 -14147 -52449 -33309 1458 -35191 -26156 -36638
1458 -36638 34353 -21777 10858 -2923 -48193 -6677 47866 -57361 -23088 -51460 -104613 -55345
1446 -55345 -25744 -116374 -60578 -90093 -3732 -102743 -26452 -21927 -100277 7081 30753 -89056
1434 -89056 19002 -49302 -40436 -32931 -58982 -22074 -89417 -1969 -25238 -49065 1246 -33354
1422 -33354 -47483 41532 -49790 -15381 -37600 -65125 -28179 6990 8706 -31010 16989 -29336
1410 -29336 5758 -7008 -7675 -52321 -7615 -51264 -45598 -21988 2354 -39033 -20839 -46646
$$ packed form
1493e4411K6835l0388M0038J2040n1262j016k1064m211J19736p4629M3444r6132
1481i1020J74237j47162N2149k7832M4391m9675P7665j06954M9567n6780O9665
1470a1749n3167M4263M9769q9986Q6595l9872l8302J9140L4767l6649R035j0482
1458c6638P0991n6130L2635j3781m5270M1516N4543j05227L4273k8372n3153M9268
1446e5345K9601r0630N5796k9515Q6361r9011P6291M525p8350J07358K3672j19809
1434h9056J08058o8304Q866P505k6051L6908o7343Q7448k3269k3827N0311l4600
1422c3354j4129Q9015r1322L4409k2219k7525L6946L5169J716l9716M7999m6325
1410b9336L5094j2766o67m4646M4706m3649N666K3610K4342m1387J8194k5807
$$ plain form
1398 -46646 -25907 -12939 -42530 -33374 -32354 -5182 6670 29597 -45656 20278 -50622 -35971
1386 -35971 -39440 -16671 38686 -34425 -73752 -66561 -106782 -61535 -11874 -53011 -20437 -54098
1374 -54098 -23001 -12047 17495 -50376 -6459 -23452 12458 -28517 20414 -22101 -23554 -25592
1362 -25592 -54102 -47453 -47873 -37421 -86207 -61253 -67397 -63924 -78383 27937 -19712 13968 -19389
1349 -19389 -1033 -61672 -16530 -47437 -35841 -96465 -6201 -68035 -48445 -23990 -2987 -79017
1337 -79017 -7688 51799 -50270 -21908 17141 -68762 -38649 27846 -84215 -41100 -49638 -26087
1325 -26087 -74757 -16871 -6045 -62452 14473 1222 -86217 -2493 23669 -61199 468 2734
1313 2734 -27157 -93639 28157 -69311 -51435 41045 13137 -2202 66322 12171 5273 -14011
$$ packed form
1398d6646K0739J2968k9591R156J020K7172J1852K2927p5253O5934p0900J4651
1386c5971l469K2769N5357p3111l9327P191m0221M5247M9661m1137L2574l3661
1374e4098L1097J0954K9542o7871M3917j6993L5910m0975M8931m2515j453k038
1362b5592k8510O649m20J0452m8786K4954o144L473j4459J06320m7649L3680l3357
1349a9389J8356o0639M5142l0907J1596o0624R0264o1834J9590K4455K1003p6030
1337g9017P1329N9487j02069K8362L9049q5903L0113O6495j12061M3115q538K3551
1325b6087m8670N7886J0826n6407P6925j3251q7439Q3724K6162q4868O1667K266
1313B734k9891o6482J21796r7468J7876R2480k7908j5339O8524n4151o898j9284
$$ plain form
1301 -14011 -12605 -45493 -74255 -2499 -98229 -58739 -81004 -99891 -96509 -23776 -118901 -55034
1289 -55034 -9916 9866 -34213 10536 995 -40922 -38836 -10883 -50260 -60761 -2733 -47242
1277 -47242 -18044 20299 -27264 -21304 15096 -13808 -45626 -68764 -11149 -68472 -52638 6577
1265 6577 -26540 25599 -4646 -20932 -12241 1249 -22038 -13865 -88 31580 -30980 -49471
1253 -49471 -8013 1706 -74767 -14684 9341 -10430 -2303 -12826 -34141 -21096 31954 -51712
1241 -51712 -4090 24773 -7983 -36970 54533 -54031 10306 24426 -51044 -18160 -41713 486
1229 486 -53044 -30618 -11750 -79972 -32515 8976 -45519 30874 -25764 -14177 -5595 1179 -14146
1216 -14146 -46446 45751 -1962 -53978 -32211 -92161 -38992 -11951 -38985 -39293 -5304 7971
$$ packed form
1301a4011J406l2888k8762P1756r5730L9490k2265j8887L382P2733r5125O3867
1289e5034M5118J9782m4079M4749r541m1917K086K7953l9377j0501N8028m4509
1277d7242K9198L8343m7563N960L6400k8904l1818k3138N7615n7323J5834N9215
1265F577l3117N2139l0245j6286Q691J3490k3287Q173J3777L1668o2560j8491
1253d9471M1458R719p6473O0083K4025j9771Q127j0523k1315J3045N3050q3666
1241e1712M7622K8863l2756k8987R1503j08564O4337J4120p5470L2884k3553M2199
1229D86n3530K2426J8868o8222M7457M1491n4495P6393n6638J1587Q582O774j5325
1216a4146l2300R2197m7713n2016K1767n9950N3169K7041k7034l08L3989J3275
$$ plain form
1204 7971 -35929 -54435 88 -22737 33 21334 -9580 -28324 18379 -38521 10551 29351
1192 29351 5981 -4297 -7224 12276 -11933 -44901 3813 -121606 -53318 -9326 -66309 -22655
1180 -22655 -40148 -22186 -30290 -17692 35992 -20215 26453 15810 -97166 46718 -40489 -10545
1168 -10545 -11667 -64969 -32603 -33665 -56790 15958 -55550 64347 -54149 -24933 -11229 -96551
1156 -96551 -28368 -30214 -36310 -12193 17305 39968 -18021 24342 3949 -87021 4631 -38763
1144 -38763 -39523 -5275 -32747 -29082 -32044 -35358 -24762 -58209 31415 -22823 18857 27275 -45406
1131 -45406 13211 -5059 -5539 48047 -24273 -38305 -16961 -39570 -3672 -48600 -8348 -27588
1119 -27588 4756 -13445 -32870 -7345 -1682 -49846 56635 17318 -15439 29337 9377 -1214
$$ packed form
1204G971m3900j8506N4523k2825K2770K1301l0914j8744M6703n6900M9072J8800
1192B9351k3370j0278k927J9500k4209l2968M8714j25419O8288M3992n6983M3654
1180b2655j7493J7962q104J2598N3684n6207M6668j0643j12976J43884q7207K9944
1168a0545j122n3302L2366j062k3125P2748p1508J19897j18496K9216J3704q5322
1156i6551O8183j846o096K4117K9498K2663n7989M2363k0393r0970R1652m3394
1144c8763p60L4248k7472L665k962l314J0596l3447Q9624n4238M1680Q418p2681
1131d5406N8617j8270m80N3586p2320j4032K1344k2609L5898m4928M0252j9240
1119b7588L2344j8201j9425K5525N663m8164J06481l9317l2757M4776j9960j0591
$$ plain form
1107 -1214 -11350 -19212 -4953 7720 16666 -36443 -76145 4962 -38652 -26902 6139 -10165
1095 -10165 -19924 -71584 -12393 -34219 29640 61028 -38841 9234 22905 -35904 -48802 -80311
1083 -80311 -31634 -69649 -60663 -5705 -105282 -4064 -27299 -27605 -18457 -43846 8782 4706 16365
1070 16365 32938 -103918 22986 -35097 -85126 13775 -22099 16878 -30989 -63697 -34822
1059 -34822 -80001 -39301 -49885 -77386 12203 -96752 -53076 -65532 12599 53371 -17336 13450
1047 13450 1639 5579 74533 -4271 -21813 15624 -8317 -24092 -57885 -36580 -56398 -26740
1035 -26740 -56233 -83086 -79147 -5495 -75034 7444 -37088 -2127 17727 -28327 -40868 20806
1023 20806 -28839 26332 -3556 1151 -29821 -84244 -54974 -85028 -15793 6154 -34831 -27204
$$ packed form
1107a214j0136p862J4259J2673Q946n3109l9702Q1107m3614J1750L3041j6304
1095a0165r759n1660N9191k1826O3859L1388r9869M8075J3671n8809j2898l1509
1083h0311M8677l8015Q986N4958r9577J01218k3235l06R148k5389N2628m076J1659
1070A6365J6573j36856J26904n8083n0029R8901l5874L8977m7867l2708K8875
1059c4822m5179M0700j0584k7501Q9589j08955M3676j2456P8131M0772p0707L0786
1047A3450j1811L940O8954p8804j7542L7437k3941j5775l3793K1305j9818K9658
1035b6740k9493k6853L939P3652o9539Q2478m4532L4961J9854m6054j2541O1674
1023B0806m9645N5171k9888M707l0972n4423K9270l0054O9235K1947m0985P627
$$ plain form
1011 -27204 -40943 -15339 -9 -34763 31490 -24610 14301 -16048 -58280 9913 113 -12600
999 -12600 -11655 -42905 5987 -30798 -18182 -40563 -56851 -12910 -41518 -48081 -2306 8578 -37967
986 -37967 -22727 3556 -824 -6955 46535 44551 56522 -19063 51985 26949 -29654 41818 -26461
973 -26461 -50758 -8361 -65106 -71012 -3564 -43882 -21172 -77098 10791 7591 -10353 42485
961 42485 28279 2017 55589 30220 27987 18765 45539 31721 -64380 -11445 -58973 -81896
949 -81896 52789 -3214 -19393 7360 12985 5601 -14045 -41807 7280 -31171 56196 20666
937 20666 -13436 29457 -7028 -8765 20289 756 -575 31155 -20966 -47581 -56831 61628
925 61628 3324 11733 -20153 -73120 -47111 -2578 -28025 14927 33185 -37920 10556 29808
$$ packed form
1011b7204j3739K5604J5330l4754O6253n6100L8911l0349m2232O8193r800j2713
999a2600R45l1250M8892l6785J2616k2381j6288M3941k8608o563M5775J0884m6545
986c7967J5240K6283m380o131N3490j984J1971p5585P1048k5036n6603P1472o8279
973b6461k4297M2397n6745n906O7448m0318K2710n5926Q7889l200j7944N2838
961D2485j4206k6262N3572k5369k233r222K6774j3818r6101N2935m7528k2923
949h1896J34685n6003j6179K6753N625p384j9646k7762M9087l8451Q7367l5530
937B0666l4102M2893l6485j737K9054j9533j331L1730n2121k6615r250J18459
925F1628n8304Q409l1886n2967K6009M4533k5447M2952J8258p1105M8476J9252
$$ plain form
913 29808 4146 -50871 -6469 -42180 11334 -5444 950 40154 4713 25721 -54006 -25314
901 -25314 1624 21385 14678 42189 -41523 34233 -11274 11192 23122 -3376 -19809 8789
889 8789 -1285 -62446 -10680 -64309 -51646 -69026 -5953 -72512 -42252 -33840 -11610 -45554
877 -45554 38162 -100268 21167 -18050 -16800 20109 -44034 -34097 -57129 -90634 19163 -38391
865 -38391 -49158 45111 -60246 30773 -9874 9178 -33556 -35707 6342 22124 -24473 100096
853 100096 17903 61731 96295 14130 -25214 14704 -25071 -12516 -14179 -18084 -49153 -29189
841 -29189 48637 -10907 -4324 69704 -37712 -1092 -14001 -25781 25602 2912 27839 25747
829 25747 18877 52802 -38406 -1492 -9636 -29564 -31646 -36389 -69542 -38919 10495 -25693 -9391
$$ packed form
913B9808k5662n5017M4402l5711N3514j6778O394L9204l5441K1008p9727K8692
901b5314K6938J9761o707K7511q3712P5756m5507K2466J1930k6498j6433K8598
889H789j0074o1161N1766n3629J2663j7380O3073o6559L0260Q412K2230l3944
877d5554Q3716j38430J21435l9217J250L6909o4143R937k3032l3505J09797n7554
865c8391j0767R4269j05357R1019m0647J9052m2734k151M2049J5782m6597J24569
853A00096q2193M3828L4564q2165l9344L9918l9775J2555j663l905l1069J9964
841b9189P7826n9544O583P4028j07416L6620j2909j1780N1383k2690K4927k092
829B5747o870L3925r1208L6914q144j9928k082m743l3153L0623M9414l6188J6302
$$ plain form
816 -9391 29624 36109 23991 24482 22066 71269 -32364 63612 26440 -1357 9423 11469 4610
803 4610 -37924 -45137 -14988 -42313 -16264 -37488 -58711 15478 -51656 -1564 4462 54993 65235
790 65235 50771 54955 43765 -669 93390 11904 41316 52482 15535 3458 -47523 -14925
778 -14925 -20084 -24640 -23643 -33599 -51799 61580 -20676 45902 -13090 24498 51807 61787 14912
765 14912 14847 -26438 67018 6108 12812 43428 -11433 6482 10731 -31134 27891 32146 19803
752 19803 -14718 -31207 10633 -27573 35421 92398 7682 53520 68550 9997 49906 2151
740 2151 -30208 -7214 -782 3568 -25460 3042 26086 -49677 16809 -50746 -82577 -2658 23285
727 23285 19020 -31942 39051 84744 4342 34377 13084 22497 -12083 1901 -43785 -7739
$$ packed form
816i391L9015O485j2118M91k416M9203j03633R5976l7172k7797J0780K046o859
803D610m2534p213L0149k7325K6049k1224k1223P4189o7134N0092O026N0531J0242
790F5235j4464M184j1190m4434R4059q1486K9412J1166l6947j2077n0981L2598
778a4925n159m556R97r956j8200J13379q2256O6578n8992L7588K7309R980m6875
765A4912o5m1285R3456o0910O704L0616n4861J7915M249m1865N9025M255j2343
752A9803l4521j6489M1840l8206O2994N6977q4716M5838J5030n8553L9909m7755
740B151l2359K2994O432M350k9028K8502K3044p5763O6486o7555l1831P9919K5943
727B3285m265n0962P0993M5693q0402L0035k1293R413l4580J3984m5686L6046
$$ plain form
715 -7739 36071 10226 -25528 25153 -16290 1949 14310 -961 -47964 19551 17983 -61366
703 -61366 -11428 -7973 -16359 -8989 17055 -31171 -23065 57207 -12530 -32670 -36338 -24324 -51294
690 -51294 2789 12608 23552 35169 64984 -26782 46214 78870 20995 1128 94229 18188
678 18188 61759 34877 -27869 16814 -8894 43034 -44010 -3946 -6607 -16250 -27844 42662
666 42662 -29312 52631 13042 38595 42367 66967 37326 28784 -41120 23194 -10776 -6493 52912
653 52912 -6402 17570 16587 -24346 -32920 11689 36198 -1701 20525 80698 11703 17153 51027
640 51027 4199 87739 27135 30723 23730 36165 14610 -78638 24588 17285 -33282 55653
628 55653 -1760 -30667 110179 -20991 3569 35835 49560 26708 11320 25390 13401 -16226
$$ packed form
715g739M3810k5845l5754N0681m1443J8239J2361j5271m7003O7515j568p9349
703f1366M9938L455q386P370K6044m8226Q106Q0272o9737k0140l668J2014k6970
690e1294N4083R819J0944J1617K9815r1766P2996L2656n7875j9867R3101p6041
678A8188M3571k6882o2746M4683k5708N1928q7044M0064k661r643j1594P0506
666D2662p1974Q1943l9589K5553L772K4600k9641q542o9904O4314l3970M283N9405
653E2912n9314K3972r83m0933q574M4609K4509l7899K2226O0173o8995N450L3874
640E1027m6828Q3540o0604L588o993J2435k1555r3248J03226p303n0567Q8935
628E5653n7413k8907J40846j31170K4560L2266J3725k2852j5388J4070j1989k9627
$$ plain form
616 -16226 37482 -23194 30765 70228 -19779 -32343 -29842 -50762 -38117 -21972 26144 1580
604 1580 52555 59677 32991 60077 91918 26553 47624 19777 -16452 41522 -16131 35472
592 35472 -37565 12408 10307 -26655 -18702 41243 -33539 18003 -33480 35 -17278 63430
580 63430 26504 -7642 66901 60713 15219 27513 102104 39151 73953 80300 -8407 -66506
568 -66506 21807 2106 -16385 -13717 -14043 -30901 -64996 14084 -11199 30674 73314 33519 41512
555 41512 102883 42495 33181 49025 -17391 -10928 4796 5903 -36719 -9792 -24546 10284 -31758
542 -31758 32424 -33359 31942 31282 4235 40324 92462 -24428 20253 21624 42392 15356
530 15356 37425 25995 -61494 -150 -9429 8434 42730 56857 -43086 28549 -972 4456
$$ packed form
616a6226N3708o0676N3959L9463r0007j2564K501k0920J2645J6145M8116k4564
604A580N0975P122k6686K7086L1841o5365K1071k7847l6229N7974n7653N1603
592C5472p3037M9973k101l6962P953N9945p4782N1542n1483L3515j7313Q0708
580F3430l6926l4146P4543o188m5494J2294P4591o2953L4802O347q8707n8099
568f6506Q8313j9701j8491K668l26j6858l4095P9080k5283M1873M2640l9795P993
555D1512O1371o0388r314J5844o6416O463J5724J107m2622K6927j4754L4830m2042
542c1758O4182o5783O5301o60k7047L6089N2138j16890M4681J371K0768k7036
530A5356K2069j1430q7489O1344r279J7863L4296J4127r9943P1635k9521N428
$$ plain form
518 4456 27945 13150 180 26044 50068 56345 46826 14738 9265 -37060 75672 -21723 13518
505 13518 42385 -4924 45258 97737 15824 32232 33232 12120 28511 -23733 54400 9672
493 9672 67302 18436 49539 32253 -9986 -7358 43157 -16510 3505 -6491 26412 28745 -40932
480 -40932 35999 -26977 -31997 13562 10336 43354 71695 46529 43008 36821 38081 18080 45082
467 45082 103386 9000 74057 74660 -15190 40684 2559 -32178 -23202 36947 6885 10947 19516
454 19516 8397 13207 77039 35496 -25446 46595 24457 -3187 32972 58453 -15979 40289
442 40289 6203 24632 -621 5107 10559 9177 -10251 36700 16004 40838 75795 -8011 33464
429 33464 24391 13081 33092 26525 55896 93423 43371 57943 34869 -8815 45896 17528
$$ packed form
518D456K3489j4795j2970K5864K4024O277r519l2088n473m6325J12732r7395L5241
505A3518K8867m7309N0182N2479q1913J6408J000k1112J6391n2244P8133m4728
493I672N7630m8866L1103j7286m2239K628N0515n9667K0015r996L2903K333o9677
480d0932P6931o2976n020M5559l226L3018K8341k5166l521o187J260k0001K7002
467D5082N8304r4386O5057O03q9850N5874l8125l4737Q976O0149l0062M062Q569
454A9516j1119M810O3832m1543o0942P2041k2138k7644L6159K5481p4432N6268
442D0289l4086J8429k5253N728N452j382j9428M6951k0696K4834L4957q3806M1475
429C3464r073j1310K0011o567K9371L7527n0052J4572k3074m3684N4711k8368
$$ plain form
417 17528 79782 33874 -80 20823 19362 52538 3654 36891 63415 53736 -19683 115651
405 115651 50041 75668 57659 43356 -40923 43608 8155 -11354 53908 40916 -77 4910
393 4910 47727 -25094 77389 81877 27490 -2094 122874 30858 21811 82928 42507 12974
381 12974 75756 49744 -21064 81100 35221 2353 36521 -5209 -46984 17196 114486 6175
369 6175 71179 87241 51458 53116 141489 -2498 51531 102256 36237 -40419 75251 90474
357 90474 -5179 52847 40381 20425 -6838 40067 -63100 41469 29636 -17198 -21564 50016
345 50016 79361 55179 70901 63324 17446 65748 42574 -51737 73946 48144 46265 46103 47143
332 47143 37258 40732 50101 58809 19030 83789 84686 7695 76438 60255 58048 95035 71597
$$ packed form
417A7528O2254m5908l3954K0903j461L3176m8884L3237K6524r679p3419J35334
405A15651o5610K5627j8009j4303q4279Q4531l5453j9509O5262j2992m0993M987
393D910M2817p2821J02483M488n4387k9584J24968r2016r047O1117m0421k9533
381A2974O2782k6012p0808J02164m5879l2868L4168m1730m1775O4180R7290j08311
369F175O5004J6062l5783J658Q8373j43987N4029N0725o6019p6656J15670J5223
357I0474r5653N8026j2466j9956k7263M6905j03167J04569j1833m6834m366P1580
345E0016K9345k4182J5722p577m5878M8302k3174r4311J25683k5802j879j62J040
332D7143r885L474R369Q708l9779O4759Q97p6991O8743j6183k207L6987k3438
$$ plain form
319 71597 43739 86398 44160 48380 45713 66482 39224 15278 471 28212 -10601 29392
307 29392 686 13894 39347 -4446 -4999 46188 4921 74119 80004 101095 104760 36628 82000
294 82000 63119 18540 52361 43560 10480 44274 8035 6927 20719 24660 43312 58128 90399
281 90399 27360 30420 39290 55756 13816 126261 15128 18643 38651 31176 -32672 16925
269 16925 55062 18698 62982 65485 71820 13224 81762 -9002 -3928 -31427 24530 -36110 63426
256 63426 18163 60880 77716 90122 100443 41646 84955 86769 43469 32706 57045 31178
244 31178 73403 82325 54637 70275 69076 100943 43679 96137 57382 50092 97237 109772 28380
231 28380 78578 67094 59257 79450 12155 53671 38098 20536 24595 -10669 29073 51126
$$ packed form
319G1597k7858M2659m2238M220k667K0769k7258k3946j4807K7741l8813L9993
307B9392k8706J3208K5453m3793n53N1187m1267O9198N885K1091L665o8132M5372
294H2000j8881m4579L3821q801l3080L3794l6239j108J3792L941J8652J4816L2271
281I0399o3039L060Q870J6466m1940J12445j11133L515K0008p475o3848M9597
269A6925L8137l6364M4284K503O335n8596O8538r0764N074k7499N5957o0640R9536
256F3426m5263M2717J6836J2406J0321n8797M3309J814m3300j0763K4339k5867
244C1178M2225Q922k7688J5638j199L1867n7264N2458l8755p290M7145J2535q1392
231B8380N0198j1484p837K0193o7295M1516j5573j7562M059l5264L9742K2053
$$ plain form
219 51126 -17117 85492 61441 43433 26443 9582 55828 57288 36288 54151 -18726 43083
207 43083 16064 -10188 29406 50698 35670 82780 38593 -4268 72474 45260 61801 60330
195 60330 66880 84207 31725 78769 104600 8867 105033 61835 66755 71734 65856 56729 28062
182 28062 -22040 63077 -51850 38766 36916 -7223 80473 25074 38478 78976 83266 53074
170 53074 93459 47438 41560 51187 87813 83018 33612 72851 25203 13430 86862 37502 23864
157 23864 95539 45369 37571 4124 4098 97364 24708 138102 67775 88683 158964 55081
$$ packed form
219E1126o8243J02609k4051j8008j6990j6861M6246J460k1000J7863p2877O1809
207D3083k7019k6252L9594K1292j5028M7110m4187m2861P6742k7214J6541j471
195F0330O550J7327n2482M7044K5831r5733R6166m3198M920M979n878r127k8667
182B8062n0102Q5117j14927R0616j850m4139Q7696n5399J3404M0498M290l0192
170E3074M0385m6021n878R627L6626m795m9406L9239m7648j1773P3432m9360j3638
157B3864P1675n0170p798l3447k6R3266p2656J13394p0327K0908P0281j03883
$$ [...]
##END NTUPLES=NMR SPECTRUM
##END=
