##TITLE=1H_CG-1152-2
 CDCl3, 8 sc, 
 24.08.2021
##JCAMPDX= 6.0         $$ Bruker NMR JCAMP-DX V2.0
##DATA TYPE= NMR SPECTRUM
##DATA CLASS= NTUPLES
##ORIGIN= UXNMR, Bruker Analytische Messtechnik GmbH
##OWNER= root
$$ XWIN-NMR		Version 3.5
$$ Tue Aug 24 11:07:57 2021 Russian Standard Time (UT+4h)  she@DPX200
##.OBSERVE FREQUENCY= 200.131506
##.OBSERVE NUCLEUS= ^1H
##.ACQUISITION MODE= SIMULTANEOUS
##.ACQUISITION SCHEME= undefined
##.AVERAGES= 8
##.DIGITISER RES= 18
##SPECTROMETER/DATA SYSTEM= spect
##.PULSE SEQUENCE= zg30
##.SOLVENT NAME= D2O
##.SHIFT REFERENCE= (INTERNAL, D2O, 0, 17.5203)
##AUDIT TRAIL= $$ (NUMBER, WHEN, WHO, WHERE, WHAT)
$$ ##TITLE= Audit trail, XWIN-NMR		Version 3.5
$$ ##JCAMPDX= 5.01
$$ ##ORIGIN= Bruker BioSpin GmbH
$$ ##OWNER= she
$$ F:/spectra/data/she/nmr/H-F/1/pdata/1/auditp.txt
$$ ##AUDIT TRAIL=  $$ (NUMBER, WHEN, WHO, WHERE, WHAT)
(   1,<2021-08-24 11:06:06.32 +0400>,<she>,<DPX200>,
      <created by zg, POWCHK disabled, PULCHK disabled
       configuration hash MD5:
       00 E9 B6 7A A2 85 ED C7 34 08 36 98 17 FE 4E 26
       data hash MD5: 16K
       FE B6 AB F4 DD F9 1F 48 F8 DC 82 42 A1 75 32 74>)
(   2,<2021-08-24 11:06:08.79 +0400>,<she>,<DPX200>,
      <Start of raw data processing
       efp BC_mod = 2 LB = 0.24 FT_mod = 6 PKNL = 1 PHC0 = -13355.28 PHC1 = 10.801 SI = 16K 
       data hash MD5: 16K
       BC 30 9A 18 1C D4 BB 32 94 DB 72 8C CF 58 78 7C>)
(   3,<2021-08-24 11:06:35.01 +0400>,<she>,<DPX200>,
      <pk PHC0 = -3.286932 PHC1 = 5.6 
       data hash MD5: 16K
       A1 C7 5E D3 EB 81 A1 73 D7 0F 05 82 4D D1 A2 A1>)
(   4,<2021-08-24 11:06:38.67 +0400>,<she>,<DPX200>,
      <abs ABSG = 5 
       data hash MD5: 16K
       56 03 BB D0 87 6C 55 89 15 CE 2D 6B FD 75 3B D7>)
$$ ##END=
$$ 
$$ hash MD5
$$ A7 6D FB A6 38 DA 09 43 BD 8F 21 59 A8 F7 D4 E9
##$RELAX= 
##$RELAX= 
##$RELAX= 
##$RELAX= 
##$RELAX= 
##$RELAX= 
$$ Bruker specific parameters
$$ --------------------------
##$DU= <F:/spectra>
##$EXPNO= 1
##$NAME= <H-F>
##$PROCNO= 1
##$TYPE= <nmr>
##$USER= <she>
##$AMP= (0..31)
100 100 100 100 100 100 100 100 100 100 100 100 100 100 100 100 100 100 
100 100 100 100 100 100 100 100 100 100 100 100 100 100 
##$AQSEQ= 0
##$AQ_mod= 1
##$AUNM= <au_zg>
##$AUTOPOS= <>
##$BF1= 200.13
##$BF2= 200.13
##$BF3= 200.13
##$BF4= 200.13
##$BF5= 200.13
##$BF6= 200.13
##$BF7= 200.13
##$BF8= 200.13
##$BYTORDA= 1
##$CFDGTYP= 0
##$CFRGTYP= 5
##$CHEMSTR= <none>
##$CNST= (0..31)
1 1 145 1 1 1 1 1 1 1 1 1 1 1 1 1 1 1 1 1 1 1 1 1 1 1 1 1 1 1 1 1 
##$CPDPRG= <>
##$CPDPRG1= <>
##$CPDPRG2= <>
##$CPDPRG3= <>
##$CPDPRG4= <mlev>
##$CPDPRG5= <mlev>
##$CPDPRG6= <mlev>
##$CPDPRG7= <mlev>
##$CPDPRG8= <mlev>
##$CPDPRGB= <>
##$CPDPRGT= <>
##$D= (0..31)
0 1.2 0 0 0 0 0 0 0 0.06 0 0.03 0 0 0 0 0.0002 0 0 0 0 0 0 0 0 0 0 0 0 
0 0 0 
##$DATE= 1629788765
##$DBL= (0..7)
120 120 120 120 120 120 120 120 
##$DBP= (0..7)
150 150 150 150 150 150 150 150 
##$DBP07= 0
##$DBPNAM0= <>
##$DBPNAM1= <>
##$DBPNAM2= <>
##$DBPNAM3= <>
##$DBPNAM4= <>
##$DBPNAM5= <>
$$ [...]
##$SUBNAM3= <"">
##$SUBNAM4= <"">
##$SUBNAM5= <"">
##$SUBNAM6= <"">
##$SUBNAM7= <"">
##$SUBNAM8= <"">
##$SUBNAM9= <"">
##$SW= 20.0188882624521
##$SWIBOX= (0..15)
0 0 2 0 0 0 0 0 0 0 0 0 0 0 0 0 
##$SW_h= 4006.41025641026
##$TD= 16384
##$TD0= 1
##$TE= 0
##$TE2= 300
##$TE3= 300
##$TEG= 300
##$TL= (0..7)
0 120 120 120 120 120 120 120 
##$TP= (0..7)
150 150 150 150 150 150 150 150 
##$TP07= 0
##$TPNAME0= <>
##$TPNAME1= <>
##$TPNAME2= <>
##$TPNAME3= <>
##$TPNAME4= <>
##$TPNAME5= <>
##$TPNAME6= <>
##$TPNAME7= <>
##$TPOAL= (0..7)
0.5 0.5 0.5 0.5 0.5 0.5 0.5 0.5 
##$TPOFFS= (0..7)
0 0 0 0 0 0 0 0 
##$TUNHIN= 0
##$TUNHOUT= 0
##$TUNXOUT= 0
##$USERA1= <user>
##$USERA2= <user>
##$USERA3= <user>
##$USERA4= <user>
##$USERA5= <user>
##$V9= 5
##$VALIST= <valist>
##$VCLIST= <CCCCCCCCCCCCCCC>
##$VD= 0
##$VDLIST= <DDDDDDDDDDDDDDD>
##$VPLIST= <PPPPPPPPPPPPPPP>
##$VTLIST= <TTTTTTTTTTTTTTT>
##$WBST= 1024
##$WBSW= 4
##$XGAIN= (0..3)
0 0 0 0 
##$XL= 0
##$YL= 0
##$YMAX_a= 472819
##$YMIN_a= -458456
##$ZGOPTNS= <>
##$ZL1= 120
##$ZL2= 120
##$ZL3= 120
##$ZL4= 120
##$ABSF1= 17.50444
##$ABSF2= -2.514599
##$ABSG= 5
##$ABSL= 3
##$ALPHA= 0
##$AQORDER= 0
##$ASSFAC= 0
##$ASSFACI= 0
##$ASSFACX= 0
##$ASSWID= 0
##$AUNMP= <proc_1d>
##$AZFE= 0.1
##$AZFW= 0.1
##$BCFW= 0
##$BC_mod= 2
##$BYTORDP= 0
##$COROFFS= 0
##$CY= -3
##$DATMOD= 1
##$DC= 0
##$DFILT= <>
##$DTYPP= 0
##$F1P= 0
##$F2P= 0
##$FCOR= 1
##$FTSIZE= 16384
##$FT_mod= 6
##$GAMMA= 0
##$GB= 0
##$INTBC= 1
##$INTSCL= 1.334414e-10
##$ISEN= 128
##$LB= 0.24
##$LEV0= 0
##$LPBIN= 0
##$MAXI= 10000
##$MC2= 0
##$MEAN= 0
##$ME_mod= 0
##$MI= 1.114404
##$NCOEF= 0
##$NC_proc= -3
##$NLEV= 6
##$NOISF1= 3.799351
##$NOISF2= 2.8
##$NSP= 0
##$NTH_PI= 0
##$NZP= 0
##$OFFSET= 17.52032
##$PC= 1
##$PHC0= -13358.57
##$PHC1= 16.401
##$PH_mod= 1
##$PKNL= yes
##$PPARMOD= 0
##$PSCAL= 0
##$PSIGN= 0
##$REVERSE= no
##$SF= 200.130002863296
##$SI= 16384
##$SIGF1= 3
##$SIGF2= 2
##$SINO= 5.538805
##$SIOLD= 16384
##$SREGLST= <1H.CDCl3>
##$SSB= 0
##$STSI= 16384
##$STSR= 0
##$SW_p= 4006.41025641026
##$SYMM= 0
##$S_DEV= 0
##$TDeff= 16384
##$TDoff= 0
##$TI= <>
##$TILT= no
##$TM1= 0
##$TM2= 0
##$TOPLEV= 0
##$USERP1= <user>
##$USERP2= <user>
##$USERP3= <user>
##$USERP4= <user>
##$USERP5= <user>
##$WDW= 1
##$XDIM= 16384
##$YMAX_p= 296128840
##$YMIN_p= -41826
$$ End of Bruker specific parameters
$$ ---------------------------------
##NTUPLES= NMR SPECTRUM
##VAR_NAME=  FREQUENCY,     SPECTRUM/REAL,   SPECTRUM/IMAG
##SYMBOL=    X,             R,               I
##VAR_TYPE=  INDEPENDENT,   DEPENDENT,       DEPENDENT
##VAR_FORM=  AFFN,          ASDF,            ASDF
##VAR_DIM=   16384,         16384,           16384
##UNITS=     HZ,            ARBITRARY UNITS, ARBITRARY UNITS
##FACTOR=    0.24454680195387, 1,            1
##FIRST=     3506.34187034866, 0,            0
##LAST=      -500.068386061595, 0,           0
##MIN=       -500.068386061595, -41826,      0
##MAX=       3506.34187034866, 296128840,    0
$$ Real data points
##PAGE= N=1
##DATA TABLE= (X++(R..R)), XYDATA
$$ [...]
7129a250r896J8001L49l6965J8333J1214j69n047m511K0194N741r742J274J321
7115H847k118j472M45n576P328j3815J4244M297j6353J1467j26J985J6436R995
7101C5584j4418J048O746L0605k42q710j1290p467j612P062L767J3936j8654j5610
7087B0745M921l107r262N239m530m334j2313M57J618j98m755r844K1062l723j7010
7072a5034n091M107J2799M014K455n175l91p850n225Q396j969J0070J3852K847
7058A7805o545o97k131l900o491k613K762k57r349J2408O459l112q195J5012P279
7043A8435j7899p357L602m833k428o518R235m000o00J1582k31n494N505Q91r016
7028i126L987k779m312K4811k3715j4186J4557M940N085L401n271q16J950Q863
$$ plain form
7129 -1250 -11146 6855 7204 -29761 -11428 -214 -383 -5430 -9941 10253 15994 6252 7526 8847
7115 8847 6729 5257 5702 126 7454 -6361 7883 12180 -4173 7294 7168 9153 25589 35584
7101 35584 21166 22214 28960 59565 59323 50613 39323 31856 30244 37306 41073 55009 36355 20745
7087 20745 25666 22559 13297 18536 14006 9672 -2641 -2184 -566 -764 -5519 -15363 5699 1976 -15034
7072 -15034 -20125 -16018 -3219 795 3250 -1925 -2316 -10166 -15391 -6995 -8964 1106 14958 17805
7058 17805 11260 10563 8432 4532 -1959 -4572 -1810 -2067 -11416 992 7451 4339 -3856 11156 18435
7043 18435 536 -6821 -3219 -8052 -10480 -16998 -7763 -11763 -12363 -781 -1012 -6506 -1001 -110 -9126
7028 -9126 -5139 -7918 -12230 12581 -11134 -25320 -10763 -5823 -738 2663 -2608 -3424 -1474 7389
7014G389j2419J4785o541J108J1393Q564Q13M302R574l535n136l3005J1154M381
7000A2827j7414R779m673j2570Q563P298J0147O285j5817j1828l198J1795J0952
6987A2146r335o342o958R260p209k596m549J386R772J1579L563j717J924Q97q655
6972C166M725N294P666N080J7124o822m474J316K451o089j0709k019J03Q21m228
6957A3405K623p126j0853Q256J0967l650o461P060j4579O541l833j0944J6233
6944G639J2701k602j1361j0269K6508J724k8388M92J2012J6733j2234K804r303
6931F456N697M046M039j1487N036j1311o338J4765r412R227K527J3573l740j6205
6917F873n812L690O986N411O932m285p2j162O713R15j3333Q26m657K2201q196
$$ plain form
7014 7389 -5030 9755 3214 4322 15715 24279 25092 29394 38968 35433 30297 -2708 8446 12827
7000 12827 -4587 5192 519 -12051 -3488 3810 13957 20242 4425 -7403 -10601 1194 12146
6987 12146 2811 -3531 -10489 -1229 -8438 -11034 -15583 -14197 -4425 7154 10717 9000 10924 11821 3166
6972 3166 7891 13185 20851 25931 43055 36233 31759 33075 35526 29437 18728 16709 16812 17633 13405
6957 13405 16028 8902 -1951 6305 17272 13622 7161 14221 -358 6183 2350 -8594 7639
6944 7639 20340 17738 6377 -3892 22616 24340 -4048 -3556 8456 25189 12955 15759 6456
6931 6456 12153 16199 20238 8751 13787 2476 -3862 10903 1491 10718 13245 26818 23078 6873
6917 6873 1061 4751 11737 17148 24080 19795 19723 18561 25274 26189 12856 13682 9025 31226 23030
6902B3030m521K394p65l31M267J8228j0361j0459r792o573J7597K80j0220j938
6888A0836O484o158O856L135q503j311m492n620P212J3598J1781l386J449R27
6874C2808j2738J0082J4493Q389M817K2666R288L875j2365j5186k5543k93p723
6861C2570r427q710M490j2050L61J3266r292p729M788J6078q703j3948K10O523
6847H427M474r953O575L195J085p992L424l593n642J3536p404O267j679l114N761
6832A3367n561J1672M402j3111J2390J196j3542k605n390M868K461L899Q64O267
6818B1177j1044o159M406N50K262n413P615p035K650q411K969o789p565J3543
6804B756k090l634O253L399o770j622Q362l08m86o750J3947j602n237Q211r666
$$ plain form
6902 23030 18509 20903 20138 19807 24074 42302 31941 21482 11690 5117 22714 22994 12774 10836
6888 10836 17320 11162 18018 21153 12650 11339 6847 1227 8439 22037 33818 30432 31881 32808
6874 32808 20070 30152 44645 53034 57851 80517 89805 93680 81315 66129 40586 40293 32570
6861 32570 23143 14433 18923 6873 7234 20500 11208 3479 8267 24345 15642 1694 1904 8427
6847 8427 12901 2948 9523 12718 13803 5811 9235 5642 0 13536 6132 12399 10720 7606 13367
6832 13367 7806 19478 23880 10769 23159 24355 10813 8208 2818 7686 10147 14046 14910 21177
6818 21177 10133 3974 8380 8930 11192 5779 13394 6359 9009 598 3567 -3222 -10787 2756
6804 2756 666 -2968 3285 6684 -86 -1708 6654 6346 5860 -890 13057 11455 6218 14429 4763
6789D763O538l5l845J4197j5346j2586L068J1267j5876M424K2436p870l273M91
6775H353k005L556J4868K247j229o456m25m890N764k427R1K050M625m03j177O203
6759B8745j4883l972P064q347m437P315P012n234J0721R250J5682m919k5587m479
6745A3931K2838j8924o392J6951M6K02O81P528Q448n564j1914J4633J0343P531
6731F0338j0012L273j0840Q45l40J7999J990L33j9941J0987K111M025K0511L899
6717H5178j720j9074k1624P829R434p151K218N632J7613j5407o672O836K3216
6704H6308r0o839j420N582L440P270n917k141Q271J4156J5962k0651p437Q181
6690A04675K6574j996j7053P366n815J7108N095l97J777j5991N929J2922J0935
$$ plain form
6789 4763 11301 11266 7421 21618 6272 -6314 -3246 8021 -7855 -3431 19005 11135 7862 8353
6775 8353 6348 9904 24772 27019 25790 19334 18909 14019 19783 17356 17447 19497 24122 23719 22542 28745
6759 28745 13862 9890 16954 8607 4170 11485 18497 13263 23984 33234 48916 43997 18410 13931
6745 13931 36769 17845 11453 28404 28450 28652 29333 36861 45309 39745 27831 42464 52807 60338
6731 60338 50326 53599 42759 43604 43264 61263 63253 63586 43645 54632 56743 60768 81279 85178
6717 85178 83458 64384 42760 50589 60023 52872 55090 60722 78335 62928 56256 63092 86308
6704 86308 86218 79379 77959 83541 86981 94251 88334 86193 94464 108620 124582 103931 96494 104675
6690 104675 131249 129253 112200 119566 113751 130859 135954 135557 137334 121343 127272 140194 151129
6677A51129j0529J2716k499J0068J1196j3031J2779Q015o494M426J1533O54J0924
6664B00887Q832R112K320J2429J6925K2062R364l53l629Q066K3679K3302J3649
6651C46645J5885L5955L0454J0267K6680K2805N6698L3914M5462N6477K7352J6541
6639G25135N7308N0277K9645J2126K0956L3602L78j7397L337q73k1224m1587k8431
6626H23252n146k7344l8329m5587k1527m5378m2162l0095k8301k8309k0010l7776
6614D53288j8361o697l7064j7163j3700k5608k3879j1983n246j7183j2143j8243
6602B46018o70L053j0671j8225r005j4572j5993j1303M247n72r579p018R040o215
6588A58535Q546r646j8006K3059O134q713J554j8951O385j3538j6669P629J04
$$ plain form
6677 151129 140600 153316 150817 160885 172081 159050 171829 179844 173350 177776 189309 189963 200887
6664 200887 209719 218831 221151 233580 250505 272567 281931 281578 277949 286015 309694 332996 346645
6651 346645 362530 398485 428939 439206 465886 488691 545389 579303 624765 681242 708594 725135
6639 725135 782443 832720 862365 874491 895447 929049 929427 912030 915367 914494 893270 851683 823252
6626 823252 818106 790762 752433 706846 685319 639941 597779 567684 539383 511074 491064 453288
6614 453288 434927 428230 391166 374003 360303 334695 310816 298833 293587 276404 264261 246018
6602 246018 245348 248401 237730 219505 210500 195928 179935 168632 172879 172307 162728 155710 164750 158535
6588 158535 167081 157435 139429 162488 168622 159909 161463 142512 148897 135359 118690 126319 126423
6575A26423j0200q305P256j1782j0605K56j2607j2893j056l510R622r261J202
6562F4540J5890L697j624m354k903k476J27J3098p868p817M942P940j5365k122
6548F5705J0343n125j026m93j873K463r352l387L102P068p032j3807J0432J0752
6534F7770n656p960j1894l755l75l02P227R569p950o114J3565m687J341o939r489
6519C4351O475K46j3690J2345J3777j492o802j4642M083N329J545J9106J6501
6506G7132k3793j5191O198P671j2225o100J9310O565j3046n480K8491n796j3999
6493D9737K495J2102q024p780O987j997J855o834Q138O746J350j4912M452O047
6479F0362j3497O114J3414m304j5589K72J8245J539j2321N801J6094l438M934
$$ plain form
6575 126423 116223 107918 115174 103392 92787 93043 80436 67543 66487 62977 72599 63338 64540
6562 64540 80430 84127 82503 78149 75246 72770 72897 85995 78127 70310 75252 83192 67827 65705
6548 65705 76048 70923 69897 69404 67531 69994 60642 57255 60357 67425 60393 46586 57018 67770
6534 67770 62114 54154 42260 38505 38130 37828 45055 54624 46674 40560 54125 49438 50779 43840 34351
6519 34351 40826 41072 27382 39727 53504 52012 45210 30568 34651 39980 41525 60631 77132
6506 77132 53339 38148 44346 52017 39792 33692 53002 59567 46521 41041 69532 63736 49737
6493 49737 52232 64334 56310 48530 55517 53520 55375 48541 56679 63425 64775 49863 54315 60362
6479 60362 46865 52979 66393 62089 46500 46772 65017 66556 54235 60036 76130 72692 77626
6466G7626R960L597j0060j0847R419p556P52J3436M964n377J2551n365O023m892
6452I4231q159K0097K72k296J985Q706J3157R24J542Q166M650J5947o459j087
6438A51676J7094J789N392J5536J3909n357k278J3242J4910J2759p078J7190Q541
6425B57325N047j82n864M464K587k353M263n441K744N878j9634o663l141j835
6411B37195j3360Q102j1536j3591n51p410j892j6270j1496k0697P245j7342k5089
6398A13308J3329M361m562o965k3834J2343n950k5198K1484o761k314m451M919
6385H9709M161Q161k0036J753m034p471K809Q771l757j6936j026J1786R082j4532
6371F8440o819J4243k474j395J1934j1560M099M709o056m018K954j718n62J3367
$$ plain form
6466 77626 87586 91183 81123 70276 79695 72139 72891 86327 91291 85914 98465 93100 99123 94231
6452 94231 86072 106169 106441 104145 106130 114836 127993 128917 130459 138625 143275 159222 152763 151676
6438 151676 168770 170559 175951 191487 205396 200039 197761 211003 225913 238672 231594 248784 257325
6425 257325 262372 262190 256326 260790 263377 261024 265287 259846 262590 268468 248834 242171 239030 237195
6411 237195 223835 231937 220401 206810 206259 198849 196957 180687 169191 148494 155739 138397 113308
6398 113308 126637 130998 126436 119471 95637 107980 102030 76832 98316 91555 89241 84790 89709
6385 89709 93870 102031 81995 83748 79714 72243 75052 83823 80066 63130 62104 73890 82972 68440
6371 68440 61621 75864 73390 71995 83929 72369 76468 81177 75121 71103 74057 72339 71777 85144
6357H5144oj1718K711Q592J4975n684l96J7984J9785p146j690N408M557K2596
6343A55112p822Q877J2461K395R251J503N281K9056J4244N948J1797j4238j0570
6330B23295P323N212k0264J1752k183j6739k3342m649J7935O625k5596r511J4376
6317A84234j4376j2090o818k0892o563M946n663k7193o743j1352M707n653r538
6304F7006P194k232n899j032j5216j9334O203M88m042O24k287M143P3p780O587
6289C4496P933p184o99J2353l799j1251j4643J0401J7070k817j1732J3938m119
6276C9947k0664J3068O09k1785P359n982J5582N322j6373P539J3142j3032J6090
6263D0822p241M927k611q875Q112j601K042k6318O291r925j319J3987q723k766
$$ plain form
6357 85144 85138 73420 76131 84723 99698 94014 93618 111602 131387 124241 122551 127959 132516 155112
6343 155112 147290 156167 168628 171023 180274 181777 187058 216114 230358 236306 248103 233865 223295
6330 223295 230618 235830 215566 227318 225135 208396 185054 180405 198340 204965 179369 169858 184234
6317 184234 169858 157768 150950 130058 123495 128441 122778 95585 88842 77490 82197 76544 67006
6304 67006 74200 71968 66069 65037 49821 30487 36690 37178 33136 33760 31473 35616 35689 27909 34496
6289 34496 42429 35245 34546 46899 43100 31849 17206 27607 44677 41860 30128 44066 39947
6276 39947 19283 32351 32960 11175 18534 12552 28134 33456 17083 24622 37764 24732 40822
6263 40822 33581 38508 35897 27022 35134 33533 35575 9257 15548 5623 4304 18291 9568 6802
6249F802J4803o70j8608O77m569J1876N463n367k358j762Q735N551q306n794L581
6234A0054j4820j712J2184J3187j7165j9126M295O759K0589q983r41J4670j9345
6221c54m903O369O716R58o301j2898K1535r873j5916J8368J0381p831j5310J4852
6207E793J4934J406k4731Q142N021j7510j2833J4561o557L443M897l088O653n740
6193e609K478l579k310n28J3128n81j0525M448j0963j4490J3799P214Q31o479
6179a3166n7J6062J0924j1375r01P588L780j7028J5818J5463j4062q405n633J4569
6165A3577K284k312R565L480p862j0507o290m51J1997j1220o569J207K448j1697
6151a2350J3858n571O82J0845j4293R455L589O097k4190L808Q519Q92l054m11
$$ plain form
6249 6802 21605 20935 2327 3004 -1565 10311 15774 10407 8049 6287 15022 20573 12267 6473 10054
6234 10054 -4766 -6478 5706 18893 1728 -17398 -13103 -6344 14245 5262 4321 18991 -354
6221 -354 -5257 1112 7828 8786 2485 -10413 11122 1249 -14667 3701 14082 6251 -9059 5793
6207 5793 20727 22133 -2598 5544 10565 -6945 -19778 -5217 -11774 -8331 -3434 -6522 131 -5609
6193 -5609 -3131 -6710 -9020 -9548 3580 2999 -7526 -3078 -14041 -28531 -14732 -7518 -6687 -13166
6179 -13166 -13223 2839 13763 2388 1487 9075 12855 -4173 11645 27108 13046 4641 -992 13577
6165 13577 15861 13549 23114 26594 18732 8225 1935 1484 13481 2261 -4308 -3101 -653 -12350
6151 -12350 1508 -4063 -3381 7464 -6829 2626 6215 12312 -11878 -8070 449 1341 -1713 -2124
6137b124O50J225j4644J0926J3346j7711M010J0872J2720M286k1295o43L0863
6124C2481l056j7315J6435J8816l2291p53L752J6974m702k6543K2977J142k2048
6111E869P084J4450r937k9638%L2659N676J753L15o762J4679o954L520j1972j0540
6096A0202J0177m339O451O046j1391K819M741j4308l91L890K866q487N95J1462
6082B0333n685j7780j1372M522j212l601m162L965N832K589j600l73Q753p317
6068g108J3345L306n432p907J1913j0432j2858J1703k390j3031N685L401J9133
6055I328j1089l0253K068J6904k816N786P993j1655M327J1065l484o843r278R977
6041g970J0552j1869L482N359n390J959K251j3638K600j2760K090J2521o618n019
$$ plain form
6137 -2124 -1474 -249 -14893 -3967 9379 -8332 -4322 6550 19270 23556 2261 1618 32481
6124 32481 29425 12110 28545 47361 15070 14317 18069 35043 30341 3798 26775 27917 5869
6111 5869 12953 27403 17466 -12172 -12172 20487 26163 27916 28231 21469 36148 29194 32714 20742 10202
6096 10202 20379 16040 22491 28537 17146 19965 24706 10398 10007 13897 16763 8276 8871 20333
6082 20333 14648 -3132 -14504 -9982 -11194 -14795 -18957 -14992 -9160 -6571 -8171 -8544 209 -7108
6068 -7108 6237 9543 4111 -3796 8117 -2315 -15173 -3470 -5860 -18891 -13206 -9805 9328
6055 9328 -1761 -32014 -29946 -13042 -15858 -10072 -2079 -13734 -9407 1658 -1826 -8669 -17947 -7970
6041 -7970 2582 -9287 -5805 -446 -5836 -3877 -1626 -15264 -12664 -25424 -23334 -10813 -17431 -22450
6027b2450L898J916L411J5075j3157J416J1590n688n771j0422j599N979j0050
6014b5852Q10M942l827l974k93J6634n172p01L014o487L067j3014P620J3589j242
5999a0886q099j712J6400o862K817j4872O203J1865L150j2032L275Q165k4582
5986b7170P238K4791l008l590J0871M821j9833L725J0636L412N209q73Q151J2535
5972C6915J317k385J0382K559n613k390J3502N343K030j3088q441M783q822L50
5958C6442K261r804k5488M83n811O530R46j0054o33J931r48j9086P359k716N793
5943a2795R510k0044M445J3542k088R907p834q982Q119m845l740k689K288n790
5929b0996K1369O468j4401N572n058q371o740M223N001R840j4722J0123n234p455
$$ plain form
6027 -22450 -18552 -16636 -13225 1850 -11307 -9891 1699 -3989 -9760 -20182 -21781 -15802 -25852
6014 -25852 -25042 -20100 -23927 -27901 -28194 -11560 -16732 -17433 -14419 -20906 -17839 -30853 -23233 -9644 -10886
5999 -10886 -18985 -20697 -4297 -11159 -8342 -23214 -17011 -5146 -1996 -14028 -10753 -2588 -27170
5986 -27170 -19932 4859 1851 -1739 9132 13953 -5880 -2155 8481 11893 17102 16229 24380 36915
5972 36915 38232 35847 46229 48788 43175 40785 54287 59630 61660 48572 40131 44914 36092 36442
5958 36442 38703 28899 3411 3894 -1917 4613 5559 -4495 -5128 -3197 -4145 -23231 -15872 -18588 -12795
5943 -12795 -3285 -23329 -18884 -5342 -7430 2477 -5357 -14339 -6220 -11065 -14805 -17494 -15206 -20996
5929 -20996 373 6841 -7560 -1988 -7046 -15417 -22157 -17934 -12933 -3093 -17815 -7692 -12926 -20381
5915b0381K589k421L201J253M101P132l152r571N231p573j1615J0570K162P871
5901a0603r971J2531N091J537k0962l922J9586j4130K15j0744J3349M211J883
5888a1929r192m077N345n409J572K0140p896j3528L174Q477O643j8372J922J0465
5874a2665l720j0187J0912Q341K384j0066j8438K5229Q286k2586J3179p667j1854
5861b8852Q088J1507o30j055L426l700J2919k1053J1703P402o499M562O193q565
5847d554j7299L512k34M804n788p160K2818L266j4031j614J621L132p311j8350
5833c7188J2256Q613R9l743Q310j0452j0883R720J9847r719J946j2704p62p195
5819c1855J842K1061n603j4590J749J7298K143J6746k1983K729J12j5169n644
$$ plain form
5915 -20381 -17792 -20213 -17012 -15759 -11658 -4526 -7678 -17249 -12018 -19591 -31206 -20636 -18474 -10603
5901 -10603 -20574 -8043 -2952 -1415 -22377 -26299 -6713 -20843 -20628 -31372 -18023 -13812 -11929
5888 -11929 -21121 -25198 -19853 -25262 -23690 -3550 -11446 -24974 -21800 -13323 -6680 -25052 -23130 -12665
5874 -12665 -16385 -26572 -15660 -7319 -4935 -15001 -33439 -8210 76 -22510 -9331 -16998 -28852
5861 -28852 -20764 -9257 -9887 -10942 -7516 -11216 1703 -19350 -7647 -245 -6744 -2182 4011 -4554
5847 -4554 -21853 -18341 -18575 -13771 -19559 -26719 -3901 -635 -14666 -16280 -14659 -11527 -18838 -37188
5833 -37188 -24932 -16319 -16220 -19963 -11653 -22105 -32988 -23268 -3421 -13140 -11194 -23898 -24660 -31855
5819 -31855 -30013 -8952 -14555 -29145 -27396 -10098 -7955 8791 -13192 -10463 -10351 -25520 -31164
5806c1164K0718M521r535p258L088L386Q925q348R021P118p090j006P711p499
5792g412r295n231j075J7708k358j5467K089l908k782m895R623J4970Q296l3112
5778c2849K0380R520k6455J836n760J1347J6124j0808k0888J8209P591n835p051
5765b4639J8675j6391k771p367J5946J5557j0268O66k425K725p578L079n955l811
5751b4557j2629J3950N519l376o850r969K8195J2302k2669p064J3726J5108r666
5738g980R389k966L802Q77j2517m285q424J2397Q21o993m229J918M852J1458M32
5723a448L226j7949k525K1243j5385j8863J4128n565q09l331J6686L637m987J421
5709a0521o831j252J939J0584J1307j9188L592P655J9371l944l0546L216R828
$$ plain form
5806 -31164 -10446 -5925 -15460 -22718 -19630 -16244 -7319 -15667 -6646 472 -6618 -7624 87 -7412
5792 -7412 -16707 -21938 -23013 -5305 -7663 -23130 -21041 -24949 -27731 -32626 -23003 -8033 263 -32849
5778 -32849 -12469 -2949 -29404 -27568 -33328 -21981 -5857 -16665 -37553 -19344 -11753 -17588 -24639
5765 -24639 -5964 -22355 -25126 -32493 -16547 -990 -11258 -10592 -13017 -10292 -17870 -14791 -20746 -24557
5751 -24557 -37186 -23236 -17717 -21093 -27943 -37912 -9717 2585 -20084 -27148 -13422 1686 -7980
5738 -7980 1409 -1557 2245 3122 -9395 -13680 -22104 -9707 -8886 -15879 -20108 -18190 -13338 -1880 -1448
5723 -1448 1778 -16171 -18696 2547 -12838 -31701 -17573 -23138 -23947 -27278 -10592 -6955 -11942 -10521
5709 -10521 -17352 -18604 -16665 -6081 5226 -13962 -10370 -2715 16656 12712 -17834 -14618 -4790
5696d790p639j6011J1348J1670q682n843k158M694K724K216j855J311j726P00
5682a4041Q404J2784j4452L205J255L51Q798q105m044L375r771n223k888j0056
5668c0408J6371q302J162J3135j3406J770J6597j4162M124J4672o234l576K235
5655f022j1220P295l125j055J9433J087L044q794j1174J6813r931L072J551L257
5641D231k3788o966J1402J1113o302m031J4984m818L84J440m605L138j5897k596
5627b2311K4478P793r797K824J649p483K010M736k548L023k996p291L225p419
5613a0107J564n006J800J3690j5435M792j959q393J022J061M727O154r678O176
5599i592J0063l486R131J1493L751j5607R016N781p802j2134K595N287M290j3780
$$ plain form
5696 -4790 -12429 -28440 -17092 -5422 -14104 -19947 -22105 -17411 -14687 -12471 -14326 -13015 -14741 -14041
5682 -14041 -5637 7147 -7305 -4100 -2845 -2494 6304 -1801 -5845 -2470 -12241 -17464 -20352 -30408
5668 -30408 -14037 -22339 -21177 -8042 -21448 -19678 -3081 -17243 -13119 1553 -4681 -8257 -6022
5655 -6022 -17242 -9947 -13072 -14127 5306 6393 9437 643 -10531 6282 -3649 -577 974 4231
5641 4231 -19557 -26523 -15121 -4008 -10310 -14341 643 -4175 -3791 -2351 -6956 -3818 -19715 -22311
5627 -22311 2167 9960 163 2987 4636 -2847 -837 3899 1351 4374 1378 -5913 -2688 -10107
5613 -10107 -8543 -13549 -11749 1941 -13494 -8702 -10661 -19054 -18032 -16971 -12244 -6090 -15768 -9592
5599 -9592 471 -3015 6116 17609 21360 5753 14769 20550 12748 614 3209 8496 12786 -994
5585i94N491N968O831j6014M873J4183M106j7364p039K1755q171q909J1362J0451
5571B6529j1071J606n392M010J7984J735p649O78O51l6q609P662j5053j3134k812
5556b901Q471q564j2917N360J4024J1970j282o369O393J396j5121P064r19N141
5542A1746j6520R54J6248n740n917N987Q252P829N256p500j1931j2991j45j4513
5528a8985J2159N898j847J5808P255o739K302o616j5445J3716l409N758m829o855
5514a829o065J7313j0812m337J4892Q779j4428N739J2689o815p257K55o89L499
5500A0934R485o829m195n034l549J0889n746j2415P881n17k887P803K649k694
5486E775k373j0976K2935J3217j6601j201J877L509m886R952p16p41k578J39o995
$$ plain form
5585 -994 4497 10465 17296 1282 6155 20338 24444 7080 41 21796 13625 4716 16078 26529
5571 26529 15458 17064 11672 15682 33666 35401 27752 28430 29081 29045 20436 28098 13045 -89 -2901
5556 -2901 5570 -2994 -15911 -10551 3473 15443 14161 7792 14185 15581 460 7524 6605 11746
5542 11746 -4774 -3820 12428 6688 771 6758 15010 22839 28095 20595 8664 -4327 -4472 -18985
5528 -18985 -6826 -928 -2775 13033 20288 13549 15851 9235 -6210 7506 4097 9855 5026 -1829
5514 -1829 -7894 9419 -1393 -5730 9162 17941 3513 9252 21941 15126 7869 8124 7435 10934
5500 10934 20419 13590 9395 4361 812 11701 5955 -6460 1421 904 -1983 5820 8469 5775
5486 5775 3402 -7574 15361 28578 11977 10776 12653 16162 11276 21228 20512 19771 17193 17332 10337
5471A0337j9423j828J3811r087r232Q81J5693J4744n937J3486n977o365p032q87
5457C184j4937J0027j5029J9940P461r530P563K823p931K65p968j3125P721N985
5443c551m158l642J45P328l735n286L967J6183m939p278l305Q668P213n022Q618
5428A1206j3368M47K204j804m401o610J4516J1628j3126j1781j6256O906K2259
5415A820j987j96n629R254N730j140Q060j3008q348k217K0532n198j4792K0708
5401A3589J1062j2233k922m216J4088q925O81K0892L127k4161j330P940O098r773
5387A3917j7853K1623J417o847M209P745q610k652J0496J2673m521p82M025k024
5373C2816j2412n043K1598l992K262r652M961p532r966L892m304J0138L617N193
$$ plain form
5471 10337 -9086 -10914 2897 -6190 -15422 -14541 1152 15896 9959 23445 17468 11103 4071 3184
5457 3184 -11753 -1726 -16755 3185 10646 1116 8679 11502 3571 3836 -4132 -17257 -9536 -3551
5443 -3551 -7709 -11351 -11206 -3878 -7613 -12899 -8932 7251 2312 -4966 -8271 397 7610 2588 11206
5428 11206 -2162 -1715 489 -1315 -5716 -12326 2190 13818 692 -11089 -27345 -20439 1820
5415 1820 -167 -363 -5992 3262 8992 7852 15912 2904 -5444 -7661 12871 7673 -7119 13589
5401 13589 24651 12418 9496 5280 19368 10443 11124 32016 35143 10982 9652 17592 23690 13917
5387 13917 -3936 17687 19104 12257 16466 24211 15601 12949 23445 36118 31597 30815 34840 32816
5373 32816 20404 15361 36959 32967 35229 25577 30538 23006 13040 16932 12628 22766 26383 31576
5359C1576l274R152j1384k896P322o513p003M838J0991q599N871N279L688j1567
5345B7481J916J0681q752k618k3781O745J8544k0999J3911l094k090J5909o375
5332B7478j893K19k089J036R69l484J70o146R841j208j0876p208K1213p640l547
5317A6835N252L2L345j3534k638Q446J8086j3704j274l56R859L503j1789O492
5303B8555m02O94K268L393o326R581M903M929Q53o441l738J1240M810Q896K050
5288F5265L549J0934J4234j2470j0287J6630j3034p95L56K233P472o306j6209
5275F1572J7510K545j52j9732J4110J7277j9033j4664M249j216l183o786o929
5262D5568q503P877J8301j822l735O648J11m82K2574j7748k368l598m351n279
$$ plain form
5359 31576 28302 37454 26070 23174 30496 23983 16980 21818 32809 24210 30081 35360 39048 27481
5345 27481 29397 40078 31326 28708 4927 11672 30216 9217 23128 20034 17944 33853 27478
5332 27478 25585 25804 23715 24751 25720 22236 22406 16260 26101 24893 14017 6809 28022 20382 16835
5317 16835 22087 22119 25464 11930 9292 17738 35824 22120 20846 20490 30349 33852 22063 28555
5303 28555 28153 28847 31115 34508 28182 37763 42666 47595 48448 42007 38269 49509 54319 63215 65265
5288 65265 68814 79748 93982 81512 71225 87855 74821 74026 74382 76615 84087 77781 61572
5275 61572 79082 81627 81475 61743 75853 93130 74097 59433 63682 62466 59283 52497 45568
5262 45568 37065 44942 63243 61421 57686 64334 64445 63963 86537 68789 66421 62823 58472 53193
5248E3193N367R304N887m633n680J4655M615l722R339J1543m382O090M156j6985
5234H8747j0053p324J1023j10o183j2486J1462O432j2213N503o87P871p129j6464
5220E8389K2542J0817k0084p280K2628Q183j4477l278J8073m411j6914R35K273
5207G7396j3803k653Q927j7178P00N892n726m284p620m19Q164N825n66J4743j3198
5192E6200j5525K4713N05P095j7956N975J7702N49k1320o583j728K5403l150J06
5178G1986j2836j082Q534O042Q124k3807j0707J0367J0681R758k724k6455J0019
5165E7900M452M639k57K909p779j2148J4825K9493o446j6718O052O076N307J795
5151I0100K873J5019J1486K0949J7340j5900p911J3729K2022J397N339M656j4831
$$ plain form
5248 53193 58560 67864 73751 69118 63438 78093 82708 78986 88325 99868 95486 101576 105732 88747
5234 88747 78694 71370 82393 82283 76100 63614 75076 81508 69295 74798 74111 81982 74853 58389
5220 58389 80931 91748 71664 64384 87012 95195 80718 77440 95513 91102 74188 75123 77396
5207 77396 63593 60940 69867 52689 53389 59281 53555 49271 41651 41232 49396 55221 54655 69398 56200
5192 56200 40675 65388 65893 72988 55032 61007 78709 79258 57938 51355 49627 75030 71880 71986
5178 71986 59150 58068 66602 72644 80768 56961 46254 56621 67302 77060 74336 47881 57900
5165 57900 62352 66991 66734 69643 61864 49716 64541 94034 87588 70870 76922 82998 88305 90100
5151 90100 92973 107992 119478 140427 157767 141867 133956 147685 169707 171104 176443 181099 166268
5138A66268K9136J402j9277r688N116K487J0364J0551m390N464N620O538J6440
5125B26031J895J9166J1556j3419O169K4041J8961J3092J5253J7268J3952L2782
5113C86747j0270j9566k3810k2595k1195j5726n140k0022n872n319N682j0797
5101B32117l911m039L711j8985p973J8985n546k0186K339J500l96j2147p81K6356
5087B11044R568k4287j7609l495j3376l8263L998l773M742k4444q758K6093k1581
5074I9859p992J6852R872j6952j3743o01J0076k588j2535n366M924n515O853j3532
5060F9612l255P702q621P222J1435K161m117j8640j3345J2419j0398r412L708
5047D6471j2278l910J6358Q393j0412m705L11K797P758K316p053P295p946J0905
$$ plain form
5138 166268 195404 196806 177529 167841 172957 175444 185808 196359 191969 197433 203053 209591 226031
5125 226031 227926 247092 258648 245229 251398 275439 294400 307492 322745 340013 353965 386747
5113 386747 376477 356911 333101 310506 289311 273585 268445 248423 242551 237232 242914 232117
5101 232117 228206 224167 227878 208893 200920 219905 214359 194173 196512 198012 197616 185469 184688 211044
5087 211044 220612 196325 178716 175221 161845 123582 127580 123807 128549 104105 95347 121440 99859
5074 99859 91867 108719 118591 101639 87896 87295 97371 94783 82248 76882 81806 76291 83144 69612
5060 69612 66357 74059 65438 72660 84095 86256 82139 63499 50154 62573 52175 42763 46471
5047 46471 34193 30283 46641 55034 44622 39917 40228 43025 50783 53099 46046 53341 45395 56300
5033E6300j2608k476k991l063n915k629M94L193j1683o261J1125J9077k4461K334
5019B0436K2517j5146j4846L003J8644j2677n860n451J2964o205n949J3561P249
5006C2240j2467j1848J1044J5433r053r665l482M524m343L620m358j3340O64K0933
4992A9902J4099J743j7861j1596K3837o004q788M067j3900m522J9283R807k014
4979B8053j2566q262J5632L756j1294L551K4312p496p711n2o997L333l76l275
4965B0608L480j0628L778J6488K884j062M463k0949L349k730K242K053M776n697
4951B3055j3930m135N184J206j899L627Q390j1458J2923Q499j0389j664j2710
4938F699J3819O689J0764j4103j01o438m52J2013M471k1928K952J5426l985q128
$$ plain form
5033 56300 43692 41216 38225 35162 29247 26618 27112 30305 18622 12361 23486 42563 18102 20436
5019 20436 42953 27807 12961 15964 34608 21931 16071 10620 23584 17379 11430 24991 32240
5006 32240 19773 7925 18969 34402 25349 15684 12202 16726 12383 16003 11645 -1695 -1031 19902
4992 19902 34001 35744 17883 6287 30124 24120 15332 19399 5499 977 20260 30067 28053
4979 28053 15487 7225 22857 26613 15319 18870 43182 35686 27975 27923 20926 24259 23883 20608
4965 20608 24088 13460 17238 33726 36610 35548 40011 19062 22411 19681 21923 23976 28752 23055
4951 23055 9125 4990 10174 11380 9481 13108 21498 10040 22963 31462 21073 19409 6699
4938 6699 20518 27207 37971 23868 23767 17329 16877 28890 33361 11433 14385 29811 25826 17698
4924A7698R283O532k4354N105L130J4618j7222j914J0378J1589j7041J748m279
4911A5271J293R177j3828J5789J254k1252N949K2061j5514P580o54l011q821O273
4897B1567q144P690M24k5659J8462K0735j3138M382n481M706K190j1773o438J1694
4883B1217j1567j998J4789k781L947Q44o866J9556j6882j6057K7857L874j5694
4870B0239j079R800k789m396r517M477J1026j6775J5158O28j7394J142p977L158
4856E701K4459m06q295n622N359k546K686N65j2138R469N268Q071P008k3748Q522
4841B4353J908k554j0204j1326J2102k495k812K378N202j4507L299L275N719O702
4827B1040r213n648J6280j882n595J1583J8741p791j1175J0081J0582J2351j0327
$$ plain form
4924 17698 26981 33513 9159 14264 17394 32012 14790 12876 23254 34843 17802 19550 15271
4911 15271 16564 25741 11913 27702 28956 7704 13653 35714 20200 27780 27126 24115 15294 21567
4897 21567 13423 21113 21537 -4122 14340 35075 21937 26319 20838 25544 27734 15961 9523 21217
4883 21217 9650 7652 22441 19660 23607 24451 17585 37141 20259 4202 32059 35933 20239
4870 20239 19160 28960 26171 21775 12258 16735 27761 10986 26144 26772 9378 10520 2543 5701
4856 5701 30160 29754 21459 15837 21196 18650 21336 21901 9763 19232 24500 32571 39579 15831 24353
4841 24353 26261 23707 13503 2177 14279 11784 8972 11350 16552 2045 5344 8619 14338 21040
4827 21040 11827 6179 22459 20577 14982 26565 45306 37515 26340 36421 47003 59354 49027
4814D9027j4471n919R110Q69pQ049j8711K738p783j2618o410K842M129R484q820
4799A1509q862M842J7401O970Q03j7990j089P139K3j227m643K917P774j3403k26
4784A1938J5297L815q679k699J8273N933j4109J026J2119N977n382m085J760K420
4770D3604R381N498p650J462m610j7037K0901R885k8236J5656J940q021N626j6528
4756C1871m24K0648m668J9786K1448k5624p666J7363j2278O077M210M313m052
4743G1004j1521J4290M358q346k170O417p068J0310L24j676j1827N910n844R562
4729G3723m296j3132j4630Q456J4402J327Q808q617k0144N499J2589j5847q644
4716C9494J1025J1855m231m257M33n342l324p25N412N101j2111j5471J1868N107
$$ plain form
4814 49027 34556 28637 37747 38616 38609 46658 27947 30685 22902 10284 3874 6716 10845 20329 11509
4799 11509 2647 7489 24890 31860 32663 14673 13584 20723 20746 19519 14876 17793 25567 12164 11938
4784 11938 27235 31050 22371 19672 37945 43878 29769 30795 42914 48891 43509 39424 41184 43604
4770 43604 52985 58483 50833 52295 47685 30648 51549 61434 33198 48854 50794 42773 48399 31871
4756 31871 31447 52095 47427 67213 88661 63037 55371 72734 60456 66533 70743 75056 71004
4743 71004 59483 73773 78131 69785 67615 74032 66964 77274 77598 75922 64095 70005 64161 73723
4729 73723 69427 56295 41665 50121 64523 65850 74658 66041 45897 51396 63985 48138 39494
4716 39494 50519 62374 58143 53886 54319 48977 45653 44928 50340 55441 43330 27859 39727 44834
4702D4834j6237O517J7944k3924n177J0231M587J568j8361N407J6238k077j1776
4689B9774k111k90M455l268K77n057L380J515o926K0694r339l128k065O250k661
4674C1500J265P499M509M562j4205k609J3998N531o762p386j868k163m177l523
4660B6171M527Q346K127M148k6836R535J1807P229n266N40o202k933M27k10R797
4645D3207O101j338Q028j033j5075R688l208J0071j3999J2175m60o069J1160J7684
4631G6932k116j0364j521J1757l872J7635j413m080J8063j8221K484J1144n313
4618I1115J7995j3732o023K620j8902j822n495J9399L444J46P217K3632P239j5202
4604A11631j1454J6884O042l051MJ4568O658r017M755K2125J2623j8301Q405J8580
$$ plain form
4702 44834 28597 35114 53058 29134 23957 34188 38775 40343 21982 27389 43627 41550 29774
4689 29774 27663 27373 31828 28560 28837 23780 27160 28675 21749 42443 33104 29976 27911 34161 31500
4674 31500 32765 40264 44773 49335 35130 32521 46519 52050 45288 37902 36034 33871 29694 26171
4660 26171 30698 39044 41171 45319 18483 28018 39825 47054 41788 42328 36126 33193 33620 33410 43207
4645 43207 49308 47970 55998 54965 39890 49578 46370 56441 42442 54617 54157 48088 59248 76932
4631 76932 74816 64452 62931 74688 70816 88451 87038 82958 101021 82800 85284 96428 91115
4618 91115 109110 95378 89355 91975 73073 71251 65756 85155 88599 88745 95962 119594 126833 111631
4604 111631 100177 117061 123103 120052 120056 134624 141282 132265 137020 159145 171768 153467 161872 180452
4590A80452O681J0954O502J6067K6366J509j9554J9102P509R0n079J1631J4101
4577B76331j7447J1264K005n895R35N676n527m695J5170J3146R546n761j311K0744
4563C14181R247k055J5027J7753L979P888P984J8967J4762j0930n900J6100J5376
4550D22379k907m431P252p988K0987K7215l76n17M825K4377p301p115m927R064
4536D80537P487l600N774R003p09j0321m386J7779K256J0751j1267J3261K0025
4523E36590J3191q330K4597J3946N736n056J0775K2031J1311R532j0015n117r246
4510F09945J3086O807J5494j5316J498K1309L471j1043J3993K9146O294O279K3941
4497G24904J9048K2106J9323M5324M5678K8537N1995L9677O614l2445k8063l1446
$$ plain form
4590 180452 187133 198087 204589 220656 247022 248531 228977 248079 255588 255678 250599 262230 276331
4577 276331 258884 270148 272153 266258 267193 272869 267342 262647 277817 290963 300509 294748 293437 314181
4563 314181 323428 321373 336400 354153 358132 366020 374004 392971 407733 396803 390903 407003 422379
4550 422379 419472 415041 422293 414305 435292 462507 462131 461614 466439 490816 483515 476400 471473 480537
4536 480537 488024 484424 490198 499201 498492 488171 483785 501564 503820 514571 503304 516565 536590
4523 536590 549781 541451 566048 579994 585730 580674 591449 613480 624791 634323 624308 619191 609945
4510 609945 623031 629838 645332 630016 631514 652823 656294 645251 659244 688390 694684 700963 724904
4497 724904 743952 766058 785381 830705 876383 904920 956915 996592 1003206 970761 942698 911252
4485I11252l8333k4046p557j2127m08P526J0028J5377J2915L0935M559L3084L3826
4472I77031K4770N0963P1435N4368N4666N2255O6046O4802N8744L5880l837l2889
4460A474234l1008m7554l9171k5411k8562j1365J1030J329p111K3995J5558M426
4448A340390J3646L1494M2348J6687M2940L4789L2771O0309L6532M3180N7026
4437A752112K9183J3002j7810k4776k8289j9192J048J9654K4457J4639M0882K1905
4425A826815J2029L9303O0390O1396M5870O6881Q8170R6876P7630P7978J01516
4414B554854J04096J09454J23509J25128J32981J41660J54222J56557J69536J96003
4404C968000K13045K45627K65452K96007L48943M10349N03899N42659O42815P41032
$$ plain form
4485 911252 872919 848873 841316 829189 828781 836307 846335 861712 874627 905562 910121 943205 977031
4472 977031 1001801 1052764 1124199 1178567 1233233 1285488 1351534 1416336 1475080 1510960 1507123 1474234
4460 1474234 1443226 1395672 1356501 1331090 1302528 1291163 1302193 1303522 1296411 1320406 1335964 1340390
4448 1340390 1354036 1385530 1427878 1444565 1487505 1522294 1555065 1615374 1651906 1695086 1752112
4437 1752112 1781295 1794297 1776487 1751711 1723422 1704230 1705278 1724932 1749389 1764028 1804910 1826815
4425 1826815 1838844 1878147 1938537 1999933 2045803 2112684 2200854 2297730 2375360 2453338 2554854
4414 2554854 2658950 2768404 2891913 3017041 3150022 3291682 3445904 3602461 3771997 3968000
4404 3968000 4181045 4426672 4692124 4988131 5337074 5747423 6251322 6793981 7436796 8177828
4394H177828Q40141R28278R77303J037810J050474J026317R69123Q31404N99541
4385A6438219K24479k01163n45682p96113q97598q84927q12064p24587o36542
4376A1164022n07143m00946k98323k11392j45035p0648m9473k9812m9005q4367
4366I317878j20915j57279k04854k39715k82951k78970l09521l16175l21407l12742
4356F773349k97483k99175k80443k45410k56873k57471k56884k34023k32234j91702
4346D221651j82688j79230j69198j64804j51078j35482j11000j16440j18957j01544
4336B791230r3232r9245q7625p1072q5550p8432p3578o5581p2076n7759m9879
4325A957201o1861n8726m5146n7308m0132l3527m0220m3792m6986m3286l472k7543
$$ plain form
4394 8177828 9017969 9946247 10923550 11961360 13011834 14038151 15007274 15838678 16438219
4385 16438219 16662698 16461535 15915853 15119740 14222142 13337215 12525151 11800564 11164022
4376 11164022 10656879 10255933 9957610 9746218 9601183 9530535 9481062 9451250 9402245 9317878
4366 9317878 9196963 9039684 8834830 8595115 8312164 8033194 7723673 7407498 7086091 6773349
4356 6773349 6475866 6176691 5896248 5650838 5393965 5136494 4879610 4645587 4413353 4221651
4346 4221651 4038963 3859733 3690535 3525731 3374653 3239171 3128171 3011731 2892774 2791230
4336 2791230 2697998 2598753 2511128 2440056 2354506 2276074 2202496 2136915 2064839 2007080 1957201
4325 1957201 1895340 1836614 1791468 1734160 1694028 1660501 1620281 1576489 1529503 1486217 1482745 1455202
4313A455202n0268l2494o512j3435l1652l2607k1112n867l1783m0962j274q437
4301A178799k7344l8360k1591J0659l8717r035j829j2956j8985q065k4397q558
4289I79621j5060j4867K257r267l6254p661K671k9677k7171k5404j9124m530l6495
4276G59039m590J5464j8091j2625j4447k1523r611m149j5853j4309r380p24k807
4263F46394k2664n142k575j9065k3012J184p267O450L460j5819n089j5823j6283
4250E24749P212J5920k1305n602M438j7330l557k6626O607J5687j6779n013J0915
4237D89316M991q447j6301K417j3786m775k3624J6250J0842j5132k211N874j3751
4224D31663k9776m123j0983J2695J19j7856l77M116j6191J0596J9985K57J7696
$$ plain form
4313 1455202 1404934 1372440 1365928 1352493 1320841 1288234 1267122 1261255 1229472 1188510 1187236 1178799
4301 1178799 1151455 1113095 1091504 1102163 1063446 1054411 1052582 1039626 1020641 1012576 988179 979621
4289 979621 964561 949694 951951 942684 906430 898769 901440 871763 844592 819188 800064 795534 759039
4276 759039 754449 769913 751822 739197 724750 703227 693616 689467 673614 659305 649925 649201 646394
4263 646394 623730 618588 616013 596948 573936 575120 567853 574303 577763 561944 556855 541032 524749
4250 524749 531961 547881 526576 520974 525412 508082 504525 477899 484506 500193 483414 478401 489316
4237 489316 494307 485860 469559 471976 458190 453415 429791 446041 456883 441751 439540 445414 431663
4224 431663 401887 397764 386781 399476 399595 381739 381362 385478 369287 379883 399868 400125 417821
4211D17821R680R978Q785J4886J6413l655l228j3472N211k1202j6477l7307l3250
4198C54183q436m169j8641o295j0144j7261M169l12n692l659o44o294m186j6616
4184B56003n774Q973L475o427P881k0882J2660O18j8113R63K2721m717O078j4798
4170B48661j3368R705q77M351K62q187r828R989n796n11l402q735j959p516J336
4155B14125k680r52k314l492K78k053J7342j0054j3241K657J7289l249O283j1717
4141B08222j558j3824N18J4280P189r991K725p330m156O329J5141k229j392N271
4127B19195k1902j254P6L941K686p990o916L985M389j457k459K5972M043j7425
4113B04884m065N909K0329k0992j3528K2217J0292o006L930r894l15L801O481
$$ plain form
4211 417821 427501 437479 446264 461150 477563 473908 470680 457208 462419 441217 424740 387433 354183
4198 354183 345747 341578 322937 316642 306498 289237 293406 293094 287402 283743 283099 276805 272619 256003
4184 256003 250229 259202 262677 256250 264131 243249 255909 256527 238414 239377 262098 257381 263459 248661
4170 248661 235293 244998 244121 248472 248734 240547 230719 240708 234912 234401 230999 222264 220305 212789 214125
4155 214125 211445 210493 208179 204687 204965 202912 220254 210200 196959 199616 216905 213656 219939 208222
4141 208222 206664 192840 193358 207638 214827 204836 207561 200231 196075 202404 217545 215316 213924 219195
4127 219195 197293 196039 196115 200056 202742 194752 187836 191821 196210 194753 192294 218266 222309 204884
4113 204884 200819 206728 227057 206065 192537 214754 225046 219040 222970 213076 212761 216562 223043
4100B23043R835K0891j0008P212K8595r610R057K6153J1411M1522L9978L1169
4088D29248K9815K9367M0214L1830J3605K7165K1103j939k9366j4784l6800m7489
4076D91969l7573M341j871m967R312j7183J053R576J4464Q944J1517J9546K5058
4063E34186L2340M2797L0152N0984L3001L5011L9076L8743p781l5290m5447l6335
4051G11437n2775m4805m8755k6525n982j3053j1634J4862K551P153k61l285K163
4038E31091o666n229K4061K3165j1746J3899K8590J6140K6797O248r485p440l1104
4025E98321m2589j5672j1185l3488k609R680j3452J951j3521L793J6481O24k876
4012D95458k042j577q592J2802M272m740j6548R246L3800r45J7724L1090r684
$$ plain form
4100 223043 232878 253769 243761 250973 279568 269958 279015 305168 316579 358101 398079 429248
4088 429248 459063 488430 528644 560474 574079 601244 622347 620408 591042 576258 539458 491969
4076 491969 454396 458737 456866 451899 461211 444028 445081 454657 469121 478065 489582 509128 534186
4063 534186 566526 609323 639475 690459 723460 758471 797547 836290 828509 793219 747772 711437
4051 711437 658662 613857 565102 538577 532595 519542 507908 522770 525321 532474 532213 528928 531091
4038 531091 524425 519196 543257 566422 554676 568575 597165 613305 640102 646350 636865 629425 598321
4025 598321 555732 540060 528875 495387 492778 502458 489006 490957 477436 481229 497710 498334 495458
4012 495458 493416 491839 483247 496049 500321 495581 479033 488279 522079 521134 538858 569948 560264
3999E60264j1589j2213p09Q316J6692m455P229L9171o955N329K6525K1824K8346
3986F77775K8302L4435M1317N4012P1273R6648J24902J34670J89811J98591K06432
3975A858168J96091J96808K67982L77315J75226l31508m64981l35832k41764j95417
3965A502088j59538j11393q2278p5887m0874k7579k9043k4419j9490j2167L273
3954I22693k7880m8184l6172k6871j1734k8858j3608j0254N484r242j03j0066
3942G05205j3620J3149J1140J0248P613j396R677J3979M974J4653J6652P587N353
3929H05214L2706K8577J714L3988K6495K6065N5609L1777L7737N0484K7029L1807
3917A189202J2852j968L60j5271j6701J3228K2327k3869K53J0687J2663N4792
$$ plain form
3999 560264 548675 536462 535753 544069 560761 556306 563535 602706 595751 601080 627605 649429 677775
3986 677775 706077 740512 781829 835841 907114 1003762 1128664 1263334 1453145 1651736 1858168
3975 1858168 2054259 2251067 2519049 2896364 3071590 2740082 2275101 1939269 1697505 1502088
3965 1502088 1342550 1231157 1148879 1072992 1032118 1004539 975496 951077 931587 919420 922693
3954 922693 894813 846629 810457 783586 771852 742994 729386 719132 724616 715374 715271 705205
3942 705205 691585 704734 715874 726122 733735 732339 742016 755995 760969 775622 792274 799861 805214
3929 805214 837920 866497 868211 902199 928694 954759 1010368 1042145 1079882 1130366 1157395 1189202
3917 1189202 1202054 1200086 1200446 1185175 1168474 1181702 1204029 1180160 1180413 1191100 1203763 1258555
3905A258555M6267L6778P6542N1202N7793O4886O1126M3433K0243j0879k8807
3894A677139o0069p9513m3006l4817n3436j5756j7906n934J6043N993J4860K1062
3882A424660k975m060j9430r576K0243J4121j324K3473K4004J1155L0555K0929
3870A531775j9426j638j4147j6893k2741l5947k1758j8340j7519k5190j2432q277
3858A317467K2746J3318J6454M1939K8221K0120L7546N2797K8394L4568M8299
3847A661869M2840M5171M3251N2943M8708N7933P7599Q2575R5224J09834J34261
3836B452208J67753K13374K69525L42508L86130M71827N31858O37272P55410P19956
3826F947821M65106K86022M29277O54015N32634l50854j173501j183319r02167
$$ plain form
3905 1258555 1304822 1341600 1418142 1469344 1527137 1592023 1653149 1696582 1716825 1705946 1677139
3894 1677139 1617070 1537557 1494551 1459734 1406298 1390542 1372636 1366702 1382745 1388738 1403598 1424660
3882 1424660 1421685 1417625 1398195 1388619 1408862 1422983 1421659 1445132 1469136 1480291 1510846 1531775
3870 1531775 1512349 1510711 1496564 1479671 1456930 1420983 1399225 1380885 1363366 1338176 1325744 1317467
3858 1317467 1340213 1353531 1369985 1411924 1440145 1460265 1497811 1550608 1579002 1613570 1661869
3847 1661869 1704709 1749880 1793131 1846074 1894782 1952715 2030314 2112889 2208113 2317947 2452208
3836 2452208 2619961 2833335 3102860 3445368 3831498 4303325 4835183 5472455 6227865 6947821
3826 6947821 7412927 7698949 8128226 8782241 9314875 8964021 7790520 6607201 5705034
3817E705034o50977m99413l93614l02166k51728k11003j55013j11718j01337p8639
3807B949426o4141l0242l6122k9549j2726q131l4733j8253l7190o9731n4202m9122
3795B505284o3833n8407n6825l2948j8456l2094k5328k3954k8263l8664n1585
3784B074927k8644k9538n8199l3442k9567l9599l9465k8385j497j9808k5899n0003
3772A690881l941k5368m1904k8445p602l9957n5127m4757l0806k5534l4657k4368
3760A328415R612k3608j8628k682j4535l6954k2071K217k696k6129k5390K6539
3748A194090J2998j4144l119L679K9377J5920N189J6410r28k4558k3564m5317
3736A166033n7171p9064m8343m5188m1060l3385k1453k3537l1782M515j0442q501
$$ plain form
3817 5705034 5054057 4554644 4161030 3858864 3607136 3396133 3241120 3129402 3028065 2949426
3807 2949426 2885285 2855043 2818921 2789372 2776646 2768515 2733782 2715529 2678339 2608608 2554406 2505284
3795 2505284 2441451 2383044 2326219 2293271 2274815 2242721 2217393 2193439 2165176 2126512 2074927
3784 2074927 2046283 2016745 1958546 1925104 1895537 1855938 1816473 1788088 1786591 1766783 1740884 1690881
3772 1690881 1686940 1661572 1619668 1591223 1583621 1543664 1488537 1443780 1412974 1387440 1352783 1328415
3760 1328415 1338027 1314419 1295791 1293109 1278574 1241620 1219549 1221766 1219070 1192941 1167551 1194090
3748 1194090 1207088 1192944 1189825 1193504 1222881 1238801 1243990 1260400 1259472 1234914 1211350 1166033
3736 1166033 1108862 1029798 981455 936267 895207 861822 840369 816832 785050 789565 779123 770622
3724G70622j2991m694k574j749r188n833j8649j7824p306Q11p105j2353l615Q495
3710F76047q801P442K2799p029R536M783N612l852k397J6899K2012J4973J4843
3697G72867K1083J2769N9419M3274O5546N6951N9847P1131N8673K0710l581m3446
3685A195243p0174o2543m5913l5805j8094k4257j5195p767o576m962j3J8865L60
3672I23169r427k2550j2537n345j8076j9392K1276K4597K1291O5860P5251R7116
3660A141233R1988J26842J29763J20492R7573J10117N1109l4569j10035j59468
3650A565045j57169j57995j50757r3201r1465o9154n1766j5372k3246j9517j3299
3639G22104m45n38j0375j6918R198J2232N27k015r90r421l558j0468l1724j8973
$$ plain form
3724 770622 757631 752937 750363 748614 739426 733593 714944 697120 689814 690625 683520 671167 667552 676047
3710 676047 667246 674688 697487 690458 699994 704777 710389 706537 704140 721039 743051 758024 772867
3697 772867 793950 806719 866138 909412 974958 1031909 1091756 1162887 1221560 1242270 1238689 1195243
3685 1195243 1125069 1062526 1016613 980808 962714 938457 923262 915495 908919 903957 903944 922809 923169
3672 923169 913742 891192 878655 873310 855234 835842 857118 881715 903006 968866 1044117 1141233
3660 1141233 1233221 1360063 1489826 1610318 1707891 1818008 1869117 1834548 1724513 1565045
3650 1565045 1407876 1249881 1099124 1005923 914458 845304 793538 778166 754920 735403 722104
3639 722104 721659 721121 710746 693828 703026 715258 715785 713770 712780 703359 699801 689333 657609 638636
3625F38636K173j1569q192r237j7134j0543r678L315m935O388Q817Q710j6497
3612E80254j1657J6168N027J5693l649K3579M2312K0433J6051L3490M5914K5460
3600H09075L1819M8137M7679M0124M9920L8538J5261L652J4700M6464L5024o270
3588A174123J5641L7394K5159O895K4222K3952L2966o375J3761K1064j1056q956
3576A348790M495J0805J6218j314L9180M7866M6478M1595M9377N7676N8257L1453
3564A750876K4422O088l5435k8006J7152K1455K2981K2789N5134P2121Q7300O6789
3552B083666R6424R2399J01850R3538J56199J47871J02611Q2637J09226R5116
3542C161537M6765j4710L2111N0464L8432J6147K9156J7513O649j6589m5111k4413
$$ plain form
3625 638636 640809 629240 621048 611811 594677 584134 574456 577771 572836 579224 588041 596751 580254
3612 580254 568597 584765 589792 605485 601836 625415 667727 688160 704211 737701 783615 809075
3600 809075 840894 889031 936710 976834 1026754 1065292 1080553 1084205 1098905 1145369 1180393 1174123
3588 1174123 1189764 1227158 1252317 1259212 1283434 1307386 1340352 1333977 1347738 1368802 1357746 1348790
3576 1348790 1353285 1364090 1380308 1378994 1418174 1466040 1512518 1554113 1603490 1661166 1719423 1750876
3564 1750876 1775298 1781386 1745951 1717945 1735097 1756552 1779533 1802322 1857456 1929577 2016877 2083666
3552 2083666 2180090 2272489 2374339 2467877 2624076 2771947 2874558 2957195 3066421 3161537
3542 3161537 3208302 3193592 3225703 3276167 3314599 3330746 3359902 3377415 3384064 3367475 3322364 3297951
3530C297951j2899l4090j8575J151O068l7455j9256L849J5253k798l7939p1403
3518C089857l8783m8164n0176k1169k9137o8616o5470m9401m6610l9452k7224
3507B605655k3338l1783j2949L778J1198P652p032k3061k9080l7274j6220n995
3495B441551j9635m5278k4604j880K7751O3479N0414J5213N722J5280J7956R894
3483B555863J5381j2621J0248J6189M3452O7439P2802O6116N1025L0147K1311
3472B937352J5958M2178L2872O2281N2473N0066P9076R4088R9901R7802O7898
3461C631945Q6129P5977Q2217P3123J18212J33401K17329K47954L09601K82902
3451E258790K94745K57573K41378K04339J92193J62316J73984J89181J64605J49521
$$ plain form
3530 3297951 3285052 3250962 3232387 3233538 3239606 3202151 3182895 3186744 3201997 3199199 3161260 3089857
3518 3089857 3051074 3002910 2952734 2931565 2902428 2833812 2768342 2718941 2672331 2632879 2605655
3507 2605655 2582317 2550534 2537585 2541363 2552561 2560213 2553181 2530120 2501040 2463766 2447546 2441551
3495 2441551 2421916 2376638 2352034 2350154 2377905 2441384 2491798 2507011 2512733 2528013 2545969 2555863
3483 2555863 2571244 2558623 2568871 2585060 2628512 2695951 2768753 2834869 2885894 2916041 2937352
3472 2937352 2953310 2995488 3028360 3090641 3143114 3193180 3272256 3366344 3466245 3564047 3631945
3461 3631945 3718074 3794051 3876268 3949391 4067603 4201004 4418333 4666287 4975888 5258790
3451 5258790 5553535 5811108 6052486 6256825 6449018 6611334 6785318 6974499 7139104 7288625
3441G288625K04481J65182J52948N3231P5163M2091J37185J94574K47279K37232
3431H797991L20563M20649N02741M23696M32553M83770O29339O67209P43146P59279
3421A4180936Q09230P47202P96715R08961J017735J029782J172771J254383J415936
3412B3333651J488022J751067K028630K504742K927175L386655L811169M685556
3404D5916667N782129P600773R696212J2807022J6603286K0795900K0739509K0706001
3396A60647499K0710773J8858846K5695128L8720888L1495706k1256983n8042878
3389B16828979m8186489l2307509k3128122j6766514j2289484r498529p734848
3382F6917484o214942n258564m490825m095132l829100l432496l038016k601648
$$ plain form
3441 7288625 7493106 7658288 7811236 7864467 7939630 7981721 8118906 8313480 8560759 8797991
3431 8797991 9118554 9539203 10041944 10465640 10898193 11381963 12011302 12678511 13421657 14180936
3421 14180936 14990166 15737368 16534083 17443044 18460779 19490561 20663332 21917715 23333651
3412 23333651 24821673 26572740 28601370 31106112 34033287 37419942 41231111 45916667
3404 45916667 51698796 59299569 68995781 81802803 98406089 119201989 139941498 160647499
3396 160647499 181358272 200217118 225912246 264633134 296128840 274871857 216828979
3389 216828979 168642490 136334981 113206859 96440345 84150861 74652332 66917484
3382 66917484 60702542 55443978 50953153 46858021 43028921 39596425 36558409 33956761
3374C3956761k305989k142943j936061j658867j475772j321360j293015j167871
3366B0654883j018807q30398p72010p05822o12439n38403n48614m55162l91738
3357A4781490l86826m77186m64498l94079l73307m33752m98472n54762n16729
3348A0681879n25951n46516n41040m95625m09197k85613k47704k02380j87046
3339G240807j38865j33918j30315j59896j09792j52263j53186j13753n5722r5483
3329E997614q3043j08186r8520r4743r7914j09201n2359q2331q7285p1093n2427
3318E060512n2768m4901r9532r7908r8678j14190j41076j12216j17871j27077
3308D054295j29606q7171q8219q2867j07729r2426j40331j32894j29438q7325
$$ plain form
3374 33956761 31650772 29507829 27571768 25912901 24437129 23115769 21822754 20654883
3366 20654883 19636076 18805678 18033668 17327846 16715407 16177004 15628390 15173228 14781490
3357 14781490 14394664 13917478 13452980 13058901 12685594 12251842 11753370 11198608 10681879
3348 10681879 10155928 9609412 9068372 8572747 8163550 7877937 7630233 7427853 7240807
3339 7240807 7101942 6968024 6837709 6677813 6568021 6415758 6262572 6148819 6093097 5997614
3329 5997614 5914571 5806385 5707865 5613122 5515208 5406007 5353648 5271317 5184032 5112939 5060512
3318 5060512 5007744 4962843 4863311 4765403 4666725 4552535 4411459 4299243 4181372 4054295
3308 4054295 3924689 3837518 3749299 3666432 3558703 3466277 3325946 3193052 3063614 2976289
3298B976289p3360o5319q0301m3380l1982j2418J617J029o0147q7173p1214l3834
3286B419807n1582l5163k3804k2556n1400l4909k2934r123l6519o4049p7080m7932
3274A942756n7125n9767n5559o4153m7716n2490o713j7775j4158j6741j3792j5809
3262A520958P947M3596M5249O4479J9603m0220k6370j7152k6491k3238l7708j9719
3250A510934k4317k6086J5428k9376n6829m2500p583m7587q4009o5536j9140k278
3238A121121J1853L199J3673O815K4043n815j3892k3646j5335j8802J5222K217
3226A120653k106L137Q166J8466K5343M93o551K004J7110L7056O0736L0670M8922
3213A364099M6958M5566M2350N4237O2148O9140N5736N9703L9478k3316n4329
$$ plain form
3298 2976289 2902929 2837610 2757309 2713929 2681947 2669529 2671146 2672175 2612028 2524855 2453641 2419807
3286 2419807 2368225 2333062 2309258 2286702 2235302 2200393 2177459 2168336 2131817 2067768 1990688 1942756
3274 1942756 1885631 1825864 1770305 1706152 1658436 1605946 1599233 1581458 1567300 1550559 1536767 1520958
3262 1520958 1528905 1572501 1617750 1682229 1701832 1661612 1635242 1618090 1591599 1568361 1530653 1510934
3250 1510934 1486617 1460531 1475959 1446583 1389754 1347254 1339671 1292084 1208075 1142539 1123399 1121121
3238 1121121 1132974 1136173 1149846 1156661 1180704 1174889 1160997 1137351 1122016 1103214 1118436 1120653
3226 1120653 1118547 1121684 1129850 1148316 1173659 1174152 1167601 1169605 1186715 1223771 1284507 1315177 1364099
3213 1364099 1411057 1456623 1498973 1553210 1615358 1684498 1740234 1799937 1839415 1816099 1761770
3202A761770n2675o7448m1086l1358p884q945P143M014J8589l40Q320m12j7674
3189A572014k2469j8139k5195j1718o57j3092J719O128q260J1499J8738P52o15
3176A510705J8349K1827N7132M0350L8172N2266L5868K5848O3512P0200P0947
3165B005176Q7521O5604P2542Q9284J04882J33610J13344J15249J30014J23956
3155C041182J05145Q2681R2871R3855Q2638P5575N2598N4766O1473O6579R1965
3144C901328N7810O8613O4993O1683L6668O7399O4367N3523P6835Q2012R2588
3133D627819J38875J56532J75279J82756J52417J02160L8343l3038r3618j08587
3123E338938j21187j17752r4993n7182k5226n7481n3661k8723l5277o1504n5896
$$ plain form
3202 1761770 1709095 1641647 1600561 1569203 1561319 1552374 1559517 1563531 1582120 1581780 1590100 1589688 1572014
3189 1572014 1549545 1531406 1506211 1494493 1493836 1480744 1482463 1488591 1480331 1491830 1510568 1511320 1510705
3176 1510705 1529054 1550881 1608013 1648363 1686535 1738801 1774669 1800517 1864029 1934229 2005176
3165 2005176 2092697 2158301 2230843 2320127 2425009 2558619 2671963 2787212 2917226 3041182
3155 3041182 3146327 3229008 3321879 3415734 3498372 3573947 3626545 3681311 3742784 3809363 3901328
3144 3901328 3959138 4027751 4092744 4154427 4191095 4258494 4322861 4376384 4453219 4535231 4627819
3133 4627819 4766694 4923226 5098505 5281261 5433678 5535838 5574181 5541143 5447525 5338938
3123 5338938 5217751 5099999 5005006 4947824 4922598 4865117 4811456 4782733 4747456 4685952 4630056
3112D630056o0669p5718p7841q0029p8417r7654j01559q2151q9152q7565q0748
3101C718553n6068n6605n4893n6809m3163n2117n9672p7112m1729l8583l2953
3090C148849m1252j7525k5070l0182j3586N336J6122L6335M0923M6703M7846N8212
3078C272711N5096O5258N9264N0091L4086L5146L6250m582j18096k01988j43389
3067C139847j14977j11765q4156o3346o8605m5097l3225m9227k5883m9176k0025
3056B474365o136P58J5592J8390L4726N7674J06611J20694J62398K03234K06986
3045C395292K26656K11712K30724K97834K02417j36607m61622n09458l98128k86755
3035B772065k48112j59522j48568j06972r0210q4667p0551p1843n8808n2883m1890
$$ plain form
3112 4630056 4569387 4493669 4415828 4335799 4257382 4159728 4058169 3976018 3886866 3799301 3718553
3101 3718553 3662485 3605880 3550987 3494178 3451015 3398898 3339226 3262114 3220385 3181802 3148849
3090 3148849 3107597 3090072 3065002 3034820 3021234 3026570 3042692 3079027 3119950 3166653 3214499 3272711
3078 3272711 3327807 3393065 3452329 3502420 3536506 3571652 3607902 3603320 3485224 3283236 3139847
3067 3139847 3024870 2913105 2828949 2765603 2696998 2651901 2618676 2569449 2543566 2494390 2474365
3056 2474365 2468229 2468987 2484579 2502969 2537695 2595369 2701980 2822674 2985072 3188306 3395292
3045 3395292 3621948 3833660 4064384 4362218 4564635 4428028 3966406 3456948 3058820 2772065
3035 2772065 2523953 2364431 2215863 2108891 2018681 1934014 1863463 1791620 1732812 1679929 1638039
3024A638039m7919k7181j3426l7722l9433l6358l061k2778k4356j240J7174J5570
3012A417309j1472L1864L0362L5799L3716K7519O3972P4241O7227Q9545R9455
3001A959537J05653J00931J39892J80499J60392J71768J85696J97898J55038J49872
2991C507176J49136J39892J04004O3694M9604J5258l9116n0320q6007j08315j22585
2980C622421j10488j20822j03997r6004r8361p7412o8213n6712n6643p7544p1230
2969B684995o6485r6616p8100o7395m7278l8629m4661m7029l0860m5310m2259
2958B080373k5142m1415l2251k6332l9924l0403n3316o4580n9951q0024o4309
2947A562726n4458n8297p2697o2360m3692m4986j4367l1210k4264l2733l1314
$$ plain form
3024 1638039 1590120 1562939 1549513 1511791 1472358 1436000 1432939 1410161 1385805 1384565 1401739 1417309
3012 1417309 1405837 1437701 1468063 1503862 1537578 1565097 1629069 1703310 1770537 1860082 1959537
3001 1959537 2065190 2166121 2306013 2486512 2646904 2818672 3004368 3202266 3357304 3507176
2991 3507176 3656312 3796204 3900208 3963902 4013506 4028764 3989648 3939328 3853321 3745006 3622421
2980 3622421 3511933 3391111 3287114 3191110 3092749 3015337 2947124 2890412 2833769 2756225 2684995
2969 2684995 2618510 2521894 2443794 2376399 2329121 2290492 2245831 2198802 2167942 2122632 2080373
2958 2080373 2055231 2013816 1981565 1955233 1915309 1884906 1831590 1767010 1707059 1627035 1562726
2947 1562726 1508268 1449971 1377274 1314914 1271222 1226236 1211869 1180659 1156395 1123662 1092348
2936A092348k1388m7473l3714m5918j9031j2534j2541l9121k3509k7140m2288
2925G67691n008k5685l4711o6Q146k3363j4052j6909j9902n074m494k6993O402
2912F05982k478j6747j866j2037P146r116k1693R590n188j5573N971j1724j7182
2899E15085K802J995J3297R944O512J6633J8960P139M362L730J5060K6772J0318
2886F52609l6789m0611m4598j8569p018l1677j8672k211j7420j0221r87j7770
2874D06066l820j5375l752J057m715p090r37k771O498r559J4229J4203n447k1886
2860C66701m527N985Q73J0383O757k861R666j4434j1948J1002J0583o636q433
2847C73111J9638P406j207K87J1943o132K025m24m941q388L556K6773l593q472
$$ plain form
2936 1092348 1070960 1023487 989773 943855 924824 912290 899749 860628 837119 809979 767691
2925 767691 762683 736998 702287 702221 710367 687004 672952 656043 636141 631067 626573 599580 605982
2912 605982 603504 586757 584891 572854 580000 570884 549191 558781 553593 538020 543991 532267 515085
2899 515085 517887 519882 533179 543123 549635 566268 585228 592367 596729 600459 615519 642291 652609
2886 652609 615820 575209 530611 512042 505024 473347 454675 452464 435044 424823 423836 406066
2874 406066 402246 386871 383119 384176 379461 372371 371434 368663 375161 365602 379831 394034 388587 366701
2860 366701 362174 368159 369032 379415 386172 383311 392977 378543 366595 377597 388180 381544 373111
2847 373111 392749 400155 398948 399235 411178 405046 407071 406647 401706 393318 396874 423647 420054 411582
2833D11582M917M820J6422j1123J2179L1124K614k6819K2469J8244P604N974J9809
2820E19816J0961R422j2475O806R424l38M785K2210J0085J5335j332L522K5896
2807F24117R095J5922K0227K4854K5007M3879K1240K2268J2577L7814K7352K5550
2795I09902M0168J2608K6497J8464J6074K4896L3958Q200J6738L6775J9599L7393
2783A201272L9291K2468L6081M1384L7850L5920L8316N6954P0821P7163P4615
2772A732135Q1343N7201Q2335Q9025Q6556N9676P4862Q9474J00503Q2295R5108
2761B630513J33604J17412J47746J97124K28510K61922K90075L61218M43983N42042
2751E354149O24083P66509Q68052R34258J000082J030116J029886J052087J056637
$$ plain form
2833 411582 416499 421319 437741 426618 438797 469921 472535 445716 468185 486429 494033 500007 519816
2820 519816 530777 540199 527724 534530 543954 543616 548401 570611 580696 596031 594699 598221 624117
2807 624117 633212 649134 669361 694215 719222 763101 784341 806609 819186 857000 884352 909902
2795 909902 950070 962678 989175 1007639 1023713 1048609 1082567 1090767 1107505 1144280 1163879 1201272
2783 1201272 1240563 1263031 1299112 1340496 1378346 1414266 1452582 1509536 1580357 1657520 1732135
2772 1732135 1813478 1870679 1953014 2042039 2128595 2188271 2263133 2352607 2453110 2535405 2630513
2761 2630513 2764117 2881529 3029275 3226399 3454909 3716831 4006906 4368124 4812107 5354149
2751 5354149 5978232 6744741 7612793 8547051 9547133 10577249 11607135 12659222 13715859
2742A3715859Q16233K41241n73281j170410j285554j115134q64594n71906l31440
2733H861014j64354l2767L3575Q2989J60410J29344q1148l38090n05282m87065
2723G658626m06799l20107k27577j86079j37278p6097m9018l9348m1267o0981
2713F114075j00669j65990l13932m08271m01837l99142l67303l10655k72405k41675
2703C132196k05743j79905j36511j32411j50858j11247q8051r5555q4544p3382
2693A873989o8440o4609n5166m0521k9258n2135n1669l7460l0948k8594n3435
2682A361754l0258j5046m4003l4409n2600l8282l0079l1591l3130m9376l8206
2671I64774r731q932l2029k5908k6366k7166k3776l5026j1659k8224k4403j4776
$$ plain form
2742 13715859 14532092 14773333 14200052 13029642 11744088 10628954 9764360 9192454 8861014
2733 8861014 8696660 8663893 8697468 8780457 8940867 9070211 8989063 8650973 8145691 7658626
2723 7658626 7251827 6931720 6704143 6518064 6380786 6304689 6255671 6216323 6175056 6114075
2713 6114075 6013406 5847416 5533484 5125213 4723376 4324234 3956931 3646276 3373871 3132196
2703 3132196 2926453 2746548 2610037 2477626 2326768 2215521 2127470 2031915 1947371 1873989
2693 1873989 1805549 1740940 1685774 1645253 1615995 1563860 1512191 1474731 1443783 1415189 1361754
2682 1361754 1331496 1316450 1272447 1238038 1185438 1147156 1117077 1085486 1052356 1002980 964774
2671 964774 955043 946111 914082 888174 861808 834642 810866 775840 764181 735957 711554 696778
2659F96778k0091p618r478j6930r139j961j5417j2383p631o717q254n470J29j0307
2645E65511k2241r730J59o711l1854k6794J012k4051k1745J1280j6963j2171j3543
2632C92159j2450k177j4276j1484J8910j726k9693j9701M113k434j0153p333M536
2619C08291Q414l4724M243m029j4755k904K4753j3615k1623K236K737m923p350
2606B46751O578J380q17m564J802j0802r638L614L922J179j1761k1820R82J757
2592B08563P604o470r282n815K690K472k196j3931q211p448L623R029q966q747
2578A62915m75J2129m939j0853K776r931j7371r734Q838J6947m649J000M191o387
2564A44457k061p96J0018R528k4086L423J1612j2711j5908n322N489n673Q638
$$ plain form
2659 696778 676687 669069 659591 642661 633522 631561 616144 603761 596130 589413 581159 575689 575818 565511
2645 565511 543270 533540 533699 526988 495134 468340 469352 445301 423556 434836 417873 405702 392159
2632 392159 379709 377532 363256 351772 370682 368956 339263 319562 323675 321241 311088 303755 308291
2619 308291 316705 281981 286224 282195 267440 264536 289289 275674 254051 256287 259024 254101 246751
2606 246751 253329 254709 253892 249328 251130 240328 230690 234304 238226 239405 227644 205824 206806 208563
2592 208563 216167 209697 200415 194600 197290 199762 197566 183635 175424 167976 171599 180628 171662 162915
2578 162915 162440 174569 169630 158777 161553 151622 134251 124517 133355 150302 145653 146653 150844 144457
2564 144457 142396 141600 151618 161146 137060 140483 152095 139384 123476 118154 123643 117970 126608
2551A26608J455m690N278j2329k843k787n053L088R315j7284p097R255N078K385
2537A10379j5123K816J5710j0126j3111J4577l036N582k96n11K985m791j163q284
2523I5608P016m952n995k189O145k642r377L194J097k159n375J2782o234n943
2509H0976M224l753R402j3451j546q28M094k555R690m84k8034R389K7700L239
2495I8063L762L60P288O645q279o016J4026J4314K248k800r96J1186o460n060
2481A28281r908o624j3225q26p102N108l755L548J3020k74r005j1807L346J6383
2467A07160o984k4175j511Q946j3248j3277J970L5328j4841j4346J5133J5238
2455I5393k5605j2429J6969J383j2681q533k948N372m611k711K138q362m126J250
$$ plain form
2551 126608 128063 123373 128651 116322 113479 110692 105639 108727 118042 100758 93661 102916 107994 110379
2537 110379 95256 98072 113782 103656 90545 105122 102086 107668 107372 106861 109846 105055 103892 95608
2523 95608 102624 97672 91677 89488 95633 92991 83614 86808 87905 85746 80371 93153 86919 80976
2509 80976 85200 81447 90849 77398 75852 75024 79118 76563 86253 85769 57735 67124 94824 98063
2495 98063 101825 102185 109473 116118 107839 101823 115849 130163 132411 129611 128615 139801 133341 128281
2481 128281 118373 111749 98524 97698 90596 95704 91949 95497 108517 108243 99238 87431 90777 107160
2467 107160 100176 76001 74490 83436 70188 56911 58881 94209 79368 65022 80155 95393
2455 95393 69788 57359 74328 75711 63030 54497 51549 56921 52310 49599 51737 43375 39249 40499
2441D0499J934J7862j043j5458N566k346p571p294Q034P396J281r689L864J8525
2427F1560j9143j2409P233R027m026j6542Q019J0330k5296J462K3921p693J244
2414C7687j7989p1l374J5939n007K772p649o084J82P525P914L680j5878q01J1952
2399C0798J2541r485j5210m66P065k033J759M812J1472p991o414J295p953n450
2385A4740r303J1836K479M196j129p286m65j217L234R08Q785q572r428K750K550
2370A4078J0401n955j1756J8383J2529j8938j6078J5208J1650k2383K590k209
2358G520J6772q881k9388L5034J4999j0800r525M610p445m056J8939q2l122j3145
2344A1430K381O948j2835n336J2031O005m154J0330j39p669l728J3750R815j3869
$$ plain form
2441 40499 42433 60295 59252 43794 49360 47014 39443 32149 40183 47579 48860 39171 43035 61560
2427 61560 42417 30008 37241 46268 42242 25700 33719 44049 18753 20215 44136 36443 37687
2414 37687 19698 19627 16253 32192 27185 29957 22308 16224 16406 23931 31845 35525 19647 18846 30798
2399 30798 43339 33854 18644 18178 25243 23210 24969 29781 41253 33262 26848 28143 20190 14740
2385 14740 5437 17273 19752 23948 22819 15533 15068 13851 17085 17993 26778 18206 8778 11528 14078
2370 14078 24479 18524 6768 25151 37680 18742 2664 17872 29522 7139 9729 7520
2358 7520 24292 15411 -13977 21057 36056 25256 15731 20341 12896 8840 27779 27697 24575 11430
2344 11430 13811 20759 7924 2588 14619 20624 16470 26800 26661 18992 15264 29014 38829 24960
2330B4960p396j941J893k407J9611o220k084j5164N194o360r870J518M318J110
2316G162k65j00Q09K397O525R736n351j2490J4969j0112J0500R131j1053k200
2302A9658j8712j504Q365n364n204J3926J2512N588q880R854O551N833q916J28
2288C3835N418o690J76R218J2390k2147j5886R82l025M683j6906K0541J1552j2276
2274B1865n479j149N998M72o680o49K8889r115k6131Q005p42O5j0639J075M405
2259A0190J806J57o720J2291r899J1141o287j0593J09m327J4744O633j6650l46
2245B249N812l031J1373j0356J8200l436k425R787o640p338m215N829j7302n436
2231f929J6228K625R22K041J2933j9289n83O620j0147k230M330J711M457P029
$$ plain form
2330 24960 17564 15623 17516 15109 34720 28500 26416 11252 16446 10086 216 1734 6052 7162
2316 7162 6897 6797 7606 10003 16528 26264 20913 8423 23392 13280 23780 32911 21858 19658
2302 19658 946 -558 7807 2443 -2761 11165 23677 29265 20385 30239 36790 42623 33707 33835
2288 33835 39253 32563 32739 41957 54347 32200 16314 17296 14271 18954 2048 22589 34141 21865
2274 21865 16386 15237 21235 21707 15027 14378 43267 34152 8021 16026 15284 15349 4710 5785 10190
2259 10190 11996 12153 5433 17724 7825 18966 12679 2086 2195 -2132 12612 19245 2595 2249
2245 2249 8061 5030 16403 6047 24247 20811 18386 28173 21533 14195 9980 15809 -1493 -6929
2231 -6929 9299 11924 12846 14887 27820 8531 7948 14568 4421 2191 6521 8232 12689 19718
2217A9718r372Q74J0514J1924k1421k2162K897K1562O212k0399j236M919j1293
2204g263o303K0721J3505k3335k452J3815k476j2087N452J2349l243q7j1622M583
2190A557J6025j6674J3184P277j9894o990k817J0536J5712q528j3155P386P107
2177A0726M760M778O842o904o54j6418j4802K8958J3752O67n764j4485r462J1405
2163A3399j606n220M78K904J0951Q191j3631j283q012K078J3999j3764J1560P930
2149B7974j875j8335q113J400J7253n947j4727K5705J0164k6215O419P875l767
2136A7811r761j921L0245p095l0017J1518K8281L988j7221l457J0452l431p581
2123B1811J3894K3294m281j7317Q200J2116j5426j1874P162J4725M261l816J7437
$$ plain form
2217 19718 10346 11220 21734 33658 12237 -9925 -7028 14534 20746 347 -889 4030 -7263
2204 -7263 -13566 7155 20660 -2675 -5127 8688 6212 -5875 -423 11926 8683 8596 -3026 1557
2190 1557 17582 908 14092 21369 1475 -5515 -8332 2204 17916 9388 -3767 3619 10726
2177 10726 15486 20264 27106 20202 19548 3130 -11672 17286 31038 31705 25941 11456 1994 13399
2163 13399 11793 6573 7051 9955 20906 29097 15466 14183 6171 8249 22248 8484 20044 27974
2149 27974 26099 7764 -349 1051 18304 12357 -2370 23335 33499 7284 13703 21578 17811
2136 17811 8050 6129 36374 29279 -738 10780 39061 43049 25828 22371 32823 29392 21811
2123 21811 35705 58999 54718 37401 45601 57717 42291 30417 37579 52304 56565 52749 70186
2110G0186J3609k3606Q344r66P334n292J5535J7692l77N33L770K4350q312j1528
2096A11272J8881M591M704K216m226P193q320j1708J7640J1025j2158O341R873
2083A57324l58J6738J2777N455K3252N240M415J8139K4288J5263P938J7075K1726
2070C29272J4633J7678L1103L4589L9673K7163M8632N5673M9168O4395P7649R9567
2058H89195Q4547N6411J38617J82973K51829L03244M47542N55109N30270N49928
2048C989665M51576N51294J022817N87694r66923j441298r53659o10010m57649
2039B173507l23714k34084j96996j57395j10513j01208n0505m1664p5911r1863
2029G89654r1244n8473l8301m7306m8250j3751k1919l7700k5629k2373k8070r712
$$ plain form
2110 70186 83795 60189 68533 67567 74901 69609 85144 102836 102459 102992 106762 131112 122800 111272
2096 111272 130153 134744 139448 141664 137438 144631 136311 124603 142243 153268 141110 147451 157324
2083 157324 156966 173704 186481 191936 215188 220428 224843 242982 267270 282533 290471 307546 329272
2070 329272 343905 361583 392686 427275 466948 494111 542743 598416 647584 711979 789628 889195
2058 889195 973742 1030153 1168770 1351743 1603572 1906816 2354358 2909467 3439737 3989665
2048 3989665 4441241 4992535 6015352 6603046 5636123 4194825 3241166 2631156 2173507
2039 2173507 1849793 1615709 1418713 1261318 1150805 1049597 999092 957428 881517 789654
2029 789654 698410 639937 601636 554330 506080 492329 470410 432710 407081 384708 356638 346926
2017C46926k2909j567O239l1964k2164P240q13j1922j9835j2145j274j6047k537
2004B17228j2923j1862j6743N330O16j7372j5646k0360P325L033j7726o571J4070
1991A28399N531Q90q334N525j436L41o718K73k0918m919N799j1546J9901q043
1977A04745j7685M47K348K623K598j3076q863j704j1586M543R9P906j0527J0235
1963G2103O406j0688r31K798m888J15n915m332j0144Q338m994R150j3073J938
1949D5883j286K276Q06j149j1998L041R436j1522k950l525O580n911Q976q199
1935C0458J3796p030j0478j247J453N410K02M18m354J831j766m024L109O951J2622
1920D7351k5036r370J9364r031j0749l474O405N322o133O480J1067m590j8218
$$ plain form
2017 346926 324017 322450 328689 296725 274561 281801 280988 269066 249231 237086 235812 219765 217228
2004 217228 204305 192443 175700 181030 181646 164274 148628 128268 135593 138626 120900 114329 128399
1991 128399 133930 134820 126486 132011 130575 130916 124198 124471 103553 98634 104433 92887 112788 104745
1977 104745 87060 87507 89855 92478 95076 82000 73137 71433 59847 64390 64489 72395 61868 72103
1963 72103 78509 67821 66890 69688 64800 64915 59000 54668 44524 52862 47868 57018 43945 45883
1949 45883 44597 46873 47679 46530 34532 37573 47009 35487 32537 29012 35592 29681 38657 30458
1935 30458 44254 37224 26746 25499 26952 32362 32564 32982 28628 30459 28693 24669 27778 34729 47351
1920 47351 22315 12945 32309 23278 12529 9055 15460 20782 14649 21129 32196 27606 9388
1907I388J1358K3864r520K374m340j1530Q248k37k825L304K6751j7257j3065L970
1893C0483n856j7394j2603K1276M568n049j4110O456P978j633K064N448K747l455
1879B0920o855j1994P91Q27Q436m378O237J287j2994J0197O150j0032m923J552
1865E221P749L644k2006N627l40K374J3975r182q599j592J8878J440j927l246
1851A2016Q307j4896j389l928k480O674j202J112K577p170O515J2337J5673l317
1837C0829p700n149L632J1879r353j5860M984R583j4848P307K2403r734j1547
1824A6426l583r812L966O744j051l943Q320k514o433J1264m465j2440K981O296
1810A1756R796k498J4871j3984J445K8641O723m179j9631r021J012k432r981P74
$$ plain form
1907 9388 20746 44610 35090 37464 33124 21594 29842 29605 26780 30084 56835 39578 26513 30483
1893 30483 24627 7233 -5370 15906 20474 15425 1315 7771 15749 14116 16180 21628 24375 20920
1879 20920 14065 2071 2862 3689 12125 7747 13984 15271 2277 12474 18624 8592 3669 5221
1865 5221 12970 16614 -5392 235 -105 2269 16244 7062 -1537 -3129 15749 17189 15262 12016
1851 12016 20323 5427 4038 110 -2370 4304 3102 4214 6791 -379 6136 18473 34146 30829
1837 30829 23129 17980 21612 33491 24138 8278 13262 22845 7997 15304 37707 27973 16426
1824 16426 12843 3031 6997 13741 12690 8747 17067 14553 8120 19384 14919 2479 5460 11756
1810 11756 21552 19054 33925 19941 21386 50027 56750 52571 32940 23919 24931 22499 12518 13292
1796A3292J2263p131K199J4936k4852N645K504j632L833k6062k528K0275j2997
1783b55P444q648j7464K5225j585j9170Q942Q835r023L278L364n191n797J3495
1769C450n307j896l385j201k241M569p147J8602j0456Q580j964J1411J605j4313
1755C07Q62J0033l257K277r197L20N447p293k780P166l045n628O708N473R966
1740A7359k4167K340j3141M831R111J490q611r120J8648K982m271n459n221M646
1726h583Q493j0842P83J4608L587j2484R423L931j2177k846N218J755l046l414
1712e594j536Q625k786q146n663K1815k119r788J0631J2204p298j2375L245J1006
1698A2221o261k0318j3158J3653J3682r000p506J9893K2102k5926l513J3871j4365
$$ plain form
1796 13292 25555 18424 20623 35559 10707 16352 18856 17224 21057 -5005 -7533 12742 -255
1783 -255 7189 -1459 -18923 6302 4717 -14453 -5511 3324 -5699 -2421 943 -4248 -10045 3450
1769 3450 -1857 -3753 -7138 -8339 -10580 -6011 -13158 5444 -5012 3568 1604 13015 14620 307
1755 307 1169 11202 7945 10222 1025 1345 6792 -501 -3281 3885 840 -4788 1920 7393 17359
1740 17359 -6808 -4468 -17609 -12778 -3667 -2177 -10788 -19908 -1260 1722 -2549 -8008 -13229 -8583
1726 -8583 -90 -10932 -10149 4459 8046 -4438 4985 8916 -3261 -6107 -889 866 -2180 -5594
1712 -5594 -7130 1495 -1291 -9437 -15100 6715 4596 -5192 5439 17643 10345 -2030 1215 12221
1698 12221 5960 -14358 -27516 -13863 -181 -9181 -16687 3206 25308 -618 -4131 9740 -4625
1685d625K658R359K900L27k3694p744J4178n979l046J8688J7920j2644q277o358
1671f337J8347l69n496j3201l423K998j786P701K334l612K672j2531L66j459L392
1656a0404L746j849m29P620J450k896m6p276O172J3703r476m005j204r101J7276
1641C281L162o600P495n679J2069o572j4047J0170K558j0126J263N153j919p739
1627g531K078N753J3787N794j1287Q82k2282K3484J0792j5936k231K832j4334
1614h199O645P774r469Q24R361K1219m291k1072j22p431q979M445K4127j786j1218
1599A828O191k2401P694j269n596K2833k777l281p952J8O469N385P201j0498P857
1584A1702j1789R963o28k11q839l984M065o804p096R748J7966j2662j1203l497
$$ plain form
1685 -4625 -1967 7392 10292 10619 -13075 -20819 -6641 -12620 -15666 3022 20942 8298 21 -6337
1671 -6337 12010 11641 6145 -7056 -10479 -7481 -9267 -1566 768 -2844 -172 -12703 -12337 -13796 -10404
1656 -10404 -6658 -8507 -8936 -1316 134 -2762 -2808 -10084 -3912 9791 315 -3690 -4894 -13995 3281
1641 3281 6443 -157 7338 1659 13728 7156 -6891 3279 5837 -4289 -3026 2127 208 -7531
1627 -7531 -5453 300 14087 19881 8594 9476 -12806 10678 21470 5534 3303 6135 -8199
1614 -8199 -1554 6220 -3249 -2425 6936 28155 23864 2792 2670 -4761 -13740 -9295 14832 13046 1828
1599 1828 8019 -14382 -6688 -7957 -13553 9280 6503 3222 -4730 -4712 1757 7142 14343 3845 11702
1584 11702 -87 9876 9248 9037 198 -3786 279 -6525 -13621 -3873 14093 1431 -9772 -13269
1570a3269K4754M65q127l82n15m36J1088k2386L895L029J428n41k26j4153m377
1555a9753J1302J1473k120Q271j2797J3006N116k1759j982J4300j0354m967k062
1542a2326K3564L748j9389o148J3817j2685p672J6358R841j4272j1401J2020N090
1529E45J0849j014K287k848j5163j1562J9959l957J6008m552q296p991j385N20
1515f600L54L392Q364j1744M810k26q463m40L949N832j6313Q185J4284k604O564
1500I344k1818p004Q821J2473m616n929J9178J216j1245n031K635J7802j0882
1487D944m81l496k281J902r921M228m089L878J2315K342j4816n195O93J4558O321
1472A0902j6807L161J177J277J242J5759j2627o347K154N814K508N473n652P67
$$ plain form
1570 -13269 11485 11950 3823 3441 2926 2490 13578 -8808 -4913 -1884 -456 -997 -1223 -15376 -19753
1555 -19753 -8451 3022 902 9173 -3624 9382 14498 -7261 -9243 5057 -5297 -10264 -12326
1542 -12326 11238 14986 -4403 -10551 3266 -9419 -17091 -733 9108 -5164 -16565 -4545 545
1529 545 11394 10380 12667 9819 -5344 -16906 3053 -904 15104 10552 2256 -5735 -7120 -6600
1515 -6600 -6246 -2854 5510 -6234 -1424 -1650 -10113 -10553 -6604 -772 -17085 -8900 5384 2780 9344
1500 9344 -12474 -19478 -10657 1816 -2800 -8729 10449 11665 420 -4611 -1976 15826 4944
1487 4944 4463 967 -1314 588 -9333 -5105 -9194 -5316 6999 9341 -5475 -10670 -9977 4581 10902
1472 10902 -5905 -2744 -1567 -290 952 16711 4084 -2263 -109 5705 8213 13686 8034 8801
1458H801Q632q377n724O81p571o433R326L585j2520M915Q946J1878m495j7830
1444f186J941O837J427j278q668j227J2406O573j2140m367j597K265O147k159
1430b6Q486k1780R409J8972J6144j6759j3162J6134j084k6411M293M41J233O681
1416B571L074q303j9167J2710J1616n083p78j2727J4405O402k0011m069J7560
1403a800o635q51j746P813J2089k6811r513K4190P812j6608R60j776n191p028
1389b5095N879J0634M585o164O916J9961j5920o571Q919N282r902j155q51P07
1375b775r457n596P754J4691j1189q334N293j2609J5398L891J989Q861j3903J82
1361e804K1767j1203k854j2063N656Q44n610M475o064Q147Q675o230o470J089
$$ plain form
1458 8801 17433 9056 3332 4013 -3558 -9991 -665 2920 -9600 -4685 4261 16139 11644 -6186
1444 -6186 -4245 2592 4019 2741 -5927 -7154 5252 11825 -315 -4682 -6279 -4014 2133 -26
1430 -26 8460 -13320 -3911 15061 31205 14446 1284 17418 16334 -10077 -5784 -5343 -4110 2571
1416 2571 5645 -2658 -21825 -9115 2501 -2582 -3360 -16087 -1682 4720 -15291 -19360 -1800
1403 -1800 -8435 -9286 -11032 -3219 8870 -17941 -27454 -3264 4548 -12060 -11100 -12876 -18067 -25095
1389 -25095 -19216 -8582 -3997 -10161 -3245 16716 796 -5775 3144 8426 -1476 -2631 -3482 -2775
1375 -2775 -12232 -17828 -10074 4617 -6572 -14906 -9613 -22222 -6824 -2933 -944 7917 -5986 -5804
1361 -5804 15963 4760 1906 -10157 -4501 -3657 -9267 -4792 -10856 -2709 5966 -264 -6734 -5645
1347e645J1056l862N539J654l779J4543j2273j6037q795J0143n170j585P463J5563
1333H815j0774n056J2122k141j1455m416L058R820L813L158N154N051m739m666
1319G744R396m915j7873p081K026N644O722o991K786J1108J0021j6980l272J3127
1305A1462r465j1591N438M751o966o853j241j724r85M362J0909j2061Q130m878
1291a0712M274O732n18j530o49j574J869J7945j493j2069r094o867O685n178M938
1276g241J2461P125j5335q740O195O879o458O075j20J159J5985j0894r998J3055
1262A0148o547n272l05o68Q781O720o262m883J1075o973o703O671R76l1993J3388
1247a1847K2545k208k4754l575J1454J5505j3950r387K1194l298p049j197P880
$$ plain form
1347 -5645 5411 1549 7088 8742 4963 19506 7233 -8804 -17599 -7456 -12626 -14211 -6748 8815
1333 8815 -1959 -7015 5107 2966 -8489 -12905 -9847 -27 3786 6944 12098 17149 12410 7744
1319 7744 17140 12225 -5648 -12729 -10703 -5059 1663 -5328 -2542 8566 18587 1607 -1665 11462
1305 11462 1997 -9594 -4156 595 -6371 -13224 -14465 -16189 -17174 -12812 -1903 -13964 -5834 -10712
1291 -10712 -6438 294 -224 -1754 -2403 -3977 -2108 15837 14344 2275 -6819 -13686 -7001 -12179 -7241
1276 -7241 5220 12345 -2990 -11730 -5535 1344 -5114 961 841 2000 17985 7091 -2907 10148
1262 10148 3601 -1671 -1976 -2644 6137 12857 6595 1712 12787 5814 -889 5782 6758 -25235 -11847
1247 -11847 10698 8490 -16264 -19839 -8385 7120 -6830 -16217 4977 1679 -5370 -6567 1313
1234A313K87k252o144k757L323j212K569r424j7421J7424K113N247J3310q528
1220b152K117j406q162R68J2558l085M343P520O30K87J650j7317P43j7506m214
1205b3026K1719L848j6491K0331l163j2975O166r868Q291L864q037q4J3714q978
1191d689j2713K096K1694N822k2526K620R524n038j3661p9J3249L258j3925J35
1177a4233J5564M792j1357M226P604j2438m102Q914j4950l922J5692n052R64r249
1163a7547K2006j488j2693J996J5873j6247L643J3295j4145M262J491J3611p827
1150F230p453P478r83K800j2535j0767J1590J7051j1772j7802M464N159j2725
1137a9265M588K071p906J6465o46m167N504o745r439J1968J0661n948J330k723
$$ plain form
1234 1313 1600 -652 -6796 -9553 -6230 -7442 -4873 -14297 -31718 -14294 -12181 -6934 6376 -2152
1220 -2152 -35 -1441 -9603 -8635 3923 838 5181 12701 13331 13618 15268 -2049 -1306 -18812 -23026
1205 -23026 -1307 2541 -13950 6381 3218 -9757 -3591 -13459 -5168 -1304 -9341 -9425 4289 -4689
1191 -4689 -17402 -15306 6388 12210 -10316 -7696 1828 -3210 -16871 -16950 -3701 -443 -14368 -14233
1177 -14233 1331 6123 -5234 -1008 6596 -5842 -9944 -1030 -15980 -19902 -4210 -9262 -8298 -17547
1163 -17547 4459 2971 -9722 -7726 8147 -8100 -4457 8838 -5307 -1045 446 14057 6230
1150 6230 -1223 6255 5272 8072 -4463 -15230 -3640 13411 1639 -16163 -11699 -6540 -19265
1137 -19265 -14677 -12606 -20512 -4047 -4693 -8860 -3356 -10101 -19540 -7572 3089 -2859 -1529 -4252
1123d252o713J342M740J5440M219o695j3017P822N402n476J197q0L477J475l070
1108E811m969Q349k642j4379Q964p635m769k191o813J9092J5627j4492O45O220
1094F818r255J3365j1600n165K041q57K984R57n951P852K1041k2316J5921J1275
1080B7110l0937J1154j590q207j4251J0847L653P456q581L390J5951j4849k370
1067a224J6340j0470j3070R248m942K0688j2860j8068K2313j1164j3401J1667
1055d943J3109P703o288m499J177k377q408Q223R43p522l403p590Q33O641R857
1040C456l873j890K616l11J1285j1666J500O083q697L490J5516j9718J0490l875
1026D406j6033Q977L388K32J5641p095n910p930j3282Q992L024j3134K685J1336
$$ plain form
1123 -4252 -10965 -9623 -4883 10557 14776 8081 -4936 2886 8288 2812 4009 3929 7406 8881 5811
1108 5811 842 9191 6549 -7830 1134 -6501 -11270 -13461 -20274 -1182 14445 -47 598 6818
1094 6818 -2437 10928 -672 -5837 -3796 -4653 -1669 -712 -6663 1189 22230 -86 15835 27110
1080 27110 -3827 7327 5737 -2470 -16721 -5874 -2221 5235 -3346 44 15995 1146 -1224
1067 -1224 15116 4646 -8424 824 -4118 16570 3710 -14358 7955 -3209 -16610 -4943
1055 -4943 8166 15869 9581 5082 6259 3882 -4526 3697 4640 -2882 -6285 -13875 -13042 -6401 3456
1040 3456 -417 -2307 309 -2 11283 -383 1117 7200 -1497 1993 17509 -2209 8281 4406
1026 4406 -11627 -2650 738 970 16611 9516 3606 -4324 -17606 -8614 -5590 -18724 -16039 -4703
1012d703L098J2524k75r134L890L125j1439J1866j6793L186K501R858n519K349
998D534O439n078N804O832n354j1700O14r852P987K405L137j7346J964k172Q658
983c128J1085K656j1q254k08J1125n193j0111N828j6743j209M894j495n823Q197
968h390J1828O20q14K088J2989j1838k0717J9032k125j1683l243K4203Q919j7992
954B877j0706J2681M015k3748J5477j08p420O944o594J0635m00k1510J2185k717
940h389L120l208K0065L745l725p625k974l510n536O386N931R065j4293P392L222
925I666r684j1135r86K1872j414k5738M077J3893L438p238j1p275K3099j0281
911B283L168J1221j7900j2406J2791m517J5629K319j4321K644l973M081L319Q63
$$ plain form
1012 -4703 -1605 10919 10644 1510 5400 8525 -2914 8952 -7841 -4655 -2154 7704 2185 4534
998 4534 10973 5895 11699 18531 13177 1477 2091 -7761 226 2631 5768 -11578 -9614 -11786 -3128
983 -3128 7957 10613 10602 2348 2140 13265 8072 -2039 3789 -12954 -14163 -9269 -10764 -16587 -8390
968 -8390 3438 4058 3244 5332 18321 6483 -14234 4798 2673 -9010 -12253 11950 20869 2877
954 2877 -7829 4852 8867 -14881 596 488 -6932 12 -6582 4053 3653 -17857 -5672 -8389
940 -8389 -5269 -8477 11588 15333 11608 3983 1009 -2501 -8037 -1651 4280 13345 -948 6444 9666
925 9666 -18 -11153 -12139 9733 8319 -17419 -13342 551 3989 -3249 -3260 -10535 12564 2283
911 2283 5451 16672 -1228 -13634 -843 -5360 10269 12588 -1733 911 -3062 1019 4338 5201
897E201j146r778j4169Q394J9297j57m340J0516m614P727r442j5445J347j866
883h475l774N852J9465j6578n913k936M955J962j5252K7366O435j0849o31p263
869e636M706p431j0711J4481K589k320k201J0260J5151j2576r195Q868M576j312
855I249k3592J7370Q677j3542j0903R204n93p11k907J0350q472r215J387k775
841a6473k35r691J0485R065j2377K365J7258M536L74j6411R03N90R324q934j862
826a1083n447P34J1646K9825n861j0941l096k954J1517j936j3532n652p92J1000
812C428J0969j3964j6224M937J3847O330p251p568J079Q363L798J362J5586j4853
798I839M212J610L5m469j0781j1080m405N896J4856j892K347j6869K914J4177
$$ plain form
897 5201 4055 -5723 -19892 -11498 7799 7642 3302 13818 9204 16931 7489 -7956 -6609 -8475
883 -8475 -12249 -6397 13068 -3510 -9423 -12359 -7404 -5442 -20694 6672 13107 2258 1627 -5636
869 -5636 -930 -8361 -19072 -4591 -2002 -4322 -6523 3737 18888 6312 -2883 5985 10561 9249
855 9249 -14343 3027 11704 -1838 -12741 -3537 -4130 -4841 -7748 2602 -5870 -15085 -13698 -16473
841 -16473 -16708 -26399 -15914 -6849 -19226 -16861 397 4933 5307 -11104 -10201 -9611 -287 -9221 -11083
826 -11083 -16530 -15796 -4150 25675 19814 8873 5777 2823 14340 12404 -1128 -6780 -7572 3428
812 3428 14397 433 -15791 -10854 2993 9323 2072 -5496 -4417 3946 7744 9106 24692 9839
798 9839 14051 15661 15696 11227 446 -10634 -15039 -9143 5713 3821 6168 -10701 -7787 6390
784F390J20R883k0657L304k019m945O540j1180O631P348m662k692J9625m410j7420
769h144j897O734O821r42m874K9976n404l1680p386J7696j535p742p605J4786
755a196J5094j4268Q608L985j018j4639l713J1792K368j8043J2929J6503j1252
742G150j3336M994j1250N267l686p11L015M776J986k684j0918K233J1503p458
728i119R435N151j2213j650N476m25k3088L502J2411R744J917j9972J3057J8233
714A2459O426j9935N999J2730q210j1250M434q291j4851J8042q10M87K034n755
700f491L138J418n194r982O967k373J5647P631j3607l225m292O808J5484k54j7083
685e408J4239o757K471j2645j7357J0067Q791Q775L936l209K59J8996j2812j4735
$$ plain form
784 6390 6510 16393 -4264 -960 -2979 -7924 -1384 -12564 -5933 1415 -3247 -5939 13686 9276 -8144
769 -8144 -10041 -3307 3514 2572 -2302 27674 22270 -9410 -16796 900 -635 -8377 -15982 -1196
755 -1196 13898 -370 8238 12223 11205 -3434 -7147 4645 7013 -11030 1899 18402 7150
742 7150 -6186 -1192 -12442 -7175 -10861 -11572 -8557 -3781 -1795 -4479 -15397 -13164 -1661 -9119
728 -9119 316 5467 -6746 -8396 -2920 -3345 -26433 -22931 -10520 -776 1141 -18831 -5774 12459
714 12459 18885 -1050 4949 17679 9469 -1781 2653 -5638 -20489 -2447 -3257 -2770 -736 -6491
700 -6491 -3353 -1935 -7129 -17111 -10144 -12517 3130 10761 -2846 -6071 -10363 -3555 11929 11675 -5408
685 -5408 8831 2074 4545 -8100 -25457 -15390 -6599 2176 6112 2903 3162 22158 9346 -5389
671e389J3655k196M0j1152Q561j0691M136q815J501J1126j6704J6403J4780l813
657A1442j909q921J003J3170p745j8857J4611O542j3386o152L24J1995l84r22
643H11k322K0979n543j4418L67J5907l57p918j3418O666j4967j0901J3987J9691
629H564j5816n50K5669m625j2508j5928M395k931p553J3368R854L267N449p626
615C029n662k661J1161J711n037K267P064j6531r693J6387P785r959j1055Q045
601c149K34J0162j8526J3428l306R809p550l732J4444j6742M280l762J3919P824
587A7333j1851j0917R829M052j4445j600J3415k721r443L607K321L059L687p236
573i10p938L91p76p106J0873J1467l471J87m648L737R407j6885j182r823n964
$$ plain form
671 -5389 8266 6070 6110 -5042 3519 -7172 -3036 -11851 -10350 776 -15928 475 15255 11442
657 11442 9533 612 1615 14785 7040 -11817 2794 9336 -4050 -10202 -9878 2117 1733 811
643 811 -1511 19468 13925 -493 -126 15781 15424 7506 -5912 754 -14213 -25114 -11127 8564
629 8564 -7252 -7802 17867 13242 734 -15194 -10799 -13730 -21283 -7915 1939 5206 10655 3029
615 3029 -2633 -5294 5867 7578 2541 4808 11872 -4659 -14352 2035 9820 -139 -11194 -3149
601 -3149 -2915 7247 -11279 2149 -1157 8652 1102 -2630 11814 -4928 -648 -4410 9509 17333
587 17333 5482 -5435 4394 8446 -5999 -7599 5816 3095 -6348 -2741 -420 2639 6326 -910
573 -910 -8848 -8457 -9233 -16339 -5466 6001 2530 2717 -1931 1806 11213 -5672 -6854 -16677 -22641
558b2641J3889R330N999Q864j0342o702J2075J7060j2860j5874N940N549j6462
545f175p132J9918L13l627p792M656J3640q746o031J1812j0758j1332M697O594
531C7K210j3605n232J9769j1016k5473R198K1346J747m180K104J310Q034j1386
517e137O99J0225m384k822P527j4607L563J103N189Q356j6256J6358R776k2697
503c107P930Q798q964j5780J1007K620p91l5n186J4947o846l997N040l533r195
488g092J169p262K530J4046n296O547R166k3941M40K2012j95r218j1092k707J5667
473D774j8277j287J6670m19o285j4391J1128K733k987n199Q500K0712j1373J446
459E745O163j5761N470J6604j6784n383K060P802k253j7426J3140J396p0j0266
$$ plain form
558 -22641 -8752 578 6577 15441 5099 -1603 10472 27532 14672 -1202 4738 10287 -6175
545 -6175 -13307 6611 6924 3297 -4495 161 13801 5055 -976 10836 78 -11254 -6557 37
531 37 2247 -11358 -16590 3179 -7837 -33310 -24112 -2766 -1019 -5199 -3095 -1785 6249 -5137
517 -5137 -4438 5787 1403 -1419 6108 -8499 -4936 -3833 1356 9712 -6544 9814 19590 -3107
503 -3107 4823 13621 4657 -11123 -116 2504 1713 1678 -3508 11439 4593 596 5636 2103 -7092
488 -7092 -5923 -13185 -10655 3391 -1905 4642 13808 -10133 -9693 12319 12124 2906 -8186 -10893 4774
473 4774 -13503 -14790 1880 1461 -4824 -19215 -8087 -5354 -8341 -13540 -5040 15672 4299 5745
459 5745 11908 -3853 1617 18221 1437 -3946 -1886 5916 3663 -13763 -623 773 703 -9563
445i563Q046J0608r856k381Q95P892k3925n091J0511J9180n411p513J1817j18
431E091j0414q808P953k976P628j0113J3627J3886k6311J3383J5940j065l097
418A4724m699M56O63j1585p287N079p60k377N352j7460J1265J9803k050m498J122
403G748k125n580J2613m297j1551J0638J3831j5807o981R237J272l229j1544J2409
389F634j1562l700J5290l393j0457J567J7299R882j0642j9389J6977j048j2193
376d735J1702J6207j6397k766m26j596l978m728Q375R243k119J021m554j5440
362a0191R06N872J0890q514O902Q982L72Q777L567j7642r220J4852J282j0846
348E989n331M216j0051j402J8219P200n269j0076J4672N535k9412J1219p008n394
$$ plain form
445 -9563 -1517 9091 -765 -3146 -2251 5641 -18284 -23375 -12864 6316 905 -6608 5209 5091
431 5091 -5323 -14131 -6178 -9154 -1526 -11639 1988 15874 -10437 2946 18886 17821 14724
418 14724 10025 10481 11144 -441 -7728 -2649 -3409 -5786 -434 -17894 -6629 13174 11124 6626 7748
403 7748 5623 43 12656 8359 -3192 7446 21277 5470 -1511 7726 8998 5769 -5775 6634
389 6634 -4928 -8628 6662 3269 -7188 -5621 11678 21560 10918 -8471 8506 7458 -4735
376 -4735 6967 23174 6777 4011 3585 1989 -1989 -6717 1658 10901 8782 9803 5249 -10191
362 -10191 -9285 -3413 7477 -1037 5865 14847 15219 23996 27563 9921 701 15553 16835 5989
348 5989 658 4874 -5177 -6579 11640 18840 13571 3495 18167 23702 -5710 5509 -1499 -6893
334f893n99j400J0471M672n633l287j0359m049M750K3126N159m915J2190j896
320B1337k0196l143P277j0971k17J5913j652o402k544Q24K35L560m56L960J1932
305A9457m699j1277o266J921M600r818k241J5183R294L624r895m943q079L345
291B06l983l46j623r74l60J4583N740j2753k164m189J2252j182j5791K1087J0777
276B1280j2824j6459K482K698J3778n048P10k441J2363o310k641O661j2242R528
262A1535M265K972j1281j5576J5957r805n108J4487m120p412R302Q171J0880l863
248B0404J4364j5588m284n59j0609R027j7779O023J0021j0642L328Q4k089m931
234c230p165J7821O406j5979r58J8522j3156j8468J7705J5813j8853p043J4627
$$ plain form
334 -6893 -7492 -8892 1579 6251 618 -2669 -13028 -17077 -12327 10799 15958 11043 23233 21337
320 21337 1141 -2002 5275 -5696 -5913 10000 8348 1946 -598 226 461 4021 3565 7525 19457
305 19457 14758 3481 -2785 -864 3736 -6082 -8323 6860 16154 19778 9883 4940 -3139 206
291 206 -3777 -4123 -5746 -6720 -7080 7503 13243 490 -1674 -5863 6389 5207 -10584 10503 21280
276 21280 8456 -8003 -5521 -2823 10955 5907 6617 4176 16539 10229 7588 14249 2007 11535
262 11535 15800 18772 7491 -8085 7872 -1933 -7041 7446 3326 -4086 5216 13387 24267 20404
248 20404 34768 19180 14896 14337 3728 12755 -5024 999 11020 378 3706 3790 1701 -3230
234 -3230 -10395 7426 13832 -2147 -3105 15417 2261 -16207 1498 17311 -1542 -8585 6042
221F042Q476j4153L45J6897P249k2555j3751J5684R794p616l427J1182P527l699
207A7995j5125j3322P516O206Q947j5828J287p37P311q49J920n069J950m784j855
192d437J2551p161j9587N198J3082J1034j4448M022L497p621l2K434J1216o485
178C263j9303K1247J9299q081j6852k2288P113J1226J358Q93j1143J9689k558
165C863j5571J1727J5045r999m881J4236j048m373j1087J6679k784J739j4000
152d54M471J8550m469r566o14o066o298P853J852j280M640M450j614L093m758
137I790j3891J3473J0339k408p417j0443K107J070o04L148J6277j894j8769P452
123H230K44L936q260P413L621M89n017l637p201m584j294j93M641J2153o727m117
$$ plain form
221 6042 14518 365 710 17607 24856 2301 -11450 4234 14028 6412 2985 14167 21694 17995
207 17995 2870 -10452 -2936 3270 12217 -3611 -2324 -3061 4250 3401 5321 252 2202 -2582 -4437
192 -4437 8114 953 -18634 -13436 -354 10680 -3768 254 3751 -3870 -3902 -1468 9748 3263
178 3263 -16040 5207 24506 16425 -427 -22715 -15602 -4376 -3018 -2125 -13268 6421 3863
165 3863 -11708 19 15064 5065 184 14420 13372 8999 -2088 14591 11807 13546 -454
152 -454 4017 22567 18098 8532 7918 1852 -4446 3407 5259 3979 8619 13069 11455 14548 9790
137 9790 -4101 9372 19711 17303 9886 -557 1550 2620 2016 5164 21441 19547 778 8230
123 8230 8474 12410 4150 11563 15184 15673 10656 7019 -182 -4766 -6060 -6253 -1612 10541 3814 -303
107c03J0279j600r09N382K606j0327k061K975m6m566O680L596k862j4147O087
92G84P030j2160N797J1991R524j2860r258K22L971j0559Q882L134n444K409l579
77a16L286n637l794l642J1699K426p755R44J1000m820j7105k068J0693P42N257
62A110l408L482L392r211K188O685L632r745O957L295L343m745r623J3303L176
47A3831j0584q45N327m300L767O251O227n957o524l55l41o395p719N697O570J737
31F387o101n187Q288L415K030K035l60l748j4532J4092N4Q965j2054M890J2458
16B0632j3788k978m430J15J3504p758K162K423P681q405m647P279q239o580j1332
1a4361L945
$$ plain form
107 -303 9976 8376 7467 12849 15455 5128 3067 6042 5996 1430 8110 11706 8844 -5303 784
92 784 7814 -4346 1451 13442 22966 10106 848 1070 5041 -5518 3364 6498 1054 3463 -116
77 -116 3170 -2467 -6261 -9903 1796 4222 -3533 -2589 8411 3591 -13514 -15582 -4889 -4147 1110
62 1110 -2298 1184 4576 -4635 -2447 4238 7870 -1875 5082 8377 11720 6975 -2648 10655 13831
47 13831 3247 2402 7729 3429 7196 13447 19674 13717 7193 6838 6497 102 -7617 -1920 4650 6387
31 6387 286 -4901 3387 6802 8832 10867 10507 6759 -7773 6319 6373 15338 3284 8174 20632
16 20632 6844 3866 -564 -449 13055 5297 7459 9882 17563 9158 4511 11790 3551 -3029 -14361
1 -14361 -10416
0a0416
$$ plain form
0 -10416
$$ Imaginary data points
##PAGE= N=2
##DATA TABLE= (X++(I..I)), XYDATA
16383b63210p850N382l392r64j749Q231O37L366J3047K822J648N055Q629k626
16369b30974K75K969o96O168J2860o565L869P905J0540N614p472P691L877k314
16355a86253Q041O014J221n323M570N634J0139L025p217k661M656J2623M138M83
16341a40910P981o703Q830J2706m024L573N891Q737O630o621N466J8083o956j5582
16327a02899J6378Q80j1963n35Q662R256J8844q783J0264J1811j2081k126R856
16314e2436l483o91Q785J8993M678j5232q039J2836P896j4143J625J687P558J1552
16300a8414K816k26O246K038J513O917n055N05N667Q780J2216J307j5966J5310
16286B3654K392l531m86L517J396N984o957J0515j3M585N161K900R597R825p076
$$ plain form
16383 -263210 -271060 -265678 -269070 -270034 -271783 -263552 -262915 -259549 -246502 -243680 -242032 -236977 -228348 -230974
16369 -230974 -230699 -227730 -228426 -222258 -209398 -215963 -212094 -204189 -193649 -188035 -195507 -187816 -183939 -186253
16355 -186253 -178212 -172198 -170977 -176300 -171730 -166096 -155957 -152932 -160149 -162810 -158154 -145531 -141393 -140910
16341 -140910 -132929 -139632 -130802 -118096 -122120 -118547 -112656 -103919 -97289 -103910 -98444 -80361 -87317 -102899
16327 -102899 -86521 -85641 -97604 -98139 -89477 -80221 -61377 -70160 -59896 -48085 -60166 -62292 -52436
16314 -52436 -55919 -56610 -47825 -28832 -24154 -39386 -47425 -34589 -26693 -40836 -39211 -37524 -29966 -18414
16300 -18414 -15598 -15824 -9578 -7540 -6027 890 -4165 -3660 2007 10787 23003 24310 8344 23654
16286 23654 26046 22515 22029 25546 26942 32926 25969 36484 36471 41056 46217 49117 58714 68539 61463
16271F1463j7601M209J5448N404P632r991L098N259j2086j898K3798R984N694
16258A00413M357j997M343j6943M499J1299k50p801Q791R282k243j0355J3118
16245A16513J3156M92l398K0145q894j4937q333K8477N641j3431k164P73j3588
16232A20452N417L103J7665P635k1439J187J7451J2408j7620k421J6289J185p068
16219A54244m503Q574l578q719M295K2443k501p594k514J0502J0603Q267o838
16206A82681J0253k4011q816J8550l799L077K595N916M318j4276p029J5601m94
16193A84566q954J3905l714p010J4091o148o41J9016k505j590J7832k1707J4452
16180B11593J0389k1233M20J2959j8690R370J672l406J3560J880k790k591P923
$$ plain form
16271 61463 43862 48071 63519 68923 76555 66564 69662 74921 62835 60937 84735 94719 100413
16258 100413 104770 102773 107116 90173 94672 105971 105721 97920 106711 115993 113750 103395 116513
16245 116513 129669 130161 126763 146908 138014 123077 114744 143221 148862 135431 133267 134040 120452
16232 120452 125869 128972 146637 154272 132833 134020 151471 163879 146259 143838 160127 161312 154244
16219 154244 149741 158315 154737 146018 150313 172756 170255 162661 160147 170649 181252 189519 182681
16206 182681 192934 168923 160107 178657 174858 177935 180530 186446 190764 176488 169459 185060 184566
16193 184566 175612 189517 185803 178793 192884 186736 186095 205111 202606 201016 218848 197141 211593
16180 211593 221982 200749 201169 214128 195438 204808 206480 203074 216634 218514 215724 213133 221056
16167B21056m115J076q950P413o94l268n901M302j826n064K6334M353l462n710
16153B25544l539J6491r931r886K4509p603o825j487J826j0869R715N574J799
16140B35318j0488K893P010O226j2655M273J950K823M064R120n622j7318m356
16127B23238L429J6218j7973Q465K0663l224m427M957n878k387o555O022J3904
16114B56452l572j3255j62J2582L719j4578j2023P511J5611j4439K915L228p238
16101B36751J613l726p149J6053O266q025J3577p608j0835J8963J1500k2897J1707
16088B56190k947l009K0612k876j1698J480J984k246k264j7389j959J9351p668
16075B47561O187J307R256J1787j8671m822m83j2129L222K8022m697j7933j567
$$ plain form
16167 221056 216941 218017 209067 216480 215786 212518 206617 210919 209093 204029 230363 234716 231254 225544
16153 225544 222005 238496 228565 218679 243188 235585 228760 227273 229099 218230 227945 233519 235318
16140 235318 224830 227723 234733 240959 228304 232577 234527 237350 241414 250534 244912 227594 223238
16127 223238 226667 242885 224912 233377 254040 250816 246389 251346 245468 243081 236526 242548 256452
16114 256452 252880 239625 239463 252045 255764 241186 229163 236674 252285 237846 240761 243989 236751
16101 236751 238364 234638 227489 243542 249808 241783 255360 247752 236917 255880 267380 244483 256190
16088 256190 253243 250234 270846 267970 256272 257752 259736 257490 255226 237837 235878 255229 247561
16075 247561 253748 255055 264311 276098 257427 252605 252122 239993 243215 271237 266540 248607 247040
16062B47040K1087o117J869j5250J3403P359k6774Q334J7317P27P053q892o297
$$ plain form
16062 247040 268127 262010 263879 248629 262032 269391 242617 250951 268268 268995 276048 267156 260859
$$ [...]
##END NTUPLES=NMR SPECTRUM
##END=
