##TITLE=1H_CG-1152-1
 CDCl3, 8 sc, 
 24.08.2021
##JCAMPDX= 6.0         $$ Bruker NMR JCAMP-DX V2.0
##DATA TYPE= NMR SPECTRUM
##DATA CLASS= NTUPLES
##ORIGIN= UXNMR, Bruker Analytische Messtechnik GmbH
##OWNER= root
$$ XWIN-NMR		Version 3.5
$$ Tue Aug 24 10:10:02 2021 Russian Standard Time (UT+4h)  she@DPX200
##.OBSERVE FREQUENCY= 200.131506
##.OBSERVE NUCLEUS= ^1H
##.ACQUISITION MODE= SIMULTANEOUS
##.ACQUISITION SCHEME= undefined
##.AVERAGES= 8
##.DIGITISER RES= 18
##SPECTROMETER/DATA SYSTEM= spect
##.PULSE SEQUENCE= zg30
##.SOLVENT NAME= D2O
##.SHIFT REFERENCE= (INTERNAL, D2O, 0, 17.5069)
##AUDIT TRAIL= $$ (NUMBER, WHEN, WHO, WHERE, WHAT)
$$ ##TITLE= Audit trail, XWIN-NMR		Version 3.5
$$ ##JCAMPDX= 5.01
$$ ##ORIGIN= Bruker BioSpin GmbH
$$ ##OWNER= she
$$ F:/spectra/data/she/nmr/H-F/1/pdata/1/auditp.txt
$$ ##AUDIT TRAIL=  $$ (NUMBER, WHEN, WHO, WHERE, WHAT)
(   1,<2021-08-24 10:08:41.28 +0400>,<she>,<DPX200>,
      <created by zg, POWCHK disabled, PULCHK disabled
       configuration hash MD5:
       00 E9 B6 7A A2 85 ED C7 34 08 36 98 17 FE 4E 26
       data hash MD5: 16K
       46 BE 78 31 B8 18 0A 4B 96 AA 3F DA D1 0D 91 17>)
(   2,<2021-08-24 10:08:46.59 +0400>,<she>,<DPX200>,
      <Start of raw data processing
       efp BC_mod = 2 LB = 0.24 FT_mod = 6 PKNL = 1 PHC0 = -13360.04 PHC1 = 15.801 SI = 16K 
       data hash MD5: 16K
       CA B8 90 BE 05 F1 45 BF 1A B9 2E EF F1 22 A6 8F>)
(   3,<2021-08-24 10:09:04.87 +0400>,<she>,<DPX200>,
      <pk PHC0 = 1.1595 PHC1 = -0.4000002 
       data hash MD5: 16K
       7C 15 5D BC 60 9A 8D 29 7A 3B 78 E1 C1 C9 1E 91>)
(   4,<2021-08-24 10:09:07.87 +0400>,<she>,<DPX200>,
      <abs ABSG = 5 
       data hash MD5: 16K
       EE 62 A4 19 A3 BB C2 27 2E 25 5C F5 F5 DB 99 D5>)
$$ ##END=
$$ 
$$ hash MD5
$$ 7B 13 91 E4 D0 45 3C 91 33 5F E3 43 85 A7 A7 73
##$RELAX= 
##$RELAX= 
##$RELAX= 
##$RELAX= 
##$RELAX= 
##$RELAX= 
$$ Bruker specific parameters
$$ --------------------------
##$DU= <F:/spectra>
##$EXPNO= 1
##$NAME= <H-F>
##$PROCNO= 1
##$TYPE= <nmr>
##$USER= <she>
##$AMP= (0..31)
100 100 100 100 100 100 100 100 100 100 100 100 100 100 100 100 100 100 
100 100 100 100 100 100 100 100 100 100 100 100 100 100 
##$AQSEQ= 0
##$AQ_mod= 1
##$AUNM= <au_zg>
##$AUTOPOS= <>
##$BF1= 200.13
##$BF2= 200.13
##$BF3= 200.13
##$BF4= 200.13
##$BF5= 200.13
##$BF6= 200.13
##$BF7= 200.13
##$BF8= 200.13
##$BYTORDA= 1
##$CFDGTYP= 0
##$CFRGTYP= 5
##$CHEMSTR= <none>
##$CNST= (0..31)
1 1 145 1 1 1 1 1 1 1 1 1 1 1 1 1 1 1 1 1 1 1 1 1 1 1 1 1 1 1 1 1 
##$CPDPRG= <>
##$CPDPRG1= <>
##$CPDPRG2= <>
##$CPDPRG3= <>
##$CPDPRG4= <mlev>
##$CPDPRG5= <mlev>
##$CPDPRG6= <mlev>
##$CPDPRG7= <mlev>
##$CPDPRG8= <mlev>
##$CPDPRGB= <>
##$CPDPRGT= <>
##$D= (0..31)
0 1.2 0 0 0 0 0 0 0 0.06 0 0.03 0 0 0 0 0.0002 0 0 0 0 0 0 0 0 0 0 0 0 
0 0 0 
##$DATE= 1629785320
##$DBL= (0..7)
120 120 120 120 120 120 120 120 
##$DBP= (0..7)
150 150 150 150 150 150 150 150 
##$DBP07= 0
##$DBPNAM0= <>
##$DBPNAM1= <>
##$DBPNAM2= <>
##$DBPNAM3= <>
##$DBPNAM4= <>
$$ [...]
##$SUBNAM3= <"">
##$SUBNAM4= <"">
##$SUBNAM5= <"">
##$SUBNAM6= <"">
##$SUBNAM7= <"">
##$SUBNAM8= <"">
##$SUBNAM9= <"">
##$SW= 20.0188882624521
##$SWIBOX= (0..15)
0 0 2 0 0 0 0 0 0 0 0 0 0 0 0 0 
##$SW_h= 4006.41025641026
##$TD= 16384
##$TD0= 1
##$TE= 0
##$TE2= 300
##$TE3= 300
##$TEG= 300
##$TL= (0..7)
0 120 120 120 120 120 120 120 
##$TP= (0..7)
150 150 150 150 150 150 150 150 
##$TP07= 0
##$TPNAME0= <>
##$TPNAME1= <>
##$TPNAME2= <>
##$TPNAME3= <>
##$TPNAME4= <>
##$TPNAME5= <>
##$TPNAME6= <>
##$TPNAME7= <>
##$TPOAL= (0..7)
0.5 0.5 0.5 0.5 0.5 0.5 0.5 0.5 
##$TPOFFS= (0..7)
0 0 0 0 0 0 0 0 
##$TUNHIN= 0
##$TUNHOUT= 0
##$TUNXOUT= 0
##$USERA1= <user>
##$USERA2= <user>
##$USERA3= <user>
##$USERA4= <user>
##$USERA5= <user>
##$V9= 5
##$VALIST= <valist>
##$VCLIST= <CCCCCCCCCCCCCCC>
##$VD= 0
##$VDLIST= <DDDDDDDDDDDDDDD>
##$VPLIST= <PPPPPPPPPPPPPPP>
##$VTLIST= <TTTTTTTTTTTTTTT>
##$WBST= 1024
##$WBSW= 4
##$XGAIN= (0..3)
0 0 0 0 
##$XL= 0
##$YL= 0
##$YMAX_a= 320729
##$YMIN_a= -320873
##$ZGOPTNS= <>
##$ZL1= 120
##$ZL2= 120
##$ZL3= 120
##$ZL4= 120
##$ABSF1= 17.51666
##$ABSF2= -2.502378
##$ABSG= 5
##$ABSL= 3
##$ALPHA= 0
##$AQORDER= 0
##$ASSFAC= 0
##$ASSFACI= 0
##$ASSFACX= 0
##$ASSWID= 0
##$AUNMP= <proc_1d>
##$AZFE= 0.1
##$AZFW= 0.1
##$BCFW= 0
##$BC_mod= 2
##$BYTORDP= 0
##$COROFFS= 0
##$CY= -3
##$DATMOD= 1
##$DC= 0
##$DFILT= <>
##$DTYPP= 0
##$F1P= 0
##$F2P= 0
##$FCOR= 1
##$FTSIZE= 16384
##$FT_mod= 6
##$GAMMA= 0
##$GB= 0
##$INTBC= 1
##$INTSCL= 1.334414e-10
##$ISEN= 128
##$LB= 0.24
##$LEV0= 0
##$LPBIN= 0
##$MAXI= 10000
##$MC2= 0
##$MEAN= 0
##$ME_mod= 0
##$MI= 1.114404
##$NCOEF= 0
##$NC_proc= -5
##$NLEV= 6
##$NOISF1= 3.799351
##$NOISF2= 2.8
##$NSP= 0
##$NTH_PI= 0
##$NZP= 0
##$OFFSET= 17.50688
##$PC= 1
##$PHC0= -13358.88
##$PHC1= 15.401
##$PH_mod= 1
##$PKNL= yes
##$PPARMOD= 0
##$PSCAL= 0
##$PSIGN= 0
##$REVERSE= no
##$SF= 200.130005551915
##$SI= 16384
##$SIGF1= 3
##$SIGF2= 2
##$SINO= 5.538805
##$SIOLD= 16384
##$SREGLST= <1H.CDCl3>
##$SSB= 0
##$STSI= 16384
##$STSR= 0
##$SW_p= 4006.41025641026
##$SYMM= 0
##$S_DEV= 0
##$TDeff= 16384
##$TDoff= 0
##$TI= <>
##$TILT= no
##$TM1= 0
##$TM2= 0
##$TOPLEV= 0
##$USERP1= <user>
##$USERP2= <user>
##$USERP3= <user>
##$USERP4= <user>
##$USERP5= <user>
##$WDW= 1
##$XDIM= 16384
##$YMAX_p= 484141026
##$YMIN_p= -139000
$$ End of Bruker specific parameters
$$ ---------------------------------
##NTUPLES= NMR SPECTRUM
##VAR_NAME=  FREQUENCY,     SPECTRUM/REAL,   SPECTRUM/IMAG
##SYMBOL=    X,             R,               I
##VAR_TYPE=  INDEPENDENT,   DEPENDENT,       DEPENDENT
##VAR_FORM=  AFFN,          ASDF,            ASDF
##VAR_DIM=   16384,         16384,           16384
##UNITS=     HZ,            ARBITRARY UNITS, ARBITRARY UNITS
##FACTOR=    0.24454680195387, 1,            1
##FIRST=     3503.65195287527, 0,            0
##LAST=      -502.758303534993, 0,           0
##MIN=       -502.758303534993, -139000,     0
##MAX=       3503.65195287527, 484141026,    0
$$ Real data points
##PAGE= N=1
##DATA TABLE= (X++(R..R)), XYDATA
$$ [...]
9184 -32960 -63572 57527 105936 92958 88540 129213 36778 -16982 -56335 -44418 11071 6342
9172 6342 13732 1313 -9464 -8267 43960 4799 -36654 -36614 -54370 -22784 -44810 4731 26538
9159 26538 29794 37279 -24633 44975 62701 88737 73113 11284 26889 54122 74773 -12692
9147 -12692 -5365 22898 26262 11229 19298 78050 23861 -830 -30382 30167 4137 -9047
9135 -9047 14282 -2217 25956 33271 65361 63158 -914 -50792 10071 -15302 -40158 17625
9123 17625 71799 27345 18651 29109 69937 14381 41337 11357 28481 74739 15902 1336
9111 1336 -23470 -32631 -25739 29424 4845 2577 -572 -17831 -24822 -34376 7246 -1640 -19459
9098 -19459 12450 47840 -7512 -11571 59362 52317 69614 50420 32518 -29642 -14741 -46398
9086 -46398 -21633 -38009 -12646 -14590 6150 49040 31293 18521 16117 -35454 -13386 13225
9074 13225 61574 16871 14291 28032 12934 -2528 -33883 1160 -45005 -44197 -6110 95442
9062 95442 29997 47080 22723 -17783 18115 3914 -28208 -36228 -41880 25452 57674 62486
9050 62486 -10343 -40331 -56684 32586 15881 12095 -12466 -15104 22643 54213 76786 688
9038 688 -25998 -4118 72472 16188 7284 9338 -28204 4732 57939 40276 -9534 -20293 -20355
9025 -20355 -18381 78309 58956 67463 49543 453 22623 8681 19571 -15583 -54980 -11467
9013 -11467 11713 44314 39670 -8426 -15077 -19482 5175 34950 20462 29982 1822 46088 22727
9000 22727 72995 40563 15282 62509 50906 52133 38383 5132 -29903 -6614 62616 16882
8988 16882 29486 40409 49876 45373 44152 46181 102730 130601 82073 108445 66758 12256 -11711
8975 -11711 -21154 38347 102202 40923 60553 62430 42892 12737 44691 74282 80450 54853
8963 54853 -3479 -55490 -20044 -58273 -12527 27985 35347 48913 62681 22887 15500 -4800
8951 -4800 14692 9975 24912 43153 16171 -23291 28089 44927 24295 30031 23647 21343 25069
8938 25069 9780 31336 70502 83204 82614 62942 37421 -6108 18500 -10787 3851 35809
8926 35809 9325 33177 65071 56565 58438 3977 29821 24887 41435 18248 8367 524 19962
8913 19962 50494 91682 51862 45058 68193 75244 93945 41700 56544 46586 55051 101243 84645
8900 84645 29183 45995 83969 -2789 -13337 35500 51411 59548 60498 65141 38560 62716 74894
8887 74894 61584 58877 31453 46129 72772 58095 24488 44001 64717 39310 33293 34550
8875 34550 77261 81792 85497 137139 148240 119690 16267 90262 35833 34429 43508 58908
8863 58908 60703 20433 74642 68613 92502 43859 51657 54062 35588 24978 4428 78485 83595
8850 83595 67945 31148 34433 58906 5471 31844 21275 56034 80427 42490 56774 91356
8838 91356 95705 105543 67345 55682 120589 153896 133504 102013 48466 54976 40306 115256
8826 115256 98986 86905 115238 99489 52030 24473 74841 47739 59958 81912 86404 51685
8814 51685 53856 58585 39707 76920 71181 44516 96814 94911 48505 80114 98841 30856 23210
8801 23210 44388 33005 54754 16175 79043 30390 55713 76875 82915 88147 60184 48598
8789 48598 59254 40404 -27361 -324 106116 90693 31512 26126 32732 44617 18679 42457
8777 42457 52598 13232 18195 81582 81975 134419 146355 130214 77734 97264 113710 156005
8765 156005 114522 137390 100765 22783 58315 120353 120268 124083 107300 66208 79800 120650
8753 120650 66779 63648 69890 79730 146335 138770 105432 58868 100091 117470 113651 103774 131452
8740 131452 143240 112216 82686 123678 107242 98288 51401 71866 84406 96104 112460 104520
8728 104520 165323 119341 110717 141124 168117 124964 105055 145339 145062 124173 111517 107031
8716 107031 52643 47926 52967 109015 137080 114111 150797 62923 52385 99049 103130 67053
8704 67053 69029 53842 38142 84018 112652 74435 34185 93947 71208 42831 111453 132041
8692 132041 106180 92298 45456 52359 47912 105497 124565 76471 77327 137301 140269 159818 124034
8679 124034 145206 150832 107588 82045 94091 109237 91202 51775 100049 143811 91845 88417
8667 88417 121000 151533 161104 145014 81165 64254 98538 104804 120494 151116 152965 185950
8655 185950 103139 154091 134779 76519 92988 94316 140422 174717 145039 152220 187641 149405
8643 149405 116414 113807 82917 106492 147602 210596 119875 109687 152939 167382 182862 183910
8631 183910 181635 189205 210769 165475 153406 158503 201261 256946 208263 280340 274000 204228
8619 204228 267400 277065 319433 265414 282095 259244 257514 277089 305770 316000 289190 303884
8607 303884 337040 343482 362343 406990 414326 459970 465537 525194 571872 614894 691211 672539
8595 672539 718780 720056 701966 712285 718026 685783 694805 609320 573762 581874 521532 502405
8583 502405 444187 494488 516439 420689 453242 457099 389861 403917 356835 393321 436362 408243
8571 408243 368615 381024 438005 437549 467445 492458 443360 469157 480759 509510 466151 416206
8559 416206 479519 403278 504679 524695 504705 529938 520141 571905 553657 560723 600435 619745
8547 619745 587791 623215 621296 636733 634924 642602 591683 633961 678400 750585 787546 778941
8535 778941 842849 821862 817508 893758 986087 1003715 1092128 1170159 1174081 1253117 1337452 1487040
8523 1487040 1613146 1649809 1807265 1907134 2040931 2152943 2332945 2367356 2345432 2377832
8513 2377832 2555984 2643374 2515165 2444751 2339551 2245673 2225349 2293483 2364190 2443520 2497959
8502 2497959 2606997 2685893 2788259 2791794 2769891 2853404 2887592 2956259 2981643 2946393 2889749
8491 2889749 2835378 2765750 2804960 2877756 2920782 2990940 3044252 3117957 3149961 3131072 3238861
8480 3238861 3257431 3212744 3177568 3102705 3022084 2876540 2776778 2722047 2652150 2652063 2696180 2817743
8468 2817743 2923447 2915516 2956928 2977509 3091032 3102276 3025189 2897125 2715001 2600795 2464588
8457 2464588 2303938 2108844 1943930 1850836 1760120 1819841 1751397 1777015 1815831 1792453 1822128
8446 1822128 1812468 1775782 1775758 1842077 1909284 1925314 1904209 1988438 2075327 2111708 2171102 2256120
8434 2256120 2292065 2394796 2470992 2601294 2698023 2810174 2959104 3168690 3356957 3476525
8424 3476525 3650859 3851800 4029879 4168446 4300139 4421698 4511918 4581602 4631761 4717850
8414 4717850 4781739 4758072 4785900 4735153 4652389 4581720 4505678 4413948 4374524 4325609 4282512
8403 4282512 4182756 4111412 4070647 4061914 4063965 4098586 4157959 4239242 4309522 4373912 4520699 4707656
8391 4707656 4800806 4875001 5008694 5154034 5283031 5335546 5397385 5440623 5442808 5404360 5392776
8380 5392776 5337781 5154911 4960140 4806835 4629852 4422744 4116563 3899655 3699609 3492764
8370 3492764 3304825 3150900 2984614 2823649 2716239 2534976 2376772 2262770 2197475 2143960
8360 2143960 2030322 1899342 1848732 1822538 1779583 1721234 1665458 1572647 1486834 1456714 1355194
8349 1355194 1319254 1300429 1228063 1155042 1172164 1167774 1141895 1110597 1061518 988542 992475 983118
8337 983118 940214 890725 868108 919490 914545 890973 879191 803511 732854 741256 766793 798994
8325 798994 719448 703821 707886 646693 676763 704649 723238 686715 615536 594206 630348 608167
8313 608167 546699 489129 539953 553402 522232 528153 524868 544697 531677 507658 506524 472994
8301 472994 461704 445469 468990 420562 414110 431219 466990 493847 491504 447307 362191 348756
8289 348756 371499 394359 365143 352599 362278 351025 397802 475064 438960 429765 425222 399060
8277 399060 368713 446807 431758 412648 478749 478521 459885 500288 449414 443371 433663 426936 341504
8264 341504 383151 415239 448870 435548 453457 427301 374493 385779 433787 365421 416754 453996
8252 453996 433992 447167 489171 487892 446919 493859 473157 506633 525495 550013 579802 585457
8240 585457 636603 646749 589307 559204 515282 564915 593398 632614 628455 628102 608668 629969
8228 629969 549030 517148 499384 552566 552672 525221 477029 499873 477714 524311 587635 576061
8216 576061 542120 489091 488956 498091 493893 553906 521494 558168 570109 596273 552280 558990 644107
8203 644107 694201 738260 711648 680792 683369 624876 681452 665475 658366 626796 781402 1152838
8191 1152838 819714 727712 713042 721049 697674 770469 812958 801335 830004 855037 843894
8180 843894 848876 890690 944020 1005428 1013301 1025192 1040710 1005010 1014232 1051119 1138743 1194326
8168 1194326 1198288 1224689 1248506 1294650 1392395 1401521 1452605 1528229 1522111 1597422 1653813 1649561
8156 1649561 1704800 1857414 1967212 2044215 2126190 2282647 2405538 2562449 2695093 2797946
8146 2797946 2918383 3087280 3280502 3473664 3640662 3772068 3925748 4101317 4271017 4515813
8136 4515813 4722617 4923957 5199263 5516207 5842460 6197339 6442267 6625272 6713321 6709537
8126 6709537 6477689 6202683 5919246 5709542 5634776 5617004 5648442 5618365 5644160 5653690 5686977
8115 5686977 5891911 6065389 6239658 6512107 6746890 6909253 7121591 7340364 7636127 7904205
8105 7904205 8243581 8699011 9172098 9646590 10106229 10602204 10943114 11149670 11083233 10781631
8095 10781631 10292520 9657464 9078234 8609204 8107016 7546526 7054319 6584280 6198293
8086 6198293 5946820 5672526 5479739 5345684 5259697 5176924 5167175 5245088 5373293 5447122 5495950
8075 5495950 5574209 5667216 5819067 5980814 6177743 6349384 6452264 6685446 6884108 7019067
8065 7019067 7041261 6912725 6663284 6232332 5669578 5079451 4565451 4176221 3863106 3597039
8055 3597039 3452893 3281178 3128906 2989427 2885497 2786057 2746014 2700152 2602886 2536455
8045 2536455 2515588 2459474 2460258 2435845 2458334 2449835 2469182 2539488 2503167 2575552 2590549 2673789
8033 2673789 2713084 2763901 2814385 2938526 3015112 3147297 3278920 3435025 3501531 3706447
8023 3706447 3934278 4156047 4526515 4904906 5352465 6003391 6756926 7621670 8561905 9742114
8013 9742114 11213219 13425647 15965414 18323027 18398219 14973340 12308389 10588600 8680794
8004 8680794 7042039 6019114 5300766 4801426 4412226 4110210 3909319 3771987 3648743
7995 3648743 3547299 3402951 3309600 3263628 3189269 3076607 3002858 3053397 3087129 3064170 3083344
7984 3083344 3110435 3200583 3244695 3303672 3414956 3511778 3650417 3795905 4021013 4205711
7974 4205711 4515034 4767929 5016166 5239547 5359819 5373490 5393230 5380102 5351382 5194966
7964 5194966 4990403 4737349 4563457 4379732 4130780 3903056 3728372 3651550 3579112 3575217
7954 3575217 3623523 3610573 3660280 3739912 3865340 4033092 4192260 4310685 4486958 4717286
7944 4717286 4932331 5059955 5159634 5279923 5501300 5737947 5911889 6044059 5959873 5745858
7934 5745858 5332317 4863972 4491211 4179825 3947363 3713962 3572789 3464345 3254406 3084985
7924 3084985 3067377 3005914 2960367 2982376 3040263 3057967 3073381 3013103 2973273 2933200 2882602
7913 2882602 2987884 3105537 3201371 3192428 3144048 3165134 3125450 3097226 2921810 2782683 2605816
7902 2605816 2409773 2283698 2165303 2065118 1959306 1811973 1761051 1757351 1699994 1722047
7892 1722047 1696091 1654911 1582019 1621186 1589378 1529663 1503971 1488882 1512004 1482275 1391536
7881 1391536 1390801 1337607 1293288 1304730 1330294 1232845 1164366 1151824 1179659 1151120 1105710 1042649
7869 1042649 999220 933594 890304 866803 846020 935697 874236 810683 815794 736957 747150 740649
7857 740649 692381 657128 631829 599629 622171 616203 604831 603985 604204 612495 619518 582865 476782
7844 476782 452412 465192 437585 505183 511369 486643 481975 476374 442706 379909 405215 391158
7832 391158 391756 376855 414055 365493 429135 466496 399510 354755 368153 373151 298430 270139
7820 270139 261980 284332 336548 308012 262359 210169 200893 271335 323017 259422 263914 311024
7808 311024 261642 224163 202340 198553 226138 200030 199434 214050 248638 232221 255597 269251
7796 269251 261730 285826 289889 293251 268418 245684 193798 141598 137988 238093 197959 189504
7784 189504 175064 194449 166526 150893 192313 177849 132032 129836 174387 166723 135603 183733
7772 183733 230941 198997 170592 186798 168642 160777 190004 138399 191948 224107 183716 180729
7760 180729 166990 202058 149126 169822 195179 175846 166746 192021 172045 169869 193607 122181
7748 122181 43486 80591 81413 35085 47663 76080 109260 88132 142290 52086 40366 8251
7736 8251 54741 80977 76657 125178 116705 89082 77455 109861 102279 123642 98753 66968 121877
7723 121877 81576 95779 31000 54714 65104 114881 127027 83673 68245 69101 97584 91724
7711 91724 128215 111301 116766 85136 80707 153642 172885 136756 100235 90361 97464 148078 102895
7698 102895 35913 101497 137407 46693 60837 80151 96986 117596 102150 119633 99088 125915
7686 125915 186549 207143 132658 157305 178532 132525 132886 161892 165140 174403 162158 205602
7674 205602 210316 156907 191207 190781 156318 169701 181122 163897 173412 270954 283632 279174 235036
7661 235036 254678 217704 263274 252396 223144 219999 232053 202797 208493 220012 225636 191626
7649 191626 162034 263862 238499 272316 279648 285597 296862 295937 331056 311295 280426 317806
7637 317806 366074 401661 404373 458575 503413 546726 550089 555828 566096 589822 660405 751793
7625 751793 816089 835703 869797 804463 747285 700423 704849 590507 568917 588371 589946 568099
7613 568099 500372 543608 497081 456686 478230 474270 419492 376442 373013 376912 423907 497340
7601 497340 573321 616364 634865 610160 615278 648669 655679 653957 639678 597154 620364 649122
7589 649122 650445 656837 549955 537240 533023 482408 472027 404915 392359 402411 416864 377790
7577 377790 342928 320717 314125 301058 274776 341148 355860 317797 358295 317544 346859 386796
7565 386796 285721 278234 247349 248921 256340 249989 239293 176630 131571 175901 213288 244774
7553 244774 250512 210262 202701 195947 189360 157381 177113 187689 203830 161858 141023 155538
7541 155538 109778 123072 120383 164366 90949 70058 74811 86172 77045 95768 147599 127887
7529 127887 127517 132788 95727 106836 104714 174371 208151 187540 127493 100713 155771 142814
7517 142814 115083 69706 116919 131014 62380 53005 92767 132403 92097 35791 11995 11148
7505 11148 47871 93172 71394 48285 26422 15955 20186 -15391 -61782 -14022 7802 -24300
7493 -24300 -42711 19041 -16778 -18973 -7899 -26668 -64544 -59376 -32277 33838 28563 66903
7481 66903 68846 45957 14999 26 46038 32685 18743 -39200 -50274 -75642 -71235 -48637
7469 -48637 -34507 7835 1731 23994 55163 28058 21954 -10663 -18048 809 -49054 -90043
7457 -90043 -58939 -64569 -23157 929 15629 -76904 -52889 -26524 -61212 -13898 3096 -18898
7445 -18898 51899 14772 29026 -20149 -48945 -31851 24174 16693 4303 -59422 -69243 -24478
7433 -24478 8154 437 40529 84053 47150 63025 74538 106071 128010 73661 86814 37696
7421 37696 59584 34906 6004 -8194 13379 30711 47476 35812 -11381 5003 -8933 -57862
7409 -57862 -39795 45457 22466 -2214 -40367 -51856 2770 -14227 -49438 -70104 -48767 -1004
7397 -1004 43175 23974 -20314 -41613 -53403 -30565 -43496 -4534 -59279 -31552 -61204 -73408
7385 -73408 -63264 -33061 -41650 -119478 -69238 -35535 -44040 3147 -3132 -17709 -85178 -75647 -44791
7372 -44791 -46090 -67830 -122426 -48376 -76291 -54391 9550 -33941 26101 61345 1116 -65570
7360 -65570 -37598 -88699 -59980 -57980 -24344 -56123 -39510 -28402 -34993 -37476 -61501 -80736
7348 -80736 -114243 -71863 -28716 -67379 -54749 -33322 -16543 -10932 -27512 -15855 61237 16017
7336 16017 1989 -43863 -8997 51685 -46959 -47241 -19825 -15274 -75194 -28202 -51601 -62515
7324 -62515 -58620 -81026 -18952 -21048 -86075 -67811 -3511 -26846 -28602 -37915 -68965 -88857 -85122
7311 -85122 -55291 -84582 -41625 -27619 -54125 -50845 -38898 -22702 -20367 -37264 -60116 -100666
7299 -100666 -20456 -39423 -17427 -48398 -76719 -46169 -57312 -19692 -40802 -21248 -9535 -26921
7287 -26921 18226 -36604 -49218 -27020 -26213 -3446 -2257 65669 34981 31371 34373 -544 -33781
7274 -33781 -35202 -68597 -68641 -76933 -66324 -10190 -29756 -59040 -94118 -98747 -89913 -49409 -44157
7261 -44157 -33912 -3231 29364 31713 -7896 29983 26751 -16841 1286 -30508 -66186 -91309
7249 -91309 -14612 -44596 -18941 12131 -41033 -32525 -55485 -62839 -548 -13030 -60246 -11721
7237 -11721 4644 -24929 -61892 -1877 -18342 -91531 -71383 -66119 -31173 -6933 -7937 -12007
7225 -12007 20413 -17460 -79400 -55971 -42567 -31548 -30501 -20776 -46752 -58125 -51903 -39394
7213 -39394 8255 4438 -39460 -15469 -63289 -56836 -69965 -59079 -24947 -79522 -93589 -91560
7201 -91560 -51928 20017 5064 -22458 30839 -23661 -32434 -41075 -25659 -35607 -21918 -16147 -21136
7188 -21136 -52933 -61074 -77460 -67167 -52554 -49630 -43554 -35848 -29928 -27740 16299 -5367 -25856
7175 -25856 -6784 -21664 -57016 -60866 9004 29244 -36832 -9621 4575 3747 -21090 11003
7163 11003 38669 36709 -30615 -18837 -5980 -18904 -18723 -7168 11494 -57175 -42065 6076
7151 6076 -60935 -72716 -21348 3025 -15617 -57852 -65855 -57268 -35549 -81763 -39811 45741
7139 45741 -29985 -36120 -51767 -17948 -16982 15549 20269 -21186 18418 29631 790 -3003 -47130
7126 -47130 -36787 -46964 -106720 -42098 -10632 -52517 -28229 -54243 -77994 -50706 8857 39309
7114 39309 34556 26525 15302 4821 21104 6522 -5535 18321 3921 34214 24644 -24354
7102 -24354 -34396 1749 14619 -1228 -40015 -40140 -37623 -4561 -62631 -41015 -46625 -54975 -17794
7089 -17794 22310 -5373 -29291 -15032 -25978 -11233 -13883 -56228 -9611 -30278 -33359 -39726
7077 -39726 22936 -59116 -87993 -11536 -20146 35805 58378 17372 -35270 7667 9418 3221
7065 3221 -62577 -79172 20518 -21393 18832 11565 -57166 -65456 -19900 36688 3674 42358
7053 42358 20052 34832 -27220 -37371 -75128 -20013 -46105 -57947 -56943 -53977 -26560 -17930
7041 -17930 20615 -25382 -79398 -6606 -34477 -79196 -90364 -35160 2803 10813 -7386 15296
7029 15296 83249 56191 22376 -39157 -82541 -52043 8070 -37834 15452 21668 14535 30510
7017 30510 23661 36792 13813 35877 18916 23711 19963 2234 31491 18430 -10776 5628
7005 5628 -17122 -16786 15269 -17031 6667 34730 14430 -2484 13509 -9537 -13582 -39292 -61141
6992 -61141 44961 54908 -34589 -7962 21744 -18031 -18653 -11478 26465 758 26111 70559
6980 70559 68280 62425 16230 39300 15507 26877 36357 73790 17054 7864 16370 80783 28947
6967 28947 6460 -21151 25450 44826 -2767 2300 46050 18336 42636 22111 35680 4975
6955 4975 -10473 59733 23360 34004 34249 10488 8597 28544 -1500 723 28297 49153 52154
6942 52154 106222 43289 32202 52405 15037 45955 67822 61705 53438 98415 138603 3177
6930 3177 -4400 -18911 -4571 49210 70092 61667 63910 76552 64244 61420 13026 -13521 34000
6917 34000 7503 -32160 17992 76806 37809 -29997 -20146 8802 39380 54007 49900 31779
6905 31779 26191 90198 52539 61121 54105 69144 81933 50371 46424 61451 93440 79081 90490
6892 90490 110396 61042 29771 45999 83142 36290 68924 83902 70107 96955 88330 105743
6880 105743 126854 136385 64293 58645 85916 101193 130630 152358 90567 98800 102857 99600 169732
6867 169732 131038 130978 137376 144895 125140 46892 76536 105233 66365 86169 112360 88098 115365
6854 115365 144680 164741 141472 124138 215550 194370 164447 102811 72708 124946 112358 160401
6842 160401 167882 227011 218896 200099 206968 145290 181531 195657 174814 260367 226250 175844
6830 175844 189110 202375 186204 171051 205220 218737 188801 186118 215338 173290 236447 323207
6818 323207 349875 322353 265615 252317 208919 196409 229332 242610 227402 253416 259049 233396
6806 233396 307425 307473 287456 306655 261368 311534 333215 263389 295815 317334 342349 364124
6794 364124 331330 353326 333741 354672 311061 337611 367424 385196 442309 449938 423995 409337
6782 409337 413528 446276 530228 577901 577493 597486 639709 671217 652265 697842 765347 766636
6770 766636 745761 831441 846668 819598 864537 876838 892624 839737 829982 923127 848436 826242
6758 826242 820154 855155 847295 839564 839471 789488 779719 743150 727899 629665 625985 647577 648238 639227
6744 639227 608382 517821 540621 484343 445629 460456 497099 514189 467085 458636 444446 432400
6732 432400 401834 386690 406119 358835 406527 395556 392170 325206 372692 419648 369389 329479
6720 329479 287711 261344 233390 300038 343785 313773 304199 254429 260737 236801 274637 235455
6708 235455 227054 283269 259165 306750 304613 304545 294730 338649 332410 303583 287532 267220 282687
6695 282687 257774 241013 278266 311533 277225 213362 257393 248852 271506 283588 255926 221330
6683 221330 260692 247360 244314 266474 266313 267273 269394 329547 346112 298510 285714 245060 238441
6670 238441 232360 228442 216706 269328 321590 281941 312819 303598 309323 356956 401243 421725
6658 421725 368490 414758 379892 381663 396604 433766 445041 489127 523342 484745 485141 457191
6646 457191 438427 436386 463356 464703 501181 530321 564075 477133 499356 542193 519580 524585
6634 524585 518917 549039 546248 577531 519051 573950 599591 609729 612771 656895 670049 669965 667255
6621 667255 677614 699489 715399 793351 826388 842175 856143 820398 810032 893116 914337 962851
6609 962851 976824 1008010 1042021 1145423 1093585 1071742 1122177 1154417 1225775 1276379 1252121
6598 1252121 1282422 1313752 1328515 1280347 1286880 1375834 1383305 1316329 1372668 1334540 1341489 1394393
6586 1394393 1354245 1331404 1300540 1337491 1304046 1285592 1330120 1299567 1289005 1248313 1278577
6575 1278577 1276148 1272162 1271543 1275568 1277601 1275219 1337662 1307636 1265307 1241241 1307327 1351473 1395272
6562 1395272 1369941 1419905 1467401 1394150 1434819 1524752 1589927 1584775 1628096 1719026 1794748 1861610
6550 1861610 1886881 1892362 1924237 2023194 2057795 2101898 2164832 2179317 2181977 2172546 2118445 2135505
6538 2135505 2147938 2143254 2157423 2170694 2174246 2225937 2257897 2242767 2279943 2290767 2242021 2306392
6526 2306392 2342827 2321007 2257256 2263054 2211353 2219216 2159601 2146972 2162861 2085313 2067571 2013916
6514 2013916 2026657 1946368 1880670 1889308 1899553 1839867 1765277 1785177 1714230 1584299 1648967
6503 1648967 1628560 1545641 1500835 1464119 1347678 1220267 1276137 1272121 1250836 1250834 1227878 1152922
6491 1152922 1057324 1086503 1106599 1026772 1011404 906068 843584 869372 835878 847906 813670
6480 813670 806126 810622 789863 765811 674289 636072 675251 666422 669490 648769 578204 548761
6468 548761 563701 541473 530372 522894 477029 513671 515228 554604 554458 505752 466463 490606
6456 490606 526312 550018 518172 496825 457311 433854 462492 475326 513215 490528 458698 411564
6444 411564 419661 343470 378394 374808 386852 404133 419801 394211 359329 419449 425061 338953
6432 338953 325308 315798 333665 313541 315502 334978 320183 322489 284906 311679 332815 319532
6420 319532 369776 347416 355295 359883 297617 297371 271784 362462 351477 291822 252255 197090
6408 197090 192631 203725 267977 309354 338883 274683 264598 310596 301323 328146 288745 362305
6396 362305 392493 333530 325030 336925 357238 378232 332375 352227 366783 379867 452452 439416
6384 439416 429165 424918 401166 421957 461065 431663 420017 414120 459409 477952 495133 505473
6372 505473 459717 495160 543174 576019 520050 509770 511719 503685 534856 520949 505606 515507
6360 515507 524993 493427 480251 497716 475953 474396 414263 411579 390635 353914 372821 320415
6348 320415 317590 256672 230312 253847 236567 272421 284856 244863 266004 221206 144152 150207
6336 150207 185016 230807 189260 204423 188461 171352 170506 127077 118370 113884 104267 134812 178984
6323 178984 173198 127627 108942 103626 96604 98390 109749 96737 118825 75154 89229 156349
6311 156349 144751 43653 82783 106715 91734 113965 107634 185846 180562 148714 222344 183401
6299 183401 114305 192005 124177 185197 144063 107804 70246 98684 102944 82709 119629 152155
6287 152155 109273 61209 59719 166518 115063 37741 104674 137287 128497 115198 101911 79521
6275 79521 103235 100550 82939 73167 60976 70801 43388 59805 105247 91531 84997 114059 107085
6262 107085 102770 105354 81407 86106 96097 105031 106971 98065 118234 117762 26122 82700 67437
6249 67437 39966 50339 65478 62113 108757 89402 72873 84239 100711 93968 108260 68562
6237 68562 95571 63451 23296 54014 40354 29112 58835 76877 51722 40006 -266 3847
6225 3847 63656 47859 52224 34161 13184 10913 -1036 -16772 35791 63188 42819 -5789
6213 -5789 46384 51249 -1217 84538 63112 19540 -27327 30002 -4895 -17830 -2036 42666
6201 42666 106345 22850 -10391 19298 15895 16558 53524 48086 73494 47098 -15951 -29678 -54486
6188 -54486 33721 102508 61120 -15520 11271 22162 3532 38165 -3405 28826 43146 46436
6176 46436 73064 88269 70635 43918 25173 43604 7929 -9852 26203 18633 21467 -21008
6164 -21008 -53709 23998 67600 52490 77698 50570 56154 42549 33060 37856 31694 -20183 -73189
6151 -73189 -22807 14755 -27508 39384 65635 85413 20838 36116 80427 43254 33078 30483
6139 30483 50845 62859 24978 -682 -22185 58199 109473 78463 67859 57750 49305 61413
6127 61413 16749 25997 33163 -32348 -54223 15781 25504 9447 27430 54513 81298 98964
6115 98964 89655 74059 29211 31005 105442 93358 72482 76460 67934 83720 92982 63658 108474
6102 108474 156059 173596 150182 159826 125573 140993 150234 145498 161793 124911 89326 127305
6090 127305 163913 167614 151994 154056 147720 116151 50579 81695 75166 60356 68153 88473 65584
6077 65584 84758 98328 30563 -1072 -56378 -34612 17085 20030 15894 21409 6679 -40371
6065 -40371 970 19398 58384 14522 8509 28516 14340 -25015 -83655 -72595 -29023 -45088
6053 -45088 -39789 -61862 -53774 -27598 -81786 -73616 -17568 -64876 -84891 -42405 -34239 -38346 -24078
6040 -24078 -7504 -8277 14288 -21287 -56705 -98666 -125914 -94317 -53397 -66451 -22189 -12178
6028 -12178 -6667 13903 11235 -5485 12576 -745 29678 -37612 -56867 -17514 33936 15105
6016 15105 -43836 -27686 -31713 -60573 -47605 -58573 -28137 -63706 -69320 -56988 -63310 -48102
6004 -48102 -82211 -104398 -37777 -14582 -1104 -1660 20225 2952 -33058 -46596 -91903 -106430
5992 -106430 -118977 -29053 -13402 2812 -13236 -41049 2964 46586 2284 2900 -31990 -26594
5980 -26594 1627 -18773 -40515 -76839 -101078 -61755 -82092 -76832 -84606 -93804 -104393 -80780
5968 -80780 -63666 -21638 -68767 -139000 -87915 -8878 11671 -32269 -19063 -2639 -9003 -8130
5956 -8130 -13152 -13321 -45 10059 -156 8309 -4001 19254 65787 46981 7212 -38120 -44912
5943 -44912 -62459 -28349 -24289 -44263 -16284 15699 15649 51599 9008 2814 11340 23861 -2124
5930 -2124 -21480 -54067 -90982 12775 21301 57078 47858 -14759 -18807 11034 710 -3323 68431
5917 68431 58960 51143 17731 -9997 -13721 -11418 10560 36503 200 -8694 -11653 54375 9473
5904 9473 -31333 -7046 -33793 -10928 22407 28307 -18855 -5805 -9825 -35882 -33281 -1043 9088
5891 9088 -3456 -59177 -51814 -4454 -30041 1764 -37866 -50295 -386 27726 60614 3923
5879 3923 -218 32187 14033 -22844 -4948 1970 20670 49744 38635 58860 19755 -1942
5867 -1942 3977 29361 -60403 -76366 -28904 -9523 -12208 15541 -20983 -11895 26309 -22568 -61612
5854 -61612 -120484 -68989 -1513 15977 -21981 10131 -11586 -48716 -85126 -51555 -47377 -13889
5842 -13889 -1030 -19390 -39594 -16496 -6282 -13877 70816 37463 6210 -7517 -2406 14739
5830 14739 36511 6063 -37253 -1837 7254 66291 -843 -39880 -66933 -36882 19646 18839
5818 18839 -14284 4405 49924 26810 -16712 28898 -7754 -21614 8738 978 40870 49868
5806 49868 63132 41224 55644 23058 28207 60094 35750 -8871 -22600 -31899 8637 12681
5794 12681 3023 49850 27163 25150 48944 -10707 -33690 -24598 -15023 -56411 -34803 13669 -8185
5781 -8185 2341 48994 -12411 -10248 41545 50788 39538 24093 31692 73669 61969 13216 -17595
5768 -17595 -13651 24086 60786 49314 9230 16657 -13397 -26433 -2157 11745 -186 56543
5756 56543 77078 27411 -9632 12478 18838 21592 43507 59215 84737 40331 45064 5208
5744 5208 17134 -7067 13983 108451 99365 72391 71455 -12887 15271 36632 31663 56453 23488
5731 23488 34019 62212 63037 63173 52734 91537 130404 79084 30124 -11915 30023 103666 106709
5718 106709 36238 77544 50220 35489 39021 46297 54164 64517 67308 76183 40222 51492 79930
5705 79930 54518 21069 55982 76138 39243 24318 22802 89328 55010 -27056 38958 66992
5693 66992 57036 57182 38960 84933 91722 63339 53882 23994 36401 58004 83275 36764 25328
5680 25328 52280 41174 4984 68709 93977 67158 64478 96253 124195 95745 59693 54148
5668 54148 51706 26560 48555 80411 9361 77668 62329 -9633 39996 77471 106769 95203
5656 95203 106808 89289 75269 16150 -27281 9790 -4416 2269 40869 -17573 30482 -5164
5644 -5164 25125 90293 41875 -11201 74492 67547 68562 95327 80223 -18903 30934 72306
5632 72306 57030 78533 46647 11175 98684 119226 106888 96952 53480 86911 47269 49487
5620 49487 86880 28429 -3642 26618 9062 -16201 40078 65345 30106 71187 57557 29368
5608 29368 43600 8920 51489 76953 77799 79099 89392 52417 26837 52769 86794 92397 77769
5595 77769 42425 36515 44591 82629 101809 119277 81466 71125 60782 38501 109001 56192
5583 56192 17032 -7845 36775 -4070 44471 70791 101231 81929 114806 59591 58917 91472
5571 91472 118582 49790 44551 93160 57057 91957 105039 101712 149758 136562 99007 128381
5559 128381 103833 126585 117385 128503 120963 77212 97350 86961 51383 56932 74715 177214
5547 177214 152314 153167 169527 138489 129712 136393 125145 64022 31175 110827 93438 58678
5535 58678 106186 94392 107884 126655 159209 109197 118108 108194 65802 106182 135158 139643
5523 139643 151841 163768 155998 115511 123578 131752 72776 92110 103144 133967 182450 158282
5511 158282 152096 118279 111127 120751 150469 159853 201396 142085 170759 182308 187210 162099 158775
5498 158775 130395 88308 136875 110565 182778 190048 145594 140815 174492 154608 158092 175548
5486 175548 132666 152444 146644 161614 203708 217958 212603 186647 173691 220063 250338 224476
5474 224476 265479 278902 253266 191651 246663 191804 218937 274791 264782 242040 241702 254790
5462 254790 243499 242439 260469 257148 275197 279964 251420 226006 204639 241162 219760 293282
5450 293282 325764 300316 348815 319535 297980 343697 322481 352050 362548 375587 366195 373473
5438 373473 316285 266708 255198 255648 294664 261212 297450 295473 313873 341827 318994 267294
5426 267294 281265 299525 237519 267366 340394 334633 281082 326348 339057 321128 338491 303214
5414 303214 320900 303836 327881 331783 386321 361052 386286 330877 354315 428670 348055 333318
5402 333318 334995 334326 299686 286551 354151 345033 341501 322466 292821 367838 374829 351931 342247
5389 342247 312104 325208 361657 360398 352132 372901 387316 379368 355224 408670 460985 406661
5377 406661 439697 445695 424464 450898 459456 450168 456631 454459 471472 470161 489334 511307 480585
5364 480585 486804 519505 575475 559625 504943 497604 550781 571589 545407 630819 630085 626659 625634
5351 625634 571248 605054 638036 653169 678081 654541 644250 703141 758209 759681 691163 630853
5339 630853 667717 632904 586228 639081 665503 712175 698398 641360 660675 647067 690577 716123
5327 716123 732844 694418 711909 702320 742411 690174 705777 706208 691858 767846 777715 779376 791101
5314 791101 782265 796490 816445 778138 764592 816232 796194 749611 691390 703931 679964 682143
5302 682143 655604 626774 697411 755359 813846 820986 815658 789835 866215 901495 884677 887994
5290 887994 875786 825258 821136 851107 855530 875574 899973 926298 937306 880333 918316 947569
5278 947569 925329 933878 920650 864712 885668 927657 972822 998220 1021958 1041544 1094102 1166898
5266 1166898 1166315 1146961 1221072 1208964 1208758 1289065 1244968 1202670 1224525 1182880 1249323 1229040
5254 1229040 1237836 1348558 1316663 1367924 1376594 1399632 1449685 1517550 1510708 1541534 1520007 1524802
5242 1524802 1601127 1659985 1696068 1762851 1869935 1949274 1984737 1988397 2077999 2212907 2237157
5231 2237157 2214848 2218447 2221922 2313022 2375086 2383670 2397655 2460511 2507208 2458682 2419241 2463581
5219 2463581 2460600 2406979 2296233 2217386 2169337 2167339 2109249 2047792 1991971 1982703 1873135 1896897
5207 1896897 1854228 1810189 1844860 1794868 1747430 1711795 1636799 1609283 1497743 1449205 1408206
5196 1408206 1367656 1327314 1362739 1344735 1309531 1301424 1309951 1350500 1369762 1352313 1344770 1303420
5184 1303420 1254516 1196037 1215914 1174589 1138837 1128211 1134732 1142572 1194844 1245583 1212059 1214313
5172 1214313 1212142 1228624 1167165 1144839 1212104 1240107 1182893 1206148 1163750 1168888 1176408 1177254
5160 1177254 1221003 1200583 1231390 1301469 1235988 1210432 1142913 1217577 1178898 1244920 1261304
5149 1261304 1314338 1292001 1278086 1280088 1273624 1221473 1235099 1303894 1326817 1365686 1382007 1328549
5137 1328549 1363842 1399579 1479588 1451413 1409869 1486704 1543409 1545717 1543913 1483914 1504155 1555515
5125 1555515 1570828 1584520 1606722 1564337 1487874 1432918 1371817 1315545 1257310 1308985 1309861 1274026
5113 1274026 1262961 1291151 1288758 1335576 1345852 1328932 1270537 1256210 1256405 1253838 1279575 1197904
5101 1197904 1188344 1154961 1169658 1175301 1103357 1104939 1126016 1076571 984728 895535 875948 848150
5089 848150 819214 815167 800115 775897 811779 821950 757549 799143 789115 803046 773014 792707
5077 792707 741020 703734 659593 674865 665531 680845 675943 658244 612515 626676 683753 622540
5065 622540 619055 604309 628878 615646 549127 540880 496760 500130 482132 471255 413306 438493
5053 438493 402293 445143 449651 449079 392519 386057 364700 343519 338498 354663 311749 299945 316892
5040 316892 343082 338652 328081 322450 346529 271870 299576 370042 324749 294905 260686 282017
5028 282017 235029 280148 254258 261388 256805 285854 300579 277562 259810 292622 283795 231872
5016 231872 174591 205514 168418 136525 195682 174042 134611 159951 138995 130025 188136 208307
5004 208307 211405 223982 203762 261524 251869 199763 196319 213264 187534 168528 179052 187168
4992 187168 199158 202312 177859 166947 249379 253514 224151 244403 182908 179351 159096 202743
4980 202743 170752 125857 92904 108547 195155 218984 158133 168723 169486 146652 146723 169952 202252
4967 202252 201395 181673 233717 199930 171880 204967 165598 154013 170992 176654 188511 171834
4955 171834 166740 181257 179609 178462 119666 172805 202142 193715 207725 181370 189722 204924 171878
4942 171878 137615 157263 158376 170538 195285 172069 128679 177575 204953 217832 222873 170203
4930 170203 166756 146940 160730 208472 192220 160402 179481 208171 214417 225973 211789 189291
4918 189291 164522 182188 216599 177660 218821 273840 245645 200223 215192 167128 152173 163724
4906 163724 174633 126664 213943 185821 200915 206721 184970 252558 281998 269708 244232 201630
4894 201630 277191 240476 225098 170395 146677 167093 188686 258701 244081 260963 207090 199826
4882 199826 228037 256706 301587 243071 162677 163188 247224 259945 243636 207341 219011 248328
4870 248328 215128 273275 230249 228292 190227 192490 181142 233761 210134 222203 276223 243116
4858 243116 241445 214756 204930 250003 280017 247364 173990 209091 230740 282651 239078 191615
4846 191615 215070 257019 240242 160850 250474 305388 273497 249771 230877 229394 258956 237117
4834 237117 248106 239622 200123 222627 168125 153792 159792 158411 217530 203990 218207 236098
4822 236098 279536 221531 237843 205770 161260 240466 253775 264667 297193 298508 259589 221727
4810 221727 225298 246163 227346 267966 280156 266751 260390 291216 293094 288165 305805 358302
4798 358302 355912 317568 308577 335863 340117 385135 325077 328649 370214 432654 454781 478614
4786 478614 499223 499856 503308 566885 611436 618305 638070 669137 739025 688723 694910 662753 602149
4773 602149 627652 600131 513613 586234 635154 655858 625605 627436 669836 677763 686966 775682
4761 775682 764090 799566 817797 762886 762747 756153 730003 673924 679890 653883 648616 623424 659714
4748 659714 683215 723410 712883 694700 751538 749756 718296 719528 726570 745948 729898 745274
4736 745274 715706 685291 673155 736427 770735 710497 684408 678715 741018 665659 664068 644084
4724 644084 692578 758608 663715 666777 620534 574421 579959 497303 498419 472861 440370 445202
4712 445202 418749 432184 471919 485732 456833 330424 313678 339486 355651 359138 399284 410891
4700 410891 350851 329747 322311 344380 424360 424665 394195 389068 427060 408319 385372 408047
4688 408047 386538 379688 405016 377100 385456 421068 417405 431928 419421 430462 427086 392125
4676 392125 418533 355966 392049 392081 424476 474675 455389 495215 521026 475628 478960 516399
4664 516399 473622 437730 464053 432113 395915 431907 425739 446391 472350 453146 436033 451215
4652 451215 448596 505576 533092 522661 524095 524298 556016 614610 591096 639647 596151 553434
4640 553434 561344 563445 566755 576609 592092 597982 577202 613877 615476 628645 633417 621736 615155
4627 615155 627718 600853 643403 663920 635931 659523 623653 619971 620060 650410 632874 615565
4615 615565 599992 618853 668666 603758 570375 595546 682516 647238 618235 644926 629448 623864
4603 623864 585468 537050 539311 602201 599129 603844 665269 611931 579562 546713 518987 530582
4591 530582 571403 578474 551524 583781 573766 589150 588006 570627 649306 683249 605013 586331
4579 586331 594205 586623 580999 630044 666704 657935 660677 650128 628406 608824 660456 641674 734607
4566 734607 691669 669477 710766 696612 633653 677132 696883 706625 691324 645497 676670 623367
4554 623367 601242 572171 572741 550551 485927 550218 538682 518099 534874 499268 552367 559432
4542 559432 550364 585573 542979 534666 599414 640228 626267 634103 650751 650057 592825 597267 689505
4529 689505 630280 660230 687611 693456 680625 719182 745275 720519 703855 757353 766885 864456
4517 864456 783199 795347 798441 835934 865247 838317 873492 925391 881881 909758 884978 911107
4505 911107 932466 985313 1043408 1067695 1100922 1111902 1088507 1157489 1241254 1248155 1325039 1351216
4493 1351216 1372647 1403226 1459625 1534401 1524467 1569538 1620814 1626833 1630995 1650090 1701686 1764921
4481 1764921 1800418 1898109 2098241 2344175 2569335 2747590 3045309 3303342 3601243 3740505
4471 3740505 3687535 3480874 3113037 2865968 2630425 2506951 2503096 2463274 2457606 2388133 2272570
4460 2272570 2192616 2128735 2113803 2045778 1985919 1949999 1923460 1905320 1856394 1928591 1907363
4449 1907363 1910009 2002590 2024284 2058349 2074770 2064077 2121992 2183985 2271184 2308246 2361528 2410529
4437 2410529 2487768 2527933 2586451 2581325 2606342 2620303 2619569 2549272 2600746 2628095 2761578 2771242
4425 2771242 2779171 2840130 2914623 3032507 3127850 3222449 3301875 3473394 3649333 3808758 4049447
4414 4049447 4283261 4501617 4788931 5057959 5286567 5312877 5268560 5101658 4804041 4521651
4404 4521651 4342638 4308291 4219675 4201261 4139050 4147720 4213861 4269847 4289142 4307470 4418417
4393 4418417 4540338 4605318 4704938 4784135 4884123 5021870 5111186 5268534 5404909 5443986 5577373
4382 5577373 5748162 5879865 6035703 6189867 6375991 6546350 6679734 6847321 7079099 7284326
4372 7284326 7505324 7711286 7884539 8089223 8338884 8548428 8851416 9077244 9305040 9535580
4362 9535580 9719246 9916347 10118364 10328964 10609205 10844205 11054564 11275507 11489461 11661949
4352 11661949 11911340 12172843 12377437 12541727 12735250 12889415 13086860 13236367 13297054 13392703
4342 13392703 13428745 13412823 13365432 13286447 13163707 12981740 12795724 12625035 12420180 12142926
4332 12142926 11885905 11603086 11390603 11171064 10894806 10650286 10456842 10232597 10045845
4323 10045845 9932491 9801113 9670531 9588741 9493620 9369449 9306924 9276043 9285977 9204762 9168590
4312 9168590 9168229 9245988 9278212 9247210 9264671 9236142 9186794 9169916 9193233 9120942 9045160 9001435
4300 9001435 8932972 8786000 8643876 8533921 8407502 8248969 8154562 8010576 7852232 7650026
4290 7650026 7448690 7320241 7136940 6965831 6808961 6635903 6463797 6294284 6193276 6109535
4280 6109535 5909225 5694272 5564520 5403898 5260009 5140914 4957727 4873602 4751825 4631494
4270 4631494 4556618 4463265 4412273 4269681 4147395 4060277 4015910 3925259 3828808 3786623 3693976
4259 3693976 3608604 3540587 3472117 3462066 3362778 3363986 3388685 3352032 3267515 3180937 3210029 3178495
4247 3178495 3173509 3153183 3114397 3141978 3113128 3120540 3131036 3117176 3087573 3068288 3111384 3102413
4235 3102413 3127509 3202028 3262786 3279672 3326990 3319239 3396298 3471299 3473701 3573065 3706915 3808394
4223 3808394 4068342 4319655 4571908 4834187 5252689 5615453 6103604 6675016 7271025 7886636
4213 7886636 8445477 8874316 8943870 8663104 8171054 7503047 6738936 5976019 5496618 5053385
4203 5053385 4698040 4505589 4344567 4192629 4101044 4094830 4054099 4133510 4171762 4212131 4248401
4192 4248401 4341307 4504400 4652997 4792447 4938716 5090483 5297028 5444418 5487780 5485375
4182 5485375 5477945 5509791 5524444 5481400 5433442 5414821 5387996 5493622 5657505 5731521 5822403
4171 5822403 5971439 6108359 6138788 6242027 6275586 6344076 6400412 6385232 6341334 6313724 6242319
4160 6242319 6219212 6120049 6111262 6104525 5940144 5907598 5921003 5919791 5973661 6074617 6246620
4149 6246620 6369556 6483607 6594957 6620403 6598204 6571841 6477879 6430355 6411191 6420480 6514335
4138 6514335 6551084 6589756 6474325 6289744 6030316 5907170 5731017 5501493 5207114 4921433
4128 4921433 4662274 4389270 4116965 3911039 3766036 3660597 3497918 3321387 3248531 3175040
4118 3175040 3139770 3027825 2911562 2848325 2796501 2685649 2706589 2607935 2602845 2668150 2668442
4107 2668442 2662100 2709806 2749044 2811462 2895061 2881282 2940684 2954146 2904923 2918989 2949918 2978615
4095 2978615 2889905 2972000 3027296 3024702 3049687 3020602 3038101 3033548 3053385 3085631 3085767 3137414
4083 3137414 3235044 3247288 3343572 3392359 3474972 3586258 3744511 3856157 3937167 3991144 4078979
4072 4078979 4169707 4250504 4399992 4583784 4773486 4978743 5140654 5338690 5562783 5843707
4062 5843707 5937565 6120972 6369797 6532393 6755846 6933217 6989009 7105014 7191250 7184423
4052 7184423 7234123 7278261 7232626 7115577 6979708 6869896 6796461 6708988 6602872 6496916
4042 6496916 6440404 6341944 6236771 6149669 6093459 6052781 6027693 6042173 6103240 6151539 6184686
4031 6184686 6177105 6175956 6199414 6218872 6221549 6211591 6161519 6124592 6081754 6018325 5980476 5955270
4019 5955270 5794928 5737017 5654582 5554491 5384743 5297850 5180778 5119015 5057049 4969717 4904162
4008 4904162 4808052 4710683 4627880 4529098 4361797 4233049 4079499 4000131 3859917 3784683 3745323
3997 3745323 3743034 3741652 3693631 3722219 3724422 3778251 3887976 3946084 4018395 4273771 4616301
3986 4616301 4838850 5077775 5318546 5635891 5638334 5153341 4618796 4134227 3867209 3599730
3976 3599730 3432858 3328435 3242843 3220097 3226705 3190703 3080728 3032142 3054839 3061744 3140224
3965 3140224 3129604 3068180 3048656 3005433 2979882 2960265 2965652 2885992 2812268 2826228 2793198 2767600
3953 2767600 2733100 2667046 2613756 2625672 2660815 2671267 2664753 2721329 2754254 2804947 2883009 2946346
3941 2946346 2964418 3013551 3023890 3118749 3234344 3262406 3255134 3287522 3365175 3350125 3393883
3930 3393883 3438547 3400429 3387478 3499574 3531088 3568038 3601212 3656506 3664491 3641480 3702054
3919 3702054 3752518 3812577 3860015 3915617 4043627 4116401 4167092 4252164 4340249 4423913 4505643
3908 4505643 4538009 4674973 4737243 4832279 4854910 4945919 4948647 5014758 5094566 5146147 5165728
3897 5165728 5178839 5216282 5310014 5413991 5551616 5558065 5715577 5905304 5994486 6144442 6249344
3886 6249344 6345054 6449841 6540400 6649473 6702214 6778842 6804301 6876011 7042350 7179861 7253440
3875 7253440 7408916 7496595 7530701 7644749 7805015 7889302 8044592 8276378 8505682 8695185
3865 8695185 8982655 9311866 9642865 9980264 10363586 10723934 11210182 11604691 12106792 12760909
3855 12760909 13436844 14141504 14906093 15648459 16549896 17751568 19153786 20746790 22736265
3846 22736265 25069823 27763180 30679601 34187215 38430623 43499901 49380914 56350098
3838 56350098 63738713 70803786 76900972 82973025 82744868 73088359 64333343 57273732
3830 57273732 52460847 49569015 47093910 43982466 40252981 36671929 33666223 31345233
3822 31345233 29747653 28498126 27106538 24944201 22544939 20613666 19013517 17758729
3814 17758729 16824076 16000055 15325923 14753159 14270451 13838001 13514593 13162413 12841737
3805 12841737 12637701 12372671 12083986 11813385 11589139 11328174 11120334 10935466 10808394
3796 10808394 10706155 10596339 10466285 10359706 10227395 10024424 9897845 9730355 9493368
3787 9493368 9297931 9080188 8949747 8822346 8656578 8543467 8449131 8350034 8217975 8035042
3777 8035042 7918322 7720113 7549620 7363344 7190423 6932674 6754106 6616845 6520686 6393456
3767 6393456 6209249 5984908 5869912 5706915 5552943 5384607 5301936 5117731 4996073 4879899
3757 4879899 4814822 4746698 4626610 4546132 4423300 4331007 4290993 4165586 4102840 4049905 3951983
3746 3951983 3856035 3826964 3731118 3651031 3575382 3544194 3524536 3461161 3486281 3474505 3508152
3735 3508152 3591821 3608843 3711841 3764046 3776574 3858183 3942421 4029093 4063753 3984303 3899989
3724 3899989 3694676 3548991 3477310 3394219 3304049 3227403 3187673 3234873 3177234 3112557 3057922
3713 3057922 3014101 2960291 2926539 2873142 2795231 2787017 2795072 2798182 2732883 2770441 2837479 2852570
3701 2852570 2877217 2858995 2946971 3054579 3118223 3164430 3189181 3231284 3306350 3330211 3329748 3367352
3689 3367352 3377318 3373898 3482603 3447078 3442147 3439646 3442994 3435130 3381400 3311380 3327559 3330331 3390057
3676 3390057 3417477 3441901 3517241 3642697 3739573 3859968 4047896 4275050 4458120 4688292
3666 4688292 4925386 5117875 5227127 5186188 5040289 4852432 4662150 4460710 4310275 4168475
3656 4168475 4078989 3982716 3923191 3828453 3827998 3812381 3796804 3895858 3906094 3832502 3836826 3826832
3644 3826832 3860539 3889553 3945380 3896197 3859241 3877354 3856937 3766725 3735552 3696218 3695152 3615251
3632 3615251 3597002 3577067 3546320 3552935 3505685 3480590 3477674 3474450 3508034 3496144 3554249 3635375
3620 3635375 3705634 3784788 3825898 3893256 3944786 3985069 4007467 4100641 4202718 4237045 4322600
3609 4322600 4299020 4317873 4309377 4298617 4301165 4330323 4332722 4347995 4326539 4301614 4341552 4320632
3597 4320632 4311937 4278083 4223908 4327131 4444275 4495872 4480003 4560770 4582092 4676906 4726584
3586 4726584 4715638 4743408 4861861 4870406 4964096 5030764 5125585 5163426 5262079 5410226 5602363
3575 5602363 5775347 5921407 6063772 6172802 6179889 6201248 6186372 6259077 6315411 6410743 6460276
3564 6460276 6637692 6701498 6837662 6963706 7084462 7263754 7429938 7562191 7790447 7960160
3554 7960160 8146725 8332714 8494400 8705818 8936327 9156481 9387671 9682268 9903985 10184992
3544 10184992 10485472 10642817 10860033 11127196 11384461 11651001 11847777 11978361 12082164
3535 12082164 12251422 12415090 12598846 12778542 13100977 13420168 13829769 14043746 14212945
3526 14212945 14301880 14451057 14469552 14501740 14466992 14408961 14296832 14179099 14027476 13927212
3516 13927212 13815446 13716518 13545748 13454284 13304219 13174460 12993582 12751309 12528807 12349876
3506 12349876 12105644 11803810 11483697 11229158 10982923 10762614 10545441 10400931 10194376
3497 10194376 10023895 9864894 9692603 9511407 9583183 9535812 9503400 9372431 9386606 9406036
3487 9406036 9387666 9383483 9433828 9472202 9569433 9620072 9679957 9785624 9940631 10089909 10346466
3476 10346466 10573930 10867372 11064082 11398998 11609098 11777940 11914302 12096143 12205144
3467 12205144 12425496 12629746 12878418 13128237 13437035 13689989 14052055 14494359 14985524
3458 14985524 15339268 15808225 16196505 16674176 17107616 17506369 17793190 18099196 18301132
3449 18301132 18619415 18955677 19419606 19979068 20686750 21246520 21821728 22449260 23106780
3440 23106780 23802185 24673796 25658950 26785828 27810484 28838556 29947979 31263162 32618919
3431 32618919 34143269 35777128 37416312 39074629 40861241 42856823 45287618 48034574
3423 48034574 51113203 54495684 58111897 62010589 66294124 71472187 77786682 85585587
3415 85585587 94917872 106399756 120262048 134603395 151005329 171587529 196149520
3408 196149520 226628884 264467019 304949529 345591157 386117184 434625141 484141026
3401 484141026 451505183 362832365 282311602 220896538 181301894 153209864 133571362
3394 133571362 118273297 107319719 97948742 90328404 83389006 77596969 72194569 67842138
3386 67842138 63646071 60222308 56898468 54301309 52010646 50296654 48615683 47306580
3378 47306580 45857131 44681602 43267965 42136102 40911656 40070139 39222008 38583409 37926429
3369 37926429 37362323 36664492 36096678 35394378 34919743 34261497 33704767 33112072 32552381
3360 32552381 31913618 31395717 30804417 30398750 29841881 29287952 28560350 27834487 27004663
3351 27004663 26352787 25687865 25083726 24424960 23890274 23301577 22707534 22064542 21438017
3342 21438017 20757731 20054123 19278657 18574842 17827095 17080601 16388457 15782153 15163564
3333 15163564 14609017 14026450 13506725 13051381 12724778 12368293 12046902 11665896 11428132
3324 11428132 11117020 10789485 10451530 10180548 9900194 9699383 9473696 9224170 8947752
3315 8947752 8705538 8542052 8340818 8107311 7858853 7841001 7723588 7598388 7403362 7275349
3305 7275349 7125182 7085921 7059045 6990841 6907424 6759722 6674936 6529661 6445509 6368198 6150981
3294 6150981 6049879 6060909 5978104 5830208 5677362 5572706 5450427 5361006 5288014 5170553
3284 5170553 5081142 4928477 4829367 4803266 4783654 4686843 4621967 4532651 4487392 4481898 4481707 4429420
3272 4429420 4458862 4326985 4202932 4070649 3986532 3847399 3818393 3770890 3709650 3703677 3731933
3261 3731933 3730465 3659797 3610405 3685584 3726283 3730835 3715397 3665865 3577591 3592212 3514256 3442249
3249 3442249 3370477 3370016 3281736 3271124 3255502 3156613 3145421 3130636 3053463 3021946 3019115 3018861
3237 3018861 2993412 3063977 3084148 3070206 3113555 3195403 3241811 3262243 3290337 3331616 3417648
3226 3417648 3549233 3615625 3694402 3721673 3799574 3791955 3868954 3924274 3945283 3931091 4046627
3215 4046627 4056094 4118033 4173071 4221134 4288812 4358807 4423943 4426834 4442307 4554431 4619293 4664422
3203 4664422 4691446 4752604 4815060 4861665 4940732 5059908 5096216 5178144 5239645 5287266 5415957
3192 5415957 5522514 5580569 5692578 5726017 5782700 5889384 5928059 5962843 6019686 6116029 6213366
3181 6213366 6302967 6393540 6536962 6697954 6814181 6926467 7139594 7343608 7478279 7740206
3171 7740206 7902297 8092106 8305102 8545765 8778835 8931595 9127620 9341274 9689660 9999533
3161 9999533 10307642 10623612 10980887 11428351 11856594 12222950 12626712 12959956 13390849 13805409
3151 13805409 14215920 14677861 15148391 15572275 16020551 16542285 17074597 17584910 18108033
3142 18108033 18618111 19116067 19470427 19870357 20063338 20190108 20178208 20009599 19908866 19799000
3132 19799000 19640034 19577986 19546850 19586001 19592792 19669370 19633738 19585698 19484475 19430082 19275043
3121 19275043 19124694 19011609 18911475 18683617 18481041 18237162 18099178 17968926 17740996
3112 17740996 17575954 17440242 17296040 17055884 16752479 16576273 16233924 16031718 15717040
3103 15717040 15409262 15047217 14797172 14543831 14203209 14046332 13986521 13955679 14065149 14323712
3093 14323712 14658230 15041169 15600214 16311203 17197201 18271739 19613577 21306759 23343498
3084 23343498 25621881 27957256 30074738 30971275 29446142 26045960 22393140 19320398
3076 19320398 17028385 15369649 14207041 13300108 12598647 12020284 11550040 11098556 10725613
3067 10725613 10378654 10135730 9904734 9568383 9201874 8988572 8751588 8540474 8401337
3058 8401337 8292602 8143286 8092963 7938397 7814678 7800298 7820158 7705788 7413793 7083370
3048 7083370 6734724 6375064 6157134 5958729 5799207 5608135 5496676 5388938 5297844 5235267
3038 5235267 5161069 5118568 5058409 4975411 4868639 4763410 4694140 4670965 4645956 4607456 4592414
3027 4592414 4537036 4586200 4600931 4632841 4735280 4795477 4817599 4926375 5001906 5138170 5308374
3016 5308374 5431626 5622528 5858138 6143299 6389521 6621335 6900099 7231633 7558335 7865748
3006 7865748 8168244 8511159 8799645 9059177 9385393 9631797 9907228 10123235 10342866 10551042
2996 10551042 10864617 11103305 11360742 11664036 12059976 12459490 12985546 13490500 13965546
2987 13965546 14358884 14780171 15174388 15440449 15626575 15779807 15852168 15717433 15431317 15142164
2977 15142164 14614536 13973130 13423626 12684466 12007387 11325935 10646574 9966229 9356705
2968 9356705 8799826 8317757 7825529 7231929 6796239 6403992 6095911 5866217 5534885 5277922
2958 5277922 5052152 4846939 4687241 4480272 4308703 4197659 4042702 3917499 3784781 3659901
2948 3659901 3495713 3380219 3366508 3315735 3187172 3080729 3014733 2978885 2900417 2805146 2705342
2937 2705342 2678198 2641972 2530559 2506696 2448572 2420863 2343631 2287853 2305338 2263146 2139057
2926 2139057 2104331 2042573 1989105 1975284 1926824 1900246 1817685 1773739 1762871 1769664 1727275 1742502
2914 1742502 1693784 1622682 1555687 1555059 1559434 1510931 1437871 1505846 1467451 1442384 1547767 1502145
2902 1502145 1491845 1487742 1483864 1481222 1362330 1402616 1397779 1394362 1358944 1397966 1336339 1280130
2890 1280130 1222384 1311988 1293756 1328515 1337764 1288247 1249095 1213256 1200654 1162590 1171632 1240916
2878 1240916 1219452 1187087 1259765 1207101 1216826 1267001 1243654 1239308 1270174 1275746 1289671 1319991
2866 1319991 1352385 1301173 1290805 1322371 1310056 1315537 1303415 1308254 1302763 1334313 1370391 1416947
2854 1416947 1390262 1443057 1425983 1368575 1376335 1433393 1440723 1489759 1487975 1472485 1466702 1487139
2842 1487139 1506378 1522365 1630197 1600687 1616796 1674765 1723980 1765114 1734328 1769522 1843554
2831 1843554 1833294 1899866 1919847 1922210 2025498 2092567 2083751 2157558 2183724 2222849 2214399 2239978
2819 2239978 2298917 2342518 2364269 2443364 2469764 2601725 2631712 2644680 2683650 2817729 2892728
2808 2892728 2961461 2967793 3040419 3110990 3203890 3283301 3470395 3549504 3498686 3575150 3761746
2797 3761746 3903531 3930337 4009820 4195525 4296031 4402990 4563562 4685306 4883846 5005641
2787 5005641 5111902 5297363 5466202 5613917 5842483 6081117 6296130 6471833 6719015 6984453
2777 6984453 7267811 7548278 7808249 8151147 8464225 8826743 9301569 9833554 10414475 11124034
2767 11124034 11769484 12603253 13652433 14650808 15763616 17095745 18573637 20132176 21754645
2758 21754645 23288067 24725762 25980533 26787094 26886735 26550958 26182424 25946989 26040469
2749 26040469 26593924 27345400 28299457 29404838 30798399 32601909 34755742 37394449 40399473
2740 40399473 43671682 46910017 49778838 51872338 52941319 53093871 52672060 51905605 50713262
2731 50713262 49079013 46846928 44061504 41033258 37784783 34690360 31780712 29131690
2723 29131690 26753363 24585352 22584272 20839158 19316361 17945033 16679819 15536629
2715 15536629 14622760 13684613 12947418 12300740 11603865 11010765 10547553 10026306 9538095
2706 9538095 9093618 8734482 8319014 7989682 7678842 7378434 7104123 6864604 6573240 6334991
2696 6334991 6119736 5888799 5705608 5530610 5361297 5162710 5046198 4861073 4678610 4550750
2686 4550750 4436647 4255861 4155044 3960245 3829929 3758352 3652634 3531411 3350148 3319395
2676 3319395 3199744 3094513 3000486 2954489 2845212 2814100 2769094 2628406 2580790 2570558 2464968
2665 2464968 2392280 2314314 2280418 2229932 2193100 2178893 2083134 2022941 1970671 1880149 1850907
2654 1850907 1799695 1810566 1735397 1629552 1609587 1537062 1524959 1479563 1457008 1451843 1380254
2643 1380254 1327911 1260499 1218314 1207581 1221855 1179869 1172912 1099205 1115500 1096564 1121698 1166582
2631 1166582 1138080 1107730 1108998 1129315 1111653 1031508 961938 975195 964096 993370 908289 911250
2619 911250 889361 918028 896160 891594 860263 866642 833181 770698 854080 906966 782428 779690
2607 779690 814071 808481 749781 643050 630940 691437 688649 682488 665350 649291 666036 600170
2595 600170 615034 678652 696187 650439 599406 597137 671844 631166 537952 555976 490441 501252
2583 501252 497284 463753 507232 571481 565287 500679 517733 482626 440222 485488 486387 492019 459545
2570 459545 435298 448281 469073 438304 468177 439186 399586 403776 358384 374180 362942 409921
2558 409921 396639 372140 340130 350845 338747 333761 397381 409894 381222 403182 386196 374699
2546 374699 304099 274193 293102 329537 387538 365631 309022 273879 285153 238893 260002 261718
2534 261718 226890 309402 325952 342613 310701 280682 308204 282878 305273 268909 331815 294369
2522 294369 282315 230363 244293 246060 223506 281059 251859 285934 310516 322952 300626 264147
2510 264147 224448 276964 328736 305917 262796 275646 284358 267786 306917 291016 294807 302491
2498 302491 318865 355925 355689 315133 309214 306118 315328 272250 269914 309721 328750 311629 343094
2485 343094 343996 357213 446700 489057 450551 456084 401075 384370 420536 475805 441051 363771
2473 363771 308562 327707 255322 197454 278935 315878 294149 271611 317210 278996 219141 185258
2461 185258 209826 229383 207662 201857 197596 151787 204612 198389 119834 128049 143981 142600 210344
2448 210344 193963 207831 161637 196210 205614 183116 164452 155713 122500 129105 87885 117759
2436 117759 163354 146235 146043 157550 208507 209768 180310 177034 172656 168195 166145 188846 124123
2423 124123 118866 92570 141028 112376 86478 86154 87979 82946 104888 63585 1646 62832 65331
2410 65331 69238 85265 52112 67980 106908 53679 92296 69323 111938 121979 70757 55771
2398 55771 117312 123549 87542 69687 71076 36983 53902 4217 -32857 51068 46543 32135
2386 32135 30644 -5069 51665 53193 38400 40342 35034 55805 78180 57538 48283 101552 75377
2373 75377 26218 -3469 22816 30027 98801 74824 32994 -12593 8367 63089 61206 -16260
2361 -16260 28933 35299 45572 71221 76121 101840 100316 56909 40740 59825 10284 3897 10984
2348 10984 56175 16991 25708 2895 -11080 25986 41790 38507 50687 -500 16051 57520
2336 57520 39588 34097 57921 13749 33346 31540 51643 17351 34444 45529 54775 98371
2324 98371 55963 50496 69880 43230 23754 115595 164860 91817 24534 64085 44618 85363
2312 85363 141577 79987 60974 86492 110395 86890 29303 89304 143075 134758 164994 159434
2300 159434 189705 161692 205110 218990 210051 215966 221163 155343 111579 63557 15969 19784
2288 19784 31922 59638 88895 82635 39445 32437 52590 26402 81467 42063 30835 10580
2276 10580 17339 96408 97368 104622 57958 -4532 18628 42915 25231 65704 46367 50948 43260
2263 43260 59776 34543 35441 42666 46052 50759 91060 116313 65823 53441 13559 34806 29555
2250 29555 53886 31537 -15300 87381 76731 58542 101512 88906 34925 -4002 53236 60995
2238 60995 20043 14473 3053 9092 14042 20949 -26486 -28219 39063 98151 35154 30254 75917
2225 75917 83192 53483 93194 108752 157906 125662 66217 58099 57939 91108 77346 65214 63611
2212 63611 70470 2778 73862 108537 56315 112429 114775 126933 73426 81793 63428 52376
2200 52376 28863 41286 92732 67943 89049 95340 129268 133333 116315 153102 140888 140092 120456
2187 120456 140054 159580 118847 114240 106004 120002 114447 136054 167702 139354 118303 123448
2175 123448 173230 117742 148147 192320 138371 204843 207628 163344 197057 199189 173437 170264
2163 170264 175410 172119 219879 170039 189364 197310 223483 285273 305915 289796 308513 293592
2151 293592 325550 285931 265192 275984 295558 306875 340945 336868 319091 349435 386578 421345
2139 421345 400539 415101 432078 429540 362433 384495 446433 498659 464934 457819 445628 485305
2127 485305 504230 615322 638637 579764 608169 618533 710484 680740 677667 725693 732188 784033
2115 784033 782160 816630 813490 847529 867251 931216 923479 957162 985280 1052662 1075532 1048788
2103 1048788 1059892 1116465 1108672 1211480 1256773 1296330 1285211 1389544 1484923 1472758 1494449
2092 1494449 1573320 1669250 1741031 1844358 1947148 2001748 2085956 2210668 2375889 2552345
2082 2552345 2701511 2839387 2997948 3163173 3372749 3544312 3803837 4097770 4413741 4799454
2072 4799454 5188422 5708789 6290286 6906273 7565719 8266403 9243124 10300783 11701413
2063 11701413 13272222 15288759 17730286 21054678 25061626 29668849 34429472 38479789
2055 38479789 37291053 30440902 24765300 19592472 15416224 12621993 10694084 9307808
2047 9307808 8150989 7393221 6789986 6306830 6025204 5728296 5285147 4823884 4428812
2038 4428812 3997007 3656472 3392937 3243775 3080783 2935826 2810072 2603809 2469872 2371117
2028 2371117 2245455 2163538 2070439 1941318 1845241 1782567 1742711 1619475 1562476 1575298 1543288
2017 1543288 1501151 1409593 1277353 1173265 1163370 1206496 1125137 1089520 1059773 1043799 1002139
2006 1002139 987694 948888 947026 864287 848437 811473 780419 782400 845595 772626 736137 746836
1994 746836 729463 702753 705902 644294 618683 594549 563382 546523 465384 466337 474675 466864 452520
1981 452520 430872 486079 491269 441266 395966 347874 352427 319577 395805 375109 356054 327321
1969 327321 308065 357440 335290 303096 339533 299543 219300 190160 276061 302789 279850 285485
1957 285485 242364 214720 233226 201420 210527 237178 210543 228697 251688 207841 245771 224569
1945 224569 223347 220254 175436 191214 156917 127471 158469 171611 166068 185504 161148 171200
1933 171200 215382 195040 240735 240382 194729 186499 165437 178632 187335 190051 148345 191731 180157
1920 180157 125054 179378 164222 153286 168256 121307 105339 142033 154948 118725 85445 137434
1908 137434 167670 170379 195111 226371 136608 85673 111041 98995 119505 162460 161721 99244
1896 99244 108175 112089 134774 58941 28140 49462 17302 55674 144831 105681 97071 62447
1884 62447 46725 64668 82613 122482 77516 72956 97039 122047 93186 25475 48405 110520
1872 110520 123927 56982 62689 41723 20078 69773 57041 50970 60146 63280 107704 96830
1860 96830 67417 44823 20495 20218 78548 63791 2331 43675 134634 64459 42290 107020
1848 107020 71532 84818 15163 19421 51075 18183 12536 26107 28543 55918 84956 76277
1836 76277 98012 151010 98169 44483 109667 78087 90741 83597 22322 -1886 65694 103464
1824 103464 90522 94890 76330 132163 159403 109756 100548 139870 198081 185080 176215 225873
1812 225873 231701 167535 106955 84527 75973 135844 138486 114763 111408 91373 94577 146728 135532
1799 135532 106025 80524 55744 15100 -1278 25994 -20263 -20521 88529 45484 43521 43570 27271
1786 27271 16990 -1978 25878 55121 16033 -48272 4623 19277 35544 24114 47441 -4045
1774 -4045 13847 50538 42608 1476 -6403 -7027 -789 25749 18824 -15633 -37788 -6810 -9738
1761 -9738 -40495 64208 51403 58183 45604 64015 37425 -61640 -4104 3541 -1121 46868
1749 46868 -8638 -31539 5919 176 10479 28424 18727 6502 7146 -22557 76889 55257 54287
1736 54287 26389 19869 5158 31884 5890 26930 8961 -18389 -24601 -2453 10512 12115
1724 12115 20656 55518 28953 64549 24262 31926 10312 30373 17227 45691 91611 43563
1712 43563 -39227 -30482 -4598 9886 36810 60609 55049 18975 28100 -19052 -14526 -28566 21581
1699 21581 33690 -20085 33122 15003 49387 56201 -6494 -2837 -4975 -47150 -46474 -16269 13451
1686 13451 23304 57866 23957 -45947 -43031 -81750 -48385 -52878 -26911 -11040 39194 -9270
1674 -9270 -10933 -17298 -26998 -38027 -46514 -62019 37438 68154 37503 -20548 -14035 -11845 -21284
1661 -21284 -6621 -577 -16132 35428 -17856 -41751 -23361 12354 20842 30876 -21350 -44898
1649 -44898 -25254 -37021 -19044 -27005 -7459 28807 -12351 35205 146053 129074 31692 35297
1637 35297 31450 -1885 -7861 37693 57708 46425 -1951 32926 49889 51213 34912 -1544
1625 -1544 16643 -3524 -22794 -20096 -35180 -21932 41192 -1253 -40631 -61922 -39114 -36075
1613 -36075 -28835 -6180 26492 -21141 19123 -34997 -49562 -37656 -1274 44219 6579 -7034
1601 -7034 -67335 -64478 -35441 -35410 -3238 7479 -7121 8413 -12357 -35591 -47573 -34787 19500
1588 19500 -18972 -267 20420 29236 28143 40738 11737 9126 55820 15442 -5510 61085
1576 61085 81551 22535 56403 16475 7578 29847 15561 46169 14299 -20912 -5545 -63762
1564 -63762 -52896 10852 4896 26890 -6609 -8961 -21521 5330 21398 -23359 -28571 -6063
1552 -6063 -13140 -27646 -4386 -45880 1047 3738 2414 -528 7415 37113 18398 8641 -70703
1539 -70703 -23079 -12254 42886 31366 47703 -8489 6129 187 -47324 -29576 -21507 -3053
1527 -3053 -33473 -56297 -94282 -98674 -47712 27242 -39834 -24047 38465 34208 -11175 20361
1515 20361 -20273 -15279 41516 -531 -7993 23546 59508 44878 5890 6254 16753 -18447 13344
1502 13344 19954 58836 43716 45586 -33733 -49007 -50227 -43711 -22124 42038 38054 19480 -9353
1489 -9353 22631 48705 15080 10406 -28745 -2403 -13684 10848 6145 10336 -71 -21166 -25685
1476 -25685 -859 26963 37458 -7492 -26245 -22065 25862 9278 -25106 9743 44046 6429
1464 6429 -10791 -37695 18377 80755 19389 15675 52686 60912 6922 -44762 -11054 -43783
1452 -43783 10558 -36405 -32070 21278 36539 46008 34750 -14140 -35475 -40088 -21458 -7378
1440 -7378 -14664 -8546 -38881 -48365 -69942 -31491 -52104 -94259 -81066 -15735 -11287 18495 46736
1427 46736 -4952 -7133 -13208 -28358 -55365 8559 57614 20036 -13577 3724 -27968 798
1415 798 -4570 -21617 -33664 -51535 -21768 46219 28879 -20043 -21192 -34923 -54204 -28265 -40512
1402 -40512 -132873 -76288 -32659 -54832 -23334 33987 -35949 -8255 17787 69369 64459 95572
1390 95572 34337 -90192 -72208 -41556 -18402 -12304 1648 56687 76354 -8629 36789 25119
1378 25119 19117 43480 -6646 -11819 72469 36556 -36697 -13414 22295 37070 54294 55555
1366 55555 30084 -28745 -6744 9476 9559 -39237 -52760 -9069 -35206 -58021 2253 -8524
1354 -8524 -14016 -10768 12892 70810 1254 -4876 11669 -27189 7215 50736 46863 21983 -13080
1341 -13080 13226 26185 -16944 -43200 -23753 -10240 58139 40750 46492 -3362 -6008 -11781
1329 -11781 -5154 2555 19895 21148 31518 2844 -22950 -2862 22397 39688 42226 -61004
1317 -61004 -73714 -35545 -43907 -31723 20794 26519 -7065 -7845 -5815 29475 43931 44048 -37465
1304 -37465 -61461 -51903 -24045 -17685 -9605 -8721 -25663 9541 -2564 -25064 -11127 29047 -5076
1291 -5076 -55889 -31598 -32369 -52607 -48479 -53416 -72531 -44904 -6658 -28432 -9885 30883 25160
1278 25160 21181 35660 -7843 -14565 33198 44669 13676 -27256 -17684 29812 96241 96965 42104
1265 42104 27131 -21874 -42569 -6747 -35481 6405 -5048 23148 5423 -28018 14117 -2422
1253 -2422 56600 66489 5289 24910 26891 -4454 37204 12088 -5271 -23391 -26304 -13337 718
1240 718 -28804 -40595 -4008 15992 62784 69753 -4080 -20784 -16455 8625 -18586 -51697 -10014
1227 -10014 6044 29709 26563 25233 -63941 -51313 -49456 5346 -33901 -74425 -23467 11171
1215 11171 48928 19008 20639 60995 32310 8006 6084 2138 -51471 -50045 28543 693 31005
1202 31005 26868 -35052 20857 8219 -7101 -15155 1880 2750 28784 -29088 32232 -7365 -10435
1189 -10435 -37634 -36532 -25922 34873 32853 -34254 -3316 15504 59150 34244 31634 17802
1177 17802 34942 34646 37220 896 33497 38608 34745 28271 29164 43700 90129 28827 23533 -791
1163 -791 -19005 -22100 -55934 -86760 -49310 4570 -40426 -23932 -20984 -28847 -19350 845 27411
1150 27411 9853 56281 59403 -47027 -46497 34534 40630 16435 9342 40868 -18611 23158 52875
1137 52875 -9312 -8340 -14945 -10541 -76570 -53082 -579 -30204 -6020 -46540 -51540 -4822 -9849
1124 -9849 -59274 -51542 -21084 -14401 -9688 -29010 -16034 -15625 -42832 -17147 12272 3088 -12814
1111 -12814 9893 -29666 -49240 -8557 44308 68845 106087 66521 15194 -3717 -5980 -14215
1099 -14215 -13739 -13679 4103 -69591 -52088 -20611 -8348 -9386 -69021 -15304 -63764 -76998 -62506
1086 -62506 -46661 15367 51711 51495 36112 -7984 21103 22623 -40042 -8111 30587 33039 37257
1073 37257 61794 49354 1212 -21526 -43346 12214 -14702 -8644 36159 -12684 -16496 28244
1061 28244 13758 -36590 -37774 -27395 -8788 -21108 -31162 -27193 -11572 -51260 -58521 -9722
1049 -9722 -2256 42567 26259 -13501 28535 35411 -19749 -8351 -6193 58704 78832 11036 -62274
1036 -62274 -69280 -63970 -73436 -67632 -56369 -14272 9500 -37923 -47998 -83333 -71310 -12476 -54924
1023 -54924 -16451 42331 -9524 -50020 9527 -27281 40834 21846 -18089 -19358 -3582 17617
1011 17617 -2470 -36346 -19685 -4286 -25764 -29190 -46951 -7137 -53900 -44551 19885 61159
999 61159 12681 35856 41687 -3048 -10158 42971 -14364 -5466 -13367 23215 29912 70085 -23773
986 -23773 -4573 26115 -5124 18681 -20228 -23309 -2649 16387 28686 59104 1456 43170
974 43170 72211 17911 -38480 34964 -308 39789 60431 9021 -15377 -9811 -30051 -4347
962 -4347 1920 -61386 21730 29954 5475 -62639 -37587 -85255 -43855 -20168 -27329 -34381 -80691
949 -80691 -19004 -4369 4017 -2614 53416 52240 122337 111424 45659 46628 57210 -2415 -6584
936 -6584 -66909 -3668 -32361 -15979 4485 12374 -14009 -53163 -50164 -3388 44715 60506 -10034
923 -10034 -52492 -29220 12096 -45775 -36069 19044 1276 -12685 -6651 -19257 -56608 -1555
911 -1555 -35771 -15226 8915 75640 37765 68842 91874 17316 -40215 -31529 -97885 -26581
899 -26581 5205 -16987 9008 -19809 11849 53225 4087 -6008 7313 27591 -14327 -27265
887 -27265 7640 15265 8614 9536 -19118 -5923 -29985 -15087 32349 3037 4271 4734 -14540
874 -14540 -13626 -54041 -67532 -22927 -28622 -17053 -13715 36338 -26638 45859 -5785 -23229 12065
861 12065 2739 -47434 -97684 19205 -24884 -71211 -20829 -33938 -70894 -21501 -19801 -60789
849 -60789 -44370 -23676 -12989 17013 29414 -34784 -58770 -9682 11721 60518 25480 -36598
837 -36598 -25142 -37107 -3901 -26079 -623 21582 -64291 15828 88214 2584 -16007 -56914
825 -56914 -32824 -6143 -14292 -23325 -12387 -1381 -27848 -29138 8669 -30216 -28642 -22620 -37726
812 -37726 -35701 -47213 2964 -18454 -13924 34160 47564 27713 46583 39425 84418 37554 2598
799 2598 35332 45586 32095 8507 -457 -36428 -66002 -26386 -88471 -78690 -90305 -60583 51294
786 51294 12999 15935 16350 -38178 -16967 -46374 -50263 -18328 -14060 -33292 -1223 -17322 -96356
773 -96356 -23225 -4907 408 -14185 -43594 -53737 -30173 -13325 -46424 -51225 -51649 -51294 45907
760 45907 12462 -902 27437 71032 17871 -51484 -43238 19561 30081 -12119 22333 -26668
748 -26668 -30606 24875 51319 27250 39215 20556 -8191 68231 56914 69413 68647 9737 -19906
735 -19906 -18018 20900 4817 6740 13019 27457 20501 28866 14159 66986 15249 20473 3332
722 3332 -11959 74895 61493 20985 75630 39376 19882 -15635 -61357 -19217 18378 32491
710 32491 -29774 -15079 -6443 -9154 51620 46396 35419 32125 29462 31777 12063 60579 17832
697 17832 -5316 26687 8896 -1546 8084 30756 38891 -34665 17668 49976 -31339 -16390
685 -16390 3949 -36712 -57643 -78235 -38346 -1836 -36117 -27045 35144 20943 29686 8264
673 8264 -3475 -44617 -8002 49769 27434 -7803 -15041 2229 -1280 41940 8489 -1263 11944
660 11944 -8354 -51005 -19304 54792 30503 -1175 -24139 -58152 -64065 3322 17954 56499
648 56499 -13089 -35548 1247 10944 49686 71203 58601 56075 6843 10203 -12848 -60920 -29241
635 -29241 -1624 28251 20521 50696 14214 -41749 24484 28544 11386 57200 15676 -15862
623 -15862 -46273 26980 3601 15635 -2467 -40926 -66587 -76929 -58558 -33841 -65991 -55841
611 -55841 12824 32980 -6974 -25306 -11703 6318 -8744 -52085 -43531 -39349 -66988 -34026
599 -34026 8700 8099 -38891 -33699 8039 -16379 -31545 -36950 19823 -3301 14721 -23710 -33737
586 -33737 -15268 62599 53534 53492 79086 58043 42108 -21742 16937 1604 -34821 21647 4306
573 4306 12661 -8305 12613 2221 -4147 72698 67078 45844 -22729 -18203 -31388 4243 -2541
560 -2541 1695 -30791 7210 57045 60126 -1805 14127 42870 -48818 -21083 -4598 62358 59385
547 59385 22075 11204 -42663 -40126 -58706 -10259 -5831 36136 -12438 -23457 -40067 25359
535 25359 32099 -2144 -44319 -55190 4611 33006 24946 -1962 68545 35412 -11089 6866
523 6866 18143 109521 80170 -14768 12593 -18307 -5770 -42567 -6869 21350 -14012 -29566
511 -29566 -59550 -56083 -44216 -31030 21172 18959 12707 -7966 26176 -20819 -16556 -52949 12152
498 12152 -21504 -47105 -8553 -12359 4602 2886 -51766 -35869 -13517 -21370 -53497 -61431 -7752
485 -7752 38429 -33824 -24087 19514 -17426 6065 -3446 -45021 -24296 20845 11554 58333 29444
472 29444 -2905 -25350 -18521 -48687 -86758 -45322 -109231 -80279 -24634 -32123 34870 21008
460 21008 -32189 -45238 -27346 31388 1575 -5357 29973 9607 72925 55459 63050 45045
448 45045 -9549 24625 39129 -2597 12750 16374 -7742 -23826 3799 32461 53604 -3352
436 -3352 -31596 13547 25989 -15773 7342 19741 41543 -24169 -38554 -25333 -64496 -72010
424 -72010 -14954 8710 -50747 9779 31864 63348 69100 -27504 7069 21264 -23822 -40295
412 -40295 -69930 -37060 2583 26962 5140 -32384 31030 17398 2774 21657 12778 17520
400 17520 40453 88976 88638 43920 60321 28954 30093 17144 -13123 36193 1385 -6213 4594
387 4594 12496 -31976 -37162 2746 54103 21443 43164 13304 23985 25718 2946 22247 -27875
374 -27875 9178 -22411 -11099 29441 29522 29744 17338 19910 37298 26588 10740 39977 43630
361 43630 -26433 -6496 38300 16410 -7393 11681 -41446 -3341 -9090 -27549 28714 66232
349 66232 26662 24080 90445 43268 1269 -26273 17177 16729 52258 72603 78181 51234 22625
336 22625 2911 -18621 -23646 -68030 -25212 33162 53511 15363 24978 55249 51565 27388 7747
323 7747 75273 14420 -4907 -31796 2337 9229 10680 -33925 -23845 40204 25572 27398 38866
310 38866 12165 41808 57228 55595 52235 22722 27838 13690 -38417 -8223 -12262 -626 26644
297 26644 21687 85819 16207 18754 39074 7449 28047 -4289 -35207 35028 85967 27654
285 27654 45041 33176 80591 75216 33998 68520 11572 32993 -22114 6385 19655 -1534
273 -1534 37342 43045 40904 19010 -19265 -30849 -14117 8624 10549 -29873 2641 14223 27333
260 27333 21342 -2179 -70240 -52162 10142 11852 14617 -26201 -61227 -12083 30526 2526 71384
247 71384 29339 15019 -7082 5100 -10850 40523 73579 35255 -9534 -15636 -35869 -12536
235 -12536 69093 67201 29007 37562 65584 97198 57990 60113 -1398 -53256 -41047 -31128 -13979
222 -13979 40095 70138 4355 -35489 -30275 14000 1162 32439 12559 23409 34885 446
210 446 -4068 -8406 -31103 -41427 17023 -3936 2941 51839 6643 -27962 -16604 31835 21954
197 21954 43282 78485 49577 65677 38607 50461 51837 35493 31350 -34881 -22392 6295
185 6295 47459 64314 50785 26995 40091 29623 31615 38308 44888 21717 17827 12177 1217
172 1217 459 34142 34305 15727 22025 19410 25247 -30228 13998 32752 27477 33301 44567 -5539
158 -5539 -3803 -8010 3030 15890 -16419 46709 11542 -12369 6014 32458 44338 59032 32909
145 32909 56989 7292 52983 -14098 -3928 17039 10364 -12143 33614 49501 13826 -6489
133 -6489 82 25817 3833 -2317 10925 78650 25874 13072 15071 -41104 -56404 -47729 -63522
120 -63522 -23989 -8623 -5846 27575 15828 8861 283 21387 50527 27677 79001 88355 24497
107 24497 19341 42990 19328 78510 52739 86176 55478 8221 31962 5787 39871 9014
95 9014 -21987 19517 16436 -433 6221 -10190 -12125 13490 -9728 18137 -18122 -46706 -45635
82 -45635 -1754 13794 -6169 -5755 -24000 -27910 -11827 14456 8276 13565 -1308 -6609 30659
69 30659 28089 26966 -14116 -7955 2529 -2628 39428 25508 -35630 -23356 -25256 2719 20847
56 20847 16850 22803 70314 65308 11449 -6188 -6340 18306 -12858 -7190 -10867 16388 91278 94448
42 94448 50372 12775 32275 57262 40110 65609 52527 5670 3986 15562 42537 4724
30 4724 -24482 27842 -6952 53300 68200 28984 26524 40460 52233 13435 -24193 11899 30214
17 30214 38218 42923 44794 46998 -1828 -3402 28469 33677 519 3907 31404 768 -21607 -27928
3 -27928 -32346 -37650 -12026
0 -12026
$$ Imaginary data points
##PAGE= N=2
##DATA TABLE= (X++(I..I)), XYDATA
16383 -728544 -720790 -751478 -796809 -762459 -740053 -704458 -724370 -718754 -705571 -718601 -704493 -729375
16371 -729375 -698910 -617081 -608881 -594372 -577179 -571777 -563056 -561067 -539294 -539765 -540403 -497309 -470274
16358 -470274 -485220 -495492 -460533 -469053 -462860 -441209 -467017 -474330 -459252 -456118 -463846 -457223 -423603
16345 -423603 -405272 -378037 -357168 -354823 -322244 -324621 -315098 -307002 -370988 -351096 -296685 -278967
16333 -278967 -222573 -222465 -267351 -257297 -233734 -214462 -231265 -244901 -231328 -204159 -223894 -225236
16321 -225236 -152884 -166783 -143070 -108650 -163225 -129739 -107845 -85125 -85341 -48711 -82695 -128291
16309 -128291 -86206 -90049 -82360 -32457 -69503 -45990 -50178 -73369 -28431 -20704 -3440 -12441
16297 -12441 25977 -15029 30793 30804 65530 61324 70961 58794 48206 66045 46287 47583 80939
16284 80939 38207 57059 87849 109051 114987 120694 133805 142284 160601 161344 164857 163414 199269
16271 199269 204476 187918 210123 246106 220374 224445 180663 212377 194257 200549 210343 210524 223459
16258 223459 263987 355005 317945 303835 300721 300164 320213 340311 336574 327961 332834 343948 348275
16245 348275 345460 330306 323121 367104 363759 366606 394506 395968 419004 411170 435449 440570 428646
16232 428646 434523 474552 457832 452206 454707 454121 483448 439274 415666 416998 411182 382222 434533
16219 434533 437051 409976 392439 427693 429387 405849 406153 440995 475908 482940 517125 551936
16207 551936 544431 531652 518399 561510 575580 502512 534272 489396 465318 492244 552615 603664
16195 603664 588712 565904 577674 542451 593413 590860 608949 597013 524596 580291 591330 622013
16183 622013 600789 589335 603613 585076 603869 597375 563490 613435 541677 550258 573523 597414
16171 597414 585016 587983 580564 577098 618932 623801 614029 604312 597759 676308 656384 652147 613341
16158 613341 607811 593708 606415 616631 568277 602003 635300 627303 630146 640136 612124 605824
16146 605824 642861 706636 715613 697022 657678 674906 661602 634250 707803 694641 672289 687340
16134 687340 644005 637294 627308 653513 666612 735454 738796 710492 655171 652196 671938 676544
16122 676544 705221 699507 720939 761147 735120 834802 784361 748936 723931 713817 729946 694127
16110 694127 664200 697129 722780 725686 740203 729835 705852 709099 645385 702728 752383 717085
16098 717085 800065 725715 688269 732451 690917 707620 715039 747871 679279 696434 748540 753915
16086 753915 738644 702945 760009 746332 703663 766000 771548 694851 684575 702353 738907 724865
16074 724865 729483 672223 721984 685856 772697 774233 749069 753543 722018 758392 740689 762337
16062 762337 800394 756700 765433 768138 728277 706629 791801 768214 746361 753768 779307 831099
16050 831099 773444 775976 766943 776698 714017 778757 785636 752015 758610 774203 833721 820185
16038 820185 800887 769185 774949 754485 765262 761590 748719 754507 725712 725298 738859 725710
16026 725710 725757 766433 767397 709492 690236 691930 692501 692436 726773 669263 680366 731710 753784 775702
16012 775702 784062 748570 701551 752274 806624 766636 763898 776621 735174 756011 788951 767026
16000 767026 723703 796693 820746 816948 770440 813685 811639 795108 787117 762766 701768 719192
15988 719192 747566 715447 706411 772652 771819 768239 721504 689481 735345 743573 787120 785868 769165
15975 769165 782632 749216 720228 798681 792076 755427 779645 786493 789015 788468 786029 768582 782913
15962 782913 795038 713068 713786 745599 705421 666219 723403 716731 761958 780627 787200 788306
15950 788306 774387 812467 857956 819179 758953 756922 748588 753320 741086 778404 750933 793895
15938 793895 818652 824528 796011 825176 843754 855539 784467 788578 820902 764033 828138 839289
15926 839289 835316 813898 825821 759197 747595 751191 790872 786018 750508 715434 722580 726089
15914 726089 772112 709389 703609 756809 685683 703972 688828 732587 724097 708413 743951 748116
15902 748116 731341 752054 774139 725287 705539 718107 759020 752423 733470 790302 791825 744941
15890 744941 768965 759835 754407 760593 726750 738038 772984 749982 717040 735126 735694 782201
15878 782201 842374 828653 723771 716121 736515 723246 723566 724257 757736 738206 757440 739841
15866 739841 795301 775350 753588 839041 805686 732296 789041 756883 800267 734179 699451
15855 699451 762652 759598 772543 760392 719549 760385 863517 852631 783228 779254 788726 790266
15843 790266 754342 747201 755760 733450 832031 731467 754837 742002 760862 786800 820484 773297
15831 773297 745265 775716 728513 703435 739848 768307 761634 708257 677862 717230 750538 770256
15819 770256 804810 798359 777410 749164 760566 796736 774918 756396 748076 730359 747924 777522
15807 777522 759555 783124 798873 748287 751067 758327 809870 814030 804915 761602 772707 792915
15795 792915 780282 823308 790229 784478 754084 758434 784929 790164 798985 759222 741355 773510
15783 773510 769972 781415 754523 831433 829392 787295 809495 782803 840259 799715 799606 809267
15771 809267 806188 775289 767755 787477 774120 765067 717651 704006 739474 827250 815999 789178
15759 789178 733377 753651 788078 802440 774095 768748 789218 803903 776930 776096 802780 740622
15747 740622 776343 822804 852624 810974 810091 848828 790684 738256 769066 791626 821404 826155
15735 826155 789384 827809 820543 795782 806377 787641 790066 845751 813088 785689 760353 746682
15723 746682 680910 723103 758602 760562 785061 752008 778245 799571 778528 791531 717316 763716
15711 763716 784958 790667 787713 790735 808946 827990 811306 819562 806989 816329 837729 809509
15699 809509 795985 792771 776233 790809 791200 809243 850338 842644 874247 805629 796912 794271 771465
15686 771465 800011 835472 838625 802940 841219 841278 830510 840505 830834 776842 788908 821658 759356
15673 759356 750018 747078 759514 806382 788617 770547 786126 754326 797075 776835 760087 785213
15661 785213 830792 768927 759517 782268 819114 781553 756101 788914 813786 777794 798429 830244
15649 830244 817608 815784 804358 780877 741807 750060 774540 794960 764391 730461 746530 707536
15637 707536 784993 791760 826399 822442 831139 828660 735910 744718 753443 753661 795563 806956 771299
15624 771299 775708 764405 704246 814892 811650 783986 797479 751811 782150 769691 762051 784598
15612 784598 787352 778136 767539 739751 796096 832592 836160 795135 737945 735857 793194 837161
15600 837161 787844 759066 741692 745093 745045 705383 710451 808829 807024 751170 797725 795102 767820
15587 767820 706862 727535 734361 734359 797684 796036 785220 805221 718358 781165 833227 848244 809162
15574 809162 771653 831043 859649 783716 754815 761981 807576 767284 754169 764625 761052 777480
15562 777480 820779 845823 845396 811717 804218 808458 820449 788945 730115 764095 772008 763302 772701
15549 772701 824339 826595 855665 879530 906000 871847 819624 829702 880339 823598 878216 903215
15537 903215 843717 774346 749242 791194 848800 826701 827783 789396 731858 779783 840389 843888
15525 843888 767542 793683 800826 777018 757454 760202 793544 806887 723491 747384 735795 794729
15513 794729 819303 820261 784115 832037 834833 802932 798806 810098 844072 893672 841319 789392
15501 789392 863377 843458 844126 839022 819663 782235 762301 767560 739381 749879 762670 750622
15489 750622 788213 803150 738169 737740 800360 770195 756281 759084 816086 830643 821672 818805
15477 818805 826896 804454 833071 817485 817065 829952 821299 796527 778816 788203 771426 824517
15465 824517 784177 740828 840344 831505 801582 816290 776948 776488 794596 817073 840852 807353
15453 807353 821853 824753 784806 727447 734777 798422 831341 817877 831233 773597 812550 805848
15441 805848 798380 798512 832633 833182 784999 785406 769256 796717 784787 743396 730453 768026 828949
15428 828949 811218 816723 790423 722100 782970 812260 812197 794351 743648 748214 751953 771910 784817
15415 784817 795475 750243 727180 803027 802920 775436 863139 877647 847192 866286 815835 799682
15403 799682 808998 770489 815127 800172 723142 784262 791338 736950 804680 855375 755885 768682
15391 768682 801143 807363 768246 783371 774926 701120 737210 788651 836949 828895 768926 799353
15379 799353 790709 792968 739087 763643 810753 812978 817880 837078 779976 742004 799119 802108
15367 802108 775174 779578 754209 778369 841653 834531 798980 811326 835638 863741 871699 854752
15355 854752 820765 789733 785921 772631 776317 769339 849043 844516 817673 848875 838206 830383
15343 830383 857626 868261 819801 808837 745954 750695 714844 780199 786190 827856 836347 801571
15331 801571 817692 851463 847807 792255 851628 859169 828264 771989 832003 873591 892043 832794
15319 832794 807466 780643 795536 732245 742162 787370 777633 820718 858369 835169 840085 852944
15307 852944 830586 866674 857741 795615 811143 770238 753163 769474 723278 743612 796017 830537
15295 830537 838428 863307 839704 789767 764465 808271 790273 826743 829414 767111 777413 804132
15283 804132 856750 831758 840237 808454 803488 838935 857553 827295 802075 818180 858686 877547
15271 877547 823482 785665 821197 845840 838568 851178 779766 760302 771499 808255 863835 886247
15259 886247 818323 780627 739830 737038 788806 741001 790454 770650 774713 791205 774671 791405
15247 791405 788589 809484 804260 825225 857462 858917 830275 827939 828649 800052 815712 806367 754460
15234 754460 731699 757741 789876 804246 806330 747614 774498 775030 814842 827029 835571 837156
15222 837156 782596 818845 769069 780777 783680 798006 775775 824641 873291 818739 794797 840910
15210 840910 842365 831309 823541 788784 765533 802980 822119 799406 776357 744394 803118 859102
15198 859102 845368 773130 781458 763832 790911 762277 733396 782545 828008 823503 848245 767366
15186 767366 788514 791412 812852 869756 868435 837464 888327 885536 879524 861643 856234 862805 824298
15173 824298 803804 784161 804576 778948 831956 835275 806582 815279 848753 837707 874758 792861
15161 792861 754278 805298 790587 819502 837608 800101 811465 836271 853588 750005 730159
15150 730159 773593 816090 830603 826187 837441 843502 823267 759426 763369 830095 807061 856734
15138 856734 850529 847118 859252 864408 868347 866239 822808 797499 804690 798237 810326 806018 823559
15125 823559 819913 852047 822256 784295 748968 725805 752863 820760 823915 812183 838636 856191
15113 856191 838475 815100 802169 818587 832387 788461 792871 849403 792224 789874 867019 854880
15101 854880 844998 863071 821672 852347 851686 824506 761349 807320 850421 851348 861260 866660 830872
15088 830872 850004 858109 863661 839190 782283 778947 782244 799126 794889 821011 780073 819071
15076 819071 830368 807331 785638 801360 790440 831176 875635 794992 837120 861709 874716
15065 874716 934222 916283 860049 791399 816128 826294 882551 879269 849903 850246 807684 797419
15053 797419 762917 767964 814928 814998 844853 834975 865706 915556 863885 806776 844097 847584 828779
15040 828779 834170 806098 817186 858225 881390 850221 799776 772070 778470 781206 716002 795658
15028 795658 837474 798100 878168 863924 840670 823053 791729 808047 852945 855247 837005 808912
15016 808912 828929 824842 830303 844996 817582 855326 875374 843970 834506 848456 870458 904733
15004 904733 906045 847510 848099 829715 825323 800641 831070 854985 798007 817128 798999 815026
14992 815026 838039 862554 914679 849145 849009 797171 812878 814829 850918 885535 846901 812718
14980 812718 809558 830194 887110 903737 839731 811937 847983 922839 903129 868127 849819 893892
14968 893892 908149 882053 892618 905694 924749 865889 822508 846811 833072 829295 798461 830119
14956 830119 819501 803121 838174 864095 892287 881394 838988 875469 839004 830601 822962 837775
14944 837775 791646 778110 760830 764423 802503 872499 919086 903510 888310 858956 885230 898653
14932 898653 889990 901713 856560 783199 808025 808690 856856 879545 843913 835782 788138 815882
14920 815882 827601 832062 820747 805483 866815 894399 882898 840620 799223 774995 792104 788936
14908 788936 798424 816453 781905 811842 814930 754985 798800 838347 864088 778232 787835 825436
14896 825436 835351 807004 794838 837673 871801 866053 898480 881162 897842 897739 828714 855388
14884 855388 888727 860328 814741 836383 827463 856276 827328 787219 823696 846974 819568 858241
14872 858241 851914 844955 845764 853909 776361 782464 823994 863763 883707 835098 802495 845631 850193
14859 850193 839501 880163 905138 906335 894987 851330 853196 884797 868351 837183 833798 798075
14847 798075 758159 839414 898822 812808 739617 772485 761278 783889 864817 926436 873849
14836 873849 915661 873857 854575 813549 801569 771562 781989 828125 831039 853378 826126 807611
14824 807611 808437 816343 792828 812760 835216 807938 809858 870060 827565 775330 841319 851757
14812 851757 868357 864091 869071 930602 934588 876776 857582 831676 751133 772132 801104 813880
14800 813880 851859 880397 863189 817461 830476 855807 850470 893550 897459 838861 771978 798995
14788 798995 812124 822469 852122 838946 815658 804116 862744 855795 871575 831229 838440 845754
14776 845754 830186 844180 837112 807692 851340 813297 778277 809829 782869 787162 822185 828625
14764 828625 824182 825776 833927 865288 921580 903642 842987 862409 914039 902255 843498 805541
14752 805541 817927 843500 865318 884159 897979 943067 846547 844914 879091 801560 783774 827000
14740 827000 845101 892188 864467 828231 810453 884504 903365 918518 843820 858134 835471
14729 835471 867324 910772 915835 883829 792570 879601 863795 831311 840286 853192 885025 896632
14717 896632 831995 857982 855509 866784 861875 825577 866197 836003 795600 859950 886894 843647
14705 843647 826102 882672 907511 871832 865662 844494 804082 852212 864801 826598 890283 836542
14693 836542 872896 852663 905727 853139 814504 866195 813982 795642 835134 844973 840985 883060
14681 883060 829636 829219 882839 870559 899991 930158 895795 897731 879692 822218 827252 837829
14669 837829 804410 861917 861787 807069 794200 807466 803080 781973 785613 798500 804353 863551
14657 863551 884187 879232 862716 908966 902551 875895 827148 895541 894070 923475 861824 884225
14645 884225 911823 859284 887300 881795 814126 777471 784202 824937 863522 854080 918575 877303
14633 877303 835565 804583 864255 886281 866074 841645 836251 850387 821173 816686 802680 811322
14621 811322 906870 895902 807953 803923 842305 863595 869727 845432 826291 803452 790757 866724
14609 866724 899873 872854 870647 901304 896765 876725 842277 835395 810158 839106 870865 859497
14597 859497 834462 796841 850099 810566 833492 873212 839769 815514 821739 830343 801605 791340
14585 791340 847191 886328 857907 893813 854959 843064 845990 821987 860826 923848 879658 826117
14573 826117 829546 899995 901263 847185 876867 932801 931535 920766 890989 885373 817599 845716
14561 845716 952212 914133 875641 845510 878463 882053 848060 837015 894938 888446 827099 829919
14549 829919 831106 818739 802775 817826 865888 882383 890862 857257 868926 862329 867114 845849
14537 845849 836833 842619 869218 892066 925543 896666 875089 875902 892799 902818 893639 873416
14525 873416 843351 843266 871078 880338 813862 815768 904780 907489 964303 936199 845211 922586 1000518
14512 1000518 948236 951371 936433 855722 906359 886460 864873 954355 892693 805685 870910
14501 870910 892756 825552 809346 873459 879807 778845 807694 853581 827240 808226 848043
14490 848043 883870 828639 786573 855596 864916 822302 876489 886162 874579 888211 853398 851503
14478 851503 843390 804053 859651 852910 827484 783794 792463 798813 851594 777773 782510 800239
14466 800239 855398 875318 858076 870806 873679 844806 854471 840708 871937 905641 899002 929341
14454 929341 861175 862226 879391 841018 780159 865522 861191 868004 831622 833739 885857 847453
14442 847453 858704 844135 817439 873487 928281 909621 880027 817035 828249 841771 819301
14431 819301 836671 901977 894114 872929 867551 861715 902300 901070 841723 835806 864395 892489
14419 892489 928027 900597 872911 878224 817154 807201 895452 898141 917358 925289 930489 907544
14407 907544 852737 901132 903088 850907 861729 850005 892231 891883 821177 882861 849043 862632
14395 862632 876970 869426 881653 897033 919585 874314 913969 910191 892575 867616 890800 861195
14383 861195 924133 877547 882332 886260 841411 850787 808665 854937 869869 828498 851670 897953
14371 897953 895735 914463 891433 917760 913267 858394 840697 843473 902292 935950 984921 914436
14359 914436 865516 927380 886579 888455 908534 921240 931564 902357 945063 934181 915012 920801
14347 920801 911290 884918 864585 872300 824527 827739 915201 973250 961040 969171 927295 865684
14335 865684 839251 875297 849975 920717 946647 872097 855145 898192 906764 890469 873612 874210
14323 874210 862526 912288 889246 879233 922799 913433 865741 828121 840421 837285 882510 877143
14311 877143 905301 912441 913536 942768 924324 867025 896053 959931 915844 922058 895652 877585
14299 877585 886220 834792 898894 938371 883154 837371 878284 910266 921738 916651 859619 846751
14287 846751 853816 833537 852640 868195 857355 865021 909444 896788 898934 909844 933632 976647
14275 976647 898908 868541 891400 894291 858715 892584 896888 904749 897856 889471 904838 905888 879643
14262 879643 906797 893400 915728 950433 897339 876005 910457 950795 931458 917740 929273
14251 929273 932950 892984 862269 906703 972908 975811 906782 870295 884817 835192 824414 819985
14239 819985 807120 814635 865147 844897 857564 880971 889301 878075 925144 978148 929897 898141
14227 898141 886380 921295 867890 894167 909370 903756 921390 883762 934894 910537 843923 821215
14215 821215 879398 826755 824551 842424 859578 877937 886812 863398 876483 892499 906930 870507
14203 870507 922074 881588 858747 870040 877853 915869 891597 894972 884971 871517 891953 890658
14191 890658 901826 931983 918773 884015 886396 911282 939208 931331 856077 849287 869212 925867
14179 925867 868480 811252 874075 881406 869354 860320 834838 857115 919733 880655 848697 849176
14167 849176 847086 875303 868454 850811 929439 997214 884018 850184 845459 902960 912471 877482
14155 877482 878712 888895 889491 907641 832174 858507 897959 860810 887771 883988 878840 925157
14143 925157 939589 974001 956085 906837 921467 915241 924776 963706 949095 976291 922214 939337
14131 939337 915966 976464 925914 857951 904848 891800 864674 869955 884316 939863 1008887 959239
14119 959239 846353 883457 903437 876569 934074 925995 960614 921761 900717 898401 883454 918593
14107 918593 909904 922399 908245 915886 920408 923524 976879 923298 941827 956699 896442 940872
14095 940872 893925 875234 885175 893914 938324 951728 947033 970998 953022 967773 961879 922409
14083 922409 958329 947390 911290 916985 900277 918615 876784 935870 969076 892923 923008 923185
14071 923185 902594 895135 945097 920117 898017 888443 916931 905096 918434 948120 952265 875461
14059 875461 888258 848670 895749 841542 868678 875484 896669 927854 890058 799677 813757 853313
14047 853313 867535 845837 832015 807034 843795 883064 857272 933269 940679 859686 951350 981624
14035 981624 988782 979470 928957 891277 865454 886942 946570 952424 922716 960667 922667 998966
14023 998966 965600 942997 918266 898341 910564 939152 937969 938051 955983 979061 1007665 1030862
14011 1030862 955836 966774 964531 972856 948205 960271 927347 938860 949353 949947 998573 976632
13999 976632 970632 875356 918123 902396 906674 931471 928233 935980 923401 856045 893263 967697
13987 967697 926323 907428 908617 922427 903265 877321 932471 894625 924567 983269 980960 928421
13975 928421 894241 935111 929895 951684 964450 1021815 993014 992292 967557 961319 956021 937123
13963 937123 885305 913077 941992 944748 858408 910064 902806 882161 920757 908407 914524 888760
13951 888760 958390 934151 930311 888107 901078 912530 915650 850537 840152 861715 962883 952463
13939 952463 927204 997431 961871 947419 920529 927202 946678 1020209 1020602 983653 936543 909489
$$ [...]
##END NTUPLES=NMR SPECTRUM
##END=
