##TITLE=1H_CG-1151-A5
 CDCl3, 8 sc, 
 26.08.2021
##JCAMPDX= 6.0         $$ Bruker NMR JCAMP-DX V2.0
##DATA TYPE= NMR SPECTRUM
##DATA CLASS= NTUPLES
##ORIGIN= UXNMR, Bruker Analytische Messtechnik GmbH
##OWNER= root
$$ XWIN-NMR		Version 3.5
$$ Thu Aug 26 10:56:43 2021 Russian Standard Time (UT+4h)  she@DPX200
##.OBSERVE FREQUENCY= 200.131506
##.OBSERVE NUCLEUS= ^1H
##.ACQUISITION MODE= SIMULTANEOUS
##.ACQUISITION SCHEME= undefined
##.AVERAGES= 8
##.DIGITISER RES= 18
##SPECTROMETER/DATA SYSTEM= spect
##.PULSE SEQUENCE= zg30
##.SOLVENT NAME= CDCl3
##.SHIFT REFERENCE= (INTERNAL, CDCl3, 0, 17.4959)
##AUDIT TRAIL= $$ (NUMBER, WHEN, WHO, WHERE, WHAT)
$$ ##TITLE= Audit trail, XWIN-NMR		Version 3.5
$$ ##JCAMPDX= 5.01
$$ ##ORIGIN= Bruker BioSpin GmbH
$$ ##OWNER= she
$$ F:/spectra/data/she/nmr/H-F/1/pdata/1/auditp.txt
$$ ##AUDIT TRAIL=  $$ (NUMBER, WHEN, WHO, WHERE, WHAT)
(   1,<2021-08-26 10:55:08.37 +0400>,<she>,<DPX200>,
      <created by zg, POWCHK disabled, PULCHK disabled
       configuration hash MD5:
       00 E9 B6 7A A2 85 ED C7 34 08 36 98 17 FE 4E 26
       data hash MD5: 16K
       11 A7 4C 79 B7 50 5C D0 3C 10 80 59 5B 0C D4 75>)
(   2,<2021-08-26 10:55:11.00 +0400>,<she>,<DPX200>,
      <Start of raw data processing
       efp BC_mod = 2 LB = 0.24 FT_mod = 6 PKNL = 1 PHC0 = -13370.33 PHC1 = 31.00099 SI = 16K 
       data hash MD5: 16K
       B4 93 19 A2 02 D7 5C A6 4F 73 07 80 88 4A 5E C6>)
(   3,<2021-08-26 10:55:29.14 +0400>,<she>,<DPX200>,
      <pk PHC0 = -6.647995 PHC1 = 5.8 
       data hash MD5: 16K
       B8 83 36 04 9C 69 30 3C B6 E5 DD D7 5F 4B 87 C1>)
(   4,<2021-08-26 10:55:32.70 +0400>,<she>,<DPX200>,
      <abs ABSG = 5 
       data hash MD5: 16K
       46 57 EF 53 5D 53 5E C1 B9 1C 99 E0 05 B3 A7 6E>)
$$ ##END=
$$ 
$$ hash MD5
$$ 3F 40 38 74 FD 43 CC 20 CB C6 58 EA 80 FE A4 6E
##$RELAX= 
##$RELAX= 
##$RELAX= 
##$RELAX= 
##$RELAX= 
##$RELAX= 
$$ Bruker specific parameters
$$ --------------------------
##$DU= <F:/spectra>
##$EXPNO= 1
##$NAME= <H-F>
##$PROCNO= 1
##$TYPE= <nmr>
##$USER= <she>
##$AMP= (0..31)
100 100 100 100 100 100 100 100 100 100 100 100 100 100 100 100 100 100 
100 100 100 100 100 100 100 100 100 100 100 100 100 100 
##$AQSEQ= 0
##$AQ_mod= 1
##$AUNM= <au_zg>
##$AUTOPOS= <>
##$BF1= 200.13
##$BF2= 200.13
##$BF3= 200.13
##$BF4= 200.13
##$BF5= 200.13
##$BF6= 200.13
##$BF7= 200.13
##$BF8= 200.13
##$BYTORDA= 1
##$CFDGTYP= 0
##$CFRGTYP= 5
##$CHEMSTR= <none>
##$CNST= (0..31)
1 1 145 1 1 1 1 1 1 1 1 1 1 1 1 1 1 1 1 1 1 1 1 1 1 1 1 1 1 1 1 1 
##$CPDPRG= <>
##$CPDPRG1= <>
##$CPDPRG2= <>
##$CPDPRG3= <>
##$CPDPRG4= <mlev>
##$CPDPRG5= <mlev>
##$CPDPRG6= <mlev>
##$CPDPRG7= <mlev>
##$CPDPRG8= <mlev>
##$CPDPRGB= <>
##$CPDPRGT= <>
##$D= (0..31)
0 1.2 0 0 0 0 0 0 0 0.06 0 0.03 0 0 0 0 0.0002 0 0 0 0 0 0 0 0 0 0 0 0 
0 0 0 
##$DATE= 1629960907
##$DBL= (0..7)
120 120 120 120 120 120 120 120 
##$DBP= (0..7)
150 150 150 150 150 150 150 150 
##$DBP07= 0
##$DBPNAM0= <>
##$DBPNAM1= <>
##$DBPNAM2= <>
##$DBPNAM3= <>
##$DBPNAM4= <>
$$ [...]
##$SUBNAM3= <"">
##$SUBNAM4= <"">
##$SUBNAM5= <"">
##$SUBNAM6= <"">
##$SUBNAM7= <"">
##$SUBNAM8= <"">
##$SUBNAM9= <"">
##$SW= 20.0188882624521
##$SWIBOX= (0..15)
0 0 2 0 0 0 0 0 0 0 0 0 0 0 0 0 
##$SW_h= 4006.41025641026
##$TD= 16384
##$TD0= 1
##$TE= 0
##$TE2= 300
##$TE3= 300
##$TEG= 300
##$TL= (0..7)
0 120 120 120 120 120 120 120 
##$TP= (0..7)
150 150 150 150 150 150 150 150 
##$TP07= 0
##$TPNAME0= <>
##$TPNAME1= <>
##$TPNAME2= <>
##$TPNAME3= <>
##$TPNAME4= <>
##$TPNAME5= <>
##$TPNAME6= <>
##$TPNAME7= <>
##$TPOAL= (0..7)
0.5 0.5 0.5 0.5 0.5 0.5 0.5 0.5 
##$TPOFFS= (0..7)
0 0 0 0 0 0 0 0 
##$TUNHIN= 0
##$TUNHOUT= 0
##$TUNXOUT= 0
##$USERA1= <user>
##$USERA2= <user>
##$USERA3= <user>
##$USERA4= <user>
##$USERA5= <user>
##$V9= 5
##$VALIST= <valist>
##$VCLIST= <CCCCCCCCCCCCCCC>
##$VD= 0
##$VDLIST= <DDDDDDDDDDDDDDD>
##$VPLIST= <PPPPPPPPPPPPPPP>
##$VTLIST= <TTTTTTTTTTTTTTT>
##$WBST= 1024
##$WBSW= 4
##$XGAIN= (0..3)
0 0 0 0 
##$XL= 0
##$YL= 0
##$YMAX_a= 47201
##$YMIN_a= -50255
##$ZGOPTNS= <>
##$ZL1= 120
##$ZL2= 120
##$ZL3= 120
##$ZL4= 120
##$ABSF1= 17.49833
##$ABSF2= -2.520708
##$ABSG= 5
##$ABSL= 3
##$ALPHA= 0
##$AQORDER= 0
##$ASSFAC= 0
##$ASSFACI= 0
##$ASSFACX= 0
##$ASSWID= 0
##$AUNMP= <proc_1d>
##$AZFE= 0.1
##$AZFW= 0.1
##$BCFW= 0
##$BC_mod= 2
##$BYTORDP= 0
##$COROFFS= 0
##$CY= -3
##$DATMOD= 1
##$DC= 0
##$DFILT= <>
##$DTYPP= 0
##$F1P= 0
##$F2P= 0
##$FCOR= 1
##$FTSIZE= 16384
##$FT_mod= 6
##$GAMMA= 0
##$GB= 0
##$INTBC= 1
##$INTSCL= 1.334414e-10
##$ISEN= 128
##$LB= 0.24
##$LEV0= 0
##$LPBIN= 0
##$MAXI= 10000
##$MC2= 0
##$MEAN= 0
##$ME_mod= 0
##$MI= 1.114404
##$NCOEF= 0
##$NC_proc= -8
##$NLEV= 6
##$NOISF1= 3.799351
##$NOISF2= 2.8
##$NSP= 0
##$NTH_PI= 0
##$NZP= 0
##$OFFSET= 17.49589
##$PC= 1
##$PHC0= -13376.98
##$PHC1= 36.80099
##$PH_mod= 1
##$PKNL= yes
##$PPARMOD= 0
##$PSCAL= 0
##$PSIGN= 0
##$REVERSE= no
##$SF= 200.130007752593
##$SI= 16384
##$SIGF1= 3
##$SIGF2= 2
##$SINO= 5.538805
##$SIOLD= 16384
##$SREGLST= <1H.CDCl3>
##$SSB= 0
##$STSI= 16384
##$STSR= 0
##$SW_p= 4006.41025641026
##$SYMM= 0
##$S_DEV= 0
##$TDeff= 16384
##$TDoff= 0
##$TI= <>
##$TILT= no
##$TM1= 0
##$TM2= 0
##$TOPLEV= 0
##$USERP1= <user>
##$USERP2= <user>
##$USERP3= <user>
##$USERP4= <user>
##$USERP5= <user>
##$WDW= 1
##$XDIM= 16384
##$YMAX_p= 271914412
##$YMIN_p= -1169961
$$ End of Bruker specific parameters
$$ ---------------------------------
##NTUPLES= NMR SPECTRUM
##VAR_NAME=  FREQUENCY,     SPECTRUM/REAL,   SPECTRUM/IMAG
##SYMBOL=    X,             R,               I
##VAR_TYPE=  INDEPENDENT,   DEPENDENT,       DEPENDENT
##VAR_FORM=  AFFN,          ASDF,            ASDF
##VAR_DIM=   16384,         16384,           16384
##UNITS=     HZ,            ARBITRARY UNITS, ARBITRARY UNITS
##FACTOR=    0.24454680195387, 1,            1
##FIRST=     3501.45253403405, 0,            0
##LAST=      -504.95772237621, 0,            0
##MIN=       -504.95772237621, -1169961,     0
##MAX=       3501.45253403405, 271914412,    0
$$ Real data points
##PAGE= N=1
##DATA TABLE= (X++(R..R)), XYDATA
$$ [...]
5026A337230m9983r499k48303M19463P8460o3803l21450K6147j79589J32374J39995
5015A261042l41247J26929n43421j72321M6287K22426o5337r697N69200J68143
5005A262004N8683j75836L27242m73008p3503J10513j12497M25314K64803m40882
4995A172833J68535J51077l50298P20l62254K4941K76371j15413L57640l66626
4985I57526N14107k95021q5950j52967q4410o4500L8169J1369J57984J58129o3334
4974A091102J34318l22245L05023M26806K17983L4646q44457J89192J23122k37538
4964A117952o6906J86435K98236j2943R4706k6806k12067q4411j95229J24465
4954A223432J93720K72798o7166j36114K21219k13821M86832O0742l11531j10650
$$ plain form
5026 1337230 1287247 1277748 1029445 1448908 1527368 1463565 1142115 1168262 988673 1121047 1261042
5015 1261042 919795 1046724 503303 330982 377269 599695 534358 524661 1093861 1262004
5005 1262004 1320687 1144851 1472093 999085 925582 1036095 923598 1348912 1613715 1172833
4995 1172833 1341368 1492445 1142147 1142867 780613 805554 1081925 966512 1324152 957526
4985 957526 1471633 1176612 1090662 937695 853285 788785 826954 838323 996307 1154436 1091102
4974 1091102 1225420 903175 1208198 1635004 1852987 1887633 1043176 1232368 1355490 1117952
4964 1117952 1051046 1237481 1535717 1522774 1617480 1590674 1378607 1294196 1098967 1223432
4954 1223432 1417152 1689950 1622784 1486670 1707889 1494068 1980900 2041642 1730111 1619461
4944A619461n6915k43685N51104L5092p1956o181k60932k55324K70659o19745
4934I61578K26959K63451M82530k12388q3741K6751M2790J10693J69947J05391
4924B093961l14293k52684L63148K82722l77275J33806L881O70081j98045N2659
4914B457961L63367K37747Q4482K36574J29520Q0311L34060m8235L83281j75011
4904D084057l9188P2973J11827k12821l562K42996o33124m90406O8552j12503
4894C088801O0112j70996n55349K32006k46491k34012k11811j09107K60319Q0756
4884B194228n33040k6015P8663l79383k2239N78088L54603p47279J97919K63358
4874A958903l67095L11277m73394j86125P078P6715k08308r6195M3043P6881R2136
$$ plain form
4944 1619461 1562546 1318861 1869965 1905057 1833101 1826920 1565988 1310664 1581323 961578
4934 961578 1188537 1451988 1934518 1722130 1638389 1665140 1707930 1818623 1988570 2093961
4924 2093961 1779668 1526984 1890132 2172854 1795579 1929385 1933266 2603347 2405302 2457961
4914 2457961 2821328 3059075 3143557 3380131 3509651 3589962 3924022 3875787 4259068 4084057
4904 4084057 4044869 4117842 4229669 4016848 4013286 4256282 3623158 3132752 3201304 3088801
4894 3088801 3148913 2977917 2422568 2654574 2408083 2174071 1962260 1853153 2113472 2194228
4884 2194228 1661188 1635173 1713836 1334453 1312214 1890302 2244905 1497626 1695545 1958903
4874 1958903 1591808 1903085 1429691 1243566 1250644 1327359 1119051 1022856 1065899 1142780 1234916
4863A234916l49602J04018P57130n18690k54987P7537K31272j43464k51286J71992
4853A058836j25366L91048J51501m83412m68888K90863J46709r084m12193N77357
4843A117371k3421p6180J93087o8446l14094O30707l78895J49575N53724k56821
4833A526607K78702k11388l28166K36785m18253l40829K90220k27426r2631K67542
4823I81163O2301k6930k4340O04639k1857m94007m0164m54865K99382J1627k6175
4812H70774K40631k37112k03103j8910M01291m6500l87291j17714q4312N77438
4802I95192K57110n20148j01862P05249l55448J06687K931K61355l3721l75972
4792I41373l25235k34691L7991J39094L45897J29982J26207l63838O4796M19533
$$ plain form
4863 1234916 885314 989332 1746462 1227772 972785 1050322 1281594 1138130 886844 1058836
4853 1058836 933470 1324518 1476019 992607 523719 814582 961291 952207 540014 1117371
4843 1117371 1093950 1017770 1210857 1142411 828317 1459024 1080129 1229704 1783428 1526607
4833 1526607 1805309 1593921 1265755 1502540 1084287 743458 1033678 806252 713621 981163
4823 981163 1043464 1016534 992194 1596833 1574976 1080969 1040805 585940 885322 896949 870774
4812 870774 1111405 874293 671190 652280 1053571 1007071 619780 502066 417754 995192
4802 995192 1252302 732154 630292 1335541 980093 1086780 1089711 1351066 1317345 941373
4792 941373 616138 381447 419438 558532 904429 1034411 1160618 796780 861576 1281109
4782A281109j14991m63612k43110M25115J72521k58642k4080R027j85886K16618
4772H14069k71841l8444K45079l14325J82041J53639k9878k10852J26956k75167
4762C81277M7705k51419N5941K15045R9149N54692J59896m54956K3572J57766
4752I88668l65918j40286Q2499J60819k34780l710J63000M17813j42964j8817
4742I06324j87835j92539O349L19263P95841p12788m98189j73306K78143J80058
4732G21321R1728L00834k20073j69105N2932J88026o1939k53798j11888O84613
4722A222651k31967l91243j3889J50959l5801K98839m05248R9719k23718j44629
4712C25673P62378J8761O2229p09484j8716O30561K7740m1336l48813j29694k3810
$$ plain form
4782 1281109 1166118 702506 459396 884511 1057032 798390 774310 783337 597451 814069
4772 814069 542228 503784 748863 434538 616579 770218 740340 529488 656444 381277
4762 381277 428982 177563 233504 448549 547698 1102390 1262286 807330 830902 988668
4752 988668 622750 482464 564963 725782 491002 487292 650292 1068105 925141 906324
4742 906324 718489 525950 532299 851562 1647403 934615 436426 263120 541263 721321
4732 721321 813049 1113883 893810 724705 777637 965663 903724 649926 538038 1222651
4722 1222651 990684 599441 585552 736511 700710 999549 594301 694020 470302 325673
4712 325673 1088051 1106812 1169041 459557 440841 1071402 1099142 1057806 708993 579299 555489
4701E55489P988K0440J88194j21160j44188O6373m99346N55501R3990L3268k20030
4690E36519j635K03243K84844q5109P5100l03805m44708L05812n5475K49723j77546
4679E86963n3759j15703k2786m2396k0254J19694N20612l87671m6773M01569M03839
4668A343335m64526j90102q76j21753j81444k0549J48669J49447K39285K5729
4658I27215j64556N7092L25947N6262k18117m61888q1894L92460l12056j41394
4648C79071L13459K98885J56900l04584L4862l28138J39952l33148j98573J94590
4638C53276L25550j34553L11761K4275p2233M80219p7378l64165P1881Q0670L69037
4627A368340l76490l16136m04511K18868J01130J76149k29218J37149k93317k3694
$$ plain form
4701 555489 563477 583917 772111 650951 506763 573136 73790 629291 723281 756549 536519
4690 536519 534884 738127 1022971 937862 1012962 709157 264449 570261 514786 764509 586963
4679 586963 533204 417501 394715 352319 332065 451759 972371 584700 537927 939496 1343335
4668 1343335 878809 688707 687831 566078 384634 364085 512754 662201 901486 927215
4658 927215 762659 819751 1145698 1201960 983843 521955 440061 832521 520465 379071
4648 379071 692530 991415 1148315 843731 878593 550455 690407 357259 158686 353276
4638 353276 678826 544273 856034 880309 808076 1288295 1210917 846752 918633 999303 1368340
4627 1368340 991850 675714 271203 490071 591201 767350 538132 675281 381964 358270
4617C58270L62662l7116j96160J88952J24984k28619o5464P7459O27314q5676
4607A126606k70496J89621L95302j80199k59849j4212k96661J25567M57220j63081
4597A109818l78263L81286j11187l05569N1793J40665M38230n49337k50920O0069
4587E86585J13459K01964j81069k64611K67240K66008J03797j33226m85788J70041
4577F44400J54039J60534n23927L21653N08248j004845j04436M55139l6273j63643
4567D10889J12347M65635K61888j33463K90130L6830K94784o25387l46937q1792
4557F84924j13442j57061L07300k96268P49186l4930j57074p8897P4452k13105
4547G65085M2762O95963j9852k71781m39823j42042k65506N59706K94642L92674
$$ plain form
4617 358270 720932 683816 487656 676608 801592 572973 507509 584968 1212282 1126606
4607 1126606 856110 1045731 1441033 1260834 1000985 986773 690112 815679 1272899 1109818
4597 1109818 731555 1112841 1001654 696085 747878 888543 1326773 777436 526516 586585
4587 586585 700044 902008 720939 456328 723568 989576 1093373 960147 474359 644400
4577 644400 798439 958973 435046 756699 1264947 260102 155666 610805 574532 410889
4567 410889 523236 988871 1250759 1117296 1407426 1444256 1739040 1113653 766716 684924
4557 684924 571482 414421 721721 425453 1174639 1139709 982635 903738 978190 765085
4547 765085 807847 1503810 1483958 1212177 772354 630312 364806 924512 1219154 1611828
4537A611828p1090n02942M11039k24872l14363N49491k75585k70900M68217k57707
4527A123116m55389K24322R8479l6462J35542m41403R4952K23860m19142J35081
4517F82956Q9614r4699K6758J717k95360M96310M79299l70015N784L57139m24014
4506I55489k70657m739O12403K11896k28500j10051Q7922N36881p76002o1823
4496I52819J77895j4832o6060k31477L86829K40572j76662J5675k11425K97950
4486A371284j53529j19279R6518L81937o6615k97611O5947n27569m2867K12459
4476I20675L29282L12207K60366n46767k3570L4447L56470j12579K26530k77756
4466A479305j77131O07461K71130l14522l66780P0715J88653r6954K03040K92525
$$ plain form
4537 1611828 1540738 1037796 1448835 1223963 909600 1459091 1183506 912606 1380823 1123116
4527 1123116 667727 892049 990528 954066 1089608 648205 743157 967017 547875 682956
4517 682956 772570 677871 704629 706346 410986 907296 1386595 1016580 1022364 1379503 955489
4506 955489 684832 680093 1292496 1504392 1275892 1165841 1253763 1790644 1014642 952819
4496 952819 1130714 1115882 1049822 818345 1205174 1445746 1269084 1284759 1073334 1371284
4486 1371284 1217755 1098476 1194994 1576931 1510316 1212705 1278652 751083 708216 920675
4476 920675 1249957 1562164 1822530 1275763 1252193 1286640 1643110 1530531 1757061 1479305
4466 1479305 1302174 1909635 2180765 1866243 1499463 1570178 1758831 1661877 1864917 2157442
4456B157442q2095l87634L06M26751k17262o8273J7239L51351J76219j32870J81946
4445B423120L6587l6313k40496K26696J15362m52663L34596j29998j95184j8598
4435B063109l15516Q2116O7329l56616q660o4741k48632J50796K31049M12000
4425B012234k5204j70156J9673o7608j17135J29974N8879K20757r8627l8577J723
4414A925933k15422M45589N7276k52238j16551O3813M05598j7251k09188J24102
4404B211661n1429m75761O68904p2092o3906l80108q8688K67197J4176J34735
4394B164689P9590J81275m70658k02817L16388K24495o9325l1633J51361K83807
4384B627172J27985J26685k73150k79945N8053O9251K28932j94760k06881P406
$$ plain form
4456 2157442 2075347 1687713 1688019 2114770 1897508 1829235 1846474 2197825 2374044 2241174 2423120
4445 2423120 2459707 2423394 2182898 2409594 2524956 2072293 2406889 2276891 2081707 2063109
4435 2063109 1747593 1829709 1897038 1540422 1531762 1467021 1218389 1369185 1600234 2012234
4425 2012234 1987030 1816874 1836547 1768939 1651804 1781778 1840657 2061414 1962787 1924210 1925933
4414 1925933 1710511 2156100 2213376 1961138 1844587 1908400 2313998 2296747 2087559 2211661
4404 2211661 2160232 1684471 2353375 2281283 2217377 1837269 1748581 2015778 2029954 2164689
4394 2164689 2244279 2425554 1954896 1752079 2068467 2292962 2223637 2192004 2343365 2627172
4384 2627172 2755157 2881842 2608692 2328747 2386800 2456051 2684983 2490223 2283342 2290748
4374B290748l05715r5582k88706P08264L53509j21545n30134P9705m24363J32776
4364A798957M29804m165l11083r3135O70662n4315K5275Q0585J37541k51568p2844
4353B355714k60015o9999J82756n89424K5657k33762J68825N75056j5671k15813
4343A923324K34910K76699l46145K29806j52851p30368L97306P2685j288j09779
4333A794299j08383O67767k29405j49540N16054j32416l53729l6087k66073M10726
4323B113213J23427M451K59788l52530o0965J51740M009k99810J09329J22187
4313B174839q4001M83247m10036n38832J06024J61821K55088L57294n11745N0944
4303B044643M50244p76667O13374P4173M7508K42377l1602j14871k69466J75905
$$ plain form
4374 2290748 1985033 1889451 1600745 2309009 2662518 2540973 2010839 2090544 1666181 1798957
4364 1798957 2228761 2224596 1913513 1820378 2491040 2436725 2462000 2542585 2680126 2428558 2355714
4353 2355714 2095699 2025700 2208456 1619032 1644689 1410927 1579752 2154808 2139137 1923324
4343 1923324 2158234 2434933 2088788 2318594 2165743 1435375 1832681 1905366 1904078 1794299
4333 1794299 1685916 2353683 2124278 1974738 2490792 2358376 2004647 1968560 1702487 2113213
4323 2113213 2236640 2241091 2500879 2148349 2087384 2239124 2243133 1943323 2052652 2174839
4313 2174839 2090838 2574085 2164049 1625217 1731241 1893062 2148150 2505444 1993699 2044643
4303 2044643 2494887 1718220 2331594 2405767 2453275 2695652 2664050 2549179 2279713 2455618
4293B455618K20304K7973q2017k66490k36575N16296K19664m61757k70499L07242
4283B429759l53204K83733k41989J31001L79560M59983m83817J91974j69733j05268
4273B521999J45430l06313J34814K29696N4109P790K52111m6691m0917N21439
4263C473467p0886k83986L54893j74898J87521n89730k00478K60542K71304j25254
4253C102495J44956o42450M06989L27460k11869l24752o2739L07176L29611j62540
4243C214337L8434k7065K32609M3428N2035j56235M0465L02584J59626K18766
4233D118984j56303N17665k77772k40068l94843N03690N15383J57805k29377N51230
4223E066394P8279k77290K33891r8462J45078J14306j78280L8699k03397N0398
$$ plain form
4293 2455618 2675922 2703895 2621878 2355388 2118813 2635109 2854773 2393016 2122517 2429759
4283 2429759 2076555 2360288 2118299 2249300 2628860 3088843 2605026 2797000 2627267 2521999
4273 2521999 2667429 2361116 2495930 2725626 2779735 2787525 3039636 2992945 2952028 3473467
4263 3473467 3402581 3118595 3473488 3298590 3486111 2896381 2695903 2956445 3227749 3102495
4253 3102495 3247451 2605001 3011990 3339450 3127581 2802829 2740090 3047266 3376877 3214337
4243 3214337 3252771 3225706 3458315 3501743 3553778 3397543 3438008 3740592 3900218 4118984
4233 4118984 3962681 4480346 4202574 3962506 3567663 4071353 4586736 4744541 4515164 5066394
4223 5066394 5144673 4867383 5101274 5002812 5147890 5262196 5083916 5122615 4919218 4969616
4213D969616l18092J00186M91311j8100L64393l49018k87440j47366j36245K70613
4203D939858o5525l57930J84817J3673o14q3451j70980K50180M4688J66877Q8692
4192E010285J05364J91144L8042k15311J79334J17863j04420k24920M98099K19975
4182E815455m11575O41242j33606o7465J40440M042j14891p8310L52236m12041
4172E735527l23734J26681M24162j611o6128L75495J08512m35578J70849j1100
4162F103075J56519K49726k23620J0598k60923N795J99528K00664k24616K96739
4152F513485l91598o18733R8548K18227J2519K58330J46456j89607K5439j42536
4142E930530l63503M21043j01645m02451L93135J6742l85254j4498K46852J43930
$$ plain form
4213 4969616 4651524 4751710 5243021 5224921 5589314 5240296 4952856 4805490 4669245 4939858
4203 4939858 4874333 4516403 4701220 4714893 4714279 4630828 4459848 4710028 4754716 4921593 5010285
4192 5010285 5115649 5306793 5344835 5129524 5308858 5426721 5322301 5097381 5595480 5815455
4182 5815455 5403880 6045122 5911516 5844051 5984491 5988533 5873642 5795332 6147568 5735527
4172 5735527 5411793 5538474 5962636 5961025 5894897 6270392 6378904 5943326 6114175 6103075
4162 6103075 6259594 6509320 6285700 6296298 6035375 6041170 6240698 6441362 6216746 6513485
4152 6513485 6121887 5503154 5601702 5819929 5832448 6090778 6237234 6047627 6073066 5930530
4142 5930530 5567027 5988070 5886425 5483974 5877109 5893851 5508597 5494099 5740951 5884881
4132E884881l11055J88926n1901o90936N57796K88821O660j46754j20699K73787
4122E879526j8832m42073j5434R2896M01932J88477k54896o0184K38597q8246
4112E921763N4703K42355l27321j18105K34649P1963l53943N93269L33509j59208
4102F493634l69019j55935K79551K68426j96383l81656j05293L63598K16981n50618
4092E863286J39810j9239l81492J39664J53992r2708k65427R1806O13778p28623
4082E514847J59651L88996m65235L23184j41121J34598l8670m09388j52440J0777
4072E325199M82906k36891K25172l31561k6229L55409L50015J22429j01950o60443
4062E504056N7784Q9872K94371J69657l53256j37333k37743M50328p6902M46138
$$ plain form
4132 5884881 5573826 5762752 5710851 5019915 5577711 5866532 5873192 5726438 5605739 5879526
4122 5879526 5860694 5418621 5403187 5496083 5898015 6086492 5831596 5771412 6010009 5921763
4112 5921763 5976466 6218821 5891500 5773395 6008044 6080007 5726064 6319333 6652842 6493634
4102 6493634 6124615 5968680 6248231 6516657 6320274 5938618 5833325 6196923 6413904 5863286
4092 5863286 6003096 5983857 5602365 5742029 5896021 5803313 5537886 5629692 6243470 5514847
4082 5514847 5674498 6063494 5598259 5921443 5780322 5914920 5876250 5466862 5314422 5325199
4072 5325199 5808105 5571214 5796386 5464825 5438596 5794005 6144020 6266449 6164499 5504056
4062 5504056 5561840 5651712 5946083 6115740 5762484 5625151 5387408 5837736 5760834 6206972
4052F206972n24400j13854L25377j81438n23551L17512L14863k60539j6716O2441
4042E606667M53459j27926j28139L35622j20724j29009j48023J17237K14469r2483
4032E981150n81106m940L74715K8328J57550L93156l77044K49890J87593J30042
4022F539334l95652k19177L15945j84419k14615K2160j6383o4228O35709k46001
4012F172673m02476L55655R5391j84519J9176J12169N33576K51539n23556j09864
4002F319764j41743K74679M6969k49724K26601p9626L1231J82579m86794M1361
3992F165297k6998m8919L13558k2493R4937j46757L4498Q8426r2497j19975K29179
3981F468256J29851L77J88664l57870J14029M79116m24039j89547K9881M00028
$$ plain form
4052 6206972 5682572 5568718 5894095 5712657 5189106 5506618 5821481 5560942 5544226 5606667
4042 5606667 6060126 5932200 5804061 6139683 6018959 5889950 5741927 5859164 6073633 5981150
4032 5981150 5400044 5395104 5769819 5798147 5955697 6348853 5971809 6221699 6409292 6539334
4022 6539334 6143682 5924505 6240450 6056031 5841416 5863576 5847193 5782965 6418674 6172673
4012 6172673 5770197 6125852 6221243 6036724 6055900 6168069 6701645 6953184 6429628 6319764
4002 6319764 6178021 6452700 6499669 6249945 6476546 6396920 6428151 6610730 6123936 6165297
3992 6165297 6138299 6089380 6402938 6380445 6475382 6328625 6363123 6451549 6359052 6239077 6468256
3981 6468256 6598107 6598484 6787148 6429278 6543307 7022423 6598384 6408837 6438718 6838746
3971F838746j14241j07368N25944J57536j77372k73081N40k3181j78183R9989
3961F749329J66435q4281K72395k71311J02476P43082l87502J25609L6964J31429
3951G584625l94478k36471K20684Q9785K27964L9354R254Q1522M9187M46105J76848
3940H294379L9857k954L3785o60752m040J95561j03810L52129j63501J21536L02330
3929H404520L65951J92885j38798j40555k77576J96135N66112L46006k0356L5131
3919I529455j42076k82979K70422O91097k58127r6810l89317l22375N82355J72462
3909I754107k18298k15348Q91876k19390K8113L72247J14281Q6782L25488L22666
3899A1242524n07089K02586o6252L07279J50937K0192K51865j35202P3403K12125
$$ plain form
3971 6838746 6724505 6617137 7143081 7300617 7123245 6850164 6850704 6827523 6649340 6749329
3961 6749329 6915764 6831483 7103878 6832567 6935043 7678125 7290623 7416232 7453196 7584625
3951 7584625 7190147 6953676 7174360 7264145 7492109 7531463 7540717 7622239 7671426 8117531 8294379
3940 8294379 8334236 8331282 8365067 7704315 7700275 7895836 7792026 8144155 7980654 8102190 8404520
3929 8404520 8770471 8963356 8824558 8684003 8406427 8602562 9168674 9514680 9494324 9529455
3919 9529455 9387379 9104400 9374822 10065919 9807792 9710982 9321665 8999290 9581645 9754107
3909 9754107 9535809 9320461 10212337 9992947 10021060 10393307 10507588 10594370 10919858 11242524
3899 11242524 10735435 10938021 10871769 11179048 11329985 11350177 11602042 11466840 11540243 11752368
3889A1752368N12182n9618N6518K65314L29267L9230O69999J14801j50418M94111
3879A4023754N09533n934O93920R26815M8712K32426N29108L39366k93452J05982
3869A7110230P18793R17322K66613P22489R45864R35966R27913J292387R90239
3860B4827816J446504J701233K034894K549943K771309K697302L091050L887418
3852D5007469M923142N404311O596504P809218J0778769J3310155J8457080J8072946
3844A30359594j870490j4340436j6324234j7697021j4456605r575276p149193
3837D8946339m666387l915946l223019k654585k123628j595639j473861j253782
3829B8039492q61859j056776p87495p08525q24641m89220m19911j86364j083062
$$ plain form
3889 11752368 12264550 12204932 12261450 12526764 12856031 12895261 13565260 13680061 13529643 14023754
3879 14023754 14533287 14527353 15221273 16148088 16196800 16429226 16958334 17297700 17004248 17110230
3869 17110230 17829023 18746345 19012958 19735447 20681311 21617277 22545190 23837577 24827816
3860 24827816 26274320 27975553 30010447 32560390 35331699 38029001 41120051 45007469
3852 45007469 49930611 55334922 61931426 69740644 80519413 93829568 112286648 130359594
3844 130359594 128489104 114148668 97824434 80127413 65670808 56095532 48946339
3837 48946339 44279952 40364006 37140987 34486402 32362774 30767135 29293274 28039492
3829 28039492 27177633 26120857 25333362 24624837 23800196 23310976 22891065 22704701 21621639
3820B1621639J2653l80350l90140j01549l68214r3583K69651n1274m07283M60998
3810B0572548m16042j12079J19677j81746P01909K05358j27904M7981P6234n9511
3800B0826425l67276k30383l8496l28673J03376l01077o51594J70428j88323k64382
3790A8730025l32111n17282K3855N65237j89517J80930j0538j83021m45620K59740
3780A8081698L11339l03410M33181J04246j36904o9469M49090N13265j38803k9191
3770A9215042M3305L9441m6024P4650k90032J60587p7085l65095J78866j28665
3760A8804990J45583k82289L7592O22607m9923J58735k01143O2J01423K49677
3750A9587314K86937l10544K05854J76477L66595J88903L51157J04707j13409
$$ plain form
3820 21621639 21634292 21253942 20863802 20762253 20394039 20300456 20570107 20518833 20111550 20572548
3810 20572548 20156506 20044427 20164104 19982358 20684267 20889625 20761721 20809702 20885936 20826425
3800 20826425 20459149 20228766 20190270 19861597 19964973 19663896 19012302 19182730 18994407 18730025
3790 18730025 18397914 17880632 17904487 18469724 18280207 18461137 18450599 18267578 17821958 18081698
3780 18081698 18393037 18089627 18522808 18627054 18490150 18420681 18869771 19383036 19244233 19215042
3770 19215042 19258347 19297788 19251764 19326414 19036382 19196969 19119884 18754789 18933655 18804990
3760 18804990 18950573 18668284 18705876 19328483 19278560 19437295 19236152 19236214 19337637 19587314
3750 19587314 19874251 19563707 19769561 19946038 20312633 20501536 20852693 20957400 20843991
3741B0843991K72703m173m1459L73172j97024l65453k46676L03521l3935m9317
3731B0855350j59504n3366k55753j31710M51651N9607k54052L63849l27858l41320
3721B0206894J39361J19247m83373K4557J72406m44403R5447L75076M7060P813
3711B0260085N6507j35506m84837N65679K47793p75673m68553N69557k63495p83001
3701A8788556K13541j87412L0489Q2422l14370l02390l2982R6471n80596k60396
3691A7533333k93475j91066O35995K87552n03758n04054j59490Q9412j15116k39890
3681A6539443k42440O0949l0457Q7161J44165K03368J86536r2624j46040j73198
3671A6536863j74851L8470j306p9078j60348l30823J10530L06994K52342l32673
$$ plain form
3741 20843991 21116694 21112521 21071062 21444234 21247210 20881757 20635081 20938602 20904667 20855350
3731 20855350 20695846 20642480 20386727 20255017 20706668 20766275 20512223 20876072 20548214 20206894
3721 20206894 20346255 20465502 19982129 20006686 20179092 19734689 19830136 20205212 20252272 20260085
3711 20260085 20316592 20181086 19696249 20261928 20509721 19734048 19265495 19835052 19571557 18788556
3701 18788556 19002097 18814685 18845174 18927596 18613226 18310836 18277854 18374325 17793729 17533333
3691 17533333 17239858 17048792 17684787 17972339 17468581 16964527 16805037 16894449 16779333 16539443
3681 16539443 16297003 16357952 16327495 16414656 16558821 16762189 16948725 16856101 16710061 16536863
3671 16536863 16362012 16400482 16399176 16320098 16159750 15828927 15939457 16246451 16498793 16166120
3661A6166120k30968j82532L39253o0811J18285j55297k28430K10091M93326k88839
3651A6180198P30027m43866o49089K58697q0960l60738n8788n5772j0149N1029
3641A5560589O29865N52300k25153J0565M3972j95974N52694O7061n1177O74712
3631A7619454J51477O21164J007830O89658J52167Q2477L50894O76611M86975
3622B1838707L16160m66113l79727K41000o3787j07840l18978r9914j03925j12276
3612B0743307O6643o47908j37377m139k62536j17447o28455p17691n94461j68457
3602A7531479k06636n60978k52882L7987l33799j73682m1002l20621l86305J90112
3592A5483673K54680k51924k89662n52477K54076p9869K8579k04586K631j06022
$$ plain form
3661 16166120 15935152 15752620 16091873 16031062 16149347 15994050 15765620 15975711 16469037 16180198
3651 16180198 16910225 16466359 15817270 16075967 15995007 15634269 15575481 15519709 15509560 15560589
3641 15560589 16190454 16742754 16517601 16528166 16572138 16376164 16928858 16995919 16944742 17619454
3631 17619454 17770931 18392095 19399925 20089583 20241750 20324227 20675121 21351732 21838707
3622 21838707 22154867 21688754 21309027 21550027 21486240 21378400 21059422 20959508 20855583 20743307
3612 20743307 20809950 20162042 20024665 20020526 19757990 19640543 19012088 18294397 17699936 17531479
3602 17531479 17324843 16763865 16510983 16548970 16215171 16041489 16000487 15679866 15293561 15483673
3592 15483673 15738353 15486429 15196767 14644290 14898366 14818497 14847076 14642490 14645121 14539099
3582A4539099m31656j44116K89269k41135J8595J1284J89261k78057J09909J10345
3572A4172798n89937j12191k08397k57542j16880j92458O7107K79356k59900K41972
3562A3023928j12710l01583j95085j23159l2740J29921l06426K70502j11319k76965
3552A1964364m2048o6684J32623j41028K18563j14263l75016N4845n03492j4j21087
3541A1006763K62414j04247J54993L12286j74838j21000j51381l6976m2065M79676
3531A1585625k11197o33413L52456p252k9911M1117n8065J98168j86491l91170
3521A0659867L33419N07460r1362l76095k67231k38463J60261L13928J00295K34444
3511A1336523j09974J82712k30583J31135j70488k16306L0243N37840q4210L33257
$$ plain form
3582 14539099 14107443 13963327 14252596 14011461 14030056 14041340 14230601 13952544 14062453 14172798
3572 14172798 13582861 13470670 13262273 13004731 12887851 12695393 12762500 13041856 12781956 13023928
3562 13023928 12911218 12609635 12414550 12291391 12258651 12388572 12082146 12352648 12241329 11964364
3552 11964364 11922316 11855632 11988255 11847227 12065790 11951527 11576511 11631356 11127864 11127850 11006763
3541 11006763 11269177 11164930 11319923 11632209 11457371 11336371 11184990 11148014 11105949 11585625
3531 11585625 11374428 10741015 11093471 11086219 11056308 11097425 11039360 11237528 11051037 10659867
3521 10659867 10993286 11500746 11409384 11033289 10766058 10527595 10687856 11001784 11102079 11336523
3511 11336523 11226549 11409261 11178678 11309813 11139325 10923019 10953262 11491102 11406892 11740149
3501A1740149k05882l26664O3025j15273j88502K59096J28479O32286q8913l60789
3491A1537012K70l37826k3903M94196J51579r1594l47719j91543Q1645M14185
3481A1686302K24453n7364K22744m71401J88865L19190K4198j4334N55890m03746
3471A2274797j49125O34419K81897j20589l06661j88928r6281M94425N92150l03122
3461A3112982j2488M02739K48073L39339o8019r1135M86301N35514q0322j77254
3451A4695730J64164l84430M69651K61791L37242N3632L74569P3799J20879M79633
3441A6646660l88989M6978N03559R3875M19245P0559Q2549J2953O038r6471J06603
3430A7503559M89200K54133N22395k2262l10932K50943O67695N08490N58967J07760
$$ plain form
3501 11740149 11534267 11207603 11270628 11155355 10966853 11225949 11354428 11986714 11897801 11537012
3491 11537012 11537282 11199456 11175553 11669749 11821328 11729734 11382015 11190472 11272117 11686302
3481 11686302 11910755 11853391 12076135 11604734 11793599 12112789 12136987 12122653 12678543 12274797
3471 12274797 12125672 12760091 13041988 12921399 12614738 12425810 12329529 12823954 13416104 13112982
3461 13112982 13100494 13503233 13751306 14090645 14022626 13931491 14417792 14953306 14872984 14695730
3451 14695730 14859894 14475464 14945115 15206906 15544148 15597780 15972349 16046148 16167027 16646660
3441 16646660 16257671 16304649 16808208 16902083 17321328 17391887 17474436 17487389 17493427 17396956 17503559
3430 17503559 17992759 18246892 18769287 18747025 18436093 18687036 19354731 19863221 20422188 20529948
3420B0529948K97370l31283O93880L25150K02584M26584M87937m2654J24129K84079
3410B2997724n0598N38249M43783k6457n1075M9054K50970r6182p2466N3083J88456
3399B4224541q81972j40671j50616n77026q5617J01665m17155l07047m42582j04981
3389B1218539m22774m45945P3673o99532l32069q96428m84631l78814m40303m20173
3379A6771543o3714m97739K66004k26024k6355k09192l11632k36229k78620l01551
3369A4886491j83096J21864m21981n73275J62726J8806m89662J53587O5504o10419
3359A3130545J44758p4405J52236j23886l24853q2440j15331n32181J17070l70566
3349A1920947j26727l8356O60203o03214J07700L01329J8179J43121n79672L07134
$$ plain form
3420 20529948 20827318 20496035 21189915 21515065 21717649 22144233 22632170 22589516 22713645 22997724
3410 22997724 22947126 23485375 23929158 23902701 23851626 23900680 24151650 24055468 23983002 24036085 24224541
3399 24224541 23342569 23201898 23051282 22474256 22388639 22490304 22073149 21766102 21323520 21218539
3389 21218539 20795765 20349820 20423493 19723961 19391892 18495464 18010833 17632019 17191716 16771543
3379 16771543 16707829 16210090 16476094 16250070 16223715 16014523 15702891 15466662 15188042 14886491
3369 14886491 14703395 14825259 14403278 13830003 13992729 14011535 13521873 13675460 13740964 13130545
3359 13130545 13275303 13200898 13353134 13229248 12904395 12821955 12706624 12174443 12291513 11920947
3349 11920947 11794220 11755864 12416067 11812853 11920553 12221882 12240061 12383182 11803510 12110644
3339A2110644k99956j76769P0786k47387j62309N76731k2673q12532m89877O89834
3329A1236492J8651j6595K39363k12097m7123j60179p14679K51783q4048K87468
3319A0799036k8099l42170K280K12219K37368L3128k06166o75351K41218J08059
3309A0381522p55557K72276K94336m55733M32300J12221k39192J68526n5896k49877
3299I904926J92195l7041p03634P7583K4489J00786l11707M36207k51702K47020
3289I679122l6590k65438j56825k31334N22930J43323m48368m51201K41836n6859
3279H940596n5672K58369j22709k53127M57870j38413q0791k25455j79418K43783
3269H845033R9967N998j24484l18375J12452O30071o9909k11284l12514L15591
$$ plain form
3339 12110644 11810688 11633919 11704705 11457318 11295009 11871740 11849067 11036535 10546658 11236492
3329 11236492 11255143 11238548 11477911 11265814 11218691 11058512 10343833 10595616 10511568 10799036
3319 10799036 10770937 10428767 10431047 10643266 10880634 10913762 10707596 10032245 10273463 10381522
3309 10381522 9625965 9898241 10192577 9736844 10169144 10281365 10042173 10210699 10154803 9904926
3299 9904926 10097121 10060080 9356446 9434029 9458518 9559304 9247597 9683804 9432102 9679122
3289 9679122 9642532 9377094 9220269 8988935 9511865 9655188 9206820 8755619 8997455 8940596
3279 8940596 8884924 9143293 9020584 8767457 9225327 9086914 9006123 8780668 8601250 8845033
3269 8845033 8945000 8950998 8826514 8508139 8620591 9250662 9180753 8969469 8656955 8972546
3259H972546r2452k59718k26259M9082L11409o0263J42327m44902k55289M26440
3249H562921J41104j14712l09045o37300m07736N29707N76887l78336Q7131N217
3239H055838r7531K6007M17591l32298j46113N28549K22931m29067l76672M30209
3229H299444k2980Q4413n0516l03419K63764K45922K97979l20573m30828M07969
3219H471175K4589r6944J56496m59124m10606L01400L23310r8652J24510j72967
3209H163187m9479K14215L08488J39196n87750M10116j77887L93859J41390q02740
3199H152595R3328K05486M1228Q0701j61542K53529j41394l12546l0874o4699
3189H115812n7867J04254J57649L90746k97247j59476K42384P7918j29322J5168
$$ plain form
3259 8972546 8880094 8620376 8394117 8443199 8754608 8694345 8836672 8391770 8136481 8562921
3249 8562921 8704025 8589313 8280268 7642968 7235232 7764939 8341826 7963490 8050621 8055838
3239 8055838 7958307 7984314 8401905 8069607 7923494 8452043 8674974 8245907 7869235 8299444
3229 8299444 8276464 8360877 8310361 8006942 8270706 8516628 8814607 8494034 8063206 8471175
3219 8471175 8495764 8398820 8555316 8096192 7685586 7986986 8310296 8211644 8336154 8163187
3209 8163187 8113708 8327923 8636411 8775607 8187857 8597973 8420086 8813945 8955335 8152595
3199 8152595 8245923 8451409 8492637 8573338 8411796 8665325 8523931 8211385 8180511 8115812
3189 8115812 8057945 8162199 8319848 8710594 8413347 8253871 8496255 8574173 8444851 8460019
3179H460019L83175j96160j21033M88048m27063l6447L01883l65935M54767m5749
3169H895505r8802n4968K15328r2317j65997J62020l4712q055J49742L29062j490
3158I295316L81368n22896l00442Q08357M9594M90005j54637R0707J0000q3780
3148A0063592l37852J52146P46691J34642L14551j4095j47804J6131L10339r6760
3138A1141581M3869L53167j17230N71213k52601L79858K9283Q0162K9296j78631
3128A2079967J92372J75229p0043P60764L94221j39876K39257N26902j6280N16426
3118A4658939K04119L80142L05264L60520P16962K54891P48285L72006N13616
3109A8514744O74394P89336J229693J053036O64020J148263J242348R15285J362926
$$ plain form
3179 8460019 8843194 8647034 8526001 9014049 8586986 8550539 8852422 8486487 8941254 8895505
3169 8895505 8796703 8741735 8957063 8864746 8698749 8860769 8826057 8818002 8967744 9296806 9295316
3158 9295316 9676684 9153788 8853346 9661703 9711297 10201302 10046665 10137372 10147372 10063592
3148 10063592 9725740 9877886 10624577 10759219 11073770 11059675 10911871 10928002 11238341 11141581
3138 11141581 11185450 11538617 11421387 11992600 11739999 12119857 12149140 12229302 12258598 12079967
3128 12079967 12272339 12447568 12377525 13138289 13532510 13392634 13631891 14158793 14142513 14658939
3118 14658939 14863058 15243200 15548464 15908984 16625946 16880837 17629122 18001128 18514744
3109 18514744 19189138 19978474 21208167 22261203 22925223 24073486 25315834 26231119 27594045
3100B7594045J584029J479324J245862J220646J530789J872147P91433R81314
3092C8299589N94106m19379p04868j732522j881097k305675j900122k333841j280982
3083B6335209j489396j015037q67794k76980o45263q69021k0728J73025l97521
3074B0926494k20675k58262o33900o10059n10713p72050m65696m15273m90661
3065A6549205p91576o00992n20526J19412J70128m95781j11271j57566l64218
3056A3796815m34005J32517J65202l59915k29859l39447m67587J06584K39573
3047A2609878q5978l00552m64742J11231j96431m33613j44930o05140j21263j15338
3037A0253122l19247k22928p7824k88179k67315l07623k40148j8499k95267L25530
$$ plain form
3100 27594045 29178074 30657398 31903260 33123906 34654695 36526842 37318275 38299589
3092 38299589 38893695 38474316 37769448 36036926 34155829 31850154 29950032 27616191 26335209
3083 26335209 24845813 23830776 22962982 22686002 22040739 21171718 21150990 21324015 20926494
3074 20926494 20705819 20447557 19813657 19203598 18692885 17920835 17455139 17039866 16549205
3065 16549205 15757629 15156637 14636111 14755523 14925651 14429870 14318599 14161033 13796815
3056 13796815 13362810 13495327 13660529 13300614 13070755 12731308 12263721 12370305 12609878
3047 12609878 12523900 12223348 11758606 11869837 11673406 11239793 11094863 10489723 10368460 10253122
3037 10253122 9933875 9710947 9633123 9344944 9077629 8770006 8529858 8511359 8216092 8541622
3027H541622K56411m41407j73172j96087R194k94790p9043k19756j69087L19758
3017G553643k80981l16331J9256Q3272j64549j25157j23796K5816m03051O94o6231
3006F202585J7826j31241j19327P577j77507o37812P7268K82460p0427J44376
2996E595778L8536R3504R5807j33928m38020j9946K55072n3460J5691j57271j95508
2985E096255K44739j29218n57791j0325M85712n7014K5558m6539j5865j52633
2975D882879l04126J62449j4520j09940M1660N91450l55318j73092l28114k48658
2965D144670M52038K58143R0703k84732j87587K2472J74983k68510j95382j21674
2955D085124K64379m6139k19919N6833P34969j17556J23273l90922l91175j97036
$$ plain form
3027 8541622 8798033 8356626 8183454 7987367 7996561 7701771 7622728 7402972 7233885 7553643
3017 7553643 7272662 6956331 6975587 7058859 6894310 6769153 6645357 6671173 6268122 6268816 6202585
3006 6202585 6220411 6089170 5969843 5977420 5799913 5162101 5239369 5521829 5451402 5595778
2996 5595778 5634314 5727818 5823625 5689697 5251677 5231731 5486803 5433343 5449034 5291763 5096255
2985 5096255 5340994 5211776 4653985 4643660 5129372 5072358 5097916 5051377 5035512 4882879
2975 4882879 4578753 4741202 4726682 4616742 4658402 5249852 4894534 4721442 4393328 4144670
2965 4144670 4596708 4854851 4945554 4660822 4473235 4495707 4670690 4402180 4206798 4085124
2955 4085124 4349503 4303364 4083445 4140278 4875247 4757691 4880964 4490042 4098867 3901831
2945C901831k22885M38944L50420j01936n1705l52203k16136N8426j730N5311
2935C858337J05028j05518M835n0632j22102j19388K55028R0682k60824j99929
2925C455517N724j33696K53182j74726q2078M48595j15680m33388q7859j11645
2915C023946M39552J71457q02587K65544K94528m03588j84690K72254L56968O782
2905C440166m3982q7464K62974k56770j0514J6905K34683K4159j12646l39753
2895C127758l90957j20056L33645L05339J61066j5127l5870p1159r1608l94500
2885B808531j60286M34860J65126j28297K3272K3671k05197N45329r9721p52088
2875B655200k59900L69005K84187J37745m38543r451K80333J73849n87768K50392
$$ plain form
2945 3901831 3678946 4117890 4468310 4366374 4314669 3962466 3746330 3804756 3803026 3858337
2935 3858337 3963365 3857847 3862682 3812050 3689948 3570560 3825588 3916270 3655446 3455517
2925 3455517 3461241 3327545 3580727 3406001 3323923 3772518 3656838 3223450 3135591 3023946
2915 3023946 3463498 3634955 2832368 3097912 3392440 2988852 2804162 3076416 3433384 3440166
2905 3440166 3396184 3308720 3571694 3314924 3304410 3321315 3555998 3580157 3467511 3127758
2895 3127758 2736801 2616745 2950390 3255729 3416795 3401668 3365798 3294639 3203031 2808531
2885 2808531 2648245 3083105 3248231 3119934 3143206 3166877 2961680 3507009 3407288 2655200
2875 2655200 2395300 2764305 3048492 3186237 2747694 2738243 3018576 3192425 2604657 2855049
2865B855049P51755j07171l00862J57723N11K86643j49865P8487N42032p8050
2855D036252l68412J30652k38347l60138J74310K55523J72826l63494J4925k38233
2845C215864O9695k0102M99628Q0378m13676L08622K86321J81914l86048P2377
2835C894973k74176K68828l2589J77757k29084K03929J77941L38148m16337O34
2825D110024j47682j66501K83814K41812M94015Q3612k87659P4552L83799J74513
2815E244299J74564j34766l1693l98179j49509M16953M05473L26313j3519j23092
2805E716844l8834M30960m70460j67784n9315R4735M80393L03762K46207r3811
2795F442697M32413J28064m50906L67740J37437L25335J69913J65438K08916p1499
$$ plain form
2865 2855049 3606804 3499633 3198771 3356494 3357005 3643648 3493783 3572270 4114302 4036252
2855 4036252 3667840 3798492 3560145 3200007 3374317 3629840 3802666 3439172 3454097 3215864
2845 3215864 3285559 3265457 3765085 3845463 3431787 3740409 4026730 4208644 3822596 3894973
2835 3894973 3620797 3889625 3857036 4034793 3805709 4009638 4187579 4525727 4109390 4110024
2825 4110024 3962342 3795841 4079655 4321467 4815482 4899094 4611435 4685987 5069786 5244299
2815 5244299 5418863 5284097 5252404 4854225 4704716 5121669 5527142 5853455 5839936 5716844
2805 5716844 5678010 6108970 5638510 5470726 5411411 5506146 5986539 6290301 6536508 6442697
2795 6442697 6875110 7003174 6552268 6920008 7057445 7382780 7552693 7718131 7927047 7855548
2785G855548K17009J94888k37468o80530K6736n703n77399q9651M51096l82001
2775F772525j64062m35839K56443M56310J81735n42975K11231J52321n166L29094
2765G211617J99553j45129m5573l98408K62819J57861K5619J6422k79309k87545
2755F717927l5510k63535m90913K91719m94447l18480P17278l67410j42419J44386
2745E758596J42129l54124l95299K27174k14046r7507L1063j16544O8479k40787
2735D809134J01390j64207j52873j12030o65411K70753j523J69439l71809p25220
2725C157643Q6664K51690k75569K10057Q8821k86679Q5319k12527k86575r3790
2715B725054K14881j81049J90615R5652j32731l30300k44260k16162K49748r5865
$$ plain form
2785 7855548 8072557 8267445 8029977 7349447 7376183 7370480 6793081 6703430 7154526 6772525
2775 6772525 6608463 6172624 6429067 6885377 7067112 6524137 6735368 6887689 6882523 7211617
2765 7211617 7411170 7266041 7220468 6822060 7084879 7242740 7268359 7284781 7005472 6717927
2755 6717927 6682417 6418882 5927969 6219688 5725241 5406761 6124039 5756629 5614210 5758596
2745 5758596 5900725 5546601 5151302 5378476 5164430 5066923 5097986 4981442 5049921 4809134
2735 4809134 4910524 4746317 4593444 4481414 3816003 4086756 4085233 4254672 3882863 3157643
2725 3157643 3244307 3495997 3220428 3430485 3519306 3232627 3317946 3105419 2818844 2725054
2715 2725054 2939935 2758886 2949501 3045153 2912422 2582122 2337862 2121700 2371448 2275583
2705B275583K22827q715p9799l61346K30319r2659L96984k9466k04046K73618
2695B623300O023k20352k83056P6329N6942m76019n62442K08579J21045L29688
2685A880037J38045J84312k62180R2509k54757J03584L27866K5208k55266j43990
2675A835368m1413l55144L3937L22435m71254N69655l44367k2859K03107K25317
2665A954782k32305j77293k8039K72006J0446o34796o5490Q0441j70997N02391
2655A511146J25340k57709N2163m38718K02731J47065r6798k56532K67894J30732
2645A387314j36056j55903K15840O8972R4293n06000j59039k16205M00040p2940
2635I20316J79467J5931R0787Q7894n47945K53154M30552n55778o7028K68796
$$ plain form
2705 2275583 2498410 2489695 2409896 2048550 2278869 2186210 2583194 2553728 2349682 2623300
2695 2623300 2629323 2408971 2125915 2202244 2259186 1783167 1220725 1429304 1550349 1880037
2685 1880037 2018082 2202394 1940214 2032723 1777966 1881550 2209416 2234624 1979358 1835368
2675 1835368 1793955 1438811 1472748 1795183 1323929 1893584 1549217 1526358 1729465 1954782
2665 1954782 1722477 1545184 1517145 1789151 1799597 1164801 1099311 1179752 1008755 1511146
2655 1511146 1636486 1378777 1430940 992222 1194953 1342018 1245220 988688 1256582 1387314
2645 1387314 1251258 1095355 1311195 1380167 1474460 968460 809421 593216 993256 920316
2635 920316 1099783 1115714 1206501 1294395 746450 999604 1430156 874378 807350 1076146
2625A076146k298L60902o6789m6094j17575J06267j63081p5264m600r7379n7507
2614I12728M873K45543k40696m85441J06944R1911N0296M81327j52214o90472
2604C24799L05335l95424M87169n6200p2632j8632J63756j52096N19699J32140
2594A237914n16216o22823L80848j99416n4148J13095L3228K68494q0778l69507
2584A90691L84832K22805J66100l13260j34076m31839J44113N24653k3251j77726
2574E53042k69230J46097J06683j98101L64029K26329l55527K00924J74731J00853
2564A049830n08387L87306k66190K37963m88465J03772L7513L88012K25455r1540
2554A075269l63189n15654J65101j11337j45084l1654J20475l15942K3182M97950
$$ plain form
2625 1076146 1073848 1434750 1367961 1321867 1204292 1310559 1147478 1072214 1067614 970235 912728
2614 912728 917601 1163144 922448 437007 543951 635862 686158 1167485 1015271 324799
2604 324799 630134 234710 721879 665679 593047 574415 738171 586075 1105774 1237914
2594 1237914 721698 98875 479723 280307 226159 339254 372482 640976 560198 190691
2584 190691 575523 798328 964428 651168 517092 85253 229366 754019 730768 553042
2574 553042 283812 429909 536592 338491 702520 928849 573322 774246 948977 1049830
2564 1049830 541443 928749 662559 900522 412057 515829 553342 941354 1166809 1075269
2554 1075269 712080 196426 361527 250190 105106 73452 193927 -122015 -98833 399117
2544C99117k85904J88684Q1031K48171m305K72132k1965L9234k12742K25632k75971
2533F53114m19605j69726j05006j1572K59829L05311R51o15829J01129K30501
2523B29097m23888L00003r810J72480J65595j36043L88635j03362j36101q6979
2513C59627k11342J59172j81847j62939J40403N5187l5708J67323O51692o9069
2503H72499k48426l60879j80278l283L27821k7953j1291L4319n97006L43559P3878
2492B22960J42168J7995l57311J20451J09946r1543J72418l06558M12943k63666
2482A79803j09709K32706r8206l27546L4111M79272k11558O0806K27786l49024
2472A18441j77677J82950L64995l32796K23593L38985n08734k40638K00120L31893
$$ plain form
2544 399117 113213 301897 382928 631099 626794 898926 876961 916195 703453 929085 653114
2533 653114 233509 63783 -41223 -52795 207034 512345 513296 -102533 -1404 229097
2523 229097 -194791 105212 95402 267882 433477 297434 686069 582707 446606 359627
2513 359627 148285 307457 125610 -37329 103074 158261 122553 289876 941568 872499
2503 872499 624073 263194 82916 79633 407454 379501 368210 402529 -194477 149082 222960
2492 222960 365128 383123 25812 146263 256209 164666 337084 30526 443469 179803
2482 179803 70094 302800 204594 -122952 -88841 390431 178873 239679 467465 118441
2472 118441 -59236 123714 488709 155913 379506 718491 209757 -30881 169239 501132
2462E01132L31529k09859m20920j53704K19058j59314n91803L1143J64323M30099
2452A41684o195j8513J26128K56544j53314J02344m7588m58285k80647L55766
2442A7924l76397k79848Q1340J48653L17104N7413J34935k53237M14547j80522
2432H1912k22818M33652k20946j79683P5001J65795O1459J20178J86962p98978
2422b97466J27174J15213K49005K05052k72761m81141j7212L33537N13928M2732
2412E18061o28177J16670L83697k68903N9007q8297M32520l6399n57617L10679
2402B41241k39375m03432K17789K0341J95424K06202L18436j8493n74222k57327
2392b93416M0467N4936J10314L45583l1542p419P2102j19983q4007J58149J50707
$$ plain form
2462 501132 832661 622802 201882 48178 267236 107922 -483881 -452738 -288415 141684
2452 141684 135489 116976 243104 499648 346334 448678 401090 -57195 -337842 17924
2442 17924 -358473 -638321 -556981 -408328 -91224 -33811 101124 -152113 262434 81912
2432 81912 -140906 292746 71800 -107883 -32882 132913 194372 314550 501512 -297466
2422 -297466 -170292 -55079 193926 398978 126217 -354924 -372136 -38599 475329 518061
2412 518061 -110116 6554 390251 121348 180355 92058 524578 488179 -69438 241241
2402 241241 1866 -401566 -183777 -163436 31988 238190 556626 538133 -36089 -293416
2392 -293416 -252949 -198013 -87699 257884 226342 218923 291025 171042 87035 245184 395891
2381C95891k66469J01690K7739j895k91964J7558K71720l51348m64655J20640
2371d41093N71311M31479o93404r3702p3284j04941N22895j66081L08947m19253
2361a57126n98851L89123k00940J14378r7201K63884Q51635k44680o56284Q7514
2351b48548N03748p64134J41286J4176J06157j70095K12218J28832O5279L33826
2341C22745l66704K48834L51774l21358M6481J09827m47942j258N0396l02294
2331c09499l6692K0075K47245M1630J3022k1550j66249r075L52817J78710J62022
2320D72456l85518l30300l03008N30048K00618k89544K63555K27925R0535j70436
2310C06331K86731J40544J43979K62898j85842K93199j67114k66343N0139M9853
$$ plain form
2381 395891 129422 231112 258851 256956 -35008 -17450 254270 -97078 -561733 -441093
2371 -441093 130218 561697 -131707 -225409 -298693 -403634 119261 -46820 262127 -157126
2361 -157126 -755977 -366854 -567794 -453416 -550617 -286733 564902 320222 -336062 -248548
2351 -248548 255200 -508934 -367648 -353472 -247315 -417410 -205192 -76360 -11081 322745
2341 322745 -43959 204875 556649 235291 281772 391599 -56343 -57601 -7205 -309499
2331 -309499 -346191 -326116 -78871 -37241 -24219 -45769 -212018 -221093 131724 310434 472456
2320 472456 86938 -243362 -546370 -16322 184296 -105248 158307 386232 476767 306331
2310 306331 593062 733606 877585 1140483 954641 1247840 1080726 814383 864522 914375
2300I14375k70079K5013k34538m56377o0297J51486o8506P3660j49390r955J44603
2289E9995r1331J10798o1232m3917j89895P08061J02334r5581n31949R8961J15342
2278A81586k39664K6611J88969K6386l34218K38831l2140J1240p9147m5429K33932
2267A76957O8637J74885j63523J65724K63843q5122l26459l03050r4675K34023
2257A11240m31942P3289q5271L48385j40459j31407K75132k95445J76710K03516
2247A03748j13836M09882j4987n72256j19142j84511M46809J04510J2890J79558
2237B52665k5798J79717K10339j90101j64100P5113K25075j89409J25738p1967
2227D27272J32288M956l98893K36694j7229M57041P3682l10200N9718l20595j81821
$$ plain form
2300 914375 644296 669309 434771 -21606 -81903 69583 1077 74737 -74653 -84608 59995
2289 59995 -31336 79462 18230 -25687 -215582 492479 594813 499232 -32717 66244 181586
2278 181586 -58078 -31467 157502 183888 -150330 88501 56361 67601 -11546 -56975 176957
2267 176957 245594 420479 256956 422680 686523 601401 274942 -28108 -122783 111240
2257 111240 -320702 -247413 -332684 15701 -124758 -256165 18967 -276478 -99768 103748
2247 103748 -10088 399794 384807 -187449 -306591 -491102 -44293 60217 73107 252665
2237 252665 226867 406584 616923 426822 262722 337835 562910 373501 499239 427272
2227 427272 559560 564516 165623 402317 385088 842129 915811 605611 665329 344734 162913
2216A62913P6820J51166j18239J2117k63192L05924K93029j52771L7084r4318
2206D10533j9291m35788L41784j63083l030O1618K87753L08174j96193R0322J09579
2195G92378l87556n98013L89840j75380L80018O5469J60988N71127n57311p68182
2185a26622R4999K81153k84747P5054M71050O3138L80814m49403l28530P5214
2175B52120N3735K11889j91032K79301J12743j57653k09377j39828M37424J20550
2165G69872L7006J6213j26172n0389K16470R2680m48646L36846K06894K52515
2155A303289k66116l2458j28765L56761l6959l49530M85851K12295r4864r0808
2145A358696L27089l37329j05830j39614L09961N11614L68299j34809J14415L42395
$$ plain form
2216 162913 239733 390899 272660 284777 21585 327509 620538 467767 504851 410533
2206 410533 391242 -44546 297238 134155 131125 192743 480496 788670 592477 682799 792378
2195 792378 404822 -193191 196649 21269 401287 466756 627744 1198871 641560 -126622
2185 -126622 -31623 249530 -35217 39837 510887 574025 954839 505436 176906 252120
2175 252120 305855 517744 326712 606013 718756 561103 351726 211898 649322 769872
2165 769872 806878 823091 696919 646530 863000 955680 507034 843880 1050774 1303289
2155 1303289 1037173 1004715 875950 1232711 1195752 846222 1332073 1544368 1449504 1358696
2145 1358696 1685785 1348456 1242626 1103012 1412973 1924587 2292886 2158077 2272492 2614887
2135B614887l05763L36661J20277m1356J05637J64623K34534j84350K06239J70611
2125C422000L04723N32351K46006L5498j0973K85504K12314j59846j34118K00435
2115D933894O6924M90973K44423J73521K69835K67869K64476J96341K60392J005111
2105H173759L89957J95736K22039L57468Q1851M03316K26451Q25902O90198k0373
2095A1546304R02492N92079J088794P55594J325436R76663R19181J211671J164641
2086B0482855J091294J816035J786216K672341K514622L240486M492717M595986
2078D2692552M641478M451879M728907N875421P480816R362873J1518059J4008454
2070A04760439J7210182K2005359K8686683L9814473M9373199J0064077k9912556
$$ plain form
2135 2614887 2309124 2645785 2766062 2724706 2830343 2994966 3229500 3045150 3251389 3422000
2125 3422000 3726723 4259074 4505080 4540578 4529605 4815109 5027423 4867577 4733459 4933894
2115 4933894 5000818 5491791 5736214 5909735 6179570 6447439 6711915 6908256 7168648 8173759
2105 8173759 8563716 8759452 8981491 9338959 9420810 9824126 10050577 10876479 11566677 11546304
2095 11546304 12448796 13040875 14129669 14885263 16210699 17187362 18106543 19318214 20482855
2086 20482855 21574149 23390184 25176400 27848741 30363363 33603849 38096566 42692552
2078 42692552 47334030 51785909 56514816 62390237 69871053 79233926 90751985 104760439
2070 104760439 121970621 143975980 172662663 212477136 261850335 271914412 242001856
2063B42001856l5053972m0066559l5064704k4326705j6730483j1989948r541118
2056F9228367p223930n496416m672521l221479l074573l003632l038634k923830
2048C6573352k459817k427002k195916j889760j247030j354800j782351q46741
2040B2369935o62318r81266j147698o55403r12789k17227n41090p47412p77117
2031A5727615n41977l76164j196963p94793Q114l69288l65839n46977p75157o1890
2021A0706681l84304m96443j28077p00486r00644L24604j93597j9659J05395p13832
2011G599638l70122m0855m08226p3134K80658j39009j31618m17314m07952m9151
2001E842915J02125j46537O732k62905l1732l08473k87681K94609N1864k96208
$$ plain form
2063 242001856 206947884 166881325 131816621 107489916 90759433 78769485 69228367
2056 69228367 62004437 56508021 51835500 48614021 45539448 42535816 39497182 36573352
2048 36573352 34113535 31686533 29490617 27600857 26353827 24999027 23216676 22369935
2040 22369935 21707617 20726351 19578653 18923250 18010461 17793234 17252144 16504732 15727615
2031 15727615 15185638 14809474 13612511 12817718 12825832 12456544 12090705 11543728 10768571 10706681
2021 10706681 10322377 9825934 9697857 8997371 8096727 8421331 8227734 8208075 8313470 7599638
2011 7599638 7229516 7188661 6780435 6707301 6987959 6848950 6717332 6300018 5892066 5842915
2001 5842915 5945040 5798503 5805235 5542330 5510598 5202125 4914444 5209053 5260917 4964709
1991D964709k98596q0335j38991m83172K40619K46265l79350k41016j47943J18530
1981C800720k1234k74220J22127j27609k95575N67738Q656k57803j55892l16278
1971C050630m02174k97252K51775j31151k39574m40498M32069J70895m77150j07792
1961A809778L25584L58144m3903k47850n16696K57182k82877j74746J42540J1828
1951A638984J4039N66838R0769n01598L41952j08980j27679j66871k90025q0833
1941A376596K62679K23323k48518q5531k25326J26323j53566M6157J9826K40424
1931A582387J25498l23506k54936J11749L59199l18720n8264J94047M0109L6852
1921A494415m4394J29058k73302l05466m8533L0405j85906P65426k94995k58966
$$ plain form
1991 4964709 4666113 4585778 4446787 3963615 4204234 4450499 4071149 3830133 3682190 3800720
1981 3800720 3779486 3505266 3627393 3499784 3204209 3771947 3780603 3522800 3366908 3050630
1971 3050630 2648456 2351204 2602979 2471828 2232254 1791756 2223825 2394720 1917570 1809778
1961 1809778 2135362 2493506 2449603 2201753 1685057 1942239 1659362 1484616 1627156 1638984
1951 1638984 1653023 2219861 2310630 1809032 2150984 2042004 1914325 1747454 1457429 1376596
1941 1376596 1639275 1862598 1614080 1528549 1303223 1429546 1275980 1322137 1341963 1582387
1931 1582387 1707885 1384379 1129443 1241192 1600391 1281671 1223407 1417454 1457563 1494415
1921 1494415 1450021 1579079 1305777 1000311 951778 982183 796277 1561703 1266708 1007742
1911A007742n47027L58958R3404l56581P6522l98577M22052J68100l2083j22911
1901F69599n48702K57505N88066k89495l41715K44573J93626n15786R5500j09866
1891B43305M14020K75343j51999m49342p8446r1099K65593j28604N01449L37022
1881A137242n47506J1413k59258J66553P7737k82879L7311o53819K67859M12480
1871C67133k31201J07705p8824Q0373K03228M00789j02002M34708K2488m30159
1861G74238m92839L1916q3660L83161M39005j59641p3452o01243L13293N222L21254
1850H57254J35371m74754l47328r3024M33675k94259J47623j51035N41632q8841
1840F66314k13630M90874q8732L3720j14598q9189m16919r0869J12502M20695
$$ plain form
1911 1007742 460715 819673 913077 556496 633018 234441 656493 824593 792510 669599
1901 669599 120897 378402 966468 676973 335258 579831 773457 257671 353171 243305
1891 243305 657325 932668 780669 331327 252881 161782 427375 298771 800220 1137242
1881 1137242 589736 601149 341891 508444 586181 303302 340613 -313206 -45347 367133
1871 367133 135932 243637 164813 245186 448414 849203 747201 1181909 1204397 774238
1861 774238 281399 313315 229655 612816 1051821 892180 818728 217485 530778 536000 857254
1850 857254 992625 517871 170543 77519 511194 216935 364558 213523 755155 666314
1840 666314 452684 943558 854826 888546 773948 684759 267840 176971 289473 710168
1830G10168K16423j85015o992N64137J77976J09587K55203k37015J52167r8665
1820A657974Q5907q18365o87725k83051J85885M07427k90797J24383k10017M34194
1810F05815j31555J52683k09100K55153J68202k69699j15928L8027R990l36984
1800A66604l1668L28817P705K37464k49957k63116L3767K56294j42153l72365
1790b8608L06591N03815l16452m39156J80556m8201K56262K54638j86413m11708
1780G1324J27927j31552L6981M7847k57299k0783m2607k14480q0261L67103k41896
1769c37696K04472M19869J82102m50929o26788O35529K32940j22703J1072K2553
1759A70421j55929L68848J28575o9060l7963q42477m38182K85639J77269M25687
$$ plain form
1830 710168 926591 741576 734584 1298721 1476697 1586284 1841487 1604472 1756639 1657974
1820 1657974 1743881 925516 237791 -45260 140625 548052 257255 381638 171621 605815
1810 605815 474260 626943 417843 672996 841198 571499 455571 493598 503588 166604
1800 166604 134936 463753 471458 708922 458965 195849 229616 485910 343757 -28608
1790 -28608 277983 781798 465346 26190 206746 158545 414807 669445 483032 71324
1780 71324 199251 67699 104680 152527 -104772 -125555 -168162 -382642 -462903 -95800 -337696
1769 -337696 -133224 286645 468747 17818 -608970 26559 259499 136796 147868 170421
1759 170421 14492 383340 511915 442855 404892 -437585 -875767 -590128 -412859 12828
1749A2828k25590j23820J77853p3357K11851K23546K36402j50891K29693m3349
1739D75166o30793K56956M34140L88382j09428o81096M86952J38879l12104J78679
1729F25733l32675k37264m08175J83162J86151J52375J37651L12101K05950l76413
1719D48596J8223L61011o57086J92208P9535l60747L58201L03249m08008m40815
1709a05633K1605k45579K11470R0697l55345k39122N13971P1255r5950r5616j74285
1698d02532K85660K32143Q0984N10087j13966j259372n992Q39522j8903n28703
1688c81072L86545K91869P3242m31702k96680n42112J61002O50841K842j56081
1678b41306l88634M89926M7101R3933j42257o48414M27050J94385J83626m71669
$$ plain form
1749 12828 -212762 -336582 -158729 -232086 -20235 203311 439713 288822 518515 475166
1739 475166 -155627 101329 535469 923851 814423 133327 620279 759158 447054 625733
1729 625733 293058 55794 -352381 -169219 16932 169307 306958 619059 825009 448596
1719 448596 466819 827830 170744 362952 442487 81740 439941 743190 335182 -105633
1709 -105633 -84028 -329607 -118137 -27440 -382785 -621907 -107936 -36681 -132631 -228247 -402532
1698 -402532 -116872 115271 196255 706342 592376 -666996 -672988 166534 147631 -381072
1688 -381072 5473 297342 370584 -61118 -357798 -899910 -738908 -88067 -85225 -241306
1678 -241306 -629940 -140014 -92913 1020 -141237 -789651 -362601 -168216 15410 -456259
1668d56259N15535J36801l28715O25587M010l44167m46514n07490Q05720M95876
1658E00384m17578J73151J59255J36714n86050J4797O1848L0482l0186P5110Q1895
1647A99822r2633M7045M279k00595O9690m68748J56557M75216k33061P821N53727
1636E19120p1319l15898k45695L59967J769m45914j8270R7946p8483j07659N1123
1625b53313L40892J23975o14915K3357J78051p8019k7368K75105K87983o02266
1615c46518M77120K12235k04731K87542K01781k61308k45633K8874r7492J05093
1605A56963L63J30528M30517q33149k78221K847O55823k59361n13531J51869K52015
1594a03337M06215l20219M80028n33513k68326J46526K56985p7279k12171L14746
$$ plain form
1668 -456259 59276 196077 -132638 492949 496959 152792 -293722 -801212 4508 500384
1658 500384 82806 255957 415212 551926 -34124 -19327 42521 73003 42817 117927 199822
1647 199822 107189 154234 158513 -42082 27608 -441140 -284583 190633 -42428 -34607 519120
1636 519120 447801 131903 -113792 246175 247944 -197970 -216240 -118294 -196777 -304436 -253313
1625 -253313 87579 211554 -403361 -380004 -201953 -279972 -307340 -32235 255748 -346518
1615 -346518 130602 342837 138106 425648 627429 366121 120488 149362 51870 156963
1605 156963 157326 287854 718371 -114778 -392999 -390152 265671 6310 -507221 -355352 -103337
1594 -103337 302878 -17341 462687 -70826 -339152 -192626 64359 -12920 -225091 89655
1584H9655L86862j93866K27111k91698j48816j12981L29040K69202m33280k88664
1574a67435l2292M66932N91430j04599o33889n9346k68058K26351L32486m0309
1564C11271j14228J22029n30914r1581O9278j61561J8225j49496n7822K54309
1554c30490k11616j32739M52208M72256j06161l22236J52241q5766L6272n00584
1544e76615J15307N69976J92860l84272L1248L5589Q7111J11408O8066o7724o88416
1533e05462K23595J87598k41850K2305J48205O3164o03250j6743L31930K59584
1523a30924k5849k04436K70335p9991J7996P5691m5594J42210o34441N59771L58889
1512C03657O5807j68419m71142K282m084J6604l0205J74327l46319J60024K34224
$$ plain form
1584 89655 476517 282651 509762 218064 69248 -43733 285307 554509 121229 -167435
1574 -167435 -199727 267205 858635 754036 120147 60801 -207257 19094 351580 311271
1564 311271 197043 319072 -211842 -303423 -234145 -395706 -377481 -526977 -584799 -330490
1554 -330490 -542106 -674845 -222637 249619 143458 -178778 -26537 -112303 -76031 -576615
1544 -576615 -461308 108668 301528 -82744 -51496 -15907 71204 182612 250678 182954 -505462
1533 -505462 -281867 -94269 -336119 -313814 -165609 -102445 -705695 -722438 -390508 -130924
1523 -130924 -156773 -361209 -90874 -170865 -152869 -77178 -122772 19438 -615003 -55232 303657
1512 303657 369464 201045 -270097 -267815 -271899 -255295 -285500 -111173 -457492 -297468 -63244
1501f3244l36758j87284J11520O9717N7451j67202M54190p5683L12594K63400
1491D38701l30133l68726m74759J51678L23675M08642O1978n61401K59436j02442
1481a93351q9692J77864J734r5000J46506n27165N34155J95513j00288K10600
1471B60876n88893J61242j16595o1421J55935M62554n35421L52425j3810j59861
1461h2969k73308M28716K22829j07624m99303J92933K13430L80256j80727n06719
1451b12486r466q0074L27164J96987j37802k03180r5778J43734J66170L501K9808
1440A28578m62328L06800K05522p4729j34486l73873K60965J98105k15179K40162
1430G9537L4000l00371q8051j0798J47913J55844k58694O7146J68832k3321j76861
$$ plain form
1501 -63244 -400002 -587286 -475766 -406049 -348598 -515800 -61610 -137293 175301 438701
1491 438701 108568 -260158 -734917 -583239 -259564 149078 211056 -350345 -90909 -193351
1481 -193351 -283043 -105179 -103445 -198445 -51939 -579104 -44949 150564 50276 260876
1471 260876 -328017 -166775 -283370 -344791 -188856 273698 -261723 90702 76892 -82969
1461 -82969 -356277 72439 295268 187644 -311659 -118726 94704 474960 294233 -212486
1451 -212486 -221952 -302026 25138 222125 84323 -118857 -214635 -70901 95269 98770 128578
1440 128578 -333750 -26950 178572 103843 -30643 -404516 -143551 54554 -160625 79537
1430 79537 113537 -186834 -274885 -285683 -137770 18074 -240620 -173474 -4642 -27963 -204824
1419b04824J79013J82626N22037j79127q4289o04614M66964r8979o9571J5363
1409A24599J69960k87512l4095M02686l29091m07353J86946J11029l53116K20130
1399a95817K59699k44297J96613J11237l19714K32350M4191K57669N6136k57830
1389A40237l46430K6446K36252P8565n0762O38873m81589j80062J74144k18948
1379A6726k29191j86034M81648l66567J15140N20771j16755q0408j90603l47996
1369c83269L4269M6062R5010R0601n0236j66918k40983J31981L99963n47023J82752
1358d07791L80695l24687J86458K03346P5047l17442o6770n1261J61811k82326
1348d42920Q7169K20623J91979J38109o2195J38899j09482n8154L6124l07575
$$ plain form
1419 -204824 -25811 156815 678852 499725 415436 -189178 277786 178807 109236 124599
1409 124599 294559 7047 -27048 375638 46547 -360806 -173860 -62831 -415947 -195817
1399 -195817 63882 -180415 16198 127435 -192279 40071 84262 341931 398067 140237
1389 140237 -206193 -179747 56505 135070 84308 723181 241592 61530 235674 16726
1379 16726 -212465 -398499 83149 -283418 -168278 352493 235738 155330 -35273 -383269
1369 -383269 -349000 -302938 -207928 -117327 -167563 -334481 -575464 -443483 -43520 -590543 -407791
1358 -407791 -27096 -351783 -165325 38021 113068 -204374 -271144 -322405 -160594 -442920
1348 -442920 -355751 -135128 56851 194960 132765 271664 162182 104028 140152 -167423
1338a67423J05385j71998K41131O8586K55579k48330J23396j80518N8344P2510
1328A56662J27887k01559k92026L545Q8586L37108j97425l20748j93004J50659
1318c40315J47946N695j07892k64383J51886K89137k25617J57949J7080K45803
1308G7289l3974n79115J77726M62151l27911L4280n2922N6254j51103K2207K65310
1297d9808m82098J66522M81301J9123k24985k65570K80394N86492O3362n06246
1287F8487j29448k8206K48466J8606M4017l39427j79867k54631K68302L24347
1277D0646K45482J38081k22479j18782o3737L59831J50436k52006k90368j05433
1267a18329Q7520j8107K84342L0356l5440j17131K0054P6526k80550J10209k81777
$$ plain form
1338 -167423 -62038 -234036 7095 75681 331260 82930 206326 25808 84152 156662
1328 156662 284549 82990 -209036 -205491 -116905 220203 22778 -297970 -490974 -340315
1318 -340315 -192369 -186674 -294566 -558949 -407063 -117926 -343543 -185594 -168514 77289
1308 77289 43315 -535800 -358074 104077 -223834 -189554 -242476 -186222 -337325 -315118 -49808
1297 -49808 -531906 -365384 115917 135040 -89945 -355515 -75121 511371 574733 68487
1287 68487 -60961 -89167 159299 177905 221922 -117505 -297372 -552003 -283701 40646
1277 40646 286128 424209 201730 82948 19211 379042 529478 277472 -12896 -118329
1267 -118329 -30809 -48916 235426 265782 230342 113211 133265 209791 -70759 39450 -242327
1256b42327J44182n3708j71883L40624L22974l3703j76919j85380j55804J8601
1246a93343J93129m67639M59860J21044l00364K48475j63154L48674p56958l2010
1236e42286K47057n3411l89727k5473K76405L46155K12522L27406N4783k78606
1226A74825K9221k74693j61103J20383J58400J60304j93343Q5912n2842j09027
1216f1963o2679P9918q4780k50897j3464O4873N31314n09102J34197N1981L76245
1205B55643k41690J56784K38574l51565Q7312k0302L12956k34414l20264N8898
1195e8068O05275n90977k13724k06777K99132K54116j64299k24123o04840L44112
1185e60173L12120O13773l3814n22841o3186N90382K26217l39549k48827q927
$$ plain form
1256 -242327 -98145 -151853 -323736 16888 339862 306159 129240 -56140 -211944 -193343
1246 -193343 -214 -467853 -7993 113051 -187313 61162 -101992 246682 -510276 -542286
1236 -542286 -295229 -348640 -738367 -763840 -487435 -141280 71242 398648 453431 174825
1226 174825 204046 -70647 -231750 -111367 47033 207337 13994 99906 47064 -61963
1216 -61963 -124642 -44724 -129504 -380401 -393865 -328992 202322 -306780 -172583 -120602 255643
1205 255643 13953 170737 409311 57746 145058 124756 437712 203298 -116966 -58068
1195 -58068 547207 -43770 -257494 -464271 -165139 88977 -75322 -299445 -904285 -560173
1185 -560173 -248053 365720 331906 -190935 -254121 336261 562478 222929 -25898 -34825
1175c4825R9216m73222j00138N84848K35790J8952l84435l00415k17058j91820
1165g63107L29568L73781j37232J6298l94110L66241q2471P5555J45023K30310
1155A59856J86411K4305r0032n84296L87233L65244k85799k02848j05273Q65271
1145G20072j40301j38108K0156l37525n9590L31658o68923J14351J21798N60545
1135E24133J41423o16373j0313l74161J17533m0857M06371o2007k37645k1547
1125a73443K02985Q693N9913M2766l48125j35764L90018j22971j89777K9103k8608
1114b65210j22546L95309n5480J77319j60396o2417j14236j6210J27863l06313
1104d02317J21672R84876k01758J40915m4362m10733J64368n9157K8233L54422
$$ plain form
1175 -34825 64391 -408831 -508969 75879 311669 330621 -53814 -354229 -571287 -763107
1165 -763107 -433539 -59758 -196990 -180692 -574802 -208561 -291032 -215477 -70454 159856
1155 159856 346267 370572 280540 -303756 83477 448721 162922 -39926 -145199 720072
1145 720072 579771 441663 461819 124294 64704 396362 -272561 -158210 -36412 524133
1135 524133 665556 49183 38870 -335291 -217758 -258615 147756 85749 -151896 -173443
1125 -173443 29542 38235 98148 140914 -207211 -342975 47043 -75928 -265705 -236602 -265210
1114 -265210 -387756 7553 -47927 129392 -31004 -93421 -207657 -223867 -96004 -402317
1104 -402317 -280645 704231 502473 643388 599026 188293 352661 293504 321737 676159
1094F76159r229m15565o4820n30612l32341J95380Q3389N36690K98536J30138
1084E67725n89004m32523k29241J92421M51247j8946o6056j52216l77075L5187
1074f18481M25256J29890j18515O26464l10410j07255M0842k1473j00586J136
1064e3132j9513Q1416l64076l53738L54559O71457J9173m38396j22715k13351
1054d38316r485M37199J88766k36792L93744k04123J84105j63518j23511J32970
1044A61039J11431k81264j9714J13247J87065n85894O06687J94008j55083J01904
1034D33426o49223l74728N15463r6984N8554L0493q4631j6964l42592K73394L05356
1023E1564m01115k2192N09608l71710K46390K08003k73358L01258r4972K40869
$$ plain form
1094 676159 666930 251365 186545 -344067 -676408 -481028 -397639 139051 437587 567725
1084 567725 -21279 -453802 -683043 -490622 -39375 -58321 -124377 -276593 -653668 -618481
1074 -618481 -193225 -63335 -181850 444614 134204 26949 67791 46318 -54268 -53132
1064 -53132 -72645 8771 -355305 -709043 -354484 316973 336146 -102250 -224965 -438316
1054 -438316 -447801 -10602 178164 -58628 335116 130993 315098 151580 28069 161039
1044 161039 272470 -8794 -28508 84739 271804 -314090 292597 486605 331522 433426
1034 433426 -215797 -590525 -75062 -172046 -113492 -82999 -167630 -184594 -527186 -253792 51564
1023 51564 -349551 -371743 137865 -233845 12545 220548 -52810 248448 153476 394345
1013C94345K66002k1597m9236j81588K80257m68065k74942o8785k25552L76302
1003B7141N0317l25854q6197L45932J73968J69605j61225j25228l10736k887p6032
992c21196l12289N51202N0225k34587J07689K57247l7190j64787l42795k0238
982d66719M28695n3710L665j90655K78005R1872r6002l16303j3105J93180q4749
971b25826L14871l10930l5310K07969j90344M94670o0603K17177l85435o57610
961f31371O69463K03590o3074J36706o161m99800m92353O61762L91312j49904
951B20170o2508M8021r5889j23970j94472J99234K00012m12543O95017j53371
941C19701J46851k85494k63549m46041j3326K75048j53972P0175J84893j93172
$$ plain form
1013 394345 660347 638750 589514 407926 688183 220118 -54824 -123609 -349161 27141
1003 27141 77458 -248396 -334593 11339 185307 354912 193687 68459 -242277 -245164 -321196
992 -321196 -633485 -82283 -32058 -266645 -158956 98291 61101 -103686 -446481 -466719
982 -466719 -38024 -91734 -88069 -278724 -719 91153 -4849 -321152 -334257 -141077 -225826
971 -225826 89045 -221885 -257195 -49226 -239570 255100 194497 411674 26239 -631371
961 -631371 38092 241682 178608 315314 309153 -190647 -683000 -21238 370074 220170
951 220170 157662 205683 109794 -14176 -208648 -9414 190598 -221945 473072 319701
941 319701 466552 181058 -82491 -528532 -541858 -266810 -420782 -350607 -165714 -358886
931c58886o3906K61519j5558K97200j31000m96859K56362K94379m5036k11797
921b13582q3551J88337n9758j06890m37108M48128M27919n32923M2166N39495
911B12233j77063K53859k03626l07198J22084K01857J63160N1432l61611J64238
901A19365r5249k66561M67493o2807j35727j95863J31229k84818J48953L30613
891A56628l52311l3991K23667m13678J19614k6868L97768R3909r1951J9015p01639
880f09837J64363N96342j28720K96996K11249l84712n3055o0525l05922P8660
870a95161j57462L35863J93268k08756J67029Q8090r9822j30002j25728l18697
860d51378M60337j93499j64858M18072l55079K84657M9559L23593o64146L6541
$$ plain form
931 -358886 -422792 -161273 -176831 120369 -10631 -507490 -251128 43251 -1785 -213582
921 -213582 -297133 -108796 -168554 -275444 -712552 -264424 163495 -369428 -327262 212233
911 212233 35170 289029 85403 -221795 -99711 102146 265306 316738 -44873 119365
901 119365 24116 -242445 225048 162241 26514 -169349 -38120 -322938 -173985 156628
891 156628 -195683 -229674 -6007 -419685 -300071 -326939 70829 164738 72787 91802 -609837
880 -609837 -445474 150868 22148 319144 530393 145681 92626 32101 -273821 -195161
870 -195161 -352623 -16760 176508 -32248 134781 222871 123049 -6953 -132681 -451378
860 -451378 8959 -184540 -349398 68674 -286405 -1748 47811 371404 -292742 -256201
850b56201J00133j94441M67366n5975P1163n9758Q7404n9033j45530j02976N36328
839C88480J2168p4110k88886r3084k19347j26892K83239K04582k44621J27723
829c0748M6375N4338j9907j1946n6789l43662j8546k39903L98580J45970l06847
818c83085R4142J15682M307k4093M5369k48538M6501J54451J01192K52544l17775
807a59303J69202P9920n08659K63100o8265M82039L3515j55100N5353k06971Q5826
796G0657J07213j65931K04384J76702N7947j92527K0160m1377l85676l76666N48461
785B3347K52585K43788k1756q3996k02359l25244k82932R7935M21986K63707o3163
774C23898l0488J24784j84449k34074k72457r4166K84672M22566j878k58320k0361
$$ plain form
850 -256201 -156068 -350509 116857 60882 132045 72287 159691 100658 -44872 -147848 388480
839 388480 400648 326538 37652 -55432 -274779 -401671 -118432 86150 -158471 -30748
829 -30748 15627 69965 50058 38112 -18677 -362339 -380885 -620788 -222208 -76238 -383085
818 -383085 -288943 -173261 -168954 -193047 -147678 -396216 -349715 -195264 -94072 158472 -159303
807 -159303 9899 89819 -418840 -155740 -224005 258034 291549 136449 191802 -15169 70657
796 70657 177870 11939 216323 393025 450972 258445 278605 237228 -148448 -525114 23347
785 23347 275932 519720 497964 413968 211609 -113635 -396567 -298632 123354 387061 323898
774 323898 293410 418194 233745 -329 -272786 -366952 -82280 340286 338408 80088 59727
763E9727L10994o33305M58702k70445K96087J85810l72905k32092J45805K87293
753B35671j31764r5175J02340J22018J20163m47298Q581N6357k58488l620L0294
742b60921R6875l43961K45136K52450J17773j04274r1796L30842l84108j49178
732b91162j58333p8475N62319m31698O4253M86985p8702J66457J39297p9153Q5286
721C87074l01656j43933K41232K23869k32861K62641o64604O8263M83018J69432
711D92475j19681l18902j36538O3606K48714m2920Q2285n13516j92587o41776
701a078840N05249M46323N4666r2493k47119K31996n1603j70896J88365n3738
691b68090O14841K7450k59864K40093k72564o7711n6624M2279M40261j52999l11915
$$ plain form
763 59727 370721 -262584 196118 -74327 221760 407570 34665 -197427 -51622 235671
753 235671 103907 8732 111072 233090 353253 -94045 -85464 -29107 -287595 -291215 -260921
742 -260921 -164046 -508007 -262871 -10421 107352 3078 -88718 242124 -141984 -291162
732 -291162 -449495 -527970 34349 -397349 -333096 153889 75187 241644 380941 301788 387074
721 387074 85418 -58515 182717 406586 173725 436366 -228238 -159975 323043 492475
711 492475 372794 53892 -82646 -19040 229674 186754 269039 -244477 -437064 -1078840
701 -1078840 -573591 -127268 -72602 -165095 -412214 -180218 -231821 -402717 -214352 -268090
691 -268090 346751 374201 114337 354430 81866 14155 -42469 -190 440071 287072 -24843
680b4843k37335m90672L49765L85497J08435l78863M26232k406l79985Q9049k67324
669d22450j95056K57339L95194K3552k69423l22912M05820N9677r5242m1595L13719
658A08623k37025j83004O37333k63385J18743J30739j82972R9661R4439R0131
648D13283n00165J39785l59976M2274M18569j70415K63700m49440R7857P7506
638b7022k79464K12965K96111J38463k02136K32282j46731o1223R0770n4947j17126
627H1942N3309k52824j8098L3066M6439k35266K32760l12805k56944J18819M5149
616d64453K20010j47620J57834j39491J29486j78112P4673J90563J73395l12728
606b96443J36129M60709J71374l60712J00586j94767p6158j9238l0356j88468
$$ plain form
680 -24843 -262178 -752850 -403085 -17588 90847 -288016 138216 135810 -244175 -155126 -422450
669 -422450 -617506 -360167 35027 58579 -210844 -533756 -127936 -68259 -163501 -205096 108623
658 108623 -128402 -311406 325927 62542 181285 312024 129052 228713 323152 413283
648 413283 -86882 52903 -307073 -264799 153770 -16645 247055 -202385 -104528 -27022
638 -27022 -306486 -93521 202590 341053 138917 371199 224468 163245 254015 199068 81942
627 81942 135251 -117573 -135671 -102605 -56166 -291432 -58672 -371477 -628421 -509602 -464453
616 -464453 -244443 -392063 -234229 -373720 -244234 -422346 -347673 -157110 16285 -296443
606 -296443 -160314 300395 471769 111057 211643 16876 -59282 -78520 -108876 -297344
596b97344J51756j96468K27581O207N2630j62715n9906l4520o4472j6176p2191
585d65618j31697K54976L96083L78984m1628l69049M63969k43170o7580j12024
575F3246k85059J65081j70227m18906N20283K21054r6439j32623j95057l30611
565f59258K34403K51102k7749j01238J58907p424O01977k5323o64694K15676M95705
554D72084l06740r2582R1793K84508j97615j55841o3885k12815N14089L8945l01185
543G0756K14504q124k55506J14238K22183n93778L37565j47375l96520O23928
533A81871m97504r7683L37138K33233j59643n325l24575q9499P3757M5742L76360
522G3872L36731m91366j73508J93833J01082k2282j47893J58867L08447k20704
$$ plain form
596 -297344 -145588 -342056 -114475 -108268 -55638 -218353 -278259 -312779 -377251 -393427 -465618
585 -465618 -597315 -342339 53744 432728 391100 22051 486020 242850 175270 63246
575 63246 -221813 -56732 -226959 -645865 -125582 95472 -967 -133590 -328647 -659258
565 -659258 -424855 -173753 -201502 -302740 -143833 -151257 450720 425397 -239297 -23621 472084
554 472084 165344 72762 164555 449063 251448 95607 31722 -181093 332996 371941 70756
543 70756 285260 277136 21630 135868 358051 -235727 101838 -45537 -442057 181871
533 181871 -315633 -413316 -76178 157055 -2588 -7913 -332488 -421987 -348230 -302488 73872
522 73872 410603 -80763 -254271 -60438 40644 18362 -129531 29336 337783 117079
512A17079O9176j02581J7983K59204K68407j46403m95806P70490j59199m30769
502A67581L36737j17043o12496r0380R4666L99893k86044k58818J06077J82162
492g7665N9047M68127l3603n18787m05435L11799N70522J77483j00269j41377
482C09842l39255k32004p3729j0806K55742N22855r3039j91721j7405k93361J17075
471d5806R0691J33609j87406L16089P6400k67168j59759J31204o73131M54903
461a30374m66j57345L4960Q8614o01019N27365r6121p4789j08191R1174L36107
450i0085l58083L08653J85770K99962j28185j05892M12163J7996k23380K6240
440C45159J24350j7631m36943o6447J85029J63252j95563q717M41860l5285n97618
$$ plain form
512 117079 186255 83674 101657 360861 629268 482865 -12941 757549 598350 167581
502 167581 504318 387275 -225221 -315601 -220935 178958 -107086 -365904 -259827 -77665
492 -77665 -18618 449509 415906 -102881 -508316 -196517 374005 551488 451219 309842
482 309842 -29413 -261417 -335146 -345952 -90210 432645 339606 147885 130480 -162881 -45806
471 -45806 44885 178494 -8912 307177 383577 116409 -43350 87854 -585277 -130374
461 -130374 -130840 -288185 -253225 -164611 -765630 -238265 -334386 -409175 -517366 -426192 -90085
450 -90085 -448168 -139515 46255 346217 218032 112140 524303 542299 318919 345159
440 345159 469509 451878 14935 -51512 133517 296769 101206 92489 534349 499064 -98554
429i8554J77727q7918J93116L14428l05059m64581L31863N8362J273o56678K6425
418e09596J96297l3149M35671K04332p59373k21668L23999M18921M6102K25576
408C27112k57295M06073Q8093k70110o5105J15900n02720J29771J66258j14718
398B3259N37716j24775j22004k34409L63284k55908J06412N809l36248J93494
388A56630K4593L5172l05389K44268O5012J02098L1133P6008o0081o35364K34391
377c1529J70837L74567j36311k87367j4907K54019k7529k8348j85024N2131n4185
366H6354J64732n5549o64713K13387M31641K32182O1879K32866j11744k93463
356B97572K23931n33381J90362L6656q8147K95819Q9684m74025Q5547M19009l01857
$$ plain form
429 -98554 79173 -8745 184371 498799 193740 -270841 61022 119384 120657 -536021 -509596
418 -509596 -313299 -346448 89223 293555 -465818 -687486 -363487 55434 101536 327112
408 327112 69817 475890 563983 293873 228768 344668 -158052 -28281 137977 23259
398 23259 560975 436200 314196 79787 443071 187163 293575 299384 -36864 156630
388 156630 181223 216395 -88994 155274 220286 322384 353517 429525 369444 -265920 -31529
377 -31529 139308 513875 377564 90197 75290 329309 301780 273432 88408 140539 86354
366 86354 251086 195537 -469176 -255789 175852 408034 469913 702779 591035 297572
356 297572 521503 -11878 178484 215140 126993 422812 512496 38471 124018 543027 241170
345B41170L39227J09596p22754J71124M6007M41815l79193m3719J51468l37996
335A6745k6682L8362J032K46084Q2817j51573L47663q3199m86609k33254l864
324b52478J34326K30132L20457j12881q7317k17366k50557o2839J05878M82925
314B90280j08969R5690l8081J73054l14831j36886K77021N56662m63118n76049
304b45227L15382J62395j00151o7697M177K77295J78660K79975l30268j10442
294C64099J63073m69590R1006n6005l19652O65700o9810j52884j25558J79531
284B69910L54260j02956O2109n1598k33654m259J412M9959K96992m0251m14693
273A87231j49011Q6112J94042J8662k88638J43347J69753K14588N3241j91848
$$ plain form
345 241170 580397 689993 -32761 138363 184370 626185 246992 203273 354741 16745
335 16745 -9937 28425 29457 275541 358358 206785 554448 471249 -15360 -248614 -252478
324 -252478 -118152 111980 432437 319556 232239 14873 -235684 -298523 -192645 290280
314 290280 181311 277001 238920 411974 97143 -39743 237278 793940 330822 -245227
304 -245227 70155 232550 132399 64702 68879 346174 524834 804809 474541 364099
294 364099 527172 57582 148588 92583 -227069 438631 368821 215937 90379 269910
284 269910 624170 521214 583323 531725 298071 293812 295224 345183 642175 601924 187231
273 187231 38220 124332 318374 337036 48398 191745 361498 576086 629327 437479
263D37479k07752l12710k71429L17196j74091K63341J61872J70849l05680O8828
253A47903j97755j81004J83066j07907K7135M60058M00120K08334j78079k68152
243D93719q7459j4126j85006l71722K20358k51188K30605M89489l9901l77310
233A07459m06345L43543k52087J29416O2829n51944M01291O7573K76329P167M40804
222F26035K6599k30149k06325n88908M80385K18611j07427J830q8823R7401k00769
211B8460J28564J8654r9686K85474K74505r5588l5913K23299M64477j00761l69735
200G21750p35034J37757j20581J86654O28578k75816j81481q5341n5634n8679
190A62173K44183K63462l13099Q553K58161m50209n7351K22685k12509J13237
$$ plain form
263 437479 229727 -82983 -354412 -37216 -211307 52034 213906 384755 79075 147903
253 147903 -49852 -230856 -47790 -155697 -128562 331496 731616 939950 761871 493719
243 493719 406260 392134 207128 -164594 55764 -195424 35181 524670 484769 107459
233 107459 -298886 44657 -207430 -78014 -15185 -567129 -165838 -98265 178064 185231 626035
222 626035 652634 422485 216160 -372748 107637 326248 218821 220651 131828 229229 28460
211 28460 157024 175678 75992 361466 635971 540383 504470 727769 1192246 1091485 721750
200 721750 -13284 124473 3892 190546 819124 543308 361827 276486 220852 162173
190 162173 406356 669818 356719 365272 623433 173224 115873 338558 126049 239286
180B39286K9951k66474o2542J208k5658n0936Q6011J4347k6825j05477M40809
169B73700L74003P0839k14277j49356j86076K76087r8980j73677R4198j40508
159A25953N656l01619J95834m0290K44056j31667n5176R7847m161n938J16609
148B47104J35291l54992j78876K85843j50021K47047k4301k34220O34008l99536
138B07347l21900P0609Q2909o8453K12412M1764M14574n000l96108n3935J56948
127C41167n8134k67964p2150J14148J45311R7585j69103J09316j83097o2757M51741
116D46063j10357k1766r489k06164k68367j61655M85282j8254J43256n3205M69015
105F94359l42296m53516M20680j06964j1283J02799k63586j01347J82899M8266
$$ plain form
180 239286 269237 2763 -59779 -58571 -84229 -135165 -49154 -34807 -61632 -167109 273700
169 273700 647703 718542 504265 354909 168833 444920 345940 172263 266461 125953
159 125953 131609 -170010 25824 -14466 229590 97923 42747 140594 136433 130495 247104
148 247104 382395 27403 -151473 134370 -15651 231396 207095 -27125 606883 207347
138 207347 -114553 -43944 38965 -29488 182924 224688 639262 634262 238154 184219 341167
127 341167 283033 15069 -57081 57067 202378 299963 130860 240176 57079 -5678 446063
116 446063 335706 313940 304451 98287 -170080 -331735 153547 135293 278549 225344 694359
105 694359 352063 -101453 319227 212263 200980 303779 40193 -61154 121745 170011
95A70011N90263j29024m05290J25046k00262L44529L46500k49242l7362j64419
85C90750j57626R1697j04615k11750K53434K21127l44849l62710J81177l0135
75g3500K70095P4477M2303j31506l31549J84493J96495k01295Q9023j8239j17556
64a6759q0306M16735L13273o8865n40538o91O5074l6548L26338l0992k75926M19428
52D90223j83357l15777L05740J42735J34748o8534l09661j61276K26494J22249
42C83584j41482k07056J86170p7483j31788j15392J9346J34332L46845l49564
32D7512J67089L94126k35995j71807M981r6106L52835J36277j25277k03709l11504
21d1578J08660j46038L04746n5326j80574L23258N11385m60376j98224M4071n1499
$$ plain form
95 170011 760274 631250 225960 351006 150744 495273 841773 592531 555169 390750
85 390750 233124 324821 220206 8456 261890 483017 138168 -224542 -43365 -73500
75 -73500 196595 271072 313375 181869 -149680 34813 231308 30013 119036 100797 -16759
64 -16759 -97065 319670 632943 564078 23540 22849 87923 51375 377713 346721 70795 490223
52 490223 306866 -8911 296829 439564 574312 505778 196117 34841 261335 383584
42 383584 242102 35046 221216 143733 11945 -103447 -84101 50231 397076 47512
32 47512 214601 608727 372732 200925 205906 109800 462635 598912 473635 269926 -41578
21 -41578 67082 -78956 225790 170464 -10110 313148 824533 364157 165933 210004 158505
10A58505J46730r5652k08130k35927L64056K94129j85626r5962n8980Q7229
0A70372
$$ plain form
10 158505 305235 209583 1453 -234474 129582 423711 238085 142123 83143 170372
0 170372
$$ Imaginary data points
##PAGE= N=2
##DATA TABLE= (X++(I..I)), XYDATA
16383i25219M3330m3698K13468K5422q4100m49090K62479n1095K19954l67599
16373a156148Q4046M09676k51679L21045M4618J34214k97910j4790K38765J91273
16363b96890j56789L2134o2923j88361J65306j39879j74759J75964J62681l58811
16353h42327j21908L01450j9197q0520L04167K17861k80437k30103k09655P2458
16343h88211K46397l08386J64901K98879L8739K29468J06252p688j12026k22790
16333d54465K94496k77135J90887J95932k56632m0244P8897l5624j7616J74791
16323a46713l69451L55991l67782L14578m6328K24955l72572j71467O5602j0787
16313e23974k0262O2700J54257l2352L02183N4993J6523o2408K51305k69156p4989
$$ plain form
16383 -925219 -881889 -925587 -712119 -686697 -770797 -1219887 -957408 -1008503 -788549 -1156148
16373 -1156148 -1072102 -662426 -914105 -593060 -548442 -414228 -712138 -726928 -488163 -296890
16363 -296890 -453679 -421545 -484468 -672829 -507523 -647402 -822161 -646197 -483516 -842327
16353 -842327 -964235 -662785 -681982 -762502 -458335 -240474 -520911 -751014 -960669 -888211
16343 -888211 -641814 -950200 -785299 -486420 -447681 -218213 -111961 -119649 -231675 -454465
16333 -454465 -159969 -437104 -246217 -50285 -306917 -347161 -268264 -303888 -321504 -146713
16323 -146713 -516164 -160173 -527955 -213377 -259705 -34750 -407322 -578789 -513187 -523974
16313 -523974 -544236 -481536 -327279 -359631 -57448 -2455 14068 -48340 202965 -66191 -141180
16302a41180N8368J2982l7551l75585J61634J48294k98308M9789K38449M80903
16292B97795k65909R68j52156Q1582L5122q2513m2457J17555J41498j89560j07327
16281a65402J45645k33625M38398M05728j90699k19378J56630K63306j91034n41293
16271a31724o2676M21189K18007N4892k68285J09182l51283j03779M62564m6567
16261C01520o67828J13266N17129J18584l41161k07411K76707N04497J59089j74725
16251E99667q7807K10260k9386m10545J14759o8863r9600M1159K62643J63968
16241F96255M2081k33331k4415K84258l96930K39291K91460J8377m8138j33307
16231G35601L3592r6226j74177j26986L89108j40899j12149m6209k4428M07871
$$ plain form
16302 -141180 -82812 -69830 -107381 -482966 -321332 -173038 -471346 -421557 -183108 297795
16292 297795 31886 32854 -119302 -37720 -2598 -85111 -127568 -10013 131485 -58075 -165402
16281 -165402 -19757 -253382 185016 590744 400045 180667 337297 600603 409569 -131724
16271 -131724 -194400 226789 444796 499688 231403 340585 -10698 -114477 348087 301520
16261 301520 -366308 -253042 264087 382671 41510 -165901 110806 615303 774392 599667
16251 599667 511860 722120 692734 282189 396948 328085 228485 269644 532287 696255
16241 696255 738336 505005 480590 764848 367918 607209 898669 917046 868908 735601
16231 735601 769193 672967 498790 371804 760912 620013 507864 461655 437227 845098
16221H45098K09631m08728j55167k7405L52707j45470m06856K48223M70001l73783
16211F08251j21021R3847m05208p945O92510J85967l34743k66148L54766N1397
16201H51673J03267J65866K01641m76615m22562K00345k35527K2927j81818J85004
16191D14201J71848L93265k07967R2532m36278j04458L76052K62882R7605m06683
16181F52999o5912J96842m28731j31548K48642K60261j5787p6025k89532M00859
16171G52068K19828K46176m832m39375j67138N91561j26509n00265j68314N54562
16161I57762K33909l6051l12540k30674J9664j17509L07384j47358Q6051Q3759
16151H44397j09904m9500N38557l7891k04411L3718j39972J00968k94121j7472
$$ plain form
16221 845098 1054729 646001 490834 463429 816136 670666 263810 512033 982034 608251
16211 608251 487230 581077 175869 167924 860434 1046401 711658 445510 800276 851673
16201 851673 954940 1120806 1322447 845832 423270 623615 388088 411015 229197 414201
16191 414201 586049 979314 771347 863879 427601 323143 699195 962077 1059682 652999
16181 652999 587087 783929 355198 223650 472292 732553 716766 640741 351209 752068
16171 752068 971896 1218072 1213240 773865 606727 1198288 1071779 571514 403200 957762
16161 957762 1191671 1155620 843080 612406 632070 514561 821945 674587 760638 844397
16151 844397 734493 684993 1223550 1185659 981248 1014966 874994 975962 681841 664369
16141F64369k5615Q889q900p6913J4680J82290k68404J84173M03752k83022J97696
16130I92995M3637j93553k8332O96593O7918m36511k93525j50158J0625N28076
16120A237765j77123j92110k06725l008j63886k09333P25546L15136m60292Q7588
16110I53558j07739K33770l42820J91619K36726M03445k02905k91205k6676R8182
16100A145955j07130n98924N46852L28336L8712r7555O3290l79562K46744j19638
16090A067080m4901N2876L12748J72099o22694r9775K48711k10914j9537j43466
16080G12227M26003K86430p45364Q1552q417K78609K35612r8640K61389J27251
16070A556652k04767l56675l86118m00423L98707K51694M6250L27132K35140l6157
$$ plain form
16141 664369 638754 647643 638743 561830 576510 758800 490396 674569 1078321 795299 992995
16130 992995 1036632 843079 814747 1511340 1579258 1142747 849222 699064 709689 1237765
16120 1237765 1060642 868532 661807 658799 494913 285580 1011126 1326262 865970 953558
16110 953558 845819 1079589 736769 928388 1165114 1568559 1365654 1074449 1047773 1145955
16100 1145955 1038825 439901 986753 1315089 1353801 1256246 1319536 939974 1186718 1067080
16090 1067080 1022179 1075055 1387803 1559902 937208 837433 1086144 875230 855693 712227
16080 712227 1138230 1424660 679296 760848 752431 1031040 1266652 1168012 1429401 1556652
16070 1556652 1351885 995210 609092 208669 607376 859070 905320 1232452 1467592 1431435
16060A431435l84314k10101j53580K07446k0902k67316k5308N05856k65558p2239
16050G45419j16346J21084N03452M9228K21689o60991k21865K70263M6619j49368
16040H09184N25226p6213q29890j04343M29518O2238j17988P3848l33235K47826
16030F86171K84315L42587j04185j36887P5158j24437Q3912O3074j36380k23144
16020H10184J13520Q8404L1329j45735j62112l18283M24588K32922l9333k3240
16010A012244L479M494J05320K55503j19194J33600k22638k80081K18432L36664
16000A447823k41338j7801K30326J13651k31567L8941l10405m67595K43209l32268
15990D72976K54272L90317j54999J30527j75478j33401l1395l18790j28727J48513
$$ plain form
16060 1431435 1047121 837020 683440 890886 869984 602668 577360 1083216 817658 745419
16050 745419 629073 750157 1253609 1302837 1524526 863535 641670 911933 958552 809184
16040 809184 1334410 1258197 428307 323964 753482 815720 697732 771580 438345 686171
16030 686171 970486 1313073 1208888 1072001 1147159 1022722 1106634 1169708 1033328 810184
16020 810184 923704 1012108 1043437 897702 735590 417307 841895 1074817 1035484 1012244
16010 1012244 1015723 1020217 1125537 1381040 1261846 1395446 1172808 892727 1111159 1447823
16000 1447823 1206485 1188684 1419010 1532661 1301094 1340035 1029630 562035 805244 472976
15990 472976 727248 1117565 962566 1093093 917615 784214 752819 434029 305302 453815
15980D53815K53412o6552J11262j24732O8141K84686L3277J9579k21497j01454
15970G09937L76172K99646J04307p83029J19672K02475N7599k81504k28746L49059
15960I25588j5162J35805q120k95385j55950J44598K81916P4813n37049P60745
15950A311799j99417J41651o86558J52187N04813k16072r8171L61093k05368k98302
15940G67655R3194j15221J36607j415M50470m58415P90483J69965l37198k57371
15930A238754K67277n90185K11114K61996J76438J6279j82188k5394m05317Q0973
15920A049747N5824j81827J97178J40942q2897N115L3497n3839J26954o3802k10090
15909A016802J07333K8801L66578k62205k79813k91985k92381K1926R43515j29038
$$ plain form
15980 453815 707227 640675 751937 627205 695346 980032 1013309 1032888 811391 709937
15970 709937 1086109 1385755 1490062 707033 826705 1029180 1086779 805275 576529 925588
15960 925588 910426 1046231 1038111 742726 586776 731374 1013290 1088103 551054 1311799
15950 1311799 1112382 1254033 567475 719662 1224475 1008403 910232 1271325 1065957 767655
15940 767655 860849 745628 882235 880820 1331290 872875 1663358 1833323 1496125 1238754
15930 1238754 1506031 915846 1126960 1388956 1565394 1581673 1399485 1374091 968774 1049747
15920 1049747 1105571 923744 1120922 1261864 1178967 1184082 1217579 1163740 1290694 1226892 1016802
15909 1016802 1124135 1152936 1519514 1257309 977496 685511 393130 415056 1358571 1229533
15899A229533m10144m34548O18837O8588k94165J90725M6198K3191l52836j55715
15889E29664l81688N13325J21820l15435L77412K68000j19669L01828k40436Q9388
15879A144209l52337K95982K95052r2316l54347L7032R5620l15944K55155k3760
15869I84346J16568J22171j82519l81669J91640j6441K65433K38834l19757J69674
15859A188280J56943n62639M78316j82485J61143q8412J28730n1429l07504p8865
15849H42078p7128K10785J57552P1055j76082R5310l76547Q6793J49874K02682
15839A186372J8202L4522K48730l42512k36315L79816o1336j03404q2668k63641
15829G77766L04248l14309l6460J24656r8891K18178M61681J00838n15387l6416
$$ plain form
15899 1229533 819389 384841 1003678 1072266 778101 968826 1015024 1038215 685379 529664
15889 529664 147976 661301 783121 467686 845098 1113098 993429 1295257 1054821 1144209
15879 1144209 791872 1087854 1382906 1290590 936243 973275 1068895 752951 1008106 984346
15869 984346 1100914 1223085 1040566 658897 850537 834096 1099529 1338363 1018606 1188280
15859 1188280 1345223 782584 1260900 1078415 1239558 1151146 1279876 1228447 920943 842078
15849 842078 764950 975735 1133287 1204342 1028260 1123570 747023 833816 983690 1186372
15839 1186372 1204574 1239096 1487826 1145314 908999 1288815 1227479 1124075 1041407 777766
15829 777766 1082014 767705 731245 855901 757010 975188 1436869 1537707 1022320 985904
15819I85904l38745j94490L18780n640L29249m7791J83595Q9678k00788j15040
15809A004712M11854m0358k89645N35327n95814N5412K63064p18735n30398O54667
15799G50086l43007j62841M60378R2667k5526K05386o73683L14305J73015J973
15789G92753L82567m64253K73466K68738j66208j82603L68880J43588p859k97367
15779A111702l9050m2444M15308j64797M2678p2305m36295j20926L39801k50147
15769G83525K28821M21432k54177J4317o5553n72229j47207M93109N7568M5671
15759A005277j06039k8497N64644O2518n44265J8357J93721o5866N0263J40338
15749A290451j44786j49817O4210R2300q3841j61637M19313k9177k34464K17905
$$ plain form
15819 985904 647159 452669 771449 765809 1095058 1047267 1230862 1320540 1119752 1004712
15809 1004712 1416566 1376208 1086563 1621890 1026076 1081488 1344552 625817 95419 750086
15799 750086 407079 244238 704616 797283 771757 977143 303460 617765 790780 792753
15789 792753 1175320 711067 984533 1253271 1087063 904460 1273340 1416928 1409069 1111702
15779 1111702 1072652 1030208 1445516 1280719 1323397 1251092 814797 693871 1033672 783525
15769 783525 1012346 1433778 1179601 1193918 1128365 556136 408929 902038 959606 1005277
15759 1005277 899238 870741 1435385 1497903 953638 971995 1165716 1099850 1150113 1290451
15749 1290451 1145665 995848 1060058 1152358 1068517 906880 1326193 1297016 1062552 1280457
15739A280457P7368M7327k94635l97192j04601J80228k8607Q99386N8382m18387
15729A299726k79362J75418k37388k52006J76998R6572j77631J64468K97599J09295
15719A373689m61503J53042k96861k36150J35862K51426m277P0709J47430J16125
15709A249492j7716k09598M99909m00224K32460M6469k99561k86344j72170L54636
15699I97353o027J45917j57014m67479L94609K43137l0521J31114j92268j55212
15689I03609M38707L61630l09251l62356K92194o7738l5586j64964j25104j85741
15679G45400K49003l41214K8864M20454M5236J08430k16077j61833K39899j9769
15669A098393L24682j90931r0549m8963p2980N20058l15898N306j77529k18083
$$ plain form
15739 1280457 1357825 1405152 1110517 713325 608724 788952 760345 1659731 1718113 1299726
15729 1299726 1020364 1195782 958394 706388 883386 979958 802327 966795 1264394 1373689
15719 1373689 912186 1065228 768367 532217 668079 919505 915228 985937 1133367 1249492
15709 1249492 1231776 1022178 1522087 1121863 1354323 1400792 1101231 814887 642717 997353
15699 997353 991326 1137243 980229 512750 907359 1150496 1119975 1251089 1058821 903609
15689 903609 1342316 1703946 1394695 1032339 1324533 1256795 1221209 1056245 931141 745400
15679 745400 994403 653189 682053 1102507 1147743 1256173 1040096 878263 1118162 1098393
15669 1098393 1423075 1232144 1141595 1092632 1019652 1539710 1223812 1229118 1051589 833506
15659H33506k33892K58054J68458k63627R0434K46769N9302r11425K15451K94979
15649G58009M12035L85642m38527j81837J05931M8552k73579M33477O7914p7167
15639A240450m42699K59331j61058K92341R5289m97904K5586L49493j01175k67173
15629G92481j2425l1702j38123M8320L48254j94626J65512K29619j06886J14519
15619A214943r7237l97815L93929n19063P1379O25451O19884n92404l2812L820
15609A290075k46054J6150p1698K8250k5384j29845k5650K34282J27283k91017
15599I06392L64485J1662n29943J28384K77807k81863K93866n845m42350J73804
15589H96399K21002O3643Q4360k32101J7362L98618j95610N467L6461q2428j64296
$$ plain form
15659 833506 599614 857668 1026126 762499 852933 1099702 1159004 247579 463030 758009
15649 758009 1170044 1555686 1117159 935322 1041253 1089805 816226 1249703 1317617 1240450
15639 1240450 797751 1057082 896024 1188365 1283654 785750 811336 1160829 1059654 792481
15629 792481 780056 748354 610231 658551 1006805 812179 977691 1207310 1100424 1214943
15619 1214943 1117706 719891 1113820 594757 666136 1291587 1911471 1319067 1286255 1290075
15609 1290075 1044021 1060171 988473 1016723 991339 861494 835844 1070126 1197409 906392
15599 906392 1270877 1282539 752596 880980 1158787 876924 1170790 1164945 722595 896399
15589 896399 1117401 1181044 1265404 1033303 1050665 1449283 1253673 1259140 1295601 1213173 1048877
15578A048877K71601n23477N0072N34138n5855l68014L81273J95324m97521p4081
15568I62337m2344k66124N29351l12210M71502k25218j18472R8427j50773k23341
15558G23135j85993J36650N708R0979l90632J30992M06838K23342k3675m78259
15548F39085K84298J04112o3506J01048r1999K43887k26441j68139j13678L53392
15538A062059j38186J74580j26202N4239k18747J21716k47903j65297J93147r175
15528G00231K27928q473M78772m11949J48640R5357R7600l18241j11475K44113
15518A142503L662j25296K48172J87988p77351o7959p0070P1931M03304R2426
15508A109310k73226J25997k22594l39446J53263J82142J18431l3604k1204k63757
$$ plain form
15578 1048877 1320478 797001 847073 1381211 1325356 957342 1338615 1533939 1036418 962337
15568 962337 919993 653869 1183220 871010 1342512 1117294 998822 1097249 946476 723135
15558 723135 537142 673792 679500 770479 379847 510839 917677 1141019 1117344 639085
15548 639085 923383 1027495 963989 1065037 973038 1216925 990484 822345 708667 1062059
15538 1062059 923873 1098453 972251 1026490 807743 929459 681556 516259 709406 700231
15528 700231 928159 919686 1398458 986509 1135149 1230506 1328106 1009865 898390 1142503
15518 1142503 1146165 1020869 1269041 1457029 679678 611719 541649 613580 1016884 1109310
15508 1109310 836084 962081 739487 400041 553304 735446 853877 820273 799069 535312
15498E35312L32730K21369n2623j62521k72662J20595Q05443k01961K53710K13023
15488A792415n40946j32352M43242p8204K1762j12428k98446l7389k06623N7056
15478I08087p7115J91338N361k91775j51592J72544j72754M69748Q4554Q2682
15468A221078J58466k73643m14578J19292l9714r389J21216J54046l89711J58788
$$ plain form
15498 535312 868042 1089411 1036788 874267 601605 722200 1527643 1325682 1579392 1792415
15488 1792415 1251469 1119117 1562359 1484155 1505917 1393489 1095043 1057654 851031 908087
15478 908087 830972 1022310 1027671 735896 584304 756848 584094 1053842 1138396 1221078
15468 1221078 1379544 1105901 691323 810615 770901 761512 882728 1036774 647063 805851
$$ [...]
##END NTUPLES=NMR SPECTRUM
##END=
