##TITLE=1H_CG-1151-A4
 CDCl3, 8 sc, 
 26.08.2021
##JCAMPDX= 6.0         $$ Bruker NMR JCAMP-DX V2.0
##DATA TYPE= NMR SPECTRUM
##DATA CLASS= NTUPLES
##ORIGIN= UXNMR, Bruker Analytische Messtechnik GmbH
##OWNER= root
$$ XWIN-NMR		Version 3.5
$$ Thu Aug 26 09:23:42 2021 Russian Standard Time (UT+4h)  she@DPX200
##.OBSERVE FREQUENCY= 200.131506
##.OBSERVE NUCLEUS= ^1H
##.ACQUISITION MODE= SIMULTANEOUS
##.ACQUISITION SCHEME= undefined
##.AVERAGES= 8
##.DIGITISER RES= 18
##SPECTROMETER/DATA SYSTEM= spect
##.PULSE SEQUENCE= zg30
##.SOLVENT NAME= CDCl3
##.SHIFT REFERENCE= (INTERNAL, CDCl3, 0, 17.4983)
##AUDIT TRAIL= $$ (NUMBER, WHEN, WHO, WHERE, WHAT)
$$ ##TITLE= Audit trail, XWIN-NMR		Version 3.5
$$ ##JCAMPDX= 5.01
$$ ##ORIGIN= Bruker BioSpin GmbH
$$ ##OWNER= she
$$ F:/spectra/data/she/nmr/H-F/1/pdata/1/auditp.txt
$$ ##AUDIT TRAIL=  $$ (NUMBER, WHEN, WHO, WHERE, WHAT)
(   1,<2021-08-26 09:22:27.25 +0400>,<she>,<DPX200>,
      <created by zg, POWCHK disabled, PULCHK disabled
       configuration hash MD5:
       00 E9 B6 7A A2 85 ED C7 34 08 36 98 17 FE 4E 26
       data hash MD5: 16K
       D5 50 C4 83 94 12 8B D7 4F 0D 0C 53 72 74 1A 60>)
(   2,<2021-08-26 09:22:29.84 +0400>,<she>,<DPX200>,
      <Start of raw data processing
       efp BC_mod = 2 LB = 0.24 FT_mod = 6 PKNL = 1 PHC0 = -13358.85 PHC1 = 16.00099 SI = 16K 
       data hash MD5: 16K
       F5 9E 2A D6 C3 71 C3 B3 B8 38 13 B4 98 D9 21 48>)
(   3,<2021-08-26 09:22:52.17 +0400>,<she>,<DPX200>,
      <pk PHC0 = 1.426194 PHC1 = -1.788139e-07 
       data hash MD5: 16K
       1D 02 D2 A2 A7 34 96 B7 D7 99 21 EE D6 8F 59 7C>)
(   4,<2021-08-26 09:22:55.56 +0400>,<she>,<DPX200>,
      <abs ABSG = 5 
       data hash MD5: 16K
       BC 66 90 86 4B BC D7 50 63 3B A6 2C EF C9 8D 02>)
$$ ##END=
$$ 
$$ hash MD5
$$ 7D 50 DB 99 E2 7A 39 B4 D7 72 6E 33 70 25 6A 05
##$RELAX= 
##$RELAX= 
##$RELAX= 
##$RELAX= 
##$RELAX= 
##$RELAX= 
$$ Bruker specific parameters
$$ --------------------------
##$DU= <F:/spectra>
##$EXPNO= 1
##$NAME= <H-F>
##$PROCNO= 1
##$TYPE= <nmr>
##$USER= <she>
##$AMP= (0..31)
100 100 100 100 100 100 100 100 100 100 100 100 100 100 100 100 100 100 
100 100 100 100 100 100 100 100 100 100 100 100 100 100 
##$AQSEQ= 0
##$AQ_mod= 1
##$AUNM= <au_zg>
##$AUTOPOS= <>
##$BF1= 200.13
##$BF2= 200.13
##$BF3= 200.13
##$BF4= 200.13
##$BF5= 200.13
##$BF6= 200.13
##$BF7= 200.13
##$BF8= 200.13
##$BYTORDA= 1
##$CFDGTYP= 0
##$CFRGTYP= 5
##$CHEMSTR= <none>
##$CNST= (0..31)
1 1 145 1 1 1 1 1 1 1 1 1 1 1 1 1 1 1 1 1 1 1 1 1 1 1 1 1 1 1 1 1 
##$CPDPRG= <>
##$CPDPRG1= <>
##$CPDPRG2= <>
##$CPDPRG3= <>
##$CPDPRG4= <mlev>
##$CPDPRG5= <mlev>
##$CPDPRG6= <mlev>
##$CPDPRG7= <mlev>
##$CPDPRG8= <mlev>
##$CPDPRGB= <>
##$CPDPRGT= <>
##$D= (0..31)
0 1.2 0 0 0 0 0 0 0 0.06 0 0.03 0 0 0 0 0.0002 0 0 0 0 0 0 0 0 0 0 0 0 
0 0 0 
##$DATE= 1629955346
##$DBL= (0..7)
120 120 120 120 120 120 120 120 
##$DBP= (0..7)
150 150 150 150 150 150 150 150 
##$DBP07= 0
##$DBPNAM0= <>
##$DBPNAM1= <>
##$DBPNAM2= <>
##$DBPNAM3= <>
##$DBPNAM4= <>
$$ [...]
##$SUBNAM3= <"">
##$SUBNAM4= <"">
##$SUBNAM5= <"">
##$SUBNAM6= <"">
##$SUBNAM7= <"">
##$SUBNAM8= <"">
##$SUBNAM9= <"">
##$SW= 20.0188882624521
##$SWIBOX= (0..15)
0 0 2 0 0 0 0 0 0 0 0 0 0 0 0 0 
##$SW_h= 4006.41025641026
##$TD= 16384
##$TD0= 1
##$TE= 0
##$TE2= 300
##$TE3= 300
##$TEG= 300
##$TL= (0..7)
0 120 120 120 120 120 120 120 
##$TP= (0..7)
150 150 150 150 150 150 150 150 
##$TP07= 0
##$TPNAME0= <>
##$TPNAME1= <>
##$TPNAME2= <>
##$TPNAME3= <>
##$TPNAME4= <>
##$TPNAME5= <>
##$TPNAME6= <>
##$TPNAME7= <>
##$TPOAL= (0..7)
0.5 0.5 0.5 0.5 0.5 0.5 0.5 0.5 
##$TPOFFS= (0..7)
0 0 0 0 0 0 0 0 
##$TUNHIN= 0
##$TUNHOUT= 0
##$TUNXOUT= 0
##$USERA1= <user>
##$USERA2= <user>
##$USERA3= <user>
##$USERA4= <user>
##$USERA5= <user>
##$V9= 5
##$VALIST= <valist>
##$VCLIST= <CCCCCCCCCCCCCCC>
##$VD= 0
##$VDLIST= <DDDDDDDDDDDDDDD>
##$VPLIST= <PPPPPPPPPPPPPPP>
##$VTLIST= <TTTTTTTTTTTTTTT>
##$WBST= 1024
##$WBSW= 4
##$XGAIN= (0..3)
0 0 0 0 
##$XL= 0
##$YL= 0
##$YMAX_a= 144812
##$YMIN_a= -161090
##$ZGOPTNS= <>
##$ZL1= 120
##$ZL2= 120
##$ZL3= 120
##$ZL4= 120
##$ABSF1= 17.52032
##$ABSF2= -2.498718
##$ABSG= 5
##$ABSL= 3
##$ALPHA= 0
##$AQORDER= 0
##$ASSFAC= 0
##$ASSFACI= 0
##$ASSFACX= 0
##$ASSWID= 0
##$AUNMP= <proc_1d>
##$AZFE= 0.1
##$AZFW= 0.1
##$BCFW= 0
##$BC_mod= 2
##$BYTORDP= 0
##$COROFFS= 0
##$CY= -3
##$DATMOD= 1
##$DC= 0
##$DFILT= <>
##$DTYPP= 0
##$F1P= 0
##$F2P= 0
##$FCOR= 1
##$FTSIZE= 16384
##$FT_mod= 6
##$GAMMA= 0
##$GB= 0
##$INTBC= 1
##$INTSCL= 1.334414e-10
##$ISEN= 128
##$LB= 0.24
##$LEV0= 0
##$LPBIN= 0
##$MAXI= 10000
##$MC2= 0
##$MEAN= 0
##$ME_mod= 0
##$MI= 1.114404
##$NCOEF= 0
##$NC_proc= -8
##$NLEV= 6
##$NOISF1= 3.799351
##$NOISF2= 2.8
##$NSP= 0
##$NTH_PI= 0
##$NZP= 0
##$OFFSET= 17.49833
##$PC= 1
##$PHC0= -13357.42
##$PHC1= 16.00099
##$PH_mod= 1
##$PKNL= yes
##$PPARMOD= 0
##$PSCAL= 0
##$PSIGN= 0
##$REVERSE= no
##$SF= 200.130007263783
##$SI= 16384
##$SIGF1= 3
##$SIGF2= 2
##$SINO= 5.538805
##$SIOLD= 16384
##$SREGLST= <1H.CDCl3>
##$SSB= 0
##$STSI= 16384
##$STSR= 0
##$SW_p= 4006.41025641026
##$SYMM= 0
##$S_DEV= 0
##$TDeff= 16384
##$TDoff= 0
##$TI= <>
##$TILT= no
##$TM1= 0
##$TM2= 0
##$TOPLEV= 0
##$USERP1= <user>
##$USERP2= <user>
##$USERP3= <user>
##$USERP4= <user>
##$USERP5= <user>
##$WDW= 1
##$XDIM= 16384
##$YMAX_p= 345297133
##$YMIN_p= -1285647
$$ End of Bruker specific parameters
$$ ---------------------------------
##NTUPLES= NMR SPECTRUM
##VAR_NAME=  FREQUENCY,     SPECTRUM/REAL,   SPECTRUM/IMAG
##SYMBOL=    X,             R,               I
##VAR_TYPE=  INDEPENDENT,   DEPENDENT,       DEPENDENT
##VAR_FORM=  AFFN,          ASDF,            ASDF
##VAR_DIM=   16384,         16384,           16384
##UNITS=     HZ,            ARBITRARY UNITS, ARBITRARY UNITS
##FACTOR=    0.24454680195387, 1,            1
##FIRST=     3501.94074241473, 0,            0
##LAST=      -504.469513995525, 0,           0
##MIN=       -504.469513995525, -1285647,    0
##MAX=       3501.94074241473, 345297133,    0
$$ Real data points
##PAGE= N=1
##DATA TABLE= (X++(R..R)), XYDATA
$$ [...]
8497 20815731 21080460 21735014 22335981 22515636 22402973 22447267 21783156 21442834 20552812 19897296
8487 19897296 18664054 17432718 16475041 15671308 15492584 14620089 14702482 14629009 13558606
8478 13558606 13430607 13291924 13099450 13384688 13793429 13760883 13905149 13729410 13815095 13983430
8468 13983430 13850368 14162636 14259273 14594917 14712894 14767228 14879539 15296590 15873638 16133131
8458 16133131 16470404 16766189 17711542 18343013 18722008 19582058 19847147 20682965 21353697
8449 21353697 22305644 23270590 24751679 26374453 27665393 28634129 30026881 32155602 33991956
8440 33991956 35985215 38724035 41008461 42940379 45578624 48001859 50078622 52869896
8432 52869896 54744075 56843422 58721863 59788074 60200564 60131537 59874984 59671210 58715296
8423 58715296 57439410 55480412 54092450 52459886 51019714 50068405 48701095 47389914
8415 47389914 47160591 46725014 46316803 46921561 47358365 48032538 48753422 49796910 50784761
8406 50784761 52531542 54443515 56821888 59256464 61362351 63079600 64948344 66665786
8398 66665786 67674281 68663607 68983329 68892008 68253700 67011969 65319737 62778810 59856086
8389 59856086 56674307 53677294 50006047 46841143 43278411 40484058 37987875 35332964
8381 35332964 33147336 31140500 29290934 27816372 26360453 24805330 23455565 22851050
8373 22851050 21906690 20907857 20023174 19040910 18075926 16900663 16361548 16320188 15726144
8364 15726144 15139444 14641189 13808951 13338341 13086876 12932053 12523027 11800818 11751293 11471085
8354 11471085 11621466 11473561 10977808 10842550 11146717 10615696 9780676 9638402 9606564 9310083
8344 9310083 9120316 9093936 8998848 8967046 8775900 8365604 8116743 7868933 7409079 7245318
8334 7245318 7954087 7866095 7357429 7261474 6803207 7008878 6783299 6774995 6579611 6251344
8324 6251344 6211717 6676235 6512507 6158922 6225711 6006965 5807144 5750363 6108115 6400245
8314 6400245 6235931 6565907 6205794 6376297 6169917 5984596 5762702 5583947 5739403 5602881
8304 5602881 5762444 5308070 5216171 5122829 5020297 5420883 5073582 5030120 5333903 5494656
8294 5494656 5216140 4789796 4487172 4448220 4429344 4419701 4827862 4768019 4488720 4741421
8284 4741421 4895024 4969808 4859208 4665192 5025345 4856997 4684444 4706330 5124742 5017066
8274 5017066 4729907 4975378 4697829 4405566 4448343 4064716 4001044 4355992 4201647 4128470
8264 4128470 3680865 4047769 4152810 4009307 3969746 3941278 4362939 4543346 4611728 4123645
8254 4123645 4400599 4643746 4735276 4383517 4553534 4753945 4701881 4862474 4295338 4777350
8244 4777350 4565635 4000388 4217946 4521124 5032373 4769278 4227390 4289546 5185310 5192662
8234 5192662 5297282 5086721 4801064 4582431 4626810 5240083 5135275 5655970 5693128 5204836
8224 5204836 5203826 5666954 5758239 5816588 5229231 5009262 5388213 5664707 5779453 5892638
8214 5892638 6183359 6150604 5941335 5749560 6048910 6249327 6271665 6201038 6240867 6567749
8204 6567749 6450004 6774475 7463484 7442280 8193352 7938128 7601286 7640131 7788653 8687556
8194 8687556 9161600 9199775 8688092 8363444 8388854 8547163 8859806 9134201 9551843 9569236
8184 9569236 9602830 10353173 10556156 10715935 10817213 10953310 11331945 11691112 11442738 11752404
8174 11752404 12273561 12680077 13103605 13604010 13931454 14704965 15257106 15592571 16222919
8165 16222919 16828689 17628376 18700560 19283105 20161458 20697809 21547899 22676518 23793001
8156 23793001 25021804 26024610 27392895 28478303 29719678 30766556 32570641 33821923
8148 33821923 35115414 36400352 37932628 39821422 41759269 43854339 45714769 47457424
8140 47457424 49860930 51376573 53109345 54157378 54617076 54406100 53727323 52745558 51724927
8131 51724927 51130958 50832175 50549350 51013664 51284352 51976202 52574868 53735586 55062821
8122 55062821 56386935 58203152 59587131 60744513 62057514 63518807 65629405 68088770
8114 68088770 70050908 72912595 75993354 78982872 81676611 85022941 87869733 88856405
8106 88856405 88577854 88094519 85792175 82897622 79954168 76810149 73236038 69634491
8098 69634491 66721502 64180233 61139624 58424641 56478854 55403057 54299455 53700908
8090 53700908 53398280 53048221 53139312 53574357 53255205 53115871 53492651 53653988 54365567 55208410
8080 55208410 56118755 56755817 57852384 59285845 59516577 59570788 59659108 59290876 57613641
8071 57613641 54888108 51728486 48457641 45669450 42720658 40442898 38232489 35865713
8063 35865713 34085919 32719185 31068690 29791510 29079298 28093942 27095976 26608750 26054478
8054 26054478 25590894 24654021 24619643 23925717 23254830 23403337 23164734 23551751 22954742 22875679
8044 22875679 22976512 22996388 23071381 23015145 23328622 23599657 23351391 24053172 24594040 24768266
8034 24768266 25702504 26186922 26648680 27567418 28784430 30492755 31780066 33232752 34297534
8025 34297534 35842501 37830808 39924867 42813425 46509928 50763351 55757400 61486878
8017 61486878 67794177 74854290 82849835 91926308 102416850 113754817 125194983 133146963
8009 133146963 133474483 126038343 112107469 95971473 81691467 70965532 62888526 56083112
8001 56083112 51488253 47501343 43689922 41206232 38673227 37073018 35407715 34414030
7993 34414030 33532818 32968782 32729283 31248151 31302859 30764611 30751865 31197227 31823250 33085294
7983 33085294 33332866 34081140 34929162 36572657 37873429 39449489 41051644 42503678 43796667
7974 43796667 45231617 45466935 46170493 46149959 45717077 44606740 43354082 42476759 40523113
7965 40523113 38517192 37079070 35876143 34804499 33584938 32931288 32335507 31909612 31703165
7956 31703165 32366066 33196700 33726063 34641661 35917024 37282976 38818508 40506249 42249852
7947 42249852 44219114 45880358 47513687 49130770 50345479 50664345 50551673 49639851 47731560
7938 47731560 45151375 42745942 39936946 37490818 35479296 32885881 30433706 29214312
7930 29214312 27942934 26926283 25503530 24760203 23922194 23545922 23022830 22743956 22741205
7921 22741205 22774565 22728900 22815231 23433898 23770912 23977283 24462612 24945879 25022521 24456901
7911 24456901 24492551 23766450 23346855 22476983 21087409 20346641 19029454 17910559 16386058
7902 16386058 15238388 14306624 14430538 13451851 12066458 11751066 11294092 10732393 10161602
7893 10161602 9405640 8775836 8791701 8963238 8972510 8496791 8221530 7790407 7725486 7439912
7883 7439912 7071949 7250845 7056011 6502698 6416674 6782977 5851749 5350154 5113820 5578129
7873 5578129 5651519 5227558 5288711 5332798 5292595 4871657 4964532 5032467 4477955 4347610 4868432
7862 4868432 5294461 4675490 4438686 4370526 4444265 4610755 4397468 3964178 3809823 3719623
7852 3719623 3896252 4063109 3656555 3454856 3440549 3421763 3018205 3380614 3314959 3435733
7842 3435733 3209249 2829289 3027961 3087810 2867634 2842322 3395807 3169525 2503809 2588979
7832 2588979 2620809 2645676 2299297 2472957 2623836 2694356 2776804 2897186 2392813 2765398
7822 2765398 2798384 2284969 2391264 2267507 2449283 2615522 2241813 1723905 1871676 2275388
7812 2275388 2278000 1703773 2095361 2404734 2212811 2219657 2241830 1611131 1815170 2214661
7802 2214661 1822580 1420585 1469751 1619485 1788166 2024379 2117430 1450840 1807671 1599871
7792 1599871 1885336 1945252 1219076 1364547 1627130 1767932 1960313 1851900 1985367 1947413
7782 1947413 1766898 1553852 1556588 1425661 1602646 1714513 1685201 1894176 1904230 2341034
7772 2341034 2389247 2266769 2261744 2283440 2009460 1996362 1367121 1228819 1588869 1355134
7762 1355134 1290206 1269145 1103167 1220481 1489023 1327017 886730 1019128 974135 1432332
7752 1432332 1409457 1671985 1594216 1349959 1194298 1066512 1201074 1063345 828157 1262144
7742 1262144 1194175 1146555 1364336 901721 697685 948636 1321479 1504219 970970 986320
7732 986320 1403471 1094898 977734 1447886 1141335 1126347 889686 594396 978294 1220969
7722 1220969 1280211 819638 933743 1335155 1199724 1046393 1212650 740896 1120192 551550
7712 551550 535471 607287 451909 279571 383834 676564 747411 783950 514490 840845
7702 840845 1103885 600837 498804 782961 667335 517796 854517 812752 316133 174771
7692 174771 224036 124679 193038 369137 128409 596301 1127112 1355209 756032 433059
7682 433059 820211 1103819 1047869 399477 263573 476185 737393 1141559 852283 600886
7672 600886 628966 1017051 914634 843186 798462 525983 819744 906311 679325 268565
7662 268565 749831 812527 541419 520540 1115809 716487 503807 368021 244735 654429
7652 654429 465948 590541 888872 690149 401815 514589 632378 825676 943868 759034
7642 759034 565018 385704 466606 445897 777616 564822 662479 640756 520265 938930
7632 938930 437909 474857 310305 286900 621187 317538 92027 938028 679948 942868
7622 942868 524067 864077 933836 1009382 802289 686786 569839 916169 911314 835974 643859
7611 643859 487092 430693 706843 810934 787372 320020 163902 900915 1027270 638900
7601 638900 -202230 483624 765223 635401 384320 574691 250624 269152 79611 319705
7591 319705 349806 202573 220693 322301 384855 344556 759925 638416 650408 721563 1081724
7580 1081724 1384879 1041982 769490 697916 930211 328548 -6022 91649 354420 -289035
7570 -289035 -458980 -32991 145490 280129 286846 462049 -205312 -500446 249659 119358
7560 119358 153340 480606 589598 479155 478995 179554 105459 -11243 -98326 -239434 -84601
7549 -84601 -292515 -151652 387344 -48231 -278152 420235 -1707 -193489 -342312 -464921
7539 -464921 -66456 -258358 31506 -96291 67556 277342 17595 59232 256136 272913
7529 272913 -91986 311547 213068 444912 266807 146442 -55290 -286951 -162281 -356716
7519 -356716 38297 93990 -71055 -322848 -48871 26981 -69921 -398247 -256003 -411988
7509 -411988 -409143 4416 -116324 -508108 42571 55559 -108785 -54384 255008 100385
7499 100385 -229592 22800 30179 -46144 259515 122169 94306 -209202 -242347 24079 239148
7488 239148 -222356 -232718 -501228 30312 -37701 441 87661 215311 400026 329952 163995
7477 163995 -249840 -318085 -82559 97314 -45699 -236421 -145004 68222 -134194 -18589
7467 -18589 -129768 -132601 -251605 -541549 -474622 -306764 -316473 -182888 -227190 -88145 -387916
7456 -387916 -1118403 -403600 -247936 -364570 -74701 20177 -64371 178787 30172 -110998
7446 -110998 -104928 -69649 -125766 -226222 71099 210831 237385 -113840 58850 -163381 -75247
7435 -75247 -151383 -169779 -299346 -484495 -552724 -833028 -743416 -305522 -288109 365661 361044
7424 361044 423329 -98870 -288757 -84351 367183 376352 741129 275649 92076 25117
7414 25117 -139024 -196289 102643 -56598 -106467 -457623 -187540 -82601 -324564 -44231
7404 -44231 -92179 134128 -508536 -197761 -80734 163656 -260016 -570227 -206402 -321002
7394 -321002 -540226 -381041 -294294 -431099 -224071 -54117 26958 248383 3290 473833
7384 473833 238629 104059 -141150 96199 290136 232596 570029 73596 304317 -115179
7374 -115179 -593371 -450150 -608481 -626515 -141340 -117505 -27543 101645 -189442 -119849
7364 -119849 97215 145126 133505 233549 -19423 -226248 -277577 -210809 -572949 -191221
7354 -191221 -132063 -269563 -75421 -526783 -467472 -17891 482237 136181 -296346 -303298
7344 -303298 -129103 -225386 -444779 -278947 176313 534065 210817 -56683 -55317 64177
7334 64177 13764 -413591 -433931 -332254 -383677 -58303 29822 -178454 -469151 -651577 -562145
7323 -562145 -288731 -287993 -294894 -381766 -46852 -333525 26993 -264125 -253607 -418259 -721038
7312 -721038 -469170 -495072 -159326 -146064 6373 -705700 -746619 -638429 -232782 -289895
7302 -289895 -129574 -314443 -915126 -769744 -564501 -229859 -61504 289109 410405 -121388
7292 -121388 -333545 -256273 -587503 -281934 -328506 -59011 -126848 -170025 -512389 -790989
7282 -790989 -537376 -745480 -575496 -430022 192503 -456 -55249 340072 42742 -85887
7272 -85887 -213872 42614 126849 128763 -56387 -117914 -586525 -700556 -865388 -579813 -350021
7261 -350021 -152112 -112138 99803 150255 6746 135316 -118202 52699 51028 39136 -114518
7250 -114518 -511333 -541162 -676513 -849811 -361128 126047 122555 125848 -220550 -325397 3041
7239 3041 -209888 -260658 -598588 -642940 -698952 -311925 -474644 -499554 -141231 -95271 -84957
7228 -84957 272833 -162538 -375114 -290720 -297567 -164211 -228665 -469409 -93326 -47007 -226661
7217 -226661 -58084 -169525 -251002 -232770 -198373 -65814 -164436 203659 427982 -75799
7207 -75799 -661062 -524540 -108856 267033 170580 50062 219599 275466 202483 338870
7197 338870 372590 -146153 -405130 -441258 -481093 -664133 -278487 171923 843734 753031
7187 753031 368548 -39177 -217792 -355523 -361170 255126 219514 124765 -160254 -310443
7177 -310443 -238358 -8112 195609 50549 -261647 -446694 -444437 -202829 59133 171626
7167 171626 -320888 -125694 -58195 -269107 -302986 -408131 -379496 -274272 76879 212202
7157 212202 49705 -86519 38888 -380471 -209266 53432 79056 -335819 -276068 359261
7147 359261 22077 -107831 -692931 -974256 -934527 -707083 -680396 -525710 -467882 -330763
7137 -330763 -416358 -10649 51602 -423824 -143431 -404923 -83341 -564182 -385105 -396963
7127 -396963 -404397 -507596 -396618 16218 69038 -38797 366608 329156 128664 336422
7117 336422 618816 506578 398352 60949 117353 174492 258844 363454 400508 356677 384282
7106 384282 535502 163685 -290774 -195112 115006 419253 462985 533342 -111784 122419
7096 122419 392707 20601 -284600 -204676 -3978 -89977 -225877 -41074 -392343 -681299
7086 -681299 -190013 -209219 -198886 7369 -276565 -393346 -283624 -101302 -137808 -69860
7076 -69860 303668 328916 365746 682162 877349 3362 206764 -195761 -396792 -102932
7066 -102932 -302817 -465188 -150659 -181798 254159 -53991 -122099 -364761 61107 -322956
7056 -322956 -547540 36837 107340 273450 362807 83241 -156750 238926 253965 -77919
7046 -77919 166014 287043 -23150 -28613 -180360 -138147 214991 76109 -18779 -135533 -131037
7035 -131037 -208006 287791 153171 -33157 -368174 -598489 -414134 -32985 529779 323807
7025 323807 263215 -310401 -319018 48744 133976 157661 182607 -188739 -210759 -468812 115245
7014 115245 181991 49699 224131 -392596 -337163 -4395 53262 110689 -140667 391998
7004 391998 303215 586606 232832 -70058 587478 263978 72012 -198918 -428042 98269
6994 98269 -31407 -268862 -760811 -281060 -83455 -84111 133562 292895 229289 -200661 -131395
6983 -131395 33012 45141 -203333 -394764 -391842 -254416 -173509 263352 242437 397059 110642
6972 110642 670663 1116214 579662 169688 166100 -479117 90508 315991 212054 286466
6962 286466 233100 -318200 174697 406391 677004 510894 336724 680691 612120 533791
6952 533791 409046 454357 42899 -308104 -231951 411981 45360 45778 -38243 18804 281479
6941 281479 -237138 357339 281374 -390301 69157 -120618 -236017 -469124 -118654 113142
6931 113142 190608 11978 106603 314454 22491 581027 293566 129123 240452 134683
6921 134683 363259 145200 147482 216986 61961 103883 494437 166675 28847 -285355
6911 -285355 -459404 -32653 330145 234835 624259 282565 569497 182944 170146 458482
6901 458482 513353 184147 27912 869439 370178 202834 298824 -17850 359201 367175
6891 367175 -132297 -75650 210675 516128 361269 200225 39610 -137381 564318 581792
6881 581792 27300 343053 138254 181920 28093 -264203 70628 192059 -340651 -202068
6871 -202068 58654 418359 787421 825216 472791 352608 495240 -76488 -209985 -52756
6861 -52756 -188706 400903 681830 746863 940748 630391 405719 474727 208062 24064
6851 24064 634993 191955 90022 264812 131764 70466 -248661 -93537 111518 27356
6841 27356 -129925 12084 351750 269071 322501 637642 740007 726218 1062332 491645
6831 491645 416050 770979 330885 728599 666861 316785 -120747 612347 561202 669894
6821 669894 353327 -178748 -28352 319399 374525 904534 454035 113991 -130455 141502
6811 141502 -103423 -205180 588183 270828 190882 385248 616266 319784 213883 48857
6801 48857 42664 131369 320812 528762 533880 481299 526370 221302 517947 583504 760134
6790 760134 689914 624193 103545 527585 441310 278670 232568 326824 686337 385440 846189
6779 846189 720670 181865 653511 844864 769605 619491 682537 451327 641134 951265
6769 951265 547628 304483 40487 265050 866930 1053026 1129525 839365 605715 447145
6759 447145 619111 575236 1015269 884601 603405 609679 570576 627969 814497 1210654 1142359
6748 1142359 1532535 1157439 670374 162403 516119 867726 687880 198161 1094211 1504615
6738 1504615 1324918 1108552 887138 1013448 876399 811400 1410675 1517800 1671440 1590792
6728 1590792 1498398 1256346 1129348 1281466 1876667 1754880 1094183 2004784 1841001 1643744
6718 1643744 1884572 1872571 2033042 1958899 1921675 1688170 1747287 2015874 1671820 1900052
6708 1900052 1962954 1980492 2038180 2690823 2637757 2623921 3074247 3074772 3394387 3259834 3107188
6697 3107188 3306585 3113996 3076576 3537673 4146337 4665653 4694743 4470897 4266984 5206635
6687 5206635 5172033 5243975 5508350 5616027 5951161 6633864 6956381 6950000 6839974 7122085
6677 7122085 7294836 7480685 7978594 8248465 8522366 8320414 8214885 8560143 8842416 8071698
6667 8071698 8141980 7726132 7633895 7397236 7421220 6885606 6535447 6855117 6419546 6107931
6657 6107931 6073201 6101712 5559035 5087386 4958490 4654605 4981451 4746948 4722525 4622621
6647 4622621 4361008 3969147 3354301 3780532 3755727 3445016 3453548 3345396 3383066 3506211
6637 3506211 3631943 3598773 3202795 3074413 2960347 3408430 3770518 3121864 2880179 2922566
6627 2922566 2991757 3141339 2997738 2859396 3329267 3259716 3115011 3175956 2844684 2707296
6617 2707296 2775448 3167651 3007895 3009224 3448315 3394705 3361169 3141368 2945705 2931109 3003149
6606 3003149 3755586 4042582 3493726 3433825 3539240 3771302 3689357 3398013 3427292 3377988
6596 3377988 3497604 3893351 4125850 4336973 4377970 3758160 3513724 3470982 3713329 3861525
6586 3861525 3766113 3548028 3784571 3883514 3874229 4175664 4494347 4432749 4290338 4410648
6576 4410648 4730585 5103934 5060225 4788309 5021045 5145730 5183993 5163881 5140414 5240985
6566 5240985 5730933 5745958 5802210 5654876 5790482 6167599 6361846 6627771 6428826 6322899
6556 6322899 6706050 6904374 7241434 7699053 7861900 7985222 7598606 7846938 8149062 8229338
6546 8229338 8230413 8366629 8307010 8776744 9002551 9104955 9586315 9857392 10041096 10230823
6536 10230823 10708097 11948734 12497776 12389988 13026291 13119314 13362296 13820400 14401173
6527 14401173 14540115 15187551 15838509 16054484 16570327 17004280 17661109 18362060 18782564
6518 18782564 19105075 19720809 20095025 20636115 21098466 21659858 22645953 23257980 23610055
6509 23610055 23684764 24309588 24885395 25134339 25267429 25216764 25603682 25143603 24851785 24763602
6499 24763602 24397776 24494865 23756208 23183120 23270129 22926735 22384215 22052887 21533198 21225421
6489 21225421 20389638 19550085 19041574 18420510 18059543 17647258 17327567 16612093 16441640
6480 16441640 15322106 14984235 14938636 14082553 13358626 12879281 12482656 12094180 12040660 11543774
6470 11543774 11272812 10652306 10158655 10297479 9900237 9313450 9263562 9105192 8623826 8062197
6460 8062197 7858568 7944386 8130499 7766267 7650893 7440794 7199556 6953848 6863635 6203684
6450 6203684 5677397 5506038 5688473 5840212 5836052 5648474 5488922 5078956 4558038 5058663
6440 5058663 4979007 4624733 4793109 5262131 5034698 4712160 4496298 4333273 4155693 4234225
6430 4234225 4017227 4054129 3923266 4193034 3797423 3779653 4077629 3409411 3294376 3219836
6420 3219836 3757629 3584629 3209299 3430280 3577801 3298006 2683444 2706211 2526808 2547786
6410 2547786 2079861 2163517 2540672 2649158 2308751 2251981 1908344 1953519 2559802 2754554
6400 2754554 2305759 2037847 2209426 1794074 1955455 1927972 1848281 1690680 1929382 2004494
6390 2004494 1929022 2065238 1818526 1954388 1722258 1717064 1844416 1784524 1421403 1324095
6380 1324095 1475232 1637965 1669620 1449500 1397411 1819854 1652632 1787466 1429818 962576
6370 962576 876291 1022073 1047392 863409 809311 785685 1228780 1345452 1371496 685922 765284
6359 765284 987214 1077753 884166 688458 735215 251650 196373 396233 574400 1011098
6349 1011098 668380 851500 799829 1046038 833321 795253 336871 696408 490697 562892
6339 562892 563648 125178 -30018 391920 756680 517880 154708 671498 838975 567028
6329 567028 324424 236141 293142 148999 758748 425596 690410 921670 926481 222098
6319 222098 351328 828395 706755 519375 521275 483629 578587 199273 230531 169526 160856
6308 160856 1113680 1378621 772442 759833 722658 730080 782725 783384 726663 75933 398561
6297 398561 536422 525574 280001 108954 65991 169458 455935 533003 608851 1107281
6287 1107281 746104 428235 594717 356192 160852 535684 727901 230717 499937 634696
6277 634696 147790 180201 162874 375871 122961 -30816 -272847 -379356 -319648 -406499
6267 -406499 41090 306313 253006 242320 501896 324850 230961 8556 -219284 -122658
6257 -122658 57446 -14844 82272 -106115 10455 -461581 124050 301828 -453901 -302608
6247 -302608 129116 -43268 -352947 -129296 -193772 620251 809040 250874 340625 122496
6237 122496 177642 504382 560749 -171503 148019 -253360 -73823 190093 439464 765781
6227 765781 308738 327918 292907 -33319 309996 562448 273772 482466 449459 592669
6217 592669 310449 326244 128634 146997 636969 540004 329132 440492 256073 -147775
6207 -147775 -140123 513754 907098 714222 102107 295725 864971 762235 280165 529764
6197 529764 723612 563214 669518 575280 689650 380039 710531 596251 690364 473217
6187 473217 -313706 33895 -118569 67029 431114 611988 596169 263222 -133820 -546832
6177 -546832 -81736 -512987 -574198 57092 98481 -140218 283554 322488 170758 313439
6167 313439 202413 154188 451775 433884 402267 9051 -20601 218537 169843 192671 -291073
6156 -291073 -300569 -163112 171468 -337015 -320351 330379 139338 111570 181514 -135929 -11384
6145 -11384 57773 -216156 -487512 -437122 -259512 180086 -301582 116827 90174 -52106
6135 -52106 -198843 -273388 -109922 -25757 -290974 -272516 310720 517172 148900 -127074
6125 -127074 -430802 85727 40189 -485228 -73451 -274898 -421649 396720 249651 -202150
6115 -202150 -52905 -186805 -364601 -141169 475772 242949 -363566 -262316 -672865 -180098
6105 -180098 467505 -52508 -83837 -273525 -267442 -437931 -325127 -245402 -311046 -238951 28363
6094 28363 3125 -85798 -621139 -384872 -83241 345936 -78781 -614232 -765263 -935947
6084 -935947 -942931 -647591 8290 12667 -444378 -815538 -764022 -461120 -303515 -335932 -177037
6073 -177037 -68753 -355015 -246968 -388216 -476051 -248078 -645051 -790900 -930694 -1076017
6063 -1076017 -615498 -325922 -353772 -200823 -120952 19515 -198566 -464525 -531769 32807
6053 32807 -285327 -396535 255450 41545 -159121 -129093 245613 396214 -214181 -292344
6043 -292344 -430794 -427490 -466482 -771128 -301776 -277348 -673658 -525365 -876377 -702939
6033 -702939 70951 64705 -239226 -376669 -400013 -327938 -488172 -750651 -597500 -260484
6023 -260484 -475593 -878343 -939587 -362722 -526963 -478094 -427028 -485822 11752 -418641
6013 -418641 -551544 -440846 -953745 -999207 -970007 -369472 -291707 -1016543 -768359 -639383
6003 -639383 124001 -308198 -592652 -758950 -487673 -381052 -327709 -408162 -112194 -411080
5993 -411080 -439460 -830882 -473477 -450190 -614334 -315112 -507229 -373604 -110387 55691
5983 55691 -247791 -366108 -493072 -365910 -312427 -282362 -233643 17846 290684 -45574
5973 -45574 -224758 -241472 -307568 -145290 -829987 -988079 -718595 -438304 -559321 -1021594
5963 -1021594 -1001508 -540618 -560488 -267315 -385808 -168840 -273575 -587222 -799990 -629527
5953 -629527 -525634 -822242 -509278 -959159 -606458 -443538 -547043 -397704 -401336 -87246
5943 -87246 -358577 -595499 -290876 7668 -176526 116437 -126091 -127192 -74193 -444916
5933 -444916 -628665 -294985 -271628 -487139 -674226 -768406 -882613 -608568 -546772 -658009
5923 -658009 -619060 -373779 -558610 -878145 -1047196 -313870 -442417 -395476 -134578 -202731
5913 -202731 -247476 -556653 -369178 -570233 -255434 -277356 -445043 -769328 -593270 -510244
5903 -510244 -796990 -995478 -477867 -282220 -5120 -456168 -816549 -338830 -245453 -177553
5893 -177553 -503905 -773407 -636772 -511689 -862126 -932394 -667154 -356816 -99314 -47030
5883 -47030 -137905 32797 95634 14363 -301393 -540807 -443287 -181520 -71588 -122896 -295740
5872 -295740 -192080 -31000 -454773 -481601 -552776 -255374 -587191 -674387 -21980 -467318
5862 -467318 -555583 -397680 -753494 -736858 -653892 -883194 -986424 -762471 -518891 -730115
5852 -730115 -301380 -47041 -646500 -717916 -356003 127864 119745 -477578 -691655 -627881
5842 -627881 -357761 -544222 -198346 -713856 -896690 -1088100 -665912 -499421 -577160 -312091
5832 -312091 -685715 -403044 -387099 -544549 -703979 -570945 -621546 -608203 -732103 -481929
5822 -481929 -444082 100201 -243818 -193116 -185634 -465291 -768851 -615832 -526839 -568720 -676936
5811 -676936 -857444 -1111686 -923846 -898217 -834281 -331872 -375713 -367280 -777274 -897811 -743861
5800 -743861 -718126 -640069 -632417 -827413 -293607 -424225 -467305 217567 93737 -117508 -528712
5789 -528712 -363352 -263138 90741 -389178 -463769 -869125 -719811 -775500 -507642 -67293
5779 -67293 -581330 -479174 -713264 -778016 -763035 -610452 -1186326 -801775 -357700 -389179
5769 -389179 -484294 -673992 -855533 -700256 -586779 24049 -278043 -435160 -721022 -901275
5759 -901275 -814215 -731481 -456096 -383604 -268686 -258490 -460342 -433390 -411875 -777860 -765320
5748 -765320 -483250 -443513 -1004791 -1094616 -245621 -205979 -443206 -475835 -422188 -81886 263098
5737 263098 -452419 -1153410 -881974 -1003010 -1149669 -1017791 -764942 -437683 -225122 -358044
5727 -358044 -796449 -870125 -410175 -583170 -857838 -487905 -439635 -81564 -528236 -956244
5717 -956244 -873492 -242420 -135011 -430131 -499511 -179024 -34451 -342804 -519295 -229419
5707 -229419 -216115 -516362 -518992 -744333 -517316 -471574 -692653 -794216 -1285647 -1207617 -850617
5696 -850617 -931348 -864818 -1033991 -507830 -462924 -328859 -336986 40732 -292249 -500841 -340516
5685 -340516 -630887 -624367 -913069 -611000 -551263 -957999 -923117 -886992 -439136 -153247 -425074
5674 -425074 -244102 -221056 -362906 -193321 -481323 -640817 -295436 -197819 -164560 12382
5664 12382 -76177 -379286 -516911 -456948 -1058510 -334565 -336917 -883557 -713013 -559827 -591097
5653 -591097 -401800 -649676 -277282 -249914 -440769 -276870 162173 -117506 -594654 -440795
5643 -440795 -479183 -597535 -509568 -620689 -673385 -371076 -407024 -360129 -111457 -4154 -651575
5632 -651575 -676125 -470929 -277922 -162063 -274194 -405586 -247366 -136285 -266027 -293824
5622 -293824 -42395 -706480 -710010 -1144671 -927084 -618925 -854220 -701721 -640381 -33711
5612 -33711 -588821 -554732 -434149 -1202393 -732945 -520002 -823161 -759730 -579631 -691256
5602 -691256 -496080 -553780 -555620 -866435 -922518 -402550 -351869 -420297 -103813 -386442 -551816
5591 -551816 -713150 -97296 -193116 -634935 -700739 -537134 -365027 -100577 -351770 -505554
5581 -505554 -574023 -234433 -131211 -458521 -605575 -296657 -223812 -227565 -869993 -452089
5571 -452089 -480158 -605501 -243145 -675444 -526318 -184598 -430456 -449386 -225538 -94013
5561 -94013 -228247 -140564 -644734 -538837 -299031 -870738 -539854 -579695 -618276 -150977
5551 -150977 -224887 -655098 -787099 -997787 -382951 -777322 -622997 -1005234 -864005 -925266
5541 -925266 -49657 -582794 -721959 -646360 -93713 56009 22957 -81651 -617002 -468982
5531 -468982 -420247 -653530 -535518 -540299 -517103 -728713 -543911 -194017 140839 -246468
5521 -246468 -428817 -952503 -571766 -352027 -584658 -584737 -378154 -320260 -246340 -324774 -112412
5510 -112412 -388994 -221970 -80484 -726780 -622950 -539537 -211406 -240875 -207335 -629471
5500 -629471 -470459 -527370 -901153 -413692 48218 -674197 -688029 -414767 -258133 -205883
5490 -205883 -262329 -310195 279993 84062 185392 -125088 -516808 -1055256 -747247 -73719
5480 -73719 6224 -442291 -445276 -922181 -735058 -655153 -684340 -429399 12001 -88921 -338275
5469 -338275 -327548 -416823 -263478 -286790 -266085 -728533 -1121823 -567549 -328688 -529185
5459 -529185 -363816 -338213 -218371 -332778 -1226502 -1071493 -707775 -529130 -324562 -760949
5449 -760949 -545259 -485118 -360601 -581284 16721 346763 -67698 -372142 -147579 51106
5439 51106 -35636 558307 104132 -251424 -359232 -123216 -90123 -176966 -256883 -57229 46268
5428 46268 -457926 -93354 61103 -88479 -216432 52843 -580593 -468322 -144661 -365166
5418 -365166 -604191 -908343 -664479 -231748 -287916 -441481 -682626 -876507 -482938 -456741
5408 -456741 214147 69878 -506087 -346591 -752757 -710934 -336958 -742860 -701683 -524137
5398 -524137 -388535 -592444 -468698 -145571 -479156 -338629 436739 -20761 -320530 -413487
5388 -413487 264933 86055 -122466 -373405 -650779 -365906 20943 -216766 -51235 -233161
5378 -233161 -688587 -387702 152247 194939 -290181 -597328 -903287 -663990 -612373 -226497
5368 -226497 -169136 -92101 -337597 -223216 -379672 -293960 -186501 -181921 -653182 -396374 -135008
5357 -135008 -159412 70526 -481121 -383403 -323318 -363678 -48192 -54794 -174380 -335222 -16661
5346 -16661 -299143 -297713 -258240 -206897 -268189 36613 -304841 -307515 89621 496636 143656
5335 143656 188440 31271 11469 -244557 -161653 206929 -262712 -87338 -132195 -187230 40645
5324 40645 -298569 -102008 -180843 -461822 -833605 -916659 -396123 80342 150233 250680
5314 250680 -97816 -437014 -97646 198471 334395 -24533 192087 47824 -386685 -382366
5304 -382366 -421342 -591614 -120752 -76679 -366411 -392490 -998105 -665183 -789461 -745748
5294 -745748 -572653 -261133 -627398 -396914 -155345 -633482 -404812 -342222 354670 -641416
5284 -641416 -865821 -542889 -426696 -193921 -153634 -166106 234345 -188797 -506686 -166311
5274 -166311 -2357 -476368 -238370 -46479 -49819 -625208 7766 542547 519231 -102429
5264 -102429 -22625 148086 -227919 -14603 -312044 -527173 -279561 -233204 -281328 89171
5254 89171 -38810 -225554 -394864 -526423 -402163 -259017 -780045 -534305 152486 -90181
5244 -90181 -193045 -504444 -628576 -601178 -363016 252878 505238 335246 218371 297010
5234 297010 278097 -135353 -226693 251179 384847 215855 404710 447136 305141 582620
5224 582620 80136 -143658 -25401 -36273 -83324 -402462 -181965 217578 2297 -350198
5214 -350198 348386 447147 491305 638387 878210 637647 534243 535300 98696 193355 623965
5203 623965 492018 573496 403790 462861 1073952 787548 588124 627099 530764 508912 485418
5192 485418 714447 762190 831732 788052 334652 705000 277927 370884 481332 485864 515158
5181 515158 919129 606136 291267 562187 1119387 1058900 476678 488372 418707 322837
5171 322837 360130 641218 709782 677636 432750 311691 329460 219567 778334 883374
5161 883374 967705 1157675 1089773 902897 1097948 1043806 1323788 895804 1115462 1360705
5151 1360705 1212466 929968 1160337 1067743 1492615 2005875 1863718 2024482 1680984 1147815
5141 1147815 725427 557985 921251 1679757 1761715 1332525 1087843 1381752 1567218 2049964
5131 2049964 1678507 1916332 2020760 2111794 2420181 2694700 2311361 2454299 2472206 2387224
5121 2387224 2783203 3216357 3039347 3609627 3881302 3826825 3832561 3891389 3877197 3709629
5111 3709629 3426311 3055740 2828442 2731294 2578606 2166529 2226966 2210278 2090512 1717175
5101 1717175 2075829 2078058 1963932 1980256 2040492 1775956 2423680 2167250 2209566 2814544
5091 2814544 3203718 3467898 3337162 3718846 4081147 4444505 4463385 3923580 3744150 2694752
5081 2694752 2264053 2026280 1956623 1803620 2034484 1517829 1710829 1620050 1166696 1572502
5071 1572502 1245164 1488834 1556567 1310232 1331942 1536330 1343330 1526869 1659667 1800035
5061 1800035 1565053 1621847 1932294 2185932 1842267 1925382 1427271 2131121 2095022 1708509
5051 1708509 1216628 1148012 1077409 1131931 909292 884038 703643 946996 973196 654703
5041 654703 491648 713194 251926 -144506 144412 583591 887773 623273 883268 687813
5031 687813 705143 800331 799438 790289 900595 378007 639385 657660 540497 304985 555405
5020 555405 626409 491796 515408 400588 65268 534899 783282 476947 529051 986303
5010 986303 1011030 308550 90150 160445 341205 130582 645964 291349 292739 53297
5000 53297 296736 572269 351735 764495 815979 492266 561578 685441 266403 459527
4990 459527 385712 902395 946299 523658 518981 194388 -35011 -98755 178459 85985 57672
4979 57672 292091 -88832 341163 432359 459862 467782 689526 773115 651838 491904 476270
4968 476270 687126 529369 416019 810390 462758 730896 702333 45865 -164704 -699650
4958 -699650 -70978 124220 -292965 369553 381444 362264 20988 274990 80377 1117
4948 1117 227816 134384 393752 128361 477357 753063 229763 397068 972314 762892
4938 762892 546416 534787 966266 939176 620824 885852 921026 818014 788758 998752
4928 998752 1130959 1168092 819028 878430 544596 368777 482279 -271339 35181 814755
4918 814755 900945 531904 492236 509784 927556 823237 819910 1176980 988537 1038358 1228309
4907 1228309 1212082 1217319 1611770 1908807 1978216 1556657 1480346 1318610 1446009 1674509
4897 1674509 962425 491504 487334 402843 559487 795727 508163 252829 254047 650107
4887 650107 368478 736771 758569 1174593 639601 302339 -81355 -36626 -6654 72974
4877 72974 286164 854682 504993 839301 1140557 606703 468478 636933 917116 317931
4867 317931 692991 668418 484993 563992 709885 866717 812009 609841 422687 482758
4857 482758 733368 638638 389044 439335 619025 417967 682551 376682 306869 55138
4847 55138 483738 323269 250151 80288 -7470 800436 762734 458168 505493 584896 848827
4836 848827 835396 494552 690822 837092 1086246 316143 345346 610819 765914 866857
4826 866857 682649 1038782 1006847 1095769 563420 436944 643972 792371 718330 962668
4816 962668 1357143 1364192 1197407 1161260 1185593 1340556 1730637 1902020 2013520 2527781
4806 2527781 2593039 2710669 2726950 2748470 3425130 3436162 3771151 4353382 4302730 4705102
4796 4705102 4803604 4432460 4329969 4634885 4517038 4199557 4298149 3937349 3986412 4016619
4786 4016619 4179745 4366610 4728364 4463210 4199574 4624438 4854339 4969111 5165982 5552653
4776 5552653 5345732 5747514 5174367 4584055 5148044 5361696 4981146 4299650 4643199 4819502
4766 4819502 5175774 5077347 4409209 4792235 4757771 5002089 5265793 5562344 5653835 5529392
4756 5529392 5244190 5401120 5059920 4950898 5182345 5103184 4934544 4729835 4779125 4958049
4746 4958049 4874948 5291109 4877492 4430051 5070632 4794426 4674190 4543834 4562241 4154268
4736 4154268 4049294 3211066 2717001 2281245 2364386 3009933 2844391 2767110 2326569 2566427
4726 2566427 2121523 1791980 2231758 1792781 1926199 1856574 1668523 1534748 1324304 939504
4716 939504 1039956 815688 825669 1111033 895069 1010960 1109899 682347 816519 965934
4706 965934 868959 645023 735590 906155 861196 836347 764013 680910 787536 864485 703170
4695 703170 856552 863427 272518 606567 530987 675454 927904 842776 739850 244204
4685 244204 304129 362897 488788 456836 299109 162587 356610 448050 515630 485504 288295
4674 288295 622365 720159 464975 724769 570311 73666 135765 644795 479970 187650
4664 187650 359773 437941 556880 315657 283991 324034 471653 726837 107546 166363
4654 166363 145905 729091 529452 236346 918781 1040043 721594 443069 436411 437124 -88811
4643 -88811 -226300 394147 -26413 213735 540875 679426 517187 554307 700489 525892
4633 525892 502587 311347 465511 565008 447514 482918 540516 534550 338042 561563 555612
4622 555612 506410 330998 325260 585918 845397 893560 -27443 52873 201947 629800 263794
4611 263794 184150 535223 325845 47116 555224 495733 853079 428324 296778 305767
4601 305767 55229 593267 204883 226688 868347 703652 673181 577208 286395 418133
4591 418133 612154 451630 241195 75695 514163 768622 713604 840935 642652 408971
4581 408971 397037 721138 808109 265935 467512 691947 150291 491973 344914 497975
4571 497975 525059 328192 416949 585763 93146 269524 80262 74102 372483 341330 580113
4560 580113 825992 598889 607685 940545 756941 616779 757410 1068084 922912 1187468
4550 1187468 1489580 1207338 1411713 1243751 1523168 1206428 1134523 1572605 1598814 1537639
4540 1537639 1523253 1554435 1346926 1350387 1440957 1539084 1462676 1471235 1352683 1592953 1751123
4529 1751123 1472948 1262996 1696767 1607222 1495833 1471406 1904081 2355810 2027321 2406654
4519 2406654 2966403 3061252 3004016 3077325 2496915 2472377 2229825 1946216 1642812 1571724
4509 1571724 1456406 1794991 1984202 1876059 1967520 1546459 1599482 1612362 1629970 2076947
4499 2076947 1991160 1908187 1732521 1796055 1690669 1403958 1641211 2043523 2587893 2654489
4489 2654489 2695184 2671307 2594991 2903014 3013786 3325006 3294887 4005440 4981017 5059462
4479 5059462 5402704 5614287 5560980 5169395 5255875 4577530 4115482 3871528 3752332 3395847
4469 3395847 2499284 2327863 2100890 1918740 2274209 2174183 2343602 2089854 2235346 2403583
4459 2403583 1642654 1664685 1706551 1751909 1793175 1798715 1343947 1641898 1838338 1796137 1751424
4448 1751424 1480362 1750532 1871650 1487691 1310311 1638730 1809036 1990866 1558765 1696857
4438 1696857 2061025 2220265 2060831 2026648 2260739 2538442 2251312 2404286 2518402 2617597
4428 2617597 3462394 3448491 3552377 3735894 4125385 4379230 4443948 4636096 5208957 5757047
4418 5757047 5992959 6329649 6255167 6103342 5787346 5837983 5761173 4916247 4393152 4028672
4408 4028672 3942610 3902126 3474937 3731081 3504272 3272009 2766363 2729878 2510751 2476751
4398 2476751 2755591 2382962 1887408 1934076 1967735 1751059 1761791 2484097 2012357 1797085
4388 1797085 2049004 1929270 1814499 2322592 2442084 2019171 2308579 1794762 1327380 1354413
4378 1354413 1249338 980258 731734 961859 1479189 1553993 1258459 1393625 1505398 1468941
4368 1468941 1850153 1498959 1545538 1160785 1505615 1563537 1553973 1502034 1430844 1782568 1483793
4357 1483793 1503425 1425118 1697257 1644091 1792990 2114792 1878734 2073949 1742101 949922
4347 949922 1523642 1880042 1390486 1373112 1290029 1649154 1724395 1775026 1663845 1816443
4337 1816443 1754485 1501476 1127692 1709146 1597834 1748361 1772898 1985370 1408466 779515
4327 779515 1228019 1259388 1378773 1946733 2319012 2054423 1953726 2344381 2393756 2084883
4317 2084883 2233841 2699550 2623647 2179434 2089324 2252438 1971131 1981219 2140185 2024224
4307 2024224 2624128 2853630 2301417 2578942 2847026 2389653 2542481 2278526 2173850 2667661
4297 2667661 2708060 2249532 2466507 2554807 2681784 2629388 2631164 2685047 2981998 2859173 2687565
4286 2687565 3214485 3126260 3224586 3943305 3615152 3467534 3842645 3363441 3351377 4066866
4276 4066866 3477192 3294752 3684338 3433779 3596019 3727655 4100737 3954951 4340484 4491650
4266 4491650 4108204 4295412 4364425 4042582 3747962 4215742 4522518 4448712 4614654 4764849
4256 4764849 4824790 4758439 4978046 5368268 5189294 5264478 5352260 5656754 5688572 5961089
4246 5961089 5826612 6108972 5951766 6231581 6522162 6812235 6809252 7185150 7322142 7175286
4236 7175286 7452868 7737304 7995080 7994835 7879089 8471180 8809206 9097850 9352779 9433683
4226 9433683 9657483 9672595 10229173 10440586 10957048 11453378 11407067 11786506 12342251 12920729
4216 12920729 13098627 13642955 14122794 14972988 16000008 16285457 16770493 17798054 18861799
4207 18861799 19564442 21129087 22175031 23542653 25204708 26851925 28651665 30949929
4199 30949929 33192947 35347781 37697712 40594344 42022126 44075126 45217010 46409654
4191 46409654 47429797 47512187 48021163 47826325 47804162 48710772 49499448 50267049 50892256 51653095
4181 51653095 52667151 53272872 54302332 54755591 55038151 55373204 55817391 56246115 56414517
4172 56414517 56610795 56385028 56539129 56296262 55406885 55302975 55158578 55158137 55078582 55627714
4162 55627714 56507906 57452675 58338618 59995305 61742673 62766957 63420098 64286828 65494343
4153 65494343 66044614 66405754 66633926 66973386 66886425 66394078 65378869 64041994 62976010
4144 62976010 61883364 60038440 57378798 54786148 51827965 48840095 46040444 43656851
4136 43656851 41108160 38976055 37201573 35394120 33685572 32243585 31459780 30288156
4128 30288156 29691685 28416837 27558674 27170963 27061221 26387336 25703302 25178064 24710236
4119 24710236 24371100 24110473 23798581 23863677 23493368 22911459 22803544 22134970 22078060 22117755
4109 22117755 22366081 22624426 22890849 22568669 22821184 23611187 23314901 23278839 24223728 24203463
4099 24203463 24524439 25414294 26140190 26472911 27082409 26978383 27527308 28684256 29358415
4090 29358415 30206553 30923187 31574615 32580315 33095843 33800267 35709816 37367769 39071452
4081 39071452 40673727 42566411 44569151 47429356 49825236 52731647 55620572 58093909
4073 58093909 60663618 62579846 64640096 66620260 68218130 69386650 70214225 70639633
4065 70639633 70528714 69835990 70106012 68986161 67846527 67262598 66363432 65676618 65287444
4056 65287444 65019596 64174296 63408127 63415016 63380260 63006680 63115826 63368219 63558081 64429323
4046 64429323 65041129 65319545 65497485 65730067 65345714 64974748 64733615 64291318 63382140
4037 63382140 62759780 61750624 60716129 59840387 58828814 57828808 56912867 56001101 55118626
4028 55118626 53660274 52649958 52331462 51331058 50868819 50438371 49370871 47795510 46188491
4019 46188491 45173467 43821136 41873381 40236644 38378903 36960541 35798531 33972607
4011 33972607 32341265 31283703 30096312 29302945 28613163 27661647 26600953 25870204 24355657
4002 24355657 24149674 24260719 24020512 23334310 22760709 22577462 22567616 22553930 22306745 21861485
3992 21861485 21920114 21507228 20944422 20778019 20601044 20821893 20054885 19539159 19426910 18778831
3982 18778831 18690119 18709240 18394699 18304416 18405570 18322711 18020426 17795663 18109868 17759625
3972 17759625 18092225 17832318 18314315 18390390 18052133 18057603 18205271 17784546 17798976 17624678
3962 17624678 17154221 16990061 16755336 16812261 17073510 17949657 17512359 17017015 16936829 17357584
3952 17357584 17069120 17426866 17685121 17392674 17513246 17248182 17082397 17481841 17510903 17771488
3942 17771488 18357265 18110349 18183589 18482212 18929260 19426236 19402723 18938075 18627766 18632063
3932 18632063 18604850 18938418 18961027 19224928 19148865 19573808 20086260 20431913 20873971 21308817
3922 21308817 21910615 22428133 22777522 23068812 22843684 22942857 23043847 23834106 24482764 24773470
3912 24773470 25610022 26234283 26243142 26684193 27034169 27006069 27333599 27809258 27688910 27689884
3902 27689884 27066047 27279807 27183394 26439519 26387618 26372456 26358152 26709141 26912178 26661596
3892 26661596 26986093 27141814 27405107 28169345 28331330 28579580 28937073 29612853 30968718
3883 30968718 31261769 31443956 32258543 33071207 33765820 34273318 34865379 35231144 36039485
3874 36039485 36987927 37773660 38727292 39817654 41080108 42428510 43849072 45705397 47796162
3865 47796162 49941762 52172750 54010135 56546217 58822297 61074992 63777587 66936156
3857 66936156 70245436 73637755 77692050 82331803 87641830 93271006 99271696 106429401
3849 106429401 114728165 124271545 135240986 147271247 161070430 175904913 192598868
3842 192598868 209664781 226402622 242418024 256321987 267786124 275013948 276400744
3835 276400744 271350871 259811886 242524568 222324539 201936744 182928557 166665129
3828 166665129 152634835 140396595 129992216 120877327 113544293 106849748 100620519 95445641
3820 95445641 91087547 87331407 83882193 80125396 77515806 74914426 72735922 70297606
3812 70297606 68616842 66764767 65585603 64142102 62523557 61985924 61449090 60462971 59831655
3803 59831655 59589760 59037374 58672512 58764302 58123355 57646026 57460646 57535650 57587482 57288255
3793 57288255 56984828 58088766 58643975 58810399 59163555 59815093 60396891 61166101 61911432
3784 61911432 63037656 64874524 65829592 66677338 67913652 69168547 71611330 73591526
3776 73591526 75325621 77264814 79190025 81372687 84180481 87183021 89951138 93275153
3768 93275153 96500933 99753840 102840835 106159844 109224065 112899295 115615767 119244064
3760 119244064 122850190 126449875 130156833 133374240 136879469 139980037 142923174 145429766
3752 145429766 147897157 150967254 153259274 155809258 158107454 160001089 161737656 163345606
3744 163345606 163934037 165100942 165333948 165651896 165492147 165198830 165164622 164249917 163004221
3735 163004221 162113470 160314606 158793125 156658269 154645520 152584564 149904667 147399095
3727 147399095 144801487 142392333 139700632 136749997 133608448 130437937 128393254 125553672
3719 125553672 123102469 120744187 118078286 116019307 113889693 111484610 109649565 107956841
3711 107956841 106020867 104745796 103127875 101719490 100811181 99961552 99194294 99344016 99081423
3702 99081423 98988839 99102811 100098401 101110643 101878096 102868384 104709030 106515600 109297410
3693 109297410 112218319 115552100 119329404 123210976 127831869 133172676 137940297 143446405
3685 143446405 149753666 155901242 161797377 167296554 172706728 177674716 182013543 186241750
3677 186241750 190644916 195562679 201303366 207302385 214261749 222219056 230667627 239723954
3669 239723954 249410778 259687434 270376084 281414183 292746736 303638137 314454556
3662 314454556 324070817 331856640 337073703 340506950 341772319 341377392 339128843 335432549
3654 335432549 331943036 327209561 321754343 315712358 310203297 303090909 294943803 285343156
3646 285343156 274363987 262439400 249472976 235953982 222425428 208938737 196166488
3639 196166488 184216074 173024733 163386397 154137185 145368812 137590626 131222629 125317365
3631 125317365 119945292 114990202 110856872 107299195 103537386 100483011 97822794 95004755
3623 95004755 92327983 90102579 87856335 85677919 83303423 81712724 79875750 77592476
3615 77592476 76116160 74610156 72536385 71443029 69597916 68363586 67189468 65682642
3607 65682642 64374038 63202048 62031106 60503488 59811147 58442950 57242196 56136778
3599 56136778 55136645 54492729 54007716 52877143 52330908 51397271 50727987 49551700 48437986
3590 48437986 48020524 47588956 46479599 45748871 45224732 44631304 44003149 43202405 42548497
3581 42548497 42134249 41816840 41555279 41117743 40324091 39779946 39495891 38766685 38011987
3572 38011987 37545205 36604822 35857015 35588732 35607528 35139178 35011814 34312511 33817123 33597133
3562 33597133 33503664 33040072 32390340 32541897 32153134 31927999 31328890 30768499 30801584 30609595
3552 30609595 29973182 29866490 29945742 29138125 28886130 29244070 28875861 28885250 28826917 28364592
3542 28364592 27809377 28025337 27562907 26670539 27188340 26895805 26332437 26747300 26989354
3533 26989354 26958758 26322018 26462473 26870885 26942430 26674136 26395976 26771885 26505052 26416263
3523 26416263 26211892 26175440 25992535 26268778 25858879 25848657 26168362 26269863 26591765 27061512
3513 27061512 27017410 27118915 27498561 27751852 27722798 27924634 28207153 28540519 29012806 29146786
3503 29146786 29176656 29596162 30231199 30374584 30781947 31209302 32062255 32166645 31999760 32492849
3493 32492849 32936679 33544276 34041820 34435251 34723740 35014062 35615277 36167116 36574314
3484 36574314 36982082 37563033 38092948 38839624 39375528 39491573 39749983 40728018 41907456
3475 41907456 42320013 42805011 43029561 43387305 44416581 44389747 45405797 46514074 47427118
3466 47427118 48028433 49204232 50403486 51649362 52507785 53220051 54832893 56510107 58268682
3457 58268682 59610769 60981019 62811368 65087101 67080081 69250287 71795337 74859736
3449 74859736 78215097 81891728 85368027 88918118 93795337 99169627 104522519 110379057
3441 110379057 116591431 123309015 130934377 139609842 148314106 157537035 167512552 177560110
3433 177560110 188168420 199608568 211208160 223389886 235685899 248525971 261489934
3426 261489934 273205311 284002303 293729959 301895216 309514943 315883043 321333568 326645597
3418 326645597 331998801 336867130 340843260 343859204 345297133 344925430 342167885 337570236
3410 337570236 330502621 322050797 312344200 302267329 291209764 280502509 270600092 260410831
3402 260410831 250324804 240251083 230639340 220606544 209631998 198677639 187206678
3395 187206678 176028419 165640799 155163051 146129155 137433931 130061361 123568287 116836468
3387 116836468 110866766 105781030 101002354 96375505 92330842 88843185 85610444 82353150
3379 82353150 79665534 76480713 73727522 71520587 69034166 66577509 64675078 62754061
3371 62754061 60440611 59138915 57368571 56061300 54136905 53072200 51871053 50021421
3363 50021421 48774385 47696052 46821913 45704217 44441478 42926409 41991888 41649444 41185767
3354 41185767 40037254 39545204 38656443 37622217 37365955 36626021 35594219 35032431 34338130
3345 34338130 33641624 33070438 32780648 32202061 31670312 31487742 30842806 30685631 29779523
3336 29779523 28866647 28625251 27872969 27611627 27204431 26891698 26945281 26108848 25557590 25283855
3326 25283855 24758730 24271472 23970877 23792588 23179097 22559835 22282864 22080483 22161106 21409395
3316 21409395 20984592 20720116 20135317 20512463 20299904 19407171 18988697 18708714 18771016 18461544
3306 18461544 18139954 18027571 17767424 16960512 16465247 16580695 16396194 16176119 15871905
3297 15871905 16145035 16137994 15430649 14844071 14824268 14477089 14254203 13788205 13906400 13924359
3287 13924359 13632329 13327835 13093235 13200199 13222385 13123953 12736152 12317611 12388493 12266950
3277 12266950 12071343 11952731 11375699 11387288 11070224 10704269 10625818 11063122 10978210 10481619
3267 10481619 10326480 10502623 10639902 10217378 10020998 10273293 10156417 10066049 9924151 9884371
3257 9884371 9932006 9902835 10157407 9901698 9963474 9877776 9756267 9594629 9181647 9289200
3247 9289200 9164129 8860066 9052274 8780814 8793724 8770517 9107340 9241082 9195999 9388604
3237 9388604 9346187 9214538 8638487 8733528 8974911 8465149 8694889 8496272 8577964 8418245
3227 8418245 8917196 8374592 7953512 7714545 7425740 7722165 7680242 7933392 8351250 7874517
3217 7874517 7828378 8174766 7563731 7384278 7682756 7434217 7748306 7515136 7156143 7380553
3207 7380553 7422322 7561931 7330361 7542910 7315074 7253808 7218033 7265342 7535056 7796002
3197 7796002 7682337 7618598 7784867 7434775 7317233 7522821 7411656 7612348 7535765 7845947
3187 7845947 7426908 7489634 7461888 7815937 7664704 7531908 7381373 7678534 7538142 7626513
3177 7626513 7601477 7667067 7944046 7875856 7450885 6935917 7782202 7908100 7920839 7760750
3167 7760750 7219616 7756328 7704985 8110040 8100655 8148418 8710627 8691965 8536654 8612427 8560668
3156 8560668 8765459 8602051 8623136 8637938 8887677 9069685 8649583 8406347 8755701 9096166
3146 9096166 9101847 9092602 8532889 8111640 8138199 8529439 8218909 7904664 7928358 7857044 7832424
3135 7832424 7827710 8057601 8621242 8580703 8256483 8165056 7824756 7251692 7535877 7629793
3125 7629793 7714062 8098106 8426941 8328361 8262989 8319788 8214000 8145016 8299354 8358188 8629552
3114 8629552 8362637 8541193 8845126 9344441 9929189 10235760 10422832 10737422 11289025 11766469
3104 11766469 11836265 12906935 13644541 13738469 13362918 13677346 13920225 13924568 14032706 14095216
3094 14095216 13610451 13636890 14048825 13981228 13912480 14005710 13509556 13315170 13573943 13785754
3084 13785754 13509343 12829320 12516017 12924033 13257209 12606171 12440754 12521432 13456046 13650704
3074 13650704 13698646 14016634 13821703 13101286 11930763 10864763 9983000 9090453 8921334
3065 8921334 9072333 8905199 8410963 7494847 7096635 7273260 7015857 6692822 6945196 7126599
3055 7126599 6846119 6930733 6960152 7168461 6978118 7308747 7460301 7858007 7858965 7946039 8397748
3044 8397748 8527760 8133672 7495180 7117241 6604281 6550450 6086753 5698154 5815877 5749218
3034 5749218 5358788 5300890 5177591 4886618 4739037 4681681 4950627 5117032 4598199 4467696
3024 4467696 4666987 4823285 4733513 4765153 4428945 4324232 4601993 4342564 4588072 4849594
3014 4849594 4588578 4208127 4349676 4024564 3934782 4095206 3792388 3914346 4027146 4077536
3004 4077536 4169952 3712599 3620481 3885417 3873770 3734551 3853059 3630901 3626251 4253524
2994 4253524 4165158 3959005 3295644 2853799 2937616 3329618 3539249 3399630 3218961 3011180
2984 3011180 3036535 3576828 3352461 3410024 3254460 3355564 3486336 3133893 3339207 3648466
2974 3648466 3324101 2973342 2894577 2512825 2852728 2881952 2938688 2667338 2583345 2327025
2964 2327025 2478495 2466112 2567489 2053988 2545836 2592244 2268332 2114423 1836809 2053478
2954 2053478 2571699 2763447 2498005 2274665 2093265 2518070 2285408 2325430 2448763 2240206
2944 2240206 2156023 2625966 2324663 2217708 1992557 1899112 1809644 2019560 2314466 2426636
2934 2426636 2138157 1762379 2136336 2503587 2305507 1985148 1387810 1672268 2086475 1849727
2924 1849727 1963968 1939734 1992962 1735515 2067012 2163975 2463998 2398100 2495314 2600616
2914 2600616 2074586 2331536 1967711 1749054 1826359 1767333 1597563 1630888 1665932 1468158
2904 1468158 1647538 2328532 1987603 1476365 1499079 1475669 1689860 1638144 1608510 1744611
2894 1744611 1703511 2112446 2013840 1414430 1594949 1955442 1708793 1356903 1584875 1772681
2884 1772681 1414744 1122946 1275885 1367331 1408248 1332588 1308812 1369933 1717011 1514891
2874 1514891 1158931 1024159 936654 1048963 1164714 1899069 2011495 1876841 1613971 1238865
2864 1238865 1462290 1642724 1595880 1678235 1862411 1790799 1761420 1521917 1597510 1687330 1793831
2853 1793831 1764649 1730019 1492196 973507 1504765 1525552 1617835 1852785 1433111 1663776
2843 1663776 2023310 1895874 1428795 1642123 1837815 1513827 1986330 1865363 2192582 2374085
2833 2374085 1811971 1548021 1738359 1884746 1679917 2343512 2042212 1693545 2201833 2440719
2823 2440719 1761320 2145784 1929613 2016201 2806596 2498530 2304551 2498971 1791817 2072624
2813 2072624 1841797 1884116 2418322 2922812 3033007 2684507 3020062 2723908 2457357 2237227
2803 2237227 2542476 2291700 2394297 2681195 2753385 2761344 3188455 2876209 2768843 2809988
2793 2809988 2924249 2625905 2711269 3296233 3145918 3211235 3010646 2944989 3751940 4246339
2783 4246339 3802352 3714006 4118339 3647508 3770288 3644161 3585250 3571854 3582519 4004958
2773 4004958 4196916 4386214 4397266 4351974 4238368 4734158 4603820 5194112 5378403 5407336
2763 5407336 5714516 6367861 6827841 6857694 6821456 5919335 5500715 5639764 5548147 5137076
2753 5137076 5257259 4966867 4459439 4256893 4119091 3883950 3618678 3801048 3867258 3372103
2743 3372103 3804115 3581137 3003852 3208207 3577836 3499380 3433659 3290968 3296683 3371371
2733 3371371 2987395 2703970 2555852 2662345 2898914 2960439 2849869 2860255 2628381 2758193
2723 2758193 2989300 2980643 2633699 2278451 2221679 2415482 2349080 1885610 2101149 2269512
2713 2269512 2218974 2135077 1987130 1848761 2031699 2164270 1962586 1660834 1789379 1373192
2703 1373192 1102724 969078 915543 1396685 1509390 1650787 1709337 1523053 1110180 1133832
2693 1133832 643259 580897 934982 1139360 670863 745300 1328266 889963 743714 1082506
2683 1082506 1063021 1284070 1383967 1049008 1051273 1532514 1237689 1180514 1215534 1051243 1134246
2672 1134246 1443817 930669 1168103 965322 865749 1021661 945872 1047570 1093444 1012250
2662 1012250 597172 658055 669166 927444 610174 722710 986486 606026 158037 646017
2652 646017 889006 726533 697236 651477 696050 956267 913364 555136 810242 393568
2642 393568 646571 146552 -371649 209281 -21736 268275 95568 223136 397644 173017
2632 173017 168387 390044 389996 245537 517613 178529 272534 598450 633659 965812 704241
2621 704241 413031 571222 381243 695762 854781 346561 644310 424119 505546 543331
2611 543331 282849 308868 269344 446617 805466 571034 471678 575690 414861 551775
2601 551775 447455 332018 617380 934155 906023 729684 678618 934132 548891 191609
2591 191609 126752 46709 198017 525768 465056 479480 614318 641661 416321 399821 513199
2580 513199 144797 137633 637048 698287 455975 760248 600833 321128 24637 175503
2570 175503 190477 458578 697049 686453 333062 387911 502402 -10061 94767 279664
2560 279664 207145 428295 786602 690917 393982 223506 -34222 551576 755922 618650
2550 618650 326290 328585 95089 -57309 57660 -140118 36730 378334 279471 386228
2540 386228 583383 262553 -24118 411554 629544 296158 236777 443522 693925 580045
2530 580045 294944 553676 628188 500499 457406 773026 745863 -190438 -547496 -407793
2520 -407793 -499828 -199624 315491 422920 570100 261362 164202 -101965 182064 63429
2510 63429 223060 282392 -2954 223962 461903 633636 857293 191473 -269809 27661
2500 27661 389914 537217 480249 387162 -208585 52374 425250 124809 63872 29085 313375
2489 313375 -221445 -73302 558356 573267 271438 367637 -221532 -284370 51212 71489
2479 71489 30546 295462 443898 491118 390248 790408 159319 -92666 416513 181560
2469 181560 394543 280196 -227967 -175957 66452 84158 22437 -54345 432770 157239
2459 157239 392891 5489 -169829 190311 152393 327237 272573 -524687 -369216 -155257
2449 -155257 -57116 194623 174625 36577 147 265622 339857 93177 -344067 4971
2439 4971 -201079 -38300 303200 231153 -100960 170450 -125915 -166490 151456 70312 122040
2428 122040 -125970 166006 514787 490368 -19065 -35838 -151955 379249 -47363 -218137
2418 -218137 112249 -84928 -459365 -212944 20753 232376 301380 413519 464429 168143
2408 168143 255885 472275 56978 -292957 -356264 -300996 -486789 84356 411012 -87524
2398 -87524 -102643 -114917 316685 88753 98056 68056 90821 -58377 -4257 -112157 -122222
2387 -122222 -85504 -482731 -314583 332339 216614 -128618 482509 329179 47432 98143
2377 98143 513732 391178 789654 366515 347448 188350 -41131 196356 456496 368084
2367 368084 531387 493293 677789 775567 770033 783019 570919 423723 -81503 389226 378329
2356 378329 -10565 409305 583799 -38615 271780 682942 445241 551407 -111943 38823
2346 38823 184692 355319 628586 170358 967300 725809 529033 636959 398987 -17206
2336 -17206 126666 33915 411572 92119 256096 275145 63611 66478 366118 344189 102049
2325 102049 399539 244994 -36969 240661 251176 308489 712484 533629 -39878 188467
2315 188467 415206 388669 548499 854203 848031 370142 599467 941104 739194 479370
2305 479370 530508 690466 671833 1024937 888827 1041608 809228 570523 629886 408366
2295 408366 718780 688729 862113 1003104 625813 298501 702146 996403 795875 574205
2285 574205 136433 683834 631636 192203 4997 59538 564160 434782 -46275 109880
2275 109880 671011 641965 616334 523260 421729 433336 85972 -43586 520243 521258 340399
2264 340399 616217 727834 422488 431117 11658 38819 407718 550065 184283 500576
2254 500576 703101 760450 729600 533805 573147 477466 594867 424786 430848 253913 468393
2243 468393 670164 412227 522146 527012 594158 383043 745974 777501 441266 260001
2233 260001 158554 411372 527363 653918 806800 708036 450922 265996 -59835 -42121
2223 -42121 367498 129049 438920 676702 691383 612701 560417 772883 739623 556189 748666
2212 748666 920780 1248259 922570 426265 242865 422437 797333 997481 1389083 1667873
2202 1667873 1568573 1689161 1226405 642076 472963 1043058 1255060 1161673 1340961 1045309
2192 1045309 1200433 1202729 1196993 1218420 885546 789513 1040330 984872 919520 1024399 1247428
2181 1247428 1230903 1049001 951976 1112799 1164710 1525203 1275981 1181752 1299672 1385713
2171 1385713 1946682 2223797 2003069 1497431 1753795 1645357 1872357 2335712 2313639 1938551
2161 1938551 1912549 2250296 2389394 2567983 2540128 1953680 2430409 3175892 3334209 3642970
2151 3642970 2918780 3016689 2720959 2893811 3245525 2891098 3138461 3698758 3505764 3355115
2141 3355115 3290470 4240001 4349530 4360202 4578210 4265431 4254606 4548091 4776668 4707066
2131 4707066 4561446 4575784 4954500 5032833 4817892 4672462 4539721 5036315 5461175 5343809
2121 5343809 5420727 5785671 5804833 6087393 5472457 6148025 6333541 6432627 6977283 6939068
2111 6939068 7434451 7396504 7571136 7877924 8086685 8446512 8895668 9375635 9706763 10057314
2101 10057314 10365650 10161208 10746351 11967821 12776982 13589284 14098925 14839871 15380475
2092 15380475 16435076 17472530 18439878 19277951 20337177 21898436 23087188 25106896
2084 25106896 27027996 29150698 31236081 33904250 36806109 39952306 43399879 47556288
2076 47556288 51873064 56788609 63261100 71242502 80142865 90147970 100703742 113140881
2068 113140881 126579478 143319366 161830782 179754881 191929350 193300300 182500723
2061 182500723 161343285 136866108 115570026 98997710 86542063 76162620 67819640
2054 67819640 61748197 56476145 51345199 47450471 44095115 40766906 38248862 35528541
2046 35528541 33071797 31186141 28653481 27173252 25931714 24625363 23358676 21706915
2038 21706915 20984934 19810272 18554347 17910062 17105745 16803555 16070860 15540551 15160127
2029 15160127 14576422 14116735 13546230 13511949 12744567 12334378 11946390 11386384 10847133 10439474
2019 10439474 10190868 9924322 9383417 9085909 8813769 8910242 9063518 8911615 8011236 7433117
2009 7433117 7262632 7403476 7199450 7111533 6911785 6846298 6570214 6150364 6140523 6048230
1999 6048230 5874323 5764338 5651209 5946576 5769686 5281871 4855883 5126131 5235096 5090221
1989 5090221 5310295 5022675 4895247 4716082 4456866 4318325 4335848 3731461 4111081 4465486
1979 4465486 4110321 3775819 3733398 3490136 3508321 3649036 3579358 3852778 3735168 3481201
1969 3481201 3447222 3534247 3224535 2873088 3060701 2493310 2454066 2800371 2530230 2576386
1959 2576386 2942714 2454774 2338900 2543231 2613866 2548401 2004235 1883166 2202388 2175709
1949 2175709 2158882 2458133 1875221 2260351 2032182 1825088 1677803 1769016 1814386 1639581
1939 1639581 1552873 1499280 1399619 1536073 911849 1156395 1639167 1707978 1508364 1487388
1929 1487388 1722005 1553191 1490834 1674863 1721995 1320427 1794633 1774457 1627382 1695882
1919 1695882 1286603 1698039 1441289 934430 588763 793231 1013204 871684 1307774 1198299
1909 1198299 1273259 1701738 1633253 1461366 1029800 1180609 1287180 1172110 1392678 1253826
1899 1253826 1370465 1365676 645749 618770 640844 944754 1078132 1338432 1012011 475466
1889 475466 869118 844709 983123 822128 677464 108112 726795 712184 651308 461430
1879 461430 226993 264138 826826 749939 973352 1006480 461601 490412 1142594 579302
1869 579302 754582 1055182 640186 820762 936080 608967 615319 596987 933555 1162528
1859 1162528 1015929 762725 685046 846078 602022 363502 370269 268092 82687 474833
1849 474833 681159 1022809 885459 450472 449048 147745 551307 444537 59850 519804
1839 519804 503990 386773 638646 1098307 1356218 945816 548183 977820 756703 1041867
1829 1041867 957143 938259 1051268 1041420 1463228 1602768 1422405 1825967 1535936 1725449
1819 1725449 1976489 1486719 1379027 1121788 1022583 1017123 1403607 818797 949764 539511
1809 539511 697219 896881 867357 585226 598912 556644 577862 718528 183362 184020 442091
1798 442091 693973 845515 1035550 663065 716062 102766 409934 522099 123905 -251018
1788 -251018 6169 692360 424837 183754 723763 334190 185274 386182 375964 609215
1778 609215 540902 -92121 -517797 -467057 356874 573330 441461 132735 12885 110313
1768 110313 -72696 494931 607552 230495 341416 413897 77610 -71892 -130914 -341098
1758 -341098 -11167 391047 227454 247202 468874 47410 90736 14966 426435 222980
1748 222980 -144564 199415 447228 576484 690879 681334 417432 149001 204329 155097
1738 155097 261930 536711 247049 168499 518857 338779 276233 420047 388446 419045
1728 419045 147866 217820 156852 -24726 -75965 310643 278165 186909 386832 -43646 -165446
1717 -165446 192409 -86816 -41381 118484 97621 418938 617639 289879 179429 141776
1707 141776 31561 -55768 178895 617753 398004 82181 501 412174 464851 154616
1697 154616 284876 -99749 249457 85407 338304 131429 -111533 -16447 -264591 -431211
1687 -431211 -694095 -327133 -112095 -232797 258157 465991 180444 149386 -74662 142984
1677 142984 -213229 -151408 -24395 292114 -200831 -431633 -325941 -234179 -14097 -179970
1667 -179970 -117136 -199870 -419187 -621856 -586540 -565595 -462634 -379216 76549 370729 185311
1656 185311 -166561 -47814 147833 141432 51903 466533 -81728 -234841 -786983 -478958
1646 -478958 24054 -9759 -297928 5442 54592 -61784 247159 635923 688688 10294
1636 10294 149768 30436 -46458 282269 34636 -67593 150772 -229926 -156847 -44489
1626 -44489 255471 133346 -301955 -303800 -345207 -275213 -198120 -247195 -504021 146708 -57748
1615 -57748 -87915 -13204 123342 189497 144999 -414002 -174366 85317 -357330 -164164 -118126
1604 -118126 1859 82384 56294 -40486 131206 -264040 124538 -166988 -575149 -412250
1594 -412250 78244 -236869 -208552 -158037 299051 310018 -278208 -518854 -293017 211739
1584 211739 -104504 -602909 -244553 -51820 -140552 -34334 -128082 -144233 -173097 -322026
1574 -322026 -260268 -259721 -114449 -171336 -63299 -497202 -255659 -358457 -281810 490657 399774
1563 399774 25165 322320 20430 45963 -13837 -237526 -298649 -306810 -137716 475719 529880
1552 529880 -405155 -418350 306986 23808 -261036 -450891 -325056 -175045 -305556 -487900
1542 -487900 -273048 207989 -9659 606502 485867 167193 -107459 -248764 -144944 456312
1532 456312 132192 176745 574230 293844 236750 462129 241819 -37978 -203954 -39079
1522 -39079 -114295 175266 570482 229568 -22096 122466 -506731 -455024 194526 141143
1512 141143 308618 117547 17364 228049 401139 215661 177165 161208 -193905 -269997
1502 -269997 -663685 -516648 -126252 386202 187067 -395329 -589881 -530101 -298615 -32879
1492 -32879 8028 5261 -202649 -82113 298485 191509 235106 -208041 -161733 161602 -69970
1481 -69970 -126881 -216341 -484554 -240123 270346 22618 -135753 -185767 -683609 -704880 -181934
1470 -181934 -892408 -358391 355719 147075 414037 250424 -232828 -27260 97584 -247326
1460 -247326 -43481 27232 258561 -13672 -29046 -38911 163300 318116 493173 207560
1450 207560 -183977 24382 352351 296722 12351 105109 -502037 -760041 -653319 -255520
1440 -255520 -158788 -508765 -272237 497595 188903 -40156 114018 105094 304077 569175
1430 569175 489958 -33938 -245751 -330446 -290531 -96244 -120909 -221687 -86150 -221435
1420 -221435 -123101 -447257 174153 43068 -260314 222704 8004 210852 -79515 -562575
1410 -562575 -466235 -628953 -172928 -76928 41806 -136883 -373795 -580127 -6094 320138
1400 320138 37314 219746 -73305 -321986 -135075 338201 -214079 -409347 -240940 -474889
1390 -474889 -410166 -609933 -399173 7791 272845 439139 87804 228551 -507205 -616707
1380 -616707 14572 109508 216837 6190 384171 3601 3964 166071 -199254 -382984
1370 -382984 -109618 -123 -593503 -785987 -327903 -102676 -318881 -174008 221636 250716
1360 250716 -623 -198046 -50485 -131636 -404417 119888 -179980 -180532 85613 -176427
1350 -176427 -364106 -18580 425615 48486 225343 296621 33368 129744 117598 178235
1340 178235 -267281 -551463 -370248 -211027 -109598 -156781 -461030 -23531 215666 84634
1330 84634 -210275 -356328 -90393 -318740 -258914 -266877 -557062 -154104 -297802 -503032
1320 -503032 91508 -382363 35743 265900 56805 134751 -641347 -468825 -700791 -340950
1310 -340950 -541558 -23030 -450984 -734619 384147 468985 71298 -68311 -114799 -78738
1300 -78738 132434 -114808 -404373 -233962 -97921 -388908 -177674 -141360 -158093 65672
1290 65672 199905 -107337 -245638 -192643 -40957 -549704 -666945 -327342 -536004 -300197
1280 -300197 -192112 100134 324980 304397 300000 318144 207124 -338717 96360 191019 53058
1269 53058 -113545 -540298 -359831 -61693 139541 384115 -20296 -270100 -23713 -62468
1259 -62468 -84600 54179 -645674 -656201 -808225 -298678 -361122 -372584 -138690 -121532 155431
1248 155431 52311 -354159 -220589 -138077 386612 411361 -90458 -28991 -45468 -291507
1238 -291507 -152203 -127520 1452 187537 -279375 -301748 -90202 -130891 3120 -110976
1228 -110976 152775 67702 -16674 340355 -120520 56718 141862 -89733 -39831 -142076
1218 -142076 74788 147684 -250754 -230359 -458359 -323803 -142986 278893 -94928 -117944
1208 -117944 -52388 53916 93402 249176 226734 507456 97097 -269925 314572 -120206
1198 -120206 -466687 -427336 -406302 -289651 -126054 111372 -162917 -372707 -267888 245650
1188 245650 205870 41205 -39949 144381 492940 494187 76038 -392991 -65419 -66741 -62110
1177 -62110 380844 -14097 -497192 -310708 -191991 -425885 -468257 -277248 -146380 -381647
1167 -381647 -248674 -109644 399146 551687 -142011 -137568 113127 -308256 -396672 24022
1157 24022 222674 -10863 -241641 82214 357334 93779 -220253 285412 154320 -10036
1147 -10036 125451 -178371 -621281 -586621 -273559 -247635 34073 3108 9551 -50848 -193407
1136 -193407 116048 238793 -112023 -367713 216676 241631 74049 87532 -100948 109375
1126 109375 196364 199810 -13503 105044 26784 -5277 100651 270317 143436 -496054 -305210
1115 -305210 -370187 -112012 -276642 -132455 116610 -221747 -182950 472184 -208643 -49964
1105 -49964 277114 338966 129896 -302670 390355 500889 -2426 -181288 -128157 -479391
1095 -479391 -568231 -193571 -268047 -75219 -496133 -53395 -165433 -324933 -238152 -272527
1085 -272527 -174056 225504 241 -275355 152316 -227490 79464 -47634 -197214 -315770
1075 -315770 -312487 -118171 406853 280477 53187 -198613 75024 -231068 168395 -422401
1065 -422401 -358581 298317 -82399 -5210 129223 41185 -289458 -398136 -133615 -78237
1055 -78237 -127950 -645112 -202610 128530 -88158 -414688 -246367 -159818 -189358 -56866
1045 -56866 -300812 -268145 -438021 -314037 -377387 -365255 -232855 -288975 -335813 -15310 -437143
1034 -437143 -321848 226968 -123600 -404232 -264769 -358024 -574123 -532306 86325 -33438
1024 -33438 88673 33250 -365117 -598254 -189635 -293745 193980 252962 -470601 -247864
1014 -247864 18321 -65799 -367536 -198092 -74397 -137957 295384 -242019 -238069 -167082 -269727
1003 -269727 -328547 -327066 -103690 -100767 31085 82760 53372 972 -116329 144743 -145450
992 -145450 -232453 507334 265566 -429395 -98351 -19036 -305211 -446217 -728758 -761635
982 -761635 -903664 -203356 -34535 -73768 -353446 -457327 -551753 -517803 18551 -118863
972 -118863 -130753 -169370 -551135 -558286 -624519 -107289 -195938 -49280 -102317 -134141 -20843
961 -20843 133863 18138 -30414 -20819 -71921 80882 -154755 94383 -148828 -18272 114983
950 114983 -487263 -693196 -650747 -185987 138341 275987 -72071 34237 -187763 -435397
940 -435397 -550740 -450294 -195320 -119931 -85050 -462724 257652 378477 -621212 -402429
930 -402429 -551351 -334019 -48181 -71676 194480 -307758 -436771 -236974 -301888 -417910
920 -417910 -97722 63263 -71220 -112499 289918 115433 -74079 221017 144629 157720
910 157720 219928 253327 -49022 88473 120858 261394 49537 -50157 161628 315442 -178119
899 -178119 -356380 204137 327814 373387 448706 533113 134879 -312754 -290002 93143 -579226
888 -579226 -834437 -817097 -854212 -619273 -669642 -199830 95839 -20249 214210 83172
878 83172 -52207 -176905 -652922 -454518 -84852 -159949 15113 40886 -450029 -810348
868 -810348 -202313 -223567 -75811 515008 452940 -197634 -228777 -520998 -236546 -407280
858 -407280 -315297 -159408 -422747 111131 40467 -116630 353522 128575 -57003 211636
848 211636 201493 124625 -201080 -429408 290225 649672 843234 405856 -66265 43463
838 43463 -272408 -283348 -156837 94730 285616 530887 515639 -60791 -228360 -388664
828 -388664 -486649 -143412 -296174 -260279 -116804 179112 -341039 -264782 -362408 -446917 -426985
817 -426985 -594902 35715 320472 26917 -116766 -29020 -146107 -515097 -531660 -97923
807 -97923 -293237 70864 338188 -10644 -60437 44727 152592 51164 457026 -43180
797 -43180 -177218 -160045 371224 163129 -264564 -430076 -348896 51223 -319307 -12139
787 -12139 -242811 134821 -519076 -677206 -582750 -367147 321868 258460 65663 -239500
777 -239500 -525783 -563790 -168681 87306 182239 57484 -264863 -262474 84433 38237 -428821
766 -428821 61086 -232115 132603 392751 315416 539273 290823 362113 4737 -165569
756 -165569 326795 131860 -380218 -154035 39972 247796 17634 106164 59159 433035
746 433035 313591 -168696 -741133 -623884 -302041 -192249 -228757 -5992 -351687 -420080
736 -420080 -197664 -66079 384382 507005 280033 303096 118814 163494 617240 262235
726 262235 170409 199167 -352794 -128017 -395055 -54779 397437 376831 180342 246007 33351
715 33351 -145846 -271308 -399060 12146 -80966 -625989 -349258 44118 115313 12822
705 12822 148792 52535 -322117 -608911 -502790 -112110 46178 -434421 -196716 -313589
695 -313589 -290406 -349882 -469582 -302259 -203946 518192 184161 99791 332995 349917 -323919
684 -323919 -25121 -346536 -116012 -185121 -179879 19002 613203 533886 143263 -111833 203598
673 203598 156997 370094 50281 -315483 -119072 183676 12469 105179 -44880 -73999
663 -73999 -154628 -3733 118011 -354525 -181811 -635141 -258497 54150 134375 57926 -252687
652 -252687 160061 226618 136867 -387417 -382640 296535 258509 -60685 -424291 -871584 -415324
641 -415324 -147551 172291 194645 5197 -6416 -179118 207621 358721 47219 -208925
631 -208925 73240 95451 130384 332139 -40497 -381287 111908 57281 262475 -648086
621 -648086 -239001 361185 218698 -272092 -381795 63420 275322 130110 591195 390968
611 390968 370164 -59598 -65419 -42996 -251885 145113 59446 10267 15969 297036 245150
600 245150 353491 84969 -194140 -355534 -388470 -343325 -50567 -189974 -125791 -388960
590 -388960 -421636 -206232 -294983 -328333 93885 118290 217966 220526 -362534 -429343 503832
579 503832 441063 291098 428289 508413 451163 343493 394484 60484 682514 323616 -187800
568 -187800 -596453 -485783 -253083 238 105287 -123404 -23013 -259837 45685 209499
558 209499 281297 -72210 -110811 -100774 -233656 -506583 -234598 -762112 -479499 -678932
548 -678932 -511120 -463130 85075 842321 482580 498360 177373 -103804 -225980 201071
538 201071 137665 332062 -28640 202869 269193 -41039 -68138 -148785 20302 51259 -259253
527 -259253 -53055 52819 85584 -511353 -314646 -266475 30260 8673 289633 471931
517 471931 346187 237962 296213 91504 241858 472777 16198 56677 40891 175735
507 175735 -117240 79114 -240136 -403983 -220094 34463 173083 -365542 -231572 164718
497 164718 224058 243800 342989 238718 357991 348042 372294 518829 651806 465444 67417
486 67417 -38902 -183181 -315837 137553 449504 281423 293945 275303 417530 -63558
476 -63558 -293769 -91360 307173 472171 -239855 157924 383699 109217 78543 -357197
466 -357197 -532540 -391896 -106706 -2747 263124 346080 -67385 395686 380119 244987
456 244987 275632 171636 236820 480625 43019 -107576 -477914 -404298 71671 -34406
446 -34406 255174 -391580 -76282 356856 447681 -174238 -277150 158716 -61515 -833521
436 -833521 -747690 -180184 385753 695865 475617 111594 -186746 2789 205844 260216
426 260216 -82766 -314929 -66706 -409230 41201 174657 74490 106751 183581 535773
416 535773 228783 -432391 -223363 -282485 138913 260709 505682 655134 305082 -257467
406 -257467 -2361 559232 232869 249634 129096 330900 415546 386682 256587 163935 428809
395 428809 311581 387880 349192 237089 -184483 121360 1034826 808601 316707 254311
385 254311 -54073 50022 111165 56270 359285 176237 -66584 -30687 357508 348996 536791
374 536791 368444 -25280 179165 52814 -24117 444846 865266 1048915 772781 793871
364 793871 713090 1038650 728409 437720 536208 171248 43516 553537 444963 391227
354 391227 -101320 272886 260140 114018 58793 -253725 -188316 -132564 241090 404156 314683
343 314683 585552 353341 133031 -452659 -293234 -101118 -48848 -199848 534011 811511
333 811511 569652 438964 177693 381310 629758 800234 614690 673819 631143 421929
323 421929 -18959 370840 309679 364674 412078 908088 228380 -48363 373865 494683
313 494683 382008 382833 444156 313367 317314 299232 1071091 911261 513342 711267 575414
302 575414 113776 -63626 -162076 169305 203567 129537 462741 13954 -55640 29566 446678
291 446678 670331 295191 458820 613467 155676 455951 110869 -66621 483046 619300
281 619300 405263 288338 171203 -211455 -20969 391999 289576 303864 -16854 196990
271 196990 453146 209880 41535 -221548 -486780 -387420 3235 381306 408726 802319
261 802319 407785 85166 362716 150725 129039 389296 745771 684468 445131 116263
251 116263 -85125 -150771 -25596 258406 496427 613636 549621 489571 457038 689414 553855
240 553855 18491 290788 57718 827819 747780 495557 304235 203403 495663 610693
230 610693 16446 135192 491820 254512 125669 27643 733868 772380 723228 465965
220 465965 625097 410957 230461 98207 142157 330839 374333 362545 282601 427149 287021
209 287021 297550 324371 917998 1021528 1004956 662145 360005 66176 701012 1005635
199 1005635 470033 442287 42517 549948 556614 456987 582813 440045 487038 520087 366489
188 366489 373248 259288 331367 198241 38613 243593 76357 164063 152115 598721 811815
177 811815 276876 243242 380601 518716 253876 184470 376138 -43569 -70559 50880
167 50880 212106 677605 394344 407827 424267 478261 577545 421597 338518 39127 149609
156 149609 573203 300777 391499 441585 668663 283976 10657 148826 382771 559072
146 559072 547121 363500 417778 431308 291545 623345 692298 301001 64880 -91973 88113
135 88113 433903 582456 457368 425805 510128 117089 205603 -146244 278915 216322 223210
124 223210 307386 214301 467710 87437 -23098 472074 577671 268584 313438 484444
114 484444 398261 875720 1015965 599586 574798 637720 764833 441153 332042 417850 447472
103 447472 260088 -745 372453 309004 561199 392773 268130 185901 49665 284330
93 284330 713590 428258 287421 42983 42852 341119 94114 505489 512316 334215 556137
82 556137 424270 518421 679599 287709 284085 720146 705671 683969 581871 570818 481985
71 481985 483657 400684 150871 183890 -19997 208987 290613 764328 587389 459555 567795
60 567795 111109 244087 453891 328766 653462 563388 552033 336519 506953 623015
50 623015 448538 296978 116031 134229 -40707 392057 698091 437578 458435 773813
40 773813 634021 652392 334280 394261 559784 351985 266086 214112 296593 465253 597293
29 597293 439552 528672 164285 226751 536318 658294 497488 270002 238512 308944 229242
18 229242 474895 684235 634477 426367 359362 621035 369643 224871 243912 234316 329361
7 329361 549909 419974 379304 243002 250778 651748 674829
0 674829
$$ Imaginary data points
##PAGE= N=2
##DATA TABLE= (X++(I..I)), XYDATA
16383 -2806586 -2716137 -2580936 -2424784 -2495872 -2602882 -2417302 -2477832 -2454355 -2524877 -2396194
16373 -2396194 -2138225 -2148639 -2002477 -1938123 -2014841 -1976806 -2229455 -2095972 -1920571 -1766880
16363 -1766880 -1549476 -1744463 -1855706 -1755277 -2024635 -1977064 -1602288 -1815982 -1508212 -1265113
16353 -1265113 -996047 -1282356 -1542066 -1262669 -1446255 -1884796 -1632912 -1336949 -1419422 -1151786
16343 -1151786 -1196039 -1356822 -1122680 -621047 -846816 -601674 -210415 -933856 -860182 -506764
16333 -506764 -680047 -730913 -439880 -104093 -211707 -376940 -407245 -485965 -527287 -186321
16323 -186321 -202750 -275321 -302123 -478794 14298 -311579 -219608 259297 -185575 -146974
16313 -146974 -10842 -104727 3179 -30006 -54813 87389 3563 21186 -114387 -55352 95876
16302 95876 390657 340850 520434 506031 654885 732182 841961 1012383 270817 250951
16292 250951 403115 537101 711345 870061 747027 812603 672531 722416 688085 451956
16282 451956 848657 1064507 1244060 985494 1037007 867871 928316 1203625 1400887 1229428
16272 1229428 996318 1469031 1545070 1511944 1665741 1443091 1077942 1329756 1169992 1169136
16262 1169136 1330570 1394990 1476627 1349551 1512876 1532001 1496652 1685540 1247538 1589791
16252 1589791 1058282 1221660 1854634 1334178 1454538 2025547 1768430 1836599 2003092 1636739
16242 1636739 2025763 2144748 1932226 2433888 2504949 2418858 2565030 2035762 2131459 2173808
16232 2173808 1969355 2044049 2105907 2014930 2113110 2279890 1769539 2037178 2058584 1819967
16222 1819967 1839755 2350009 2083877 1955106 2172683 2269962 2506266 2519701 2494235 2061799
16212 2061799 2266399 2357129 2835656 2632159 2330119 2611959 2723313 2483506 2747405 2902505
16202 2902505 2719109 2294926 2622690 2591788 2577222 2116104 2254289 2556406 2843929 2715838
16192 2715838 2362062 2362765 2457607 2387273 2659094 2795884 2887647 2759660 2781200 2976172 2820502
16181 2820502 2798956 2780056 2944701 2703432 2757510 2760092 2807190 2712424 3178079 3306526 2882535
16170 2882535 3138276 3315540 3005198 2780790 3129096 3106410 3329658 3194374 3311316 3237921
16160 3237921 2998030 3392320 2957625 2561998 3032484 3243307 2903126 2511013 2429541 2902127
16150 2902127 3408472 3169658 2983911 3252304 3043648 3420192 3595627 3878201 3443231
16141 3443231 3152281 2819102 2790710 2449822 2965039 3226170 3126700 3471731 3432577 3357739
16131 3357739 3353888 3176278 3425339 2826960 2942619 3026191 2833135 3378118 3389455 3313999
16121 3313999 3414804 3516782 3623208 3236364 3076327 3039965 2920935 3471314 3135347 2991579
16111 2991579 3182163 3279613 3377457 3174513 3250409 3413592 3496846 3795826 3374090 3227123
16101 3227123 3359406 3393335 3286667 3311503 3377350 3016122 3211443 3109751 3130774 3063455
16091 3063455 3063753 3207581 3172327 3013804 3066703 3248270 3272127 3285527 3342765 3765376 3695110
16080 3695110 3385948 3034917 2894903 3306720 3513039 3385876 3813120 3435758 3070661
16071 3070661 3145921 3397605 3310168 3363571 3582136 3370827 2949138 3074209 3692310 3586108
16061 3586108 3093057 3028133 3188094 3318012 3329091 3667449 3806238 3570378 3243647 3203534
16051 3203534 3081913 3428316 3601751 3816555 3739752 3302473 3071708 3143765 3241052 3967387
16041 3967387 4256345 3872969 3533300 3418865 3666540 3375956 3380229 2834503 2966809 3524425
16031 3524425 3384410 3797138 3715732 3274584 3228096 3284733 3690038 3671523 3599718 3218787
16021 3218787 3480876 3621124 3572595 3362283 3152160 3620657 3106722 2863539 3195513 2801217
16011 2801217 2931053 3549160 3374290 3334904 3414110 2956860 2762254 3086567 3401002 2861518
16001 2861518 3122307 3420906 3215187 3522612 3744069 3685318 3438513 3608168 3821771 3498824
15991 3498824 3488609 3840492 3609308 3255806 3483145 3509906 3246845 3103773 3432107 3530599
15981 3530599 3196527 3405153 3836557 3978167 3694758 3912587 3730390 4078579 3523982
15972 3523982 3644210 3623799 3639339 3908895 3544475 3663192 3359806 3231452 3481778 3281848
15962 3281848 3630360 4111032 3801510 3633749 3233260 3409812 3440637 3470963 3411488 3544103
15952 3544103 3944486 3836664 3486963 3630328 3411736 3424803 3820184 3743016 3754257 3499930
15942 3499930 3302303 3509589 3653346 3968925 3393959 3108914 3643193 3731768 3607109 3119003
15932 3119003 3075549 3489196 3453938 3238576 3538661 3606425 3141511 3298678 3426714 3787198
15922 3787198 3619730 3884294 3749449 3690787 4045385 3972513 3523110 3451993 3848197 3950499
15912 3950499 3595970 3521593 3788634 3615838 3509828 3835588 3748977 3748559 3847044 3024957
15902 3024957 3295201 3705906 3854707 4062626 4239522 4319610 4186992 4013107 3757531 3280731
15892 3280731 3416859 3622971 3265687 3512866 3253945 3649510 3731216 3322857 3668321 3534351
15882 3534351 3557088 3673028 3732233 3633474 3453356 3501236 3751062 3533403 3218170 3415403
15872 3415403 3794119 3384953 3002285 2921188 3252476 3668504 3403267 3469879 3620253 3459834
15862 3459834 3257998 3390603 3549946 3404510 3628926 3620800 3418247 3758213 3556075 3242310
15852 3242310 3608744 3661783 3093170 3605494 3492108 2932716 3040627 3109453 3114920 3045900
15842 3045900 3496418 3315174 3672921 3851802 3109959 2983498 3100788 3879895 3838465 3730853
15832 3730853 3408404 3316566 3482821 3379901 3209819 3124514 3291976 3306251 3861114 3617224
15822 3617224 3999799 3950860 3349678 3519028 3881475 3615386 3072051 2945894 3716325 3373104
15812 3373104 3353804 3444741 3394431 3510732 3759618 3662605 3466687 3806464 3723584 3201847
15802 3201847 3103220 3338105 3043326 2902151 3244659 3118694 3325437 3235125 3312757 3425495
15792 3425495 3082487 3732150 4026945 4002863 3438717 3267834 3438252 3372317 3831532 3729598
15782 3729598 3751518 3669768 3820588 3159629 3317195 3364356 3339561 3377150 3125861 3382549
15772 3382549 3431160 3439931 3656014 4036275 3575628 3708422 3087690 3555929 4177830 4172550
15762 4172550 3801138 3793366 3188990 3418353 4290203 3834136 3126744 3701726 3355979 3099788
15752 3099788 3412051 3309784 3705548 4001299 3655510 3366520 3432440 3605681 4027638 3621904
15742 3621904 3504596 3416528 3236781 3401616 3498206 3771941 3972458 3964093 3596247 3387987
15732 3387987 3158584 3073807 3267785 3571052 3923994 3734472 3825506 3822593 3778760 3787329 3853100
15721 3853100 3738014 3874945 3612884 3853658 4121501 3267059 3570539 3561143 3838246 3403054
15711 3403054 3572367 3684753 3754429 3380166 3498012 3994900 4220425 3869160 3496515 3595298
15701 3595298 3383275 3446857 3568814 3431874 3432299 3884528 3312977 3573955 3875542 3910975
15691 3910975 3560952 3928149 3997533 4017079 4193528 3661688 3482728 3526541 3665445 3558798
15681 3558798 3367655 3170752 3001035 3531984 3390199 3269807 3657444 3886792 3402902
15672 3402902 3153657 3700301 3674403 3630115 3247623 3415900 3663850 3496404 3824052 3538053
15662 3538053 3948636 3694975 3397780 3592506 3500527 3756816 3351870 3450715 3454135 3145706
15652 3145706 3359128 3254189 3289360 3306051 3581828 3374184 3792400 3976605 3889185 3709088
15642 3709088 4064512 4087726 3788422 3840448 3984847 4004561 4021377 3384959 3258851 3372076
15632 3372076 3667160 3639465 3452020 3188033 3123679 3787996 3780378 3819422 3270687 3466053
15622 3466053 4097628 3853231 4058768 3931942 3722272 3515989 3051678 3587117 3844870
15613 3844870 3913439 3607114 3852088 3476809 3816506 3785621 3491667 3611280 3275822 3262772
15603 3262772 3291761 2802013 3281760 3354148 3087111 3661270 3918050 3661839 3879686 3577437
15593 3577437 3061487 3322127 3204016 3352887 3342205 3595770 3487821 3590963 3341174 3145935
15583 3145935 3705494 3465636 3710639 3517040 3354692 3291263 3321003 3400495 3655454 3499671
15573 3499671 3885126 3808725 4208014 3712579 3724889 3934816 3224440 3125097 3374510 3326975
15563 3326975 2963960 2853309 3392224 3677213 3317208 3690016 4195436 4279763 4151748 3798013
15553 3798013 3086875 3549421 3864837 4026761 3740519 3699814 3782085 4017107 4076380 4419376
15543 4419376 4147403 3915630 3588563 3640255 3661117 3470119 3212482 3426316 3456792 3198360
15533 3198360 3312923 3780507 4011508 3988877 3714908 3503382 3881250 3791055 3707396 3991785
15523 3991785 4235634 3999592 3655556 3826698 3376740 3265612 3433478 3337107 3331547 3767549
15513 3767549 3660162 3652329 3659726 3510336 3530875 3667288 3686804 3925060 3582919 2854093
15503 2854093 3560291 3679097 3817196 3764752 3568377 2971291 3449888 3820383 3496902 3479387
15493 3479387 3599316 3677992 3865444 3867641 3545774 3828791 3640461 3658578 3728731 3751616
15483 3751616 3452563 3583211 4036409 3994268 3546901 3825095 3723822 3483953 3672098 4092367
15473 4092367 4279303 3793509 3827968 3307797 3510972 3970917 4159228 3742334 4076644 4056433
15463 4056433 3578262 3474642 3836681 4077109 4050965 4207141 4433452 3852894 3894320 3587061
15453 3587061 3190340 3079037 3469109 3273330 3394457 3552774 3794565 3788043 3923424 4156946
15443 4156946 3527274 3499742 3497871 3614261 4015063 4497364 3647203 3830606 3745750 3730858
15433 3730858 3555471 3689766 3831881 3836552 3995391 3992063 3951235 3793494 3669525 3722158
15423 3722158 4087327 3853842 3901918 4072353 4156323 3743940 3428517 3796070 3797898 4092153
15413 4092153 3996131 3745100 4112195 4194230 4169982 4079444 3366806 3308729 3498199 3728875
15403 3728875 3957171 4052628 4193906 4030133 3759456 3695571 3739036 4146996 3798679 3676782
15393 3676782 3941996 3594763 3209135 3447059 3356366 3849139 4067181 3155779 3183571 3778781
15383 3778781 3542635 3229461 3354151 3460616 3550868 3596087 3962243 3668274 3997773 3632349
15373 3632349 3506193 3958818 3662898 3587183 3533210 3646844 3327888 3554296 3594800 3809746
15363 3809746 3868942 3953047 3787580 3863589 3915739 4041197 3930942 3445903 3561788 3207318
15353 3207318 3436412 3641961 3645966 3711860 3482625 3243789 3551811 3640704 3933737 3986000
15343 3986000 4236727 4064845 3732460 2848331 3046540 3662132 3522222 3845927 3795103 3733844
15333 3733844 3562480 3436234 3204450 3361135 3851769 3705129 3741968 3730100 3779480 3416526
15323 3416526 4100695 4051337 3703210 3623726 3360967 3617951 3597416 3414503 3626296 3890147
15313 3890147 3335556 3258834 4061914 4066342 4226378 4257581 3664055 3490706 3724282 3754103
15303 3754103 4002805 3794574 3605367 3750567 3605344 3347391 3544580 4081493 3832506
15294 3832506 3693250 3504129 3630764 3588502 3332056 3327931 3380195 3078822 3795140 3522751
15284 3522751 3829223 3728715 3680338 3910013 3894958 4006151 3575693 3285698 3471279 3536604
15274 3536604 3249956 3689625 3781728 4035882 3928672 3552394 3637407 3876570 4149573 4000340
15264 4000340 4183330 4029603 4030314 3604365 3487954 3420912 3582309 3890899 3850297 4065963
15254 4065963 3985764 3974318 4040522 3900037 4058563 3890061 3906228 3813234 3785780 3764982 3604938
15243 3604938 3716275 3392640 3614473 3497493 3280787 3695367 3762532 3544075 4014485 3739203
15233 3739203 3153942 2933911 3120986 3356128 3579068 3425981 3782271 4527972 4223494
15224 4223494 3430645 3421777 4038661 4185310 4319723 3524502 3135797 3619895 3833727 3911205
15214 3911205 4020346 4345436 4133754 3760662 3303627 3545933 3723170 3654893 3690911 3970267
15204 3970267 3864962 4213609 4069461 4199739 4117325 4051743 4195119 4132248 4180594 3807498
15194 3807498 3853450 4015034 3859142 3952608 3867332 3908447 3997904 3625112 3568203 3600747 3925404
15183 3925404 3861751 3860736 3704065 3886171 3543614 3604875 3419427 3708221 4011789 4208838
15173 4208838 4022141 4024254 3818031 3422017 3574651 3303904 3262231 3566048 3821017 3735346
15163 3735346 3541343 3186603 3590442 3608059 3804404 4109918 4165050 4226991 4046839 3836316
15153 3836316 3737849 3609351 3791177 3685457 3394790 3631805 3918966 3795090 4190291 4104010
15143 4104010 4116894 3993268 3739325 3630338 3862322 4202017 4144299 3897070 3791771 4066189
15133 4066189 4128358 3939212 3944349 4109643 4080518 4575454 4196924 3668621 3515303 3633899
15123 3633899 3891451 3517687 3609292 3634190 3987493 4042548 4221917 4099469 3656448 3920767
15113 3920767 4019970 3946323 4026357 3911687 3954534 4084593 4117616 4173301 4017351 3883348
15103 3883348 3693028 3829870 3544689 3050466 3543285 4029144 3594995 3816837 4030656
15094 4030656 3837830 3633506 4415123 4228794 3859333 3933352 3472419 3286972 3264122 3346537
15084 3346537 3408069 3473844 3311655 3445530 3345101 3545713 4071182 4212947 3989947 3823492
15074 3823492 4594844 4607439 4134213 3804108 3911864 3663512 3460070 3702032 3822649 4098990
15064 4098990 4001469 3627871 3517424 3381459 3453830 3644272 3528217 3329140 3216493 3431391
15054 3431391 3256331 3281186 3468988 3838567 3577701 3612318 3795675 3601019 3820600 4031025
15044 4031025 3971454 3987503 3787275 3705662 4035697 3912869 3908083 4121631 3929168 4103014
15034 4103014 4020942 3977027 3692147 3600359 3745226 3299111 3401611 3547178 3869840 3375114
15024 3375114 3679618 4027093 3876651 3597180 3456152 3179602 3550244 3640921 3398409 3777518
15014 3777518 3753820 3744693 3958382 3652849 3503828 3727415 3788904 3794559 3895510 3579180
15004 3579180 3435197 3595709 4044076 4073104 4306506 4211062 3793158 4094125 3846874 4189259
14994 4189259 3924404 3992077 4079358 4266181 3938094 3768838 3928435 3721248 3606552 3975870
14984 3975870 3640240 3413992 3602305 3671624 3546683 3228246 3877566 3830679 4168693 4547860
14974 4547860 3988998 4225675 4125114 3754107 3872269 3653589 3779653 3701974 3811333 3957424
14964 3957424 3726800 3754409 3586313 4018177 4184820 4103318 4039850 4218798 4364144 4096212
14954 4096212 3707996 4028333 3836566 3942984 4058843 3745734 3830263 4003803 4069371 3810430
14944 3810430 4093166 3741580 3674596 3686343 3913350 3676343 3923457 4170730 4425424 4548069
14934 4548069 4283123 3906053 3836987 4088361 3515016 4033597 4034356 3399767 3882388 4765699
14924 4765699 4699645 4769891 4149844 3931228 4015355 4024966 3740371 4039863 3775332 3690041
14914 3690041 3807897 3436284 3766907 4080912 3503153 3297357 3541784 3277052 3299110 3688860
14904 3688860 3831255 3344328 3338050 3309478 3643131 4121266 4022255 3644256 3590072 4099752
14894 4099752 4042623 3961026 3919057 3629567 3626634 3632348 3686030 3722398 3565716 3810000 3850681
14883 3850681 3970917 4017011 3770698 3796111 3899059 3765365 3240881 3595089 3575390 4124455
14873 4124455 4304721 4356151 4150217 3740152 3812727 3816577 3919110 4037182 4008169 3923919
14863 3923919 3509699 3655784 3679893 3319419 3575394 3852205 4285551 4313614 3968660 4129463
14853 4129463 3635552 3935369 3818720 4013537 4382053 4333209 3878247 3559042 3471978 3862061
14843 3862061 4206365 4025390 4121161 3935822 3639956 3558112 3182556 3267107 3904869 3725416
14833 3725416 3367423 3523994 4065476 4212351 3821006 3891575 3908718 4199390 4172494 4037353
14823 4037353 3889073 3832745 4346894 4206286 3789898 4291795 4247531 4056027 4607194 4458406
14813 4458406 4386293 4130489 3586912 3850779 3966718 4095832 3996761 3806040 3942657 3835622
14803 3835622 3965316 4196252 4095494 3431955 3555774 3534384 3731998 3722319 3579256 3667477
14793 3667477 3935928 3993878 3977527 3932059 3911219 4060417 4312063 4209556 4266062 3911278
14783 3911278 3659786 3433693 3514538 3531765 4023916 3880431 4011967 3963857 3949683 3829970
14773 3829970 3518646 4231105 3836356 3826108 3937743 3906622 4555869 4582665 4363625 3659839
14763 3659839 4182337 4583267 4214680 4185336 3926400 4061661 4229024 4396965 4950792 4669198
14753 4669198 4326356 4038891 3916577 3318512 3274483 3948497 3953879 4027124 3799018 3832129
14743 3832129 3681695 3901069 3496889 3637914 3926136 4037329 4448006 4515743 4359979 3942927
14733 3942927 3744424 4058688 3782374 3877119 4104073 4126726 3968295 3960053 4130283 3961313
14723 3961313 4175208 4335514 3814716 3619250 3726784 3377027 3145229 3418929 3941679
14714 3941679 4217748 4203088 4177204 4344868 4113703 4267336 3982973 3834436 4048558 3690799
14704 3690799 3806559 3230388 3338173 3928481 3694530 3824778 3931454 3748102 4140380
14695 4140380 4370404 4371489 4313187 3572866 3804796 3637689 3514402 3837346 4040528 3822528
14685 3822528 4092836 3830450 3679865 4271313 4333695 4050382 3863838 4041002 3621758 3836902
14675 3836902 3976707 3966173 4292585 4101573 4185589 4715741 4426477 4055024 4000907 4105258
14665 4105258 3961274 3670706 4003279 3828246 3985333 4006678 3801004 3871603 4230521 3936196
14655 3936196 3668525 4160385 4053448 3891373 3347152 3660181 4143801 3980955 4030407 3956242
14645 3956242 3657498 3927991 4027908 3918873 3426607 3512401 3585600 3902290 4116058 4641763
14635 4641763 4070283 4007949 3939009 4095604 4069784 4079955 4276491 4229438 4172281 4066289
14625 4066289 4180562 4515537 4178743 4013321 4158061 4200288 3799438 3881100 4044942 4403160
14615 4403160 3838307 3645697 3540478 3867481 3878512 3562417 3402344 3727635 3820164 3826876
14605 3826876 3840503 3878791 3974452 3466082 3877289 3767595 4360925 4357241 4823536 3937237
$$ [...]
##END NTUPLES=NMR SPECTRUM
##END=
