##TITLE=1H_CG-1151-A3
 CDCl3, 8 sc, 
 26.08.2021
##JCAMPDX= 6.0         $$ Bruker NMR JCAMP-DX V2.0
##DATA TYPE= NMR SPECTRUM
##DATA CLASS= NTUPLES
##ORIGIN= UXNMR, Bruker Analytische Messtechnik GmbH
##OWNER= root
$$ XWIN-NMR		Version 3.5
$$ Thu Aug 26 09:18:10 2021 Russian Standard Time (UT+4h)  she@DPX200
##.OBSERVE FREQUENCY= 200.131506
##.OBSERVE NUCLEUS= ^1H
##.ACQUISITION MODE= SIMULTANEOUS
##.ACQUISITION SCHEME= undefined
##.AVERAGES= 8
##.DIGITISER RES= 18
##SPECTROMETER/DATA SYSTEM= spect
##.PULSE SEQUENCE= zg30
##.SOLVENT NAME= CDCl3
##.SHIFT REFERENCE= (INTERNAL, CDCl3, 0, 17.5203)
##AUDIT TRAIL= $$ (NUMBER, WHEN, WHO, WHERE, WHAT)
$$ ##TITLE= Audit trail, XWIN-NMR		Version 3.5
$$ ##JCAMPDX= 5.01
$$ ##ORIGIN= Bruker BioSpin GmbH
$$ ##OWNER= she
$$ F:/spectra/data/she/nmr/H-F/1/pdata/1/auditp.txt
$$ ##AUDIT TRAIL=  $$ (NUMBER, WHEN, WHO, WHERE, WHAT)
(   1,<2021-08-26 09:16:19.92 +0400>,<she>,<DPX200>,
      <created by zg, POWCHK disabled, PULCHK disabled
       configuration hash MD5:
       00 E9 B6 7A A2 85 ED C7 34 08 36 98 17 FE 4E 26
       data hash MD5: 16K
       90 45 D2 7F 23 F2 7D E4 9E E4 AE 0A 57 3F 5F C8>)
(   2,<2021-08-26 09:16:22.15 +0400>,<she>,<DPX200>,
      <Start of raw data processing
       efp BC_mod = 2 LB = 0.24 FT_mod = 6 PKNL = 1 PHC0 = -13357.82 PHC1 = 14.00099 SI = 16K 
       data hash MD5: 16K
       66 71 9E 3F FA 7F E5 BE ED 54 59 39 A2 55 EF A7>)
(   3,<2021-08-26 09:16:42.82 +0400>,<she>,<DPX200>,
      <pk PHC0 = -1.027728 PHC1 = 2 
       data hash MD5: 16K
       EE 7B D7 70 64 37 AB FB 99 6A 4D EC B4 E7 C7 A7>)
(   4,<2021-08-26 09:16:46.00 +0400>,<she>,<DPX200>,
      <abs ABSG = 5 
       data hash MD5: 16K
       0E 20 F5 D4 66 7D 9A 61 64 66 08 5E E1 FF 2C 79>)
$$ ##END=
$$ 
$$ hash MD5
$$ 3A 20 16 F3 37 6E 57 29 4D 47 E8 8A 36 4F 2C 28
##$RELAX= 
##$RELAX= 
##$RELAX= 
##$RELAX= 
##$RELAX= 
##$RELAX= 
$$ Bruker specific parameters
$$ --------------------------
##$DU= <F:/spectra>
##$EXPNO= 1
##$NAME= <H-F>
##$PROCNO= 1
##$TYPE= <nmr>
##$USER= <she>
##$AMP= (0..31)
100 100 100 100 100 100 100 100 100 100 100 100 100 100 100 100 100 100 
100 100 100 100 100 100 100 100 100 100 100 100 100 100 
##$AQSEQ= 0
##$AQ_mod= 1
##$AUNM= <au_zg>
##$AUTOPOS= <>
##$BF1= 200.13
##$BF2= 200.13
##$BF3= 200.13
##$BF4= 200.13
##$BF5= 200.13
##$BF6= 200.13
##$BF7= 200.13
##$BF8= 200.13
##$BYTORDA= 1
##$CFDGTYP= 0
##$CFRGTYP= 5
##$CHEMSTR= <none>
##$CNST= (0..31)
1 1 145 1 1 1 1 1 1 1 1 1 1 1 1 1 1 1 1 1 1 1 1 1 1 1 1 1 1 1 1 1 
##$CPDPRG= <>
##$CPDPRG1= <>
##$CPDPRG2= <>
##$CPDPRG3= <>
##$CPDPRG4= <mlev>
##$CPDPRG5= <mlev>
##$CPDPRG6= <mlev>
##$CPDPRG7= <mlev>
##$CPDPRG8= <mlev>
##$CPDPRGB= <>
##$CPDPRGT= <>
##$D= (0..31)
0 1.2 0 0 0 0 0 0 0 0.06 0 0.03 0 0 0 0 0.0002 0 0 0 0 0 0 0 0 0 0 0 0 
0 0 0 
##$DATE= 1629954979
##$DBL= (0..7)
120 120 120 120 120 120 120 120 
##$DBP= (0..7)
150 150 150 150 150 150 150 150 
##$DBP07= 0
##$DBPNAM0= <>
##$DBPNAM1= <>
##$DBPNAM2= <>
##$DBPNAM3= <>
##$DBPNAM4= <>
$$ [...]
##$SUBNAM3= <"">
##$SUBNAM4= <"">
##$SUBNAM5= <"">
##$SUBNAM6= <"">
##$SUBNAM7= <"">
##$SUBNAM8= <"">
##$SUBNAM9= <"">
##$SW= 20.0188882624521
##$SWIBOX= (0..15)
0 0 2 0 0 0 0 0 0 0 0 0 0 0 0 0 
##$SW_h= 4006.41025641026
##$TD= 16384
##$TD0= 1
##$TE= 0
##$TE2= 300
##$TE3= 300
##$TEG= 300
##$TL= (0..7)
0 120 120 120 120 120 120 120 
##$TP= (0..7)
150 150 150 150 150 150 150 150 
##$TP07= 0
##$TPNAME0= <>
##$TPNAME1= <>
##$TPNAME2= <>
##$TPNAME3= <>
##$TPNAME4= <>
##$TPNAME5= <>
##$TPNAME6= <>
##$TPNAME7= <>
##$TPOAL= (0..7)
0.5 0.5 0.5 0.5 0.5 0.5 0.5 0.5 
##$TPOFFS= (0..7)
0 0 0 0 0 0 0 0 
##$TUNHIN= 0
##$TUNHOUT= 0
##$TUNXOUT= 0
##$USERA1= <user>
##$USERA2= <user>
##$USERA3= <user>
##$USERA4= <user>
##$USERA5= <user>
##$V9= 5
##$VALIST= <valist>
##$VCLIST= <CCCCCCCCCCCCCCC>
##$VD= 0
##$VDLIST= <DDDDDDDDDDDDDDD>
##$VPLIST= <PPPPPPPPPPPPPPP>
##$VTLIST= <TTTTTTTTTTTTTTT>
##$WBST= 1024
##$WBSW= 4
##$XGAIN= (0..3)
0 0 0 0 
##$XL= 0
##$YL= 0
##$YMAX_a= 524119
##$YMIN_a= -562801
##$ZGOPTNS= <>
##$ZL1= 120
##$ZL2= 120
##$ZL3= 120
##$ZL4= 120
##$ABSF1= 17.52521
##$ABSF2= -2.49383
##$ABSG= 5
##$ABSL= 3
##$ALPHA= 0
##$AQORDER= 0
##$ASSFAC= 0
##$ASSFACI= 0
##$ASSFACX= 0
##$ASSWID= 0
##$AUNMP= <proc_1d>
##$AZFE= 0.1
##$AZFW= 0.1
##$BCFW= 0
##$BC_mod= 2
##$BYTORDP= 0
##$COROFFS= 0
##$CY= -3
##$DATMOD= 1
##$DC= 0
##$DFILT= <>
##$DTYPP= 0
##$F1P= 0
##$F2P= 0
##$FCOR= 1
##$FTSIZE= 16384
##$FT_mod= 6
##$GAMMA= 0
##$GB= 0
##$INTBC= 1
##$INTSCL= 1.334414e-10
##$ISEN= 128
##$LB= 0.24
##$LEV0= 0
##$LPBIN= 0
##$MAXI= 10000
##$MC2= 0
##$MEAN= 0
##$ME_mod= 0
##$MI= 1.114404
##$NCOEF= 0
##$NC_proc= -6
##$NLEV= 6
##$NOISF1= 3.799351
##$NOISF2= 2.8
##$NSP= 0
##$NTH_PI= 0
##$NZP= 0
##$OFFSET= 17.52032
##$PC= 1
##$PHC0= -13358.85
##$PHC1= 16.00099
##$PH_mod= 1
##$PKNL= yes
##$PPARMOD= 0
##$PSCAL= 0
##$PSIGN= 0
##$REVERSE= no
##$SF= 200.130002862909
##$SI= 16384
##$SIGF1= 3
##$SIGF2= 2
##$SINO= 5.538805
##$SIOLD= 16384
##$SREGLST= <1H.CDCl3>
##$SSB= 0
##$STSI= 16384
##$STSR= 0
##$SW_p= 4006.41025641026
##$SYMM= 0
##$S_DEV= 0
##$TDeff= 16384
##$TDoff= 0
##$TI= <>
##$TILT= no
##$TM1= 0
##$TM2= 0
##$TOPLEV= 0
##$USERP1= <user>
##$USERP2= <user>
##$USERP3= <user>
##$USERP4= <user>
##$USERP5= <user>
##$WDW= 1
##$XDIM= 16384
##$YMAX_p= 396023230
##$YMIN_p= -314946
$$ End of Bruker specific parameters
$$ ---------------------------------
##NTUPLES= NMR SPECTRUM
##VAR_NAME=  FREQUENCY,     SPECTRUM/REAL,   SPECTRUM/IMAG
##SYMBOL=    X,             R,               I
##VAR_TYPE=  INDEPENDENT,   DEPENDENT,       DEPENDENT
##VAR_FORM=  AFFN,          ASDF,            ASDF
##VAR_DIM=   16384,         16384,           16384
##UNITS=     HZ,            ARBITRARY UNITS, ARBITRARY UNITS
##FACTOR=    0.24454680195387, 1,            1
##FIRST=     3506.34187034188, 0,            0
##LAST=      -500.068386068375, 0,           0
##MIN=       -500.068386068375, -314946,     0
##MAX=       3506.34187034188, 396023230,    0
$$ Real data points
##PAGE= N=1
##DATA TABLE= (X++(R..R)), XYDATA
$$ [...]
6696E549820J30547K09538J98556J01078L7624J58531q3541r3337l9738n1736
6686F117342J4297j6277l11655j37165o1563j95785n8731k43853k79585j97420
6676D629605J806j76757l07481j94173j26792j84131r5484j48396j83553j24325
6666C090319j7757m9119j59543j41755k1106r2098k35526l9226j47969m1666O1804
6655B206358j9600M1329J3345j52749N8665n1017m5024l1306j36813k0949k3444
6644A838795n3399L4357k2563l2896o6121k9651p8200j712P2860j31363j273L2913
6632A561747j38763j45707J08733Q4675j17079K436j7413r2980j24183o322J4535
6621A129679J300K4204M5806l4114L5255q7521r7233L2849j01675L1943J08380
$$ plain form
6696 5549820 5680367 5889905 6088461 6189539 6227163 6385694 6302153 6208816 6169078 6117342
6686 6117342 6131639 6115362 5803707 5666542 5604979 5409194 5350463 5106610 4827025 4629605
6676 4629605 4631411 4454654 4147173 3953000 3826208 3642077 3546593 3398197 3214644 3090319
6666 3090319 3072562 3023443 2863900 2722145 2701039 2608941 2373415 2334189 2186220 2144554 2206358
6655 2206358 2186758 2228087 2241432 2088683 2147348 2096331 2051307 2020001 1883188 1862239 1838795
6644 1838795 1785396 1819753 1797190 1764294 1698173 1668522 1590322 1588610 1661470 1530107 1528834 1561747
6632 1561747 1422984 1277277 1386010 1470685 1353606 1356042 1338629 1245649 1121466 1115144 1129679
6621 1129679 1130979 1155183 1200989 1166875 1202130 1114609 1017376 1050225 948550 980493 1088873
6610A088873q425j34153K3853j6073j06617q1871J03299o002K1022j3346j33141
6599G37419O0217j1511K8296q4590k2112J49802L7772j07925j05316o5266P0718
6588F87504L4140l4687J38q2368K8587O4860m7430j2064K0979N1822K2927l3897
6576G00511O3019m7509l5128M67j2639J41873K1396Q8558q0198j85560p8666n5331
6564E20793L2162j51143O8559j2183Q1925M5399k1706L19K8478j6143r2604l1283
6552D52573l6476m2600J5638R760N110P4124l7610J0326K1160q6777N9438l881
6540D40785o4171n1723P1353Q3584j39956R824N618J0373L9375K0634l4809J98
6528C91085k5363k4666N8875j8625O2288m643l5476m0435O6804l6363j3682J16777
$$ plain form
6610 1088873 1080448 946295 970148 954075 847458 765587 868886 862884 883906 870560 737419
6599 737419 797636 786125 814421 729831 707719 857521 895293 787368 682052 616786 687504
6588 687504 721644 686957 687095 604727 633314 698174 650744 638680 659659 711481 734408 700511
6576 700511 763530 716021 680893 681360 668721 810594 831990 920548 840350 654790 576124 520793
6564 520793 552955 401812 470371 458188 540113 585512 563806 564125 592603 576460 483856 452573
6552 452573 416097 373497 389135 398895 404005 478129 440519 450845 472005 385228 444666 440785
6540 440785 376614 324891 396244 479828 339872 349696 355314 365687 405062 425696 390887 391085
6528 391085 365722 341056 399931 381306 443594 438951 403475 363040 429844 393481 379799 496576
6516D96576k1360j27077j05576P7527J11518K0828J7363q422Q2k1518n3456P908
6504C94393j7859l0494k7220q444R2115K5207r4338l4357m5607J8952O6272M4162
6492C82782J9962k4665Q1332k4508L0569j6889j1494O3737m5794j37652J11106
6481D28486M932J359N1937l3684k6995R8362P5635K3344K084p6147J4035J29057
6469F92405l3898q441L0226K6579p5769M2286J35058k01712m4830O4812J31238
6458G57954j43840Q9778k8737o5041O9728J79824p1023J0556p7319p439o0336
6447F54105J27367K8303M3576J0224j4612J6377J8796o9376k5589k6235J9715
6436G82651k2767l568J43476Q1423r3161j2344J8679L1073L4864j02163j7834
$$ plain form
6516 496576 475216 348139 242563 320090 431608 452436 469799 461377 461459 439941 386485 394393
6504 394393 376534 346040 318820 310376 402491 427698 333360 299003 253396 272348 338620 382782
6492 382782 402744 378079 459411 434903 465472 448583 437089 500826 455032 317380 428486
6481 428486 433418 434777 486714 453030 426035 524397 600032 623376 625460 549313 563348 692405
6469 692405 658507 650066 680292 706871 631102 673388 808446 606734 561904 626716 757954
6458 757954 614114 703892 675155 610114 679842 859666 788643 799199 721880 714441 654105
6447 654105 781472 809775 853351 863575 848963 865340 884136 814760 789171 762936 782651
6436 782651 759884 756316 899792 981215 888054 875710 894389 925462 960326 858163 840329
6425H40329N2640L1085q5391J71279m3928K2263m4881o2676P7477n0950q1633
6414H25614K42874o5108q4675J04271k6640m0298n849q9394P1453P4287l928j3631
6402I88976P1156J04795k8097O8549R6481j23084m7623O5828m124K168J20331
6391A315356M7985L2271l5321J32318Q6962p6985N9012q5118p0135j199O1221
6380A466367J35285m080O2250k6181J0918m4324J01519L9853q7117R4910J06927
6369A856327n9003J7136q302J09639J32457l2494L0554K092J39118Q6303n6126
6358B217701Q0893R4334P8098P3141J13257O329J09292J00692k2626L2300J66390
6347C049801o2063N8438J61605K7130K15112L9407j8829K8797J21978J6984J56062
$$ plain form
6425 840329 892969 924054 838663 1009942 966014 988277 943396 880720 958197 907247 825614
6414 825614 1068488 1003380 918705 1022976 996336 956038 950189 860795 932248 1006535 1002607 988976
6402 988976 1060132 1164927 1136830 1205379 1301860 1178776 1131153 1196981 1192857 1195025 1315356
6391 1315356 1363341 1395612 1360291 1492609 1579571 1502586 1561598 1476480 1406345 1405146 1466367
6380 1466367 1601652 1597572 1659822 1633641 1644559 1600235 1701754 1741607 1654490 1749400 1856327
6369 1856327 1797324 1814460 1806158 1915797 2048254 2015760 2046314 2048406 2187524 2273827 2217701
6358 2217701 2298594 2392928 2471026 2544167 2657424 2663753 2773045 2873737 2851111 2883411 3049801
6347 3049801 2987738 3046176 3207781 3234911 3450023 3489430 3470601 3499398 3621376 3638360 3794422
6336C794422J18556J57029J18763M0671R5358J97409L7438O4634L3809O7135J41756
6325D866980N3570J85146J95180O7553K22103R5512K18214K06486J72000K84710
6315F567454J11770Q6957K38412K12241K43679K62002L21902K99812L07458M25663
6305I077350M42963M20930L32629M33051M06433L59346N46978P56121P50864O99733
6295A4226398O83160Q30982Q33589J105853J186317J114544J299108J523170J779085
6286B4582206J810224J894260K076161K271915K356530K342768K407114K454356
6278D2195534K189078J871435J717874J029369P07174K67677k89800n25190q26865
6269D8336286j053434j357400j447649j593304j852261k004437j986853k016945
$$ plain form
6336 3794422 3912978 4070007 4188770 4229441 4324799 4522208 4559646 4624280 4658089 4725224 4866980
6325 4866980 4920550 5105696 5300876 5368429 5590532 5686044 5904258 6110744 6282744 6567454
6315 6567454 6679224 6766181 7004593 7216834 7460513 7722515 8044417 8344229 8651687 9077350
6305 9077350 9520313 9941243 10273872 10706923 11113356 11472702 12019680 12775801 13526665 14226398
6295 14226398 14909558 15740540 16574129 17679982 18866299 19980843 21279951 22803121 24582206
6286 24582206 26392430 28286690 30362851 32634766 34991296 37334064 39741178 42195534
6278 42195534 44384612 46256047 47973921 49003290 49710464 49978141 49688341 49163151 48336286
6269 48336286 47282852 45925452 44477803 42884499 41032238 39027801 37040948 35024003
6261C5024003k013164k136438j954494j793255j587082j631516j574204j403088
6253B0930762j312994j061417j162817q97617q71509r19407q11477p56279o52912
6244A2484333o04244n73264n86272n44893m69482m42148l21891l74508l96667
6235H170964k99912k40406m15716l06141k35493j54658k92546j94234k34410j70918
6225E626530j40024k27410j49897n5999l3189k87424k27785j04647q9723j65135
6215D145297q8129j02252j8449r4499j10615j47229j06959k06729K8052K5939
6205C324427k06628j21457o9839j38820l893j47471j61111J3689n1163n9496r8032
6194B280206N38p2588q8007O0900m4499j70518q8128J4503l0498Q90j2099q0690
$$ plain form
6261 35024003 33010839 30874401 28919907 27126652 25539570 23908054 22333850 20930762
6253 20930762 19617768 18556351 17393534 16495917 15624408 14705001 13893524 13137245 12484333
6244 12484333 11880089 11306825 10720553 10175660 9706178 9264030 8942139 8567631 8170964
6235 8170964 7871052 7630646 7214930 6908789 6673296 6518638 6226092 6031858 5797448 5626530
6225 5626530 5486506 5259096 5109199 5053200 5020011 4732587 4504802 4400155 4310432 4145297
6215 4145297 4057168 3954916 3936467 3841968 3731353 3584124 3477165 3270436 3298488 3324427
6205 3324427 3117799 2996342 2926503 2787683 2783790 2636319 2475208 2488897 2437734 2378238 2280206
6194 2280206 2280744 2208156 2120149 2181049 2136550 1966032 1877904 1892407 1861909 1862799 1850700 1770010
6182A770010q2583Q243J19806o5637j54346m9797p3514j45938j2667K4377J21239
6171A459193j06473p9571O6888j06750j1873n6000m4415p088j32343j26474R0757
6160I45851J20405m5465j75514o8810Q2176M9440K4145J9592j15118O1787q4985
6149H13504m2857P385l1635n8343M9807k3941m1085l9800L1569R4353J5584r6096
6137F78445r6236l9507O3963J06053j30895O0923o1897n5096m1714j9996j43078
6126C20965O4051O727j2962O142N0672K5932n5327K3911o0381p6214R8838l122
6114C89232j7470O9518j8920q8264M1548j7333n7952Q9977K9089Q352K9319o4834
6102C92262j13882J40564q204J8108L3972j01796O9526N963j6116k1520N2586
$$ plain form
6182 1770010 1687427 1695670 1815476 1749839 1595493 1545696 1472182 1326244 1313577 1337954 1459193
6171 1459193 1352720 1273149 1340037 1233287 1221414 1165414 1120999 1113911 981568 855094 945851
6160 945851 1066256 1020791 845277 776467 858643 908083 932228 951820 836702 898489 813504
6149 813504 770647 778032 746397 688054 737861 713920 672835 633035 664604 758957 774541 678445
6137 678445 582209 542702 606665 712718 581823 642746 580849 525753 484039 464043 320965
6126 320965 385016 391743 378781 384923 435595 461527 406200 430111 369730 293516 392354 389232
6114 389232 371762 441280 422360 334096 375644 358311 300359 390336 419425 427777 457096 392262
6102 392262 278380 418944 410740 428848 462820 361024 430550 436513 420397 398877 451463
6091D51463J253K6869q4371j54090J0398O8196O751J0212j35981J8585M1p809
6079B11517Q438o5198K4109J05224m3771l0949l1297K5349J29364m8481k4494
6068B59811o6236j2646K5482n3603o1611l6874O1662L2765l8782m5740J22502
6057A86730L5783L9978r7340j29512J07395j07065R4965Q2627m227j10377O5163
6046A64120q4330J21535n0022j36999L7892O4001M2511R608J1269k8252n8973
6035I2360o4703l2194P8564l5214j7962o7230j1658P9514O4695p1560o7835j423
6023e4646J23848k5392j5094O7011K0689P443r6327L2719M4168q9144r8034J05294
6011B2535n7757J5746j8404J23584o0238j13608P9583M6083K625K7740J2494P1022
$$ plain form
6091 451463 452716 479585 395214 241124 251522 319718 326469 336681 200700 219285 219326 211517
6079 211517 219955 154757 178866 284090 240319 209370 178073 203422 332786 284305 259811
6068 259811 193575 180929 206411 152808 91197 54323 115985 148750 109968 64228 186730
6057 186730 222513 262491 165151 35639 143034 35969 130934 213561 209334 98957 164120
6046 164120 79790 201325 151303 14304 52196 116197 158708 168316 179585 151333 92360
6035 92360 27657 -4537 74027 38813 20851 -46379 -58037 21477 86172 14612 -53223 -54646
6023 -54646 69202 43810 28716 95727 116416 123859 27532 60251 104419 15275 -82759 22535
6011 22535 -35222 -19476 -37880 85704 25466 -88142 -8559 37524 40149 67889 80383 151405
5999A51405o1267j54925j3705n728J6459j05211M0237O1382k0711l1908K25117
5988A01145m3476j09476N6175l5828n5793N0422k8640p4991J8738R125J30963
5977A8364k4139J43786k4137o8189p0320O3943J3451q5010n6749n8117k424Q0773
5965f8768O8418J1416j44517L3936j9696J10535M9839j06890J3439q935j08035
5954a69258j0711J31133P645J3017p1127j5978M3138j5186K8510J00537j00524
5943e8804N2489O5542j57612n1538J08334j02837Q6973K7982m8757M142P8198
5932D112l5173r5550R7181m0663K6427k181L1466K8923j6099j5166N2331j18362
5920h2754j1247M9382l7648N2346K8074L8487O9433n0185j20801k198j9606K5016
$$ plain form
5999 151405 90138 -64787 -78492 -84220 -67761 -172972 -132735 -71353 -92064 -123972 101145
5988 101145 57669 -51807 4368 -31460 -87253 -36831 -65471 -140462 -121724 -112599 18364
5977 18364 -5775 138011 113874 45685 -24635 39308 52759 -32251 -89000 -147117 -149541 -68768
5965 -68768 -350 11066 -133451 -99515 -119211 -8676 41163 -65727 -52288 -61223 -169258
5954 -169258 -179969 -48836 -41191 -28174 -99301 -115279 -72141 -87327 -58817 41720 -58804
5943 -58804 -6315 59227 -98385 -149923 -41589 -144426 -57453 -29471 -78228 -74086 4112
5932 4112 -31061 -126611 -29430 -70093 -43666 -45847 -14381 14542 -1557 -16723 35608 -82754
5920 -82754 -94001 -44619 -82267 -29921 -1847 36640 106073 55888 -64913 -67111 -86717 -61701
5908f1701j9220J147l6844k1091J4721N2771J9726J19658j612j49030N5604m002
5896b9873o4466P6453N1055l7675l6925k0148k0277j6707o409M0066O5809k2233
5884b1330k0640j6389M7431q2777j06920m2740J12950N0611n4703O652j5969j9093
5872a62917O0330N9589M4643O8250p7176K9839l0960Q948l0183L3644L7505o7541
5860b6029o7717n4770M5418J38869n0739j07605M7412L2545L5640J8661j07131
5849i5446Q799J31807k7304r3134Q454p1112j77010K42721l470J771P17q0787
5837a53994k3653j8814J10226R19j9296L3409N958M6937M6278k10507J07559R1809
5825A6831k08492L3846R9128J2977p9886M2177k5223l3897K4667q383m0442q2350
$$ plain form
5908 -61701 -80921 -79774 -116618 -137709 -122988 -70217 -50491 69167 67555 -81475 -25871 -29873
5896 -29873 -94339 -17886 33169 -4506 -41431 -61579 -81856 -98563 -104972 -64906 903 -21330
5884 -21330 -41970 -58359 -10928 -93705 -200625 -243365 -130415 -79804 -134507 -127855 -143824 -162917
5872 -162917 -102587 -42998 1645 69895 -7281 22558 -8402 546 -29637 4007 41512 -26029
5860 -26029 -93746 -148516 -103098 35771 -14968 -122573 -75161 -42616 -6976 11685 -95446
5849 -95446 -86647 45160 17856 -75278 -66824 -137936 -314946 -72225 -75695 -73924 -73207 -153994
5837 -153994 -177647 -196461 -86235 -85316 -104612 -71203 -65245 -18308 27970 -182537 -74978 16831
5825 16831 -191661 -157815 -58687 -45710 -125596 -83419 -108642 -142539 -117872 -126255 -166697 -249047
5813b49047j0329J76260q743m2696J12756J48m1296j0524q3911m9624J11592J14112
5801A8698q5331o2453O3768n7660m288L3850J08682o7947o7489K0477P8682J3618
5789g393q9254N3047R396J3784o2065Q281N4143O8041J956K3440o6729j26280
5777a19633L6013m3268m0497j4563M4438O6764Q539k1693L328j11297k7209J64352
5765e4726O2177j26416p6699M5194n9560J07027J52950q6737m1928j92026N6732
5754b14012J05936J6690K7756k1179l6299O5295o2534l2346k5691M7113J3936
5743a15335k1800L4632l9183k7387J35463l0967m3251J8795j12469L5013N4196
5732a12293j13540o3273P9970J83608O378m6767k2101K241K3514J01541l4743
$$ plain form
5813 -249047 -259376 -83116 -91859 -134555 -21799 -21651 -62947 -73471 -157382 -207006 -95414 18698
5801 18698 -66633 -129086 -65318 -122978 -127266 -93416 15266 -52681 -120170 -99693 -21011 -7393
5789 -7393 -96647 -43600 -34204 -20420 -82485 -74204 -20061 47980 49936 73376 6647 -119633
5777 -119633 -83620 -126888 -167385 -181948 -137510 -70746 -62207 -83900 -80572 -191869 -219078 -54726
5765 -54726 7451 -118965 -195664 -150470 -210030 -103003 49947 -36790 -78718 -270744 -214012
5754 -214012 -108076 -91386 -63630 -84809 -121108 -55813 -118347 -150693 -176384 -129271 -115335
5743 -115335 -137135 -102503 -141686 -169073 -33610 -64577 -107828 -89033 -201502 -166489 -112293
5732 -112293 -225833 -289106 -209136 -25528 -19150 -65917 -88018 -85777 -62263 39278 4535
5721D535j01334k0356p7233J49235K9784n6743K3341q1551o0431J20449P1212
5710I08Q801j32889j25110Q9064L7733j7897l9658K5322P7863K1310O3708N197
5698A4352n6142m8510J07813j51695q1291J11589O069k2614J15035o6188o0211
5687a31793m4249M9474m3514K0290j1284J1499m1380M0489Q7113r947q4455j2664
5675a70421k2229j2931m4883J08426n112o0079Q3562O3215Q109N8165m3991L8986
5663H17o0710l6537J01525j4755n2499j1068M7068n9503j7223l0493J36153j74078
5651a71303J02721Q2772K4371r002j04455J8448J31467o1637j02508J08147J8542
5640C7563j23662n3760J905j2229k1394O2800Q509J5702k9098J16576m7048o101
$$ plain form
5721 4535 -96799 -117155 -194388 -45153 -15369 -72112 -48771 -130322 -190753 -70304 908
5710 908 9709 -123180 -248290 -159226 -121493 -139390 -179048 -153726 -75863 -54553 9155 14352
5698 14352 -41790 -90300 17513 -134182 -215473 -103884 -97815 -120429 -5394 -71582 -131793
5687 -131793 -176042 -126568 -170082 -149792 -161076 -149577 -190957 -150468 -63355 -73302 -157757 -170421
5675 -170421 -192650 -205581 -250464 -142038 -147150 -207229 -123667 -60452 -52343 5822 -38169 817
5663 817 -59893 -96430 5095 -9660 -62159 -73227 -26159 -85662 -102885 -133378 2775 -171303
5651 -171303 -68582 14190 38561 29559 -74896 -56448 75019 13382 -89126 19021 37563
5640 37563 -86099 -139859 -137954 -150183 -171577 -108777 -100268 -84566 -113664 2912 -44136 -50237
5628e0237o6385k2212l0231j4924M9877J58008n652j09266J5556K9932P4675j6256
5616A2885p2424m2311N8226l3440o998n8953J36366n5895J22247K4765n1836o3648
5604c1016k6955J394J1021l8901R4955j7883k5063m3348k1135O7891m1331o5423
5592a35794L3093p862M6238k942K0910M4163j2258M3083Q8544p0913l4391O9716
5580H1587j46858r632J33192J7915q4935N6208p1001n5340Q329k1513J29199n8669
5568b1518j14047j1553j02899K21571O9912p1568m891J2165O7598q7511j8841
5557f1582N0418j4440K598q0140l5857o38J17441q7916L4843J5897L5648j4388
5545c8116J3466o6599j4793r104j5543J1416J02597j14994J39594L2925K8533
$$ plain form
5628 -50237 -116622 -138834 -169065 -183989 -134112 23896 18244 -91022 -75466 -45534 29141 12885
5616 12885 -59539 -101850 -43624 -77064 -84062 -143015 -6649 -62544 59703 84468 32632 -31016
5604 -31016 -57971 -56577 -45556 -84457 10498 -7385 -32448 -75796 -96931 -29040 -70371 -135794
5592 -135794 -102701 -110563 -64325 -67267 -46357 -2194 -14452 28631 117175 46262 11871 81587
5580 81587 -65271 -74903 58289 76204 -8731 47477 -23524 -78864 -70535 -92048 37151 -21518
5568 -21518 -135565 -147118 -250017 -28446 41466 -30102 -34993 -22828 44770 -42741 -61582
5557 -61582 -11164 -25604 -23006 -103146 -139003 -139641 -22200 -110116 -75273 -59376 -23728 -38116
5545 -38116 -24650 -91249 -106042 -115146 -130689 -119273 -16676 -131670 7924 40849 69382
5534F9382j43381q8787J64731J6909o2748q2579K3254N9881l8795K5029k5711
5523h2815M5793Q786k2293O956n8089J02875k9987J22507k1469j00998O191l7518
5511f0061Q1960Q2241q7587m0831J5459l3205j8269J30953m6337J11694J2722
5500A48739K1150j52733j3534Q0718P523j13067m0912k9430J5389L1306L4682
5489a0169n110q7422K1882J21848j2793j29809p0235N8520N402R2582o510n3056
5477g4870L0366Q1772J04050o8365q1805O2875K0941K2544r1416J5765M0125l3775
5465B8207P9991j17113p5249N6257O732M6661m014j2098J05328l5007j16778q5474
5453a22557R1235N4921l5531m5889p2066Q6878M6260M5372j48237O390N1416R404
$$ plain form
5534 69382 -73999 -162786 1945 18854 -43894 -126473 -103219 -43338 -82133 -57104 -82815
5523 -82815 -37022 -28236 -50529 -43573 -101662 1213 -28774 93733 72264 -28734 -22543 -60061
5511 -60061 21899 104140 16553 -24278 -8819 -42024 -60293 70660 24323 136017 148739
5500 148739 169889 17156 3622 84340 91863 -21204 -62116 -91546 -76157 -44851 -10169
5489 -10169 -15279 -102701 -80819 41029 28236 -101573 -171808 -113288 -107886 -15304 -21814 -74870
5477 -74870 -44504 37268 141318 72953 -8852 54023 74964 97508 6092 21857 61982 28207
5465 28207 108198 -8915 -84164 -27907 -21175 25486 21472 9374 114702 79695 -37083 -122557
5453 -122557 -31322 23599 -11932 -57821 -129887 -43009 3251 48623 -99614 -93224 -41808 -32404
5441c2404L0958K4950r3815Q0117k2495Q4975L7331p5470m4133j23655J14369
5430a9272J32262q3775J2349k5220L8391q3273l9072R6702n2514r807m0637K453
5418g1413p9580J16681j6924K0672o5465R4222L7422l7141Q518O7865k8157L8181
5406H4881J8777j8032m5837K6424l2776l2492J9968J10700m5857j3831o7453k4453
5394a9981l1362l6460J40211J1424R862k9839o4462J5784O73l3873N1601N2181
5382F5759r2824K8979K2960J39301k2936k3029M1525j69747L1430O2864m028K9213
5370A09467n7797l4154k5130K3082N6151L727N3600o4484k6187q4391p670O545
5358d7241J1272K1403R2275j40694J28934j2521j8453K8371l1703M9664p4663
$$ plain form
5441 -32404 -1446 23504 -70311 9806 -12689 72286 109617 34147 -9986 -133641 -19272
5430 -19272 112990 29215 41564 16344 54735 -28538 -67610 29092 -23422 -33229 -73866 -71413
5418 -71413 -150993 -34312 -51236 -30564 -96029 -1807 35615 -1526 6992 74857 46700 84881
5406 84881 103658 85626 39789 66213 33437 945 20913 131613 85756 71925 4472 -19981
5394 -19981 -51343 -87803 52408 63832 73694 43855 -20607 -4823 -4150 -38023 13578 65759
5382 65759 -27065 1914 24874 164175 141239 118210 159735 -10012 21418 84282 80254 109467
5370 109467 51670 17516 -7614 15468 71619 75346 128946 64462 38275 -46116 -53786 -47241
5358 -47241 -35969 -14566 77709 -62985 65949 53428 34975 63346 31643 81307 6644
5347F644J3059M6466m4559l9919Q7868p5159o1065J455q3170Q652J15986r9108
5335a22850K6005M6525P5534k601J3073l2131J2171n4977Q4089J15689l3662o1115
5323F5750m234j04778m6314L4061O1914j8078r548J0441J00258j37413R3098M4286
5311H9443n3537m6211L0778r67k2263J13763m7815K7747P412j54780O8137P9588
5299I1295j77775O732j4627J24938r0374L1614M9306O1109j09272p694J3369J00812
5287G9433p657j02094j1165L9440k9907N1241J05340k3311j81395M9475j50230
5276a80830J67163o4367k6082P4481j24298J00970P2124N7303q7499K693k3207
5265c1549L6667J1071j9134J36970N692r3893k298j58512j7760K20192K2570k4312
$$ plain form
5347 6644 19703 66169 21610 -18309 69559 -5600 -66665 -65210 -148380 -139728 -23742 -122850
5335 -122850 -96845 -50320 25214 22613 35686 3555 15726 -39251 44838 160527 126865 65750
5323 65750 61516 -43262 -89576 -55515 6399 -11679 -21227 -10786 89472 -47941 45157 89443
5311 89443 35906 -10305 20473 19506 -2757 111006 63191 90938 98350 -56430 11707 91295
5299 91295 -86480 -79748 -94375 30563 -59811 -28197 21109 82218 -27054 -34748 -21379 79433
5287 79433 71776 -30318 -41483 -2043 -31950 19291 124631 101320 -80075 -30600 -180830
5276 -180830 -13667 -78034 -104116 -29635 -153933 -52963 19161 76464 -11035 -8342 -31549
5265 -31549 5118 16189 -2945 134025 139717 45824 43526 -114986 -132746 87446 110016 85704
5253H5704j05306K4457J8688n7369K1247P0735n9778j03792J26617R7614J2877
5242A31694m2000J6497q3450R9919j8318p6737Q127r3299N1913Q7827K3168r426
5230I5915k3194p465J40883j8339j04762o8055J07074Q6739j32303L7182K3292
5219A36967n420l2721n0676P3020p154J3472L9528j13327Q2663M6756j7945j21506
5207D3657L3099p8626N8858Q4785J3405J306Q4139p911L2285N8960j34417p7553
5195A11987J3257j2433N5370O2012j49693R8479M307k3977Q0979R064O4375l2722
5183B81005q8932m1225L917P7967n5724p828Q1103J7081r3468J6357M2722P7611
5171C10586n4959r5588K7246k701P1932l3248K3927O865J3990L5041N6226n1887
$$ plain form
5253 85704 -19602 4855 23543 -33826 -12579 58156 -1622 -105414 21203 118817 131694
5242 131694 89694 106191 22741 122660 104342 27605 35732 -57567 -5654 82173 105341 95915
5230 95915 72721 65256 206139 187800 83038 14983 122057 208796 76493 113675 136967
5219 136967 131547 98826 48150 121170 114016 127488 167016 53689 136352 183108 165163 43657
5207 43657 76756 -1870 56988 141773 155178 156484 240623 232712 264997 323957 189540 111987
5195 111987 125244 112811 168181 230193 80500 178979 183286 159309 240288 249352 313727 281005
5183 281005 192073 150848 154765 232732 177008 169180 250283 267364 173896 190253 232975 310586
5171 310586 255627 160039 187285 184584 256516 223268 247195 254060 268050 303091 359317 307430
5159C07430K4404n5029p4358R4629o0191P229n754M1747n8123n7193Q6506j08793
5147A42504J26815J4036j4468r729j80856P1429L6382j2103N7896q5786O7927
5136B14047J4506J6152o439j318Q5339K0212R8761n982q5495m962r9749N3808
5124B98880L4940O8998m118o9090L016j5596O5473k3681o2626P749J67667l1108
5112D40504K06459j16815n4474k6025P0876J3623j35139L1613l4230j1889Q2259
5101D66762L4682n7067P913j29909Q2627L3602Q3018p1064J68823J03043L0413
5090G52843O092N1242J4520J073J40990l3744k5030J20478M6684J7153p3606j19735
5078H98960q3010j32972K5398O5466M4144m1082K2445p9036J8702P1591k1227
$$ plain form
5159 307430 331834 276805 202447 297076 236885 244114 238360 280107 221984 164791 251297 142504
5147 142504 269319 283355 268887 259158 78302 149731 186113 174010 231906 146120 214047
5136 214047 228553 244705 238266 236948 322287 342499 441260 435278 349783 344821 245072 298880
5124 298880 333820 402818 398700 329610 332626 317030 382503 358822 296196 303945 471612 440504
5112 440504 646963 530148 475674 449649 520525 534148 399009 430622 396392 384503 466762
5101 466762 501444 444377 452290 322381 405008 438610 521628 450564 619387 722430 752843
5090 752843 758935 810177 824697 825770 966760 933016 907986 1028464 1075148 1092301 1018695 898960
5078 898960 815950 682978 708376 773842 817986 776904 799349 720313 739015 810606 789379
5067G89379n9322Q9879k6670L9838J56055J2118p1297R4044N1425J76642J9917
5056A272008J3330J61121O8619P70O7813n057j6520L5289L0177k6571l0619J02809
5044A673169j9736M0082N2617l0329l2194J6371J0333N729j15648P0208n1529
5033A619073j05455N0283J26053J42736O6517p812J11866J04662P3986K50047
5023B431956P5507J36059N6480K9548M4551q17j99871j12856k68763j30999j23449
5012A937346j71275r5141k43547M958L8231o1804N0950K0590J9241n4853j54315
5001A290381k8711K39395q67J04751O9625m0069J34541L3165p1310n5381r9766
4990A575754k00957r1741p4718k5937q2595j55190n9891k690J3108J9834P336
$$ plain form
5067 789379 730057 819936 793266 833104 989159 1001277 929980 1024024 1075449 1252091 1272008
5056 1272008 1285338 1446459 1515078 1515848 1583661 1578604 1562084 1597373 1627550 1600979 1570360 1673169
5044 1673169 1653433 1693515 1746132 1715803 1683609 1699980 1710313 1716042 1600394 1670602 1619073
5033 1619073 1513618 1563901 1689954 1832690 1899207 1891395 2003261 2107923 2181909 2431956
5023 2431956 2507463 2643522 2700002 2729550 2774101 2773284 2573413 2460557 2191794 2060795 1937346
5012 1937346 1766071 1670930 1427383 1432341 1470572 1408768 1459718 1480308 1499549 1444696 1290381
5001 1290381 1261670 1501065 1500198 1604949 1674574 1634505 1769046 1802211 1730901 1675520 1575754
4990 1575754 1374797 1283056 1208338 1182401 1099806 944616 884725 882035 895143 914977 922313
4979I22313o189j27383L0776k9513j3888K1587o5370l67M7095j08733r1844J4659
4967E93143N3154r0151J21850j5940L164L4959q1558p2545R3905M0670M725q0203
4955F05173P5773J74368L6326j76765n3211o643J08710M6674n3064L6743q1394
4944G12690l8759m5929n9589j4148J50999R4126p5956K0299n9562n548R466J2048
4932G00137k170j05029L03J3313K4327k5905K383L6264J281R6353q3037q7436
4920E70784J1702N3643R7906m0117L004n7341N2688o9621o3619R7405L1802N8305
4908G46541K6625j12329O4627R8004r034q437q2165l3753L9173P9355q526K9697
4896H29778n7803j44938k5382K048J60938p6793M7164r1247q7438J26967K9985
$$ plain form
4979 922313 916124 788741 819517 790004 776116 797703 732333 731966 779061 670328 578484 593143
4967 593143 646297 556146 677996 662056 665220 700179 618621 546076 639981 680651 685376 605173
4955 605173 680946 855314 891640 714875 661664 655021 763731 810405 757341 794084 712690
4944 712690 673931 628002 568413 554265 705264 799390 723434 743733 684171 678623 688089 700137
4932 700137 697967 592938 593241 606554 630881 604976 607359 643623 644904 741257 658220 570784
4920 570784 582486 636129 734035 693918 696922 639581 692269 622648 559029 656434 688236 746541
4908 746541 773166 660837 725464 823468 814434 805997 723832 690079 729252 808607 800081 829778
4896 829778 771975 627037 601655 603703 764641 687848 735012 643765 556327 683294 713279
4885G13279m3006K5965J21777l5309k4316j12297K2653M5673R6893O3157L5851
4874I10320P7925J86916l4924K2955J30091J48033J01770M268K23850J32545L8221
4863A941970j89522p7453k77338j73949n0544m753j11574M8680k3733j14085L2179
4852I99878O9309J60675q988j9024J33874J1188Q5181Q8024J67518R0243K43391
4841B021269K63964K15547J92479K57230K10278o7213k61482l53505m31153l82334
4831A665080k37591n5334P335k01840k36170J5103M6312M8599K1111q1160Q8124
4820A079569q6597M3984J34880J16495R90P1872K0464N4606J30656R3597P6162
4809A736678J83117q4794j96096k05947j34563p8918j47210j96724j5278R5167
$$ plain form
4885 713279 670273 696238 818015 782706 758390 646093 668746 714419 811312 874469 910320
4874 910320 988245 1175161 1140237 1163192 1293283 1441316 1543086 1547354 1771204 1903749 1941970
4863 1941970 1752448 1674995 1397657 1223708 1173164 1168411 1056837 1105517 1081784 967699 999878
4852 999878 1069187 1229862 1220874 1201850 1335724 1346912 1432093 1520117 1687635 1777878 2021269
4841 2021269 2285233 2500780 2693259 2950489 3160767 3093554 2832072 2478567 2047414 1665080
4831 1665080 1427489 1372155 1379490 1177650 941480 956583 1002895 1051494 1072605 991445 1079569
4820 1079569 992972 1036956 1171836 1288331 1289321 1361193 1381657 1436263 1566919 1660516 1736678
4809 1736678 1919795 1835001 1638905 1432958 1298395 1219477 1072267 875543 860265 955432
4799I55432n8123L5175p0131N4365p370j22745q5700j5314M7060J5067m5754j2214
4787F89748P9369j3267K6457k6012Q156p5597J08893K6961q1078l845J70093N8892
4775I68770Q378L6864q5904k5559M5933Q3100r0767k2697n9332n3359J0243j65654
4763F50016J10886J13685j3745j03149k3257J6014L4502j6040j04753L6325J27865
4752H28349o7122N3760J0147k2998l4003q5725M3600J4382n9400J175o9403J9342
4740F32104j4312K6510N9898J9156O9980n2911J78602o2912K79390K8664r6893
4729A067276n8642O0861K997O1157J94390n628k8576j21506R28p3820j00310K7604
4717A026731n8425l3654l0506J5975p1290j6604o8124k3784l0893N7342j17307
$$ plain form
4799 955432 897309 932484 862353 916718 909348 786603 700903 685589 732649 747716 701962 689748
4787 689748 769117 755850 782307 756295 764451 688854 797747 824708 743630 739785 909878 968770
4775 968770 977148 1014012 928108 902549 948482 1031582 940815 918118 858786 805427 815670 650016
4763 650016 760902 874587 860842 757693 734436 750450 784952 768912 664159 700484 828349
4752 828349 761227 814987 825134 802136 768133 682408 726008 740390 680990 682165 612762 632104
4740 632104 617792 644302 704200 723356 793336 740425 919027 856115 1135505 1164169 1067276
4729 1067276 1008634 1069495 1072492 1133649 1328039 1322411 1293835 1172329 1173257 1099437 999127 1026731
4717 1026731 968306 934652 904146 920121 848831 832227 764103 740319 709426 766768 649461
4706F49461L1732j18392q7586J41012Q181o19k0183J06016J7471l8988m2490m0741
4694F04874K3744O9758l179j00334j2020m272J6602J76676m6662l9371Q4388N7916
4682H28120j3654n7343n0722O7135o8583R9699j10332J8118j0983J01618n0564
4671G52509k8244K13396k4752L0146J2057l7587J20228M3804l2080L7194M8267
4660A134938m4971l6191j1386j7922l2787j66250N1169N1609k9359n9134j2951
4649H26765o6233k5822l7077J2988J61473j06395L3089N1228P5753p5455j1002
4638H39312p105M6662J07055J9304q4446K3961M1116M192m0635p469J22093q9895
4626I74145M5266O0472o7332j19566j34190J06569R9651r194R8763k5668R2772
$$ plain form
4706 649461 681193 562801 475215 616227 624408 623789 603606 709622 727093 688105 645615 604874
4694 604874 628618 698376 695197 594863 582843 578571 595173 771849 725187 685816 770204 828120
4682 828120 814466 757123 706401 773536 704953 804652 694320 712438 701455 803073 752509
4671 752509 724265 937661 912909 943055 955112 917525 1037753 1081557 1049477 1086671 1134938
4660 1134938 1089967 1053776 1042390 1024468 991681 825431 876600 928209 898850 839716 826765
4649 826765 760532 734710 697633 710621 872094 765699 798788 850016 925769 850314 839312
4638 839312 832207 878869 985924 1005228 920782 944743 985859 990051 949416 941947 1064040 974145
4626 974145 1019411 1079883 1012551 892985 758795 865364 965015 955821 1054584 1028916 1121688
4615A121688l0538R1789O110L3448n6841P5603M4890J09960J33939j64923M0759
4604A405884J11498L8110R1740J99432M1498P9888N6337m0318J2125Q2476K9297
4593B107967Q6926J52275n917Q8946J13982q3498p6512O1254k6875L4598m552
4582B448594Q36N8926P1736N6459K6696p1004L6977N4949L2211j2251J90525j23047
4570B771607J48961J7070l0746K03484L7674o3131L0132J56583K1965K5897L550
4559C323046M8474P1421J07979J36451O9884K4361O5535K6425M1937J12412j03097
4548C924828K2046J71232j4985P4117P0039Q7849k9508K4882R5590J58888k027
4537D582951Q5410K0776K30072N4249K72397J81232M056J53681k4028j73869k6992
$$ plain form
4615 1121688 1091150 1182939 1189049 1222497 1165656 1241259 1286149 1396109 1530048 1365125 1405884
4604 1405884 1517382 1555492 1647232 1846664 1888162 1968050 2024387 1984069 1996194 2078670 2107967
4593 2107967 2194893 2347168 2341251 2430197 2544179 2460681 2384169 2445423 2418548 2453146 2448594
4582 2448594 2449430 2508356 2580092 2636551 2663247 2592243 2629220 2684169 2716380 2704129 2894654 2771607
4570 2771607 2920568 2937638 2906892 3110376 3148050 3084919 3115051 3271634 3293599 3319496 3323046
4559 3323046 3371520 3442941 3550920 3687371 3757255 3781616 3847151 3873576 3915513 4027925 3924828
4548 3924828 3946874 4118106 4103121 4177238 4247277 4335126 4305618 4330500 4426090 4584978 4582951
4537 4582951 4668361 4689137 4919209 4973458 5245855 5427087 5431143 5584824 5560796 5386927 5359935
4526E359935j32622j48762n2686M6661M7535M440o7906K2237k1289J16124J15056
4515E288723P3575L4067J17634J99505J08230J00128l1347R7807N0388J13646
4505F152356K94725R6428Q1802J46744J06667J65926l4169l4389Q9436L9677O8262
4494G173465n2170N8434K45074N1092Q3731l1063K26723J89043L5631K48515J50096
4483H378571K89017L27860K67114L65801K52658L42661K68306K06925R7423L04780
4473A1101116J05355J41488K74776K35109L78828L42072M32948M47022M59434
4464A3918148N40432O84111Q13042Q08832J004187J429463J668833K029199K477145
4455B5373392K940390L302319L760408M486029N410824O701904P849865Q300702
$$ plain form
4526 5359935 5227313 5078551 5025865 5072526 5120061 5124501 5056595 5078832 5057543 5173667 5288723
4515 5288723 5362298 5396365 5513999 5713504 5821734 5921862 5890515 5988322 6038710 6152356
4505 6152356 6447081 6543509 6625311 6772055 6878722 7044648 7010479 6976090 7065526 7105203 7173465
4494 7173465 7121295 7179729 7424803 7475895 7559626 7528563 7755286 7944329 7979960 8228475 8378571
4483 8378571 8667588 8995448 9262562 9628363 9881021 10223682 10491988 10698913 10796336 11101116
4473 11101116 11206471 11347959 11622735 11857844 12236672 12578744 13011692 13458714 13918148
4464 13918148 14458580 15142691 15955733 16764565 17768752 19198215 20867048 22896247 25373392
4455 25373392 28313782 31616101 35376509 39862538 45273362 51975266 59825131 68125833
4447F8125833Q427690Q628612R949362R414510M435629l658665j1966661j5453094
4439G7903216j4276854j0995345p977425n746986m247719l331587k841011k504429
4431B5981860k107286j531013j313341j043363q39175p98429o78485o22649n43916
4422A6504203n09662k85140l84432k28974j18937k49949j50052r7314j39766j55317
4412A4184660Q722j8472r982J01240K65255J74791K68359M50550N32629N74977
4402A6532729N76741Q10458N99456P27734P99800J203111J402615J829640K346512
4393B6828796K791586L248472L862112M748081N810194O990922P459506Q046056
4385F9785725Q341374R332846J0075933N873423M81658m309020j0350689j4446419
$$ plain form
4447 68125833 76553523 85182135 95131497 104546007 108981636 105322971 93356310 77903216
4439 77903216 63626362 52631017 44653592 38906606 34658887 31327300 28486289 25981860
4431 25981860 23874574 22343561 21030220 19986857 19147682 18349253 17670768 17048119 16504203
4422 16504203 15994541 15709401 15324969 15095995 14977058 14727109 14577057 14479743 14339977 14184660
4412 14184660 14193382 14174910 14164928 14266168 14531423 14706214 14974573 15425123 15957752 16532729
4402 16532729 17109470 17919928 18519384 19247118 20046918 21250029 22652644 24482284 26828796
4393 26828796 29620382 32868854 36730966 41479047 47289241 54280163 61739669 69785725
4385 69785725 78127099 87459945 97535878 103409301 103890959 99581939 89231250 74784831
4377G4784831j3650407j0722255q115248n935332m619623l465133k868662k397731
4369B3010440k046597j695408j302261j100430r98199r19507r88567q68460n30438
4360A2560573p68070n00136m73497p26342o15962m75747k70282l27534n36804
4351G866199k78623k84091l99684j60712k99483k00927k17046r1025j15904j90971
4341E627733j35880j78700k69983j0462k71860j39330n5000j33280j89165j30907
4331D113166j26040j30936N6150n8465p1337j31942j50919k8377l9178m9178j90
4320C382754q4736r1759j25736n03n1068n3839r4538j23936p615r29J6226o2141
4308B702180j35695J13014P1226n8048j293L1050j30913k24689j9669P4793n7081
$$ plain form
4377 74784831 61134424 50412169 42296921 36361589 31741966 28276833 25408171 23010440
4369 23010440 20963843 19268435 17966174 16865744 15867545 14948038 13959471 13091011 12560573
4360 12560573 11792503 11292367 10818870 10092528 9476566 9000819 8730537 8403003 7866199
4351 7866199 7587576 7303485 6903801 6743089 6443606 6242679 6025633 5934608 5818704 5627733
4341 5627733 5491853 5313153 5043170 5032708 4760848 4621518 4566518 4433238 4244073 4113166
4331 4113166 3987126 3856190 3912340 3853875 3782538 3650596 3499677 3471300 3432122 3382944 3382754
4320 3382754 3298018 3206259 3080523 3080020 3028952 2975113 2880575 2756639 2749024 2748095 2764321 2702180
4308 2702180 2566485 2679499 2750725 2692677 2691384 2722434 2591521 2366832 2347163 2421956 2364875
4297B364875m0428M2033o0149j13914o9491M7836r1135o1078J29830M470J5278
4286B168127l5710n1120q2612l1335l098Q3479J0243q2443j60565o4065R3907
4275A844808K6758P7249L2974Q671O5681j19897l9578O7935R2870Q157l3294P4793
4263B107127p057l0446k0589n3483K8723k6120j03617q374j19895q815l0960r5304
4251A631190M0425J28514j8511j0590j8629N0914m5083n1014m5353l4039O6198
4240A694022k6281J6777j892Q5872l5436m7486L8903J0366p1494M4912L5013p772
4228A735504N2515j6133k1186o430O8058q0077J15039J3565r7026N6525k2343
4217A798011J25017J30302j52975r439j233K1116J10088k1422M0619M8202N2804
$$ plain form
4297 2364875 2324447 2366480 2306331 2192417 2122926 2170762 2079627 2018549 2148379 2152849 2168127
4286 2168127 2132417 2081297 1998685 1967350 1964252 2047731 2057974 1975531 1814966 1750901 1844808
4275 1844808 1871566 1948815 1981789 1990460 2056141 1936244 1896666 1964601 2057471 2065628 2032334 2107127
4263 2107127 2100070 2069624 2049035 1995552 2024275 1998155 1894538 1886164 1766269 1757454 1726494 1631190
4251 1631190 1671615 1800129 1781618 1771028 1752399 1803313 1758230 1707216 1661863 1627824 1694022
4240 1694022 1667741 1684518 1682626 1768498 1733062 1685576 1724479 1734845 1663351 1708263 1743276 1735504
4228 1735504 1788019 1771886 1750700 1744270 1812328 1732251 1847290 1860855 1763829 1820354 1798011
4217 1798011 1923028 2053330 1900355 1890916 1889683 1910799 2020887 1999465 2040084 2088286 2141090
4206B141090R3432M816K5599J74866M8872n751j0317K9079J31522J11832M5203
4195B790243J00583J4112J7747J17487K55475L735k02816N5756J55475j10923
4185C196874k23769r8259J30753N079N2348N2020j8031J34873K5640p309J04310
4174C354529Q1745J23107R3463m7787M1673J87114K19618Q6092J9634J25889R4426
4163D379503J08883J24507J08885M11978L5172R7617J8689p0528q1829j91201
4153D941676p3575j30552j06018j12061p8829j23065K7303j27243j4404q1959
4143D121273l9261j8335j25316l3357L7820J25075m5787R4254L8001J8077J67123
4132D339567R2354P3502m1421N1200J03628J06554O1358o6777k9022m3091J4223
$$ plain form
4206 2141090 2234522 2239338 2264937 2439803 2488675 2482924 2472607 2501686 2633208 2745040 2790243
4195 2790243 2890826 2904938 2922685 3040172 3295647 3299382 3096566 3152322 3307797 3196874
4185 3196874 2973105 2874846 3005599 3010678 3063026 3115046 3097015 3231888 3257528 3250219 3354529
4174 3354529 3436274 3559381 3652844 3605057 3646730 3833844 4053462 4139554 4159188 4285077 4379503
4163 4379503 4488386 4612893 4721778 5133756 5168928 5266545 5285234 5214706 5132877 4941676
4153 4941676 4868101 4737549 4631531 4519470 4440641 4317576 4344879 4217636 4203232 4121273
4143 4121273 4082012 4063677 3938361 3905004 3942824 4067899 4022112 4116366 4154367 4172444 4339567
4132 4339567 4431921 4505423 4464002 4515202 4618830 4725384 4786742 4719965 4690943 4647852 4662075
4121D662075n5358r356j45958p5751j34666j19567j47236j74742q1681m5843P049
4110C678966r4771j53028j01295n7469J39396j6928J7774q6032N2617J17699R8200
4099C595129R9038l572o3059j72274M0570P8334p1273j55056o7588M890J29016
4088C414155j35390M9001o8158j07209K69363K0202m1492Q7815K2094L468N1725
4077C565574O9587M5090J38006N8342m7783Q828P0977R7540J98274K9151P5138
4066D308724P581J53278K4830Q8713N8789J44740Q3892M930K54572J48202R799
4055E288050l2867O2118P9635J82340p4944m1786J13150N5494l909J3607K38J34259
4043E775385k2792m0327r4716j84170j69686p8799j18007O2862L5114m531K0473
$$ plain form
4121 4662075 4606717 4597361 4451403 4375652 4240986 4121419 3974183 3799441 3717760 3671917 3678966
4110 3678966 3584195 3431167 3329872 3272403 3411799 3394871 3412645 3326613 3379230 3496929 3595129
4099 3595129 3694167 3690595 3627536 3455262 3495832 3574166 3502893 3347837 3280249 3285139 3414155
4088 3414155 3278765 3327766 3259608 3152399 3421762 3441964 3400472 3488287 3510381 3513849 3565574
4077 3565574 3635161 3680251 3818257 3876599 3828816 3837644 3908621 4006161 4204435 4233586 4308724
4066 4308724 4316305 4469583 4494413 4583126 4641915 4786655 4870547 4875477 5130049 5278251 5288050
4055 5288050 5255183 5317301 5396936 5579276 5504332 5462546 5575696 5631190 5627281 5640888 5641126 5775385
4043 5775385 5752593 5712266 5617550 5433380 5263694 5184895 5066888 5129750 5164864 5160333 5180806
4032E180806L1831m7773n8036J22544M082J37614K7829O2848k287J20191J396
4021E581045L6687J48296k17059j3327J43554n5802Q5116P121N093j39668j00832
4010E480224j6818k1106n2649l4819l0019m9973j10095J8866P6067k9988L9088
3999E268778K7455P8019r5909j11389k9723K6392K09801R8719j31671K2795O0670
3988E423937k1834J56669J07986j52337R8781R5268j09664K9389Q2301q8672J08227
3977E730051J09247k3830O7996J86407J30467r127J58083M2052R6851J51632N3927
3966F693756J87383J00370K42677J63453J76154K59025J13913J79592R4772O002
3956H217097l2933p6926k1940n6182Q8254J07580J16181J10973o6946R2995Q7535
$$ plain form
4032 5180806 5212637 5164864 5106828 5229372 5233454 5371068 5398897 5461745 5459458 5579649 5581045
4021 5581045 5617732 5766028 5548969 5535642 5679196 5623394 5708510 5715631 5720724 5581056 5480224
4010 5480224 5463406 5442300 5389651 5354832 5324813 5274840 5164745 5183611 5259678 5229690 5268778
3999 5268778 5296233 5374252 5278343 5166954 5137231 5163623 5373424 5472143 5340472 5363267 5423937
3988 5423937 5402103 5558772 5666758 5514421 5613202 5708470 5598806 5628195 5710496 5621824 5730051
3977 5730051 5839298 5815468 5883464 6069871 6200338 6191211 6349294 6391346 6488197 6639829 6693756
3966 6693756 6881139 6981509 7224186 7387639 7563793 7822818 7936731 8116323 8211095 8217097
3956 8217097 8184164 8107238 8085298 8029116 8117370 8224950 8341131 8452104 8385158 8478153 8565688
3945H565688j09213r9428J2129J40172O5199L8383J13442K18781K03758K52109
3935I401020L12138K17282K74715L98048K69445J12708N1522l0478j07136k12399
3925A0686865j2827l6923q2950L3662P3087J09959o4469P8414l1216J55473Q1140
3914A0990215J63519n3269O8711K91559Q1480K96507L59021L41572L85228L55706
3904A3280249K77567L35054M01373L70865K01903J86982K52716K44385K94085
3895A5845179J44258L8814J12529J13634J37167J49416J40115P5481J33611m5454
3885A6844750M058k44326j37414m5059j1135J20766J64525K43678K94326K48515
3875A7482684L60086M05526J65274K64143M16298J14184J68106q8516K9236L0620
$$ plain form
3945 8565688 8456475 8357047 8369176 8509348 8574547 8612930 8726372 8945153 9148911 9401020
3935 9401020 9713158 9930440 10205155 10603203 10872648 10985356 11036878 11006400 10899264 10686865
3925 10686865 10674038 10637115 10554165 10587827 10660914 10770873 10706404 10784818 10753602 10909075 10990215
3914 10990215 11153734 11100465 11169176 11460735 11542215 11838722 12197743 12539315 12924543 13280249
3904 13280249 13557816 13892870 14294243 14665108 14867011 15053993 15306709 15551094 15845179
3895 15845179 15989437 16028251 16140780 16254414 16391581 16540997 16681112 16756593 16890204 16844750
3885 16844750 16848808 16604482 16467068 16422009 16410874 16531640 16696165 16939843 17234169 17482684
3875 17482684 17842770 18248296 18413570 18677713 19094011 19208195 19376301 19287785 19317021 19347641
3865A9347641j7805K4380J4850J21647K91367L41945M14030M70143N71876O63235
3855B2243309N78537N79762P24273P78947Q28709Q05706O07684L94331K29984
3846B7771242K48468P0016K9992Q5764K38687J48114K09418L92916M52648N50037
3836C0197302O37243Q14413R63561R63026J300564J339221J505275J459364J808844
3827D0988813K258537K502751K859506L236355L625879L954340M323679M636787
3819F8386647M829867M367004L537985L253562L089292J515751k593225n977321
3811H0409562o432642n001830l451706k204017j242510n60728j82850J26669L73544
3802F1833492N40951R62397J174859J655007K087055K713718L037651L880179
$$ plain form
3865 19347641 19329836 19354216 19369066 19490713 19782080 20124025 20538055 21008198 21580074 22243309
3855 22243309 22821846 23401608 24125881 24904828 25733537 26539243 27146927 27541258 27771242
3846 27771242 28019710 28089726 28119718 28205482 28444169 28592283 28801701 29194617 29647265 30197302
3836 30197302 30834545 31648958 32612519 33575545 34876109 36215330 37720605 39179969 40988813
3827 40988813 43247350 45750101 48609607 51845962 55471841 59426181 63749860 68386647
3819 68386647 73216514 77583518 81121503 84375065 87464357 88980108 86386883 80409562
3811 80409562 73976920 68975090 65523384 63319367 62076857 61516129 61333279 61459948 61833492
3802 61833492 62374443 63336840 64511699 66166706 68253761 70967479 74005130 77885309
3794G7885309M577743N203888N845539O494780P491277Q412682R704623J1253713
3786A36869554J3193104J4251703J4483015J4054648J1635813L064444j0134804
3779A97417477j8966738j9950442j6567134j2611347r219626o759411n081109
3772A08261670l848968k747273j868435j214443o48805k31327r4891j02010k02813
3763I7302705k8959j93295l76711k72859l7488L73571N99377R09453J301431J536658
3753A01113883J478104J533833J442347J405087J218286R79495J068109J098142
3745A11337286J050473J135273J092613P10338O04407O20207P16554J121218J333646
3736A19722015J736103K293374K781270L251375L651096L958374M052649M475296
$$ plain form
3794 77885309 82463052 87666940 93512479 100007259 107498536 115911218 125615841 136869554
3786 136869554 150062658 164314361 178797376 192852024 204487837 207552281 197417477
3779 197417477 178450739 158500297 141933163 129321816 120102190 113342779 108261670
3772 108261670 104412702 101665429 99796994 98582551 97933746 97702419 97607528 97505518 97302705
3763 97302705 97273746 97080451 96703740 96430881 96393393 96766964 97366341 98275794 99577225 101113883
3753 101113883 102591987 104125820 105568167 106973254 108191540 109171035 110239144 111337286
3745 111337286 112387759 113523032 114615645 115325983 115930390 116550597 117267151 118388369 119722015
3736 119722015 121458118 123751492 126532762 129784137 133435233 137393607 141446256 145921552
3728A45921552M470731M084168L897779L501530K939620K700339K360606K252494
3720A72128819J855291J493119J340391J420814J572264J478789J676078J774638
3712A84740203K050493J895039J996481J791673J393821J051163K70045l86151
3704A94802767j087075j819699k303942k460058k411205k446692k347830k129380
3696A77796886j850638j845527j810475j769289j750118j550407j598122j537219
3688A64085091j304003j211241j141619j052690j177066j039656r89697r69483
3680A55199636q38835p19275p17648r86368j519158k038339k415838k629385k708237
3671A40626553k817499k518350k355272k435015k243217k061328k144715k768496
$$ plain form
3728 145921552 150392283 154476451 158374230 161875760 164815380 167515719 169876325 172128819
3720 172128819 173984110 175477229 176817620 178238434 179810698 181289487 182965565 184740203
3712 184740203 186790696 188685735 190682216 192473889 193867710 194918873 195188918 194802767
3704 194802767 193715692 191895993 189592051 187131993 184720788 182274096 179926266 177796886
3696 177796886 175946248 174100721 172290246 170520957 168770839 167220432 165622310 164085091
3688 164085091 162781088 161569847 160428228 159375538 158198472 157158816 156169119 155199636
3680 155199636 154360801 153641526 152923878 151937510 150418352 148380013 145964175 143334790 140626553
3671 140626553 137809054 135290704 132935432 130500417 128257200 126195872 124051157 121282661
3663A21282661l108593l172368l387481l274513k985589k759165k382026k010882
3655I8202044j639549j151671j002880r15024o84741n29008m88951l93451k25562
3646I1171207j75811l5367J9138k2150J30423K19537N16795O31015P41560J157411
3636I4353758J290928J395207J674978J864478K056051K445323K540678K509067
3628A10130468K373896K243464K045348J824814J856884K086084K575150L294781
3620A28430889M265406N254233O476529P683501Q990085J0636991J2114483J3628017
3612A97480134J5636613J7769293J9799592K1678719K3172987K3604515K3017151
3605C42159004K0649930J6535073J1055030N228325L95868l056784m990546n585008
$$ plain form
3663 121282661 118174068 115001700 111614219 108339706 105354117 102594952 100212926 98202044
3655 98202044 96562495 95410824 94407944 93492920 92808179 92279171 91790220 91396769 91171207
3646 91171207 90995396 90960029 90979167 90957017 91087440 91306977 91823772 92454787 93196347 94353758
3636 94353758 95644686 97039893 98714871 100579349 102635400 105080723 107621401 110130468
3628 110130468 112504364 114747828 116793176 118617990 120474874 122560958 125136108 128430889
3620 128430889 132696295 137950528 144427057 152110558 161100643 171737634 183852117 197480134
3612 197480134 213116747 230886040 250685632 272364351 295537338 319141853 342159004
3605 342159004 362808934 379344007 390399037 395627362 396023230 392966446 387975900 382390892
3597C82390892n356014m954441m291242m089230m598823n982524p938093j0649819
3589C34530706j3758652j6762511j9186631k0432223k0378957j9438016j7788818
3582B06784898j5905960j3899138j2028540j0336791q966700p658783o307294
3575A31681692n457722m598439l688120l048637k512919k227406k074361k056953
3567A06017135k346081k649102l028788l633748l754440l679859l694368l268766
3559G9961983l020585k779188k355910k149780k076863j913944j721640j496988
3551F2447085j261012r86838p86891n86217n38592k49816N8836J23505J51403
3542E8371463N02500M13785M18710L71099R2068k70195l87993m92155o01005n97766
$$ plain form
3597 382390892 377034878 372080437 367789195 363699965 359101142 353118618 345180525 334530706
3589 334530706 320772054 304009543 284822912 264390689 244011732 224573716 206784898
3582 206784898 190878938 176979800 164951260 154614469 145647769 137988986 131681692
3575 131681692 126223970 121625531 117937411 114888774 112375855 110148449 108074088 106017135
3567 106017135 103671054 101021952 97993164 94359416 90604976 86925117 83230749 79961983
3559 79961983 76941398 74162210 71806300 69656520 67579657 65665713 63944073 62447085
3551 62447085 61186073 60199235 59412344 58826127 58287535 58037719 58096555 58220060 58371463
3542 58371463 58873963 59287748 59706458 60077557 60169625 59899430 59511437 59019282 58418277 57820511
3532E7820511p10775q25503j287355j825562k101743k138765k024992j746326
3524D5159490j641791j337596j082720r76448o74915n59210l13560k44712J0813
3515C8339351M2872Q6677L95684K04724L89775K11295J46425K05683j15174k98654
3505C9608658o3944j28439k40225r5281l35475q04820p42739r27544q69548r52988
3495C4447655r72671q21695o13005m37457l65487l39103j09319L6648Q2672J58697
3485C1066935O3433K15547K88417J87074q9087p5799j09487l5300L3233K95779
3475C1840745K43564L69241M30942M18146J89243L10133N4419l44525l91299l24152
3465C2796457l29824k28683j19306P637J29633J02682J64572L64914N60717L24095
$$ plain form
3532 57820511 57109736 56284233 54996878 53171316 51069573 48930808 46905816 45159490
3524 45159490 43517699 42180103 41097383 40120935 39446020 38886810 38573250 38328538 38339351
3515 38339351 38382223 38468900 38864584 39069308 39459083 39670378 39816803 40022486 39907312 39608658
3505 39608658 39544714 39416275 39176050 39080769 38745294 37940474 37197735 36270191 35400643 34447655
3495 34447655 33474984 32653289 32040284 31602827 31237340 30898237 30788918 30825566 30908238 31066935
3485 31066935 31130368 31345915 31634332 31821406 31732319 31656520 31547033 31511733 31544966 31840745
3475 31840745 32084309 32453550 32884492 33302638 33491881 33802014 33856433 33511908 33120609 32796457
3465 32796457 32466633 32237950 32118644 32126281 32255914 32358596 32523168 32888082 33448799 33772894
3455C3772894N73561M28028P67168P46321Q65082Q21417Q94727R38363Q76338
3446D0683899J184867J077760J116914J043224J126084J066512J131712J200400
3438D9631372J117376J354923J576381J780645J945623K297769K517902K475670
3430F4697661K809881L120625L188309L288981L471801L375357L180102L200632
3422I0333349L017929K901357L073293L422033L730940L864983M167660M272487
3414A18784031M220688L967077L947049L716116L639075L755934M007871M534506
3406A50572347N255487O043583P000036P951666Q875890R957220J0992123J1721241
3398B18369593J2313413J2746442J2438706J1529453J0214317Q563625O910879
$$ plain form
3455 33772894 34346455 34774483 35541651 36287972 37153054 37974471 38869198 39807561 40683899
3446 40683899 41868766 42946526 44063440 45106664 46232748 47299260 48430972 49631372
3438 49631372 50748748 52103671 53680052 55460697 57406320 59704089 62221991 64697661
3430 64697661 67507542 70628167 73816476 77105457 80577258 83952615 87132717 90333349
3422 90333349 93351278 96252635 99325928 102747961 106478901 110343884 114511544 118784031
3414 118784031 123004719 126971796 130918845 134634961 138274036 142029970 146037841 150572347
3406 150572347 155827834 161871417 168871453 176823119 185699009 195656229 206648352 218369593
3398 218369593 230683006 243429448 255868154 267397607 277611924 286175549 293086428
3391B93086428N950739N550876O089466O938100P663965Q210292Q046498P181841
3383C48718205N367324K478201j021586m735383q165129j0767094j2196869j2672368
3375C07005301j2315028j1522456j0732710r923948r391434r516890j0081768
3368B33521067j1026798j2182292j3250118j3861517j3867120j3290850j2074058
3361A43968314j0816847r728470q675888p593935o601354n928794n443556m937061
3353H4242409m314132l845008l542928l224577k961932k752934k473373k273139
3345E8854386k051873j909158j781318j742748j636868j463606j492077j490582
3337D5286156j275955j324252j195336j103819j077558j043441j076399q60830
$$ plain form
3391 293086428 299037167 304588043 310677509 317615609 325279574 333489866 341536364 348718205
3383 348718205 354085529 356563730 355542144 350806761 342641632 331874538 319677669 307005301
3375 307005301 294690273 283167817 272435107 262511159 253119725 243602835 233521067
3368 233521067 222494269 210311977 197061859 183200342 169333222 156042372 143968314
3361 143968314 133151467 123422997 114747109 107153174 100551820 94623026 89179470 84242409
3353 84242409 79928277 76083269 72540341 69315764 66353832 63600898 61127525 58854386
3345 58854386 56802513 54893355 53112037 51369289 49732421 48268815 46776738 45286156
3337 45286156 44010201 42685949 41490613 40386794 39309236 38265795 37189396 36328566
3329C6328566r63815q28380p67579p77409q33483o74348q00578p65212p18131
3320B9199631p41430o41848o79251o86834o44118m87908n94733n57920m89906
3311B3675683n34543n60426m63774m68947p39666m36928n00633m15777m59396
3302A9095593m87101k49347n25324m23703l25315l96834l72858j96165m21998
3293A5696948l64296l42925l58931k18749k74552m69691l50006k93993k91076
3284A2732729l08766k94027j59553j40874q6715j81029k73002k44286r8691j15549
3274A0830237k14275j72911K0111j47824j00206k48680j90245k86785j69920o0721
3264I258781j25678k35256k13089o5309j18480J8647j61337k5950m8968K5746
$$ plain form
3329 36328566 35364751 34536371 33768792 32991383 32157900 31483552 30682974 29917762 29199631
3320 29199631 28458201 27816353 27137102 26450268 25806150 25318242 24723509 24165589 23675683
3311 23675683 23141140 22580714 22116940 21647993 20908327 20471399 19970766 19554989 19095593
3302 19095593 18608492 18359145 17833821 17410118 17084803 16687969 16315111 16118946 15696948
3293 15696948 15332652 14989727 14630796 14412047 14137495 13667804 13317798 13023805 12732729
3284 12732729 12423963 12129936 11970383 11829509 11742794 11561765 11288763 11044477 10945786 10830237
3274 10830237 10615962 10443051 10463162 10315338 10215132 9966452 9776207 9489422 9319502 9258781
3264 9258781 9133103 8897847 8684758 8619449 8500969 8519616 8358279 8332329 8283361 8309107
3254H309107j12929k91633p8011M1702N1776n3889j70403j6681j00824r0240j22871
3243G365104j28291j2507o5035j23262j09446j42496j87965p5442J7104k36013
3233F301751j40005p7018q4256q2904R1717j73968j38519L0409l2007r0858j69547
3222E434795p406O520M2857k20934k5938K2998p7924r3914M0579l2476r9084m9758
3210D940315K0061L8703L357l7380j11093J5634o2118n5601j22387q6891L6487
3199D579087K4767j35330r2903j9222m4568R6060m5512j0049M0743k7080m6444
3188D319549n6300n7877M7171j736O6750o7495j3942K3548n6627K0244q083p6131
3176D139071J91856K2277m370M5684r9188R719K9514J51544p9135Q1218J1344
$$ plain form
3254 8309107 8196178 7904545 7826534 7868236 7920012 7866123 7695720 7679039 7578215 7487975 7365104
3243 7365104 7236813 7224306 7159271 7036009 6926563 6784067 6596102 6520660 6537764 6301751
3233 6301751 6161746 6084728 6000472 5917568 6009285 5835317 5696798 5727207 5695200 5604342 5434795
3222 5434795 5427389 5433909 5476766 5255832 5229894 5252892 5174968 5081054 5121633 5089157 4990073 4940315
3210 4940315 4960376 4999079 5002436 4965056 4853963 4869597 4807479 4751878 4629491 4542600 4579087
3199 4579087 4603854 4468524 4375621 4356399 4311831 4407891 4362379 4352330 4393073 4365993 4319549
3188 4319549 4263249 4205372 4252543 4250807 4317557 4250062 4236120 4259668 4203041 4223285 4215202 4139071
3176 4139071 4330927 4353204 4348834 4394518 4295330 4305049 4334563 4486107 4406972 4488190 4499534
3165D499534P9560J37382K3067j3830l9129J1362O7206J44190L9433k909P8823
3154E024689J771Q8274J59568j37870J80147q1157J24616J99950n3314J1705R2103
3143E610482J96268j6508K9776N8018J99527J52810O6568N4953J52143K02389
3133F706426J00271j6647J73974K49330P3060J70690K55556m226J57971L48373
3123H214778J02524O3579J15889J67260J56349K6781K0860J92602J94636O4932
3113I320190J27711K05594J90J63289J08209j3370J70774K39706J75685J14193
3103A0612171J76652j0878K22355K34993M6643K14313L13490L84812L59977L57885
3093A2912413L84096L38259M76836M25231N82966O03751N72994P73176Q52498
$$ plain form
3165 4499534 4579094 4716476 4739543 4725713 4686584 4697946 4765152 4909342 4948775 4945866 5024689
3154 5024689 5026460 5114734 5274302 5136432 5316579 5235422 5360038 5559988 5506674 5518379 5610482
3143 5610482 5806750 5790242 5820018 5878036 6077563 6230373 6296941 6351894 6504037 6706426
3133 6706426 6806697 6790050 6964024 7213354 7286414 7457104 7712660 7708434 7866405 8214778
3123 8214778 8317302 8380881 8496770 8664030 8820379 8847160 8868020 9060622 9255258 9320190
3113 9320190 9447901 9653495 9653685 9816974 9925183 9911813 10082587 10322293 10497978 10612171
3103 10612171 10788823 10777945 11000300 11235293 11281936 11496249 11809739 12194551 12554528 12912413
3093 12912413 13296509 13634768 14111604 14536835 15119801 15723552 16296546 17069722 17922220
3084A7922220J029213J242720J208150J397211J514171J605492J930147K156007
3076C0005331K097165J941009J722855R56374J49443j027533k006255k699202
3068C1139187l116708k954706k714622k227460j887384j704441j440704j175436
3060A3917726j024648j017502o86506n77003n77779n07520m33396m35117k96113
3051H362142k95529k84049j79174j93671j92482m060k00652m95773k19556m20444
3041E876752l87012q7012k87977j49388j54504j56361j02680k08250n5565j42522
3031D145481k3848j59260k13509r8779J09548j38618j56755J8737q1845K5949
3021C427101r0265m3447n61L2695M7554j08293j28037j26980j60455k6762Q306
$$ plain form
3084 17922220 18951433 20194153 21402303 22799514 24313685 25919177 27849324 30005331
3076 30005331 32102496 34043505 35766360 36722734 36872177 35844644 33838389 31139187
3068 31139187 28022479 25067773 22353151 20125691 18238307 16533866 15093162 13917726
3060 13917726 12893078 11875576 11189070 10612067 10034288 9526768 9093372 8658255 8362142
3051 8362142 8066613 7782564 7603390 7409719 7217237 7213177 7012525 6516752 6297196 5876752
3041 5876752 5489740 5402728 5114751 4965363 4810859 4654498 4551818 4343568 4288003 4145481
3031 4145481 4121633 3962373 3748864 3650085 3759633 3621015 3464260 3482997 3401152 3427101
3021 3427101 3336836 3293389 3292828 3325523 3373077 3264784 3136747 3009767 2849312 2822550 2830856
3010B830856j88760o9012M4395j25407j04050j6136q2332n1278l3537R02k1813
2999B183828M0499j83703l2876k4148q3125K8170o8334M521p4885L8319r896j37607
2987A680763J3796m4176j1940l3547q653m8537j55003L9760K1541L4273j90971
2976A297306L2895J54266o8678l7741J49107m8361n8880o8355J5496r383J7594
2965A375266j08344K0690J03973K7364k21584k4909l2829K4227O1759j10219M8997
2954A164391j5182Q1253j29539R1333K8928j59946R3327j0796Q486n848M1756
2943A188163K4076L9344K1907j23063K2493q2103p1151r3157K7166k0728Q2526
2932A015473r474l2268M1257p7001m622P3576q0692q5951P3479N5887p6542P7135
$$ plain form
3010 2830856 2642096 2573084 2617479 2492072 2388022 2371886 2289554 2238276 2204739 2205641 2183828
2999 2183828 2224327 2040624 2007748 1983600 1900475 1928645 1860311 1864832 1789947 1828266 1818370 1680763
2987 1680763 1694559 1650383 1638443 1604896 1596243 1547706 1392703 1432463 1454004 1488277 1297306
2976 1297306 1330201 1484467 1415789 1378048 1527155 1478794 1419914 1351559 1367055 1357672 1375266
2965 1375266 1266922 1287612 1391585 1418949 1197365 1172456 1139627 1163854 1225613 1115394 1164391
2954 1164391 1149209 1230462 1100923 1192256 1221184 1061238 1154565 1143769 1152255 1146407 1188163
2943 1188163 1212239 1251583 1273490 1150427 1172920 1090817 1019666 926509 953675 932947 1015473
2932 1015473 1005999 973731 1014988 937987 933365 1006941 926249 840298 913777 969664 893122 970257
2920I70257J5200M5813j05673J0535J7319K4663J0730J4848J12784m1395o7299
2909A007782l2166k7366k557j562r1471K6477M3355K4465o4554M3918K1459M492
2897I52272m6562O1214K3735o9544L0553j6788O3359Q5295j31254j5039n6534
2886H80707L9043P6886L8126o5626L8024K37559r2968p6339L8090L2093l0758
2875A114837P4017l7754r5529k02621J0082Q9880m2829Q8118p1861p72l0232j04356
2863G90980n3786N6424L9063m2831k4152j4079P1364N2218n2905l2759R9750K1662
2851I10949j86291o2055M7284K07223n15l5097K3547j02530o8513L6557N3756
2840H24315N7765l5871q7204M234p429J06076Q590K4033k9088o6028K12646j6143
$$ plain form
2920 970257 985457 1031270 925597 936132 953451 978114 988844 1003692 1116476 1075081 1007782
2909 1007782 975616 948250 945693 944131 852660 879137 922492 946957 882403 926321 947780 952272
2897 952272 905710 966924 990659 921115 951668 934880 998239 1083534 952280 937241 880707
2886 880707 919750 996636 1034762 969136 1007160 1244719 1151751 1075412 1113502 1145595 1114837
2875 1114837 1188854 1151100 1055571 852950 863032 952912 910083 998201 926340 925568 895336 790980
2863 790980 737194 793618 832681 789850 765698 751619 822983 875201 822296 789537 889287 910949
2851 910949 724658 662603 709887 917110 916595 881498 905045 802515 734002 770559 824315
2840 824315 882080 846209 759005 763239 755810 861886 870476 894509 865421 799393 1012039 995896
2828I95896j44406j2835P1080J5714l3947O2704o7799N3257P9490m1506Q1764
2817A059412p9404p1583L9282k6978J4237m5716J41211P4288J4551K1263J14890
2806A255453j6518P4533O1386J7940k3315P8673J06406O0772l2345K2532J58306
2795A763823L4396N5912O8177L8858Q6878R5310m76J9484O9772J8948o0517M2692
2783B233257n7306k095P6114K095P9652n6113J38J49903J11595n505p801J29096
2771B653030p157J89279J45947J32316J55218K26442J09235J7097j60138k48714
2761C212555k16423j40005k28735j83990j63989j16226q3776M5428j0372J477
2751B115944o1039r7749O0010j03100m5617q3729l9510O2539J4513j8003K8203
$$ plain form
2828 995896 851490 838655 909735 925449 891502 954206 886407 939664 1019154 977648 1059412
2817 1059412 980008 908425 947707 920729 934966 889250 1030461 1104749 1119300 1140563 1255453
2806 1255453 1238935 1313468 1374854 1392794 1369479 1448152 1554558 1615330 1582985 1605517 1763823
2795 1763823 1798219 1854131 1922308 1961166 2048044 2143354 2142878 2162362 2232134 2251082 2190565 2233257
2783 2233257 2175951 2173856 2249970 2252065 2331717 2275604 2275742 2425645 2537240 2531735 2523934 2653030
2771 2653030 2645873 2835152 2981099 3113415 3268633 3495075 3604310 3621407 3461269 3212555
2761 3212555 2996132 2856127 2627392 2443402 2279413 2163187 2079411 2124839 2114467 2115944
2751 2115944 2054905 1957156 2017166 1914066 1868449 1784720 1745210 1807749 1822262 1804259 1832462
2740A832462M1577Q3272O5116J8711p2414m2552q0282j62775k46918K3241n3160
2729A406278l9726K2647o0818j01912j10227m4451K1397K2104l014n6250o8007
2718I88021P108P6569Q2623k13029K0114O0226j08972q1112l1056J1593p2315
2707G39770J440n3070K5947o9908o4731n53J08512k3399J2195M2148q8730K9761
2695F59382m9811j027q4834k8761Q7242o9021n4606J0378l1838N3293L4724o6077
2683D59044q4036K9966K2811L205O569j3210q8704M1907k7880O079M2128j19252
2671B78627J7892l8276M7344l8804Q13R702n3931J3266J11677K2967m7077L2604
2659C56804M201k6296K9349n6682o2511o1745N1610J89396K256j19175o4932O3882
$$ plain form
2740 1832462 1874039 1957311 2022427 2041138 1968724 1926172 1845890 1683115 1436197 1459438 1406278
2729 1406278 1366552 1389199 1328381 1226469 1116242 1071791 1093188 1115292 1112278 1056028 988021
2718 988021 995129 1071698 1154321 941292 961406 1021632 912660 831548 800492 812085 739770
2707 739770 741210 688140 714087 644179 579448 578895 687407 664008 676203 718351 629621 659382
2695 659382 609571 608544 523710 494949 582191 513170 458564 468942 437104 490397 525121 459044
2683 459044 375008 404974 427785 430990 437559 424349 335645 377552 349672 355751 397879 278627
2671 278627 296519 258243 305587 266783 267596 277298 223367 236633 348310 371277 324200 356804
2659 356804 361005 334709 364058 307376 244865 183120 234730 424126 426382 307207 242275 306157
2647C06157n5676L1988r682k8510P0180n5849r200l861J89766P011j10901k202
2635C29221J1922j0327n4071J04116k0991m4188Q9559k8757r2672L1394j5567
2624B99639O4165p4991J00488k1944l2117l8811Q7658j00151p7320J78827n6553
2613C28890n7205n2669o7081l9539P4783L5124l3876m6161J5801O7940p1129M7357
2601B02235R0042o3435J02332O517n1553j65177Q535J63320o550q7320q3532N0612
2589A66026j4953O5264n7142n7733J7709L6786q735L3505M0284j6980n6807L8445
2577A85669L270N0013P2708m8478N7527j54187k5704J799P374p498n0667L6642
2565A28468J55424o0256k6317Q0267K1197j16398L7453N9856j0928N5892k6452
$$ plain form
2647 306157 250481 282469 272787 244277 314457 258608 249408 245547 435313 442324 331423 329221
2635 329221 341143 330816 276745 380861 359870 315682 405241 376484 283812 315206 299639
2624 299639 363804 288813 389301 367357 335240 296429 384087 283936 206616 385443 328890
2613 328890 271685 219016 151935 112396 187179 222303 188427 142266 158067 226007 154878 202235
2601 202235 292277 228842 331174 337691 286138 120961 129496 292816 286266 198946 115414 166026
2589 166026 151073 216337 159195 101462 119171 155957 147222 180727 221011 204031 147224 185669
2577 185669 188939 238952 311660 263182 320709 166522 140818 142617 149991 142493 91826 128468
2565 128468 283892 223636 197319 277586 298783 182385 219838 279694 268766 324658 298206
2554B98206r1935q3615O5925J6559j0649J31507j18063K9529J3769j31470p2526
2543D7237j3200R1685o8392J363P2086J8076Q7702p284K1152K0007r5770n1434
2531A23228M8841M5056L4031L8818j73488l0855N9021o768J1804n4803n7853M5533
2519H2565K0499o1540M5804R2839N590m1853K6650O6627M0483m172j00723M3476
2507B16245J23504j4259j50103n9770P6769O3385k1503l8886l4549O8310n1106
2496A78037m614O2702n5959L0534J5205P5313j69428M4221O2399j21134Q9370
2485B06646n204o735k9417k4125j3638J0669Q9511r0557N1656j19363J7741J3962
2473A01146n0058J13090o5153M4476l0771r7484L8987N4921j7892j5915j0343
$$ plain form
2554 298206 206271 122656 188581 205140 194491 325998 207935 237464 251233 119763 47237
2543 47237 34037 125722 57330 58693 130779 148855 236557 229273 250425 270432 174662 123228
2531 123228 172069 217125 251156 289974 116486 85631 144652 137884 149688 94885 37032 82565
2519 82565 103064 41524 87328 180167 185757 143904 170554 237181 277664 273492 172769 216245
2507 216245 339749 325490 175387 115617 192386 255771 234268 195382 160833 229143 178037
2496 178037 173423 236125 180166 210700 225905 301218 131790 176011 238410 117276 206646
2485 206646 201442 194707 165290 141165 127527 138196 227707 137150 188806 69443 87184 101146
2473 101146 51088 164178 99025 143501 112730 15246 54233 109154 91262 75347 65004
2462F5004O7758K7320L1627O20l1785p4272K3258M2129N2095r3031P7194l1783
2450A56134l670l0781k8029O1330j06413p970L3118Q3242j0616R500j8207p4372
2438F3266m6122J00750N2537j11648J0877l5742J3509l6354K4137l5337J45075
2427A44948K3169N652M1602p7234j36575Q7173l4467k1357m6068Q7666l5289N7772
2415I6992Q0407n2103J30156p1300k1822Q782q7394P551O2711q5761M7879K388
2403A18486N0544K1928n4650j01400R7831p5005n5034P3602J91491n9375j72315
2392C6103M4929l78j6820O7974k944m079j50222p674J71582P3632p6283j42875
2380g055m9504J33276N6733j25307l0921O9523J36155n2404m4558M9326q3803
$$ plain form
2462 65004 132762 160082 191709 192329 160544 86272 109530 151659 203754 110723 187917 156134
2450 156134 152464 121683 93654 154984 48571 40601 73719 156961 146345 155845 137638 63266
2438 63266 17144 117894 170431 58783 69660 33918 47427 11073 35210 -127 144948
2427 144948 168117 173769 215371 138137 1562 88735 54268 32911 -13157 74509 39220 96992
2415 96992 177399 125296 255452 184152 162330 171112 83718 91269 153980 68219 116098 118486
2403 118486 169030 190958 136308 34908 132739 57734 2700 76302 267793 208418 36103
2392 36103 81032 80654 63834 131808 128864 124785 -25437 -33111 138471 212103 135820 -7055
2380 -7055 -56559 76717 133450 8143 -22778 46745 182900 130496 85938 135264 51461
2369E1461j4564J05531N9800p5978p4758K6754J50095j42471k5363o2429K8678
2358B6756m8871j7644K2065J24151q3686l0988q9980q6J20472L3470Q1097l7733
2346I9023M9077N4858o9230N4156N685n9183l7346l4427k0370J367Q6417j2739
2334A17288P871q3150r03P9213j418n9204N1447M600r63n093o0890K2315J38468
2321B09581m5290L3066m2367q390M5462r569o4680n7515K8342L0356L5365M1292
2309A95653q6053N676o9205M3562l627P4474p5018r835M7730R4122Q8852j31069
2297A75262r933k6149K5534r0314k9720J17595R8698O1870k4830p1430J97998
2286D24581P4871j93026m4771j495N43O2051J4258l2689q7740o0716P7355n5841
$$ plain form
2369 51461 36897 142428 202228 126250 51492 78246 228341 85870 60507 -1922 26756
2358 26756 -22115 -39759 -17694 106457 22771 -8217 -98197 -98283 22189 55659 136756 99023
2346 99023 148100 202958 133728 187884 193569 134386 97040 62613 42243 43610 130027 117288
2334 117288 125159 42009 41106 120319 118901 59697 111144 115744 114781 109688 48798 71113 209581
2321 209581 164291 197357 154990 146600 192062 182493 117813 60298 88640 118996 154361 195653
2309 195653 109600 115276 46071 89633 86006 160480 85462 75627 123357 217479 306331 175262
2297 175262 165329 139180 164714 74400 44680 162275 260973 322843 298013 226583 424581
2286 424581 499452 306426 261655 260160 260703 322754 337012 304323 216583 155867 233222 177381
2274A77381K4588r576j26759n1785J46133m4268q9260J41134J07007j70416p9130
2263B5049m0571L4518N9274K0024k588P2708n8290o4367m3171m3466P3433K8635
2251F1188L2091j9394p294M9326M4131O9087r4095m513j18080J8064J44156j27819
2239D6848J3506j48146N0734k2837J55291l2011j4293k3679l2074k0721K9527
2228B145J75627l0458k8104Q1148p6740j30537L8183lO8150m2564K4465O2787
2216A44099n2382k2586M9929j6352m3037r449O119K3142n3040R4326M2999p3070
2204I0698M481m1293L5683j12875J01327J78415n4524n5402j4430J27318n3689
2193B05709k5996M1060K4542q4302O1289J25468j04536l7654J03086j07792q6944
$$ plain form
2274 177381 201969 192393 65634 13849 159982 115714 26454 167588 274595 104179 25049
2263 25049 -15522 18996 78270 98294 95706 168414 110124 45757 2586 -40880 32553 61188
2251 61188 93279 73885 66591 115917 160048 229135 135040 130527 12447 30511 174667 46848
2239 46848 60354 -87792 -37058 -59895 95396 63385 49092 25413 -6661 -27382 2145
2228 2145 177772 147314 119210 200358 123618 -6919 31264 31261 99411 56847 81312 144099
2216 144099 91717 69131 119060 102708 59671 50222 56341 79483 26443 120769 163768 90698
2204 90698 95179 53886 89569 -23306 78021 256436 201912 146510 132080 259398 205709
2193 205709 179713 220773 245315 161013 222302 347770 243234 205580 308666 200874 113930
2182A13930l0313M8103n2323k972O3908k349j4097l5399O1699K9445P1880N7190
2170C08702P3585j7009o133L2453j03945j4002q8555Q1788p8331M1091R3064j76340
2158A46368J49044J42425j4542k6411j31404L7241J84617p6089j5472K4996L3239
2147D54012P6723J3062n3989l1791q5776M293J33051j33672k6575M3775J15561
2136E08674R6030p6020j9716K3876J5471M2323R905K5726o5082M5429O6394j23963
2124E49047P1504J4704m8732P7055j3537l129J25772P4459n114L6784Q5416L0495
2112I94724N227o8344O5627O1156N7121O0860O4706Q9577k582n1859K2429J09136
2100A407778J8634O4459N3141p0279k6208N9029N1737L5704Q9347R6224N8179
$$ plain form
2182 113930 83617 131720 79397 76425 140333 137984 123887 88488 150187 179632 251512 308702
2170 308702 382287 365278 359145 391598 287653 273651 185096 266884 188553 229644 322708 146368
2158 146368 295412 437837 423295 396884 265480 302721 487338 411249 395777 420773 454012
2147 454012 530735 543797 489808 458017 372241 376534 509585 375913 349338 393113 508674
2136 508674 604704 528684 508968 532844 548315 590638 600543 626269 561187 606616 673010 549047
2124 549047 620551 635255 586523 663578 650041 646912 772684 847143 842029 878813 964229 994724
2112 994724 999951 931607 997234 1058390 1115511 1176371 1241077 1330654 1328072 1276213 1298642 1407778
2100 1407778 1426412 1490871 1544012 1473733 1447525 1506554 1558291 1593995 1683342 1779566 1837745
2089A837745K10986J60554n2316N1145O0545J55174J10082J76630J89707P1875
2079B972127N4726J21961Q3807J95403K37919J19538J46287L4023K33153J67834
2069D366778K33722L33316L00510L38227L09868M95686O92516P33882O99625R07664
2059I411794J052385J308893J095400J354215J521877J941476K295060K920749
2051B2901849L668417M569057N940181P417389P548082Q592500M348137n276017
2043E9709595j0688968j1416877p975629n218507l634786k469063j915198j620237
2035A4770330j407787j127193p95406m61241p46389p77889p27949p20039o98240
2026G308197n17687k72808l57023m20106l72819j86401k83533k81422l30360p1330
$$ plain form
2089 1837745 2048731 2209285 2156969 2208114 2268659 2423833 2533915 2710545 2900252 2972127
2079 2972127 3026853 3148814 3232621 3428024 3665943 3785481 3931768 3965791 4198944 4366778
2069 4366778 4600500 4933816 5234326 5572553 5882421 6378107 7070623 7804505 8504130 9411794
2059 9411794 10464179 11773072 12868472 14222687 15744564 17686040 19981100 22901849
2051 22901849 26570266 31139323 37079504 44496893 52044975 60637475 64985612 59709595
2043 59709595 49020627 37603750 29628121 24409614 20774828 18305765 16390567 14770330
2035 14770330 13362543 12235350 11439944 10978703 10232314 9454425 8726476 8006437 7308197
2026 7308197 6790510 6517702 6160679 5740573 5367754 5181353 4897820 4616398 4286038 4214708
2016D214708k10094j84061j89773j26581j87345k00533j15192j25473q0113l4171
2006B761372p7869k59896N9447l8764j25963q3306q6091j09627q6240l0644j21939
1995A800480q5590n8767M2643p3629p6893p9924J7032q4480L2511J02608j15497
1984A420494o2365j41571K3452J16367n1736m9543n0550j5795J1835m9233j24893
1973A026462o0412j06987Q3905L7096k6337n9715p8685n5051k1839j20123q9890
1962E28424J56002j0771p8162m7088J18402J0177j39220l0677l8112J4449J8460
1951E01884o0287J2914k9554L6464m1068J7075k7398r9134J11457J07581Q3191
1940F13125j05382j02282j1533n4933J01655N4258J9507j18708q0455K7478Q7030
$$ plain form
2016 4214708 4004614 3820553 3630780 3504199 3316854 3116321 3001129 2875656 2795543 2761372
2006 2761372 2683503 2423607 2483054 2444290 2318327 2235021 2148930 2039303 1953063 1922419 1800480
1995 1800480 1714890 1656123 1698766 1625137 1548244 1468320 1485352 1400872 1433383 1535991 1420494
1984 1420494 1358129 1216558 1240010 1356377 1304641 1255098 1204548 1188753 1200588 1151355 1026462
1973 1026462 966050 859063 942968 980064 953727 894012 815327 760276 738437 618314 528424
1962 528424 684426 673655 595493 548405 666807 676984 537764 507087 468975 483424 501884
1951 501884 441597 454511 424957 461421 420353 437428 410030 310896 422353 529934 613125
1940 613125 507743 405461 393928 338995 440650 494908 514415 395707 315252 342730 429760
1929D29760J26416j46349M0850n7548r9126N8758l8514J47808J5284r9710n3374
1918C24255k9451N560n5898N3329J9625q9137N660M5812M5570M0073N797j8752
1906C52443M1605L2160j02982m2323m6064o9000J456j16864m0966P4109P2666
1895A56240Q8639r5072L296n8096p7696Q7046K6641l0575l080K3942m0863j99
1883H0223J45916Q539n9878l5823m0867K4685P5661M7708l8825l9314j4437M978
1871A58566J4960O2934j14371J8602M1088L6392q1178R0199o9325p902Q764K4463
1859A83192j3751o6799r075N5641M8776m2058q65l1817O2380j683j08425J133
1847G6649n3766M6626q131L6327K727L5288O4560p0877l8175K5316m3951J10260
$$ plain form
1929 429760 556176 409827 450677 393129 294003 352761 314247 462055 477339 377629 324255
1918 324255 294804 300364 244466 297795 317420 228283 233943 279755 325325 365398 371195 352443
1906 352443 394048 426208 323226 280903 234839 165839 167295 50431 9465 83574 156240
1895 156240 244879 149807 153103 95007 17311 104357 130998 100423 97343 121285 80422 80223
1883 80223 226139 234678 174800 138977 98110 122795 198456 246164 207339 168025 153588 158566
1871 158566 173526 236460 122089 140691 181779 218171 136993 227192 157867 149965 158729 183192
1859 183192 169441 102642 93567 149208 197984 155926 155061 123244 185624 183941 75516 76649
1847 76649 22883 69509 61378 97705 100432 135720 200280 129403 91228 116544 72593 182853
1835A82853K6462L2343k8075j37058J1510j8941j1295J15390N180j26803K6900
1824G8466p8688J56708P1436k8471j60960J40941M170k18837j4171P1661Q5684
1813A07939K6153o2094k566J8378J03069N8846L4218k049O8608o6362J27958M9941
1801D62039M8108o8187j93695j6610k2339p5339M9816m1657J12905J41642j00321
1790B96362N8966j19619r7542p4037R7930R2980p4852j44545M3695P094r357K0975
1778I8050j2919J045k0563L4494j7886J6965p0305N7862L3849J531l6139l0211
1766E5773J12156p6649R987K2141j7217m6555j24424L2975P4108M8018q6894O5978
1754F9397J45302r7904o4368M7851J5355J4207r17K4968n1551k4356P4538n0133
$$ plain form
1835 182853 209315 241658 213583 76525 88035 69094 57799 173189 178369 51566 78466
1824 78466 -222 156486 227922 199451 38491 179432 183602 -35235 -49406 22255 107939
1813 107939 134092 71998 69432 87810 190879 249725 283943 281894 350502 284140 412098 462039
1801 462039 510147 441960 248265 231655 209316 133977 183793 142136 255041 396683 296362
1790 296362 355328 235709 138167 64130 162060 255040 180188 35643 79338 86432 77075 98050
1778 98050 85131 86176 65613 100107 82221 99186 28881 86743 120592 122123 85984 55773
1766 55773 167929 91280 101267 123408 106191 59636 -64788 -31813 42295 90313 3419 69397
1754 69397 214699 116795 52427 100278 115633 129840 128923 153891 102340 77984 152522 102389
1742A02389j881K6455l0347n4814q910K7745P5055L1405k5748j25665n13Q706
1730B3877j17122n7750P6349J0393K5075J70592Q600K9905p3642j8392K5056Q7903
1718A90844p1505q9632L2115j0523k8354k6987J7296j9574N2667p2869q438J4641
1706b0319l790r8422O1027R1870k7486q6662j4486J08630J24289j1336l4012J34284
1694B23587p3436j35586l6381j1451j0587L9028k1999N1109M1446L3097m5298
1683E3529r267Q9109q1425o8883K2293M9147J912L1958n5408l2699L2028n8633
1671b6339N2189R5536j52385l8289J5068j9253R729n177J0482J46981l8686O0233
1659A10089K1535o8920L2328k7714j02634m680M4752J5965O9776Q3323j42245
$$ plain form
1742 102389 100508 126963 96616 41802 32892 60637 135692 167097 141349 15684 15171 23877
1730 23877 -93245 -150995 -74646 -64253 -39178 131414 140014 169919 96277 77885 102941 190844
1718 190844 119339 29707 61822 51299 22945 -4042 13254 -6320 46347 -26522 -34960 -20319
1706 -20319 -24109 -122531 -61504 30366 2880 -83782 -98268 10362 134651 123315 89303 223587
1694 223587 150151 14565 -21816 -33267 -43854 -4826 -26825 24284 65730 98827 53529
1683 53529 44262 133371 51946 -16937 5356 54503 56415 88373 32965 266 32294 -26339
1671 -26339 25850 121386 -30999 -69288 -54220 -73473 -63744 -68921 -58439 88542 49856 110089
1659 110089 131624 62704 95032 67318 -35316 -39996 4756 20721 90497 173820 31575
1648C1575n8219p7643q3012O3055j7721R1702K2540j287j15061K0152R9149k481
1636b7251j0889O1701P9360q2930R1565j10466K7649J33445j33035n2920j8016
1625d1787K527L4250J5050j3932j13877O4321J20534o1300j0306O8882k8962j33377
1613i7977N5310M6378k3728O3713M3460q7256j09606R1902O5790p8607R1051p8879
1601a8449M6714q9427R4513L4073l5271p3403k495M0280m7583Q7514J43093J9246
1589A98805k06953L7350J173k8581n1047k8709l540K8394P921j08519J14769O4599
1577B5662k6160r3415L5383J8367Q0523P7875l6342Q1374r1457j00966J6077J16599
1565A03520j38497o604m8103K0505J38350o2116k8007m9754O2616K9166K6913
$$ plain form
1648 31575 -26644 -104287 -187299 -124244 -141965 -50263 -27723 -29010 -144071 -123919 -24770 -27251
1636 -27251 -38140 23561 102921 19991 111556 1090 28739 162184 29149 -23771 -41787
1625 -41787 -39260 -5010 10040 -3892 -117769 -53448 67086 5786 -4520 64362 35400 -97977
1613 -97977 -42667 3711 -20017 43696 87156 -100 -109706 -17804 47986 -30621 60430 -18449
1601 -18449 28265 -61162 33351 67424 32153 -41250 -43745 -3465 -51048 36466 179559 198805
1589 198805 -8148 29202 30375 1794 -49253 -77962 -81502 -53108 -45187 -153706 -38937 25662
1577 25662 -498 -93913 -58530 -40163 40360 118235 81893 163267 71810 -29156 -13079 103520
1565 103520 -34977 -41581 -89684 -69179 69171 7055 -20952 -70706 -8090 21076 47989
1554D7989j7212j4051N8734M5640j05039M3683L8395n9827j70046K8837J78318
1543G5421P2527o7090j04560l2240n361Q0348r790o1249Q4722o4109l3075N2002
1531a2454p2724L0883L2723o984L357k3745J1327P936p677q1557N4122O8088Q6158
1518H9453J09750o0067j562p6075r3212J4013J0446J0856r0912J29162K6371l7793
1506C0430R6720k00110j1764j2859L1606P0275l1861K1564n4976M6437k0417k6704
1494f1659J34060q0947P6753N986j6086k1473L0249K5062j1806j07132l7834Q5256
1482B0429L1816N6626k3768n6165K235q6815J26023L5491j3773r9743j8951j20852
1470a47447O417O2892J29737N1530j32092K885J21968o838J0158j0864J2023l881
$$ plain form
1554 47989 30777 16726 75460 121100 16061 59744 98139 38312 -131734 -102897 75421
1543 75421 147948 80858 -23702 -55942 -61303 19045 9255 -51994 32728 -31381 -64456 -12454
1531 -12454 -85178 -54295 -21572 -28556 -25199 -48944 -37617 -29681 -37358 -118915 -64793 3295 89453
1518 89453 199203 139136 137574 61499 -31713 -17700 -7254 3602 -87310 41852 68223 30430
1506 30430 127150 -72960 -84724 -97583 -65977 4298 -27563 -5999 -60975 -14538 -34955 -61659
1494 -61659 72401 -8546 68207 74193 58107 36634 66883 91945 80139 -26993 -64827 20429
1482 20429 52245 108871 85103 28938 31173 -55642 70381 105872 92099 -7644 -26595 -147447
1470 -147447 -141030 -78138 51599 103129 -28963 -26078 95890 89052 99210 88346 100369 96488
1458I6488j21045q0321J36914N0645m4969N3663n3352m6788K4580N8144j05984
1447c2025J7192j0182P2400N6573j2575q2455n0122J8028J6361q4676K04567o6618
1435D6468q8460r5127R4527M0745L611L6163L1827n506K7861r5085N7872J52455
1423B07351q2853M8916j16389r1604K8163o522k2988O8078P1027O813P9028J5091
1411B04111q9107j15128O5482M7752r4855J1943r962J40822m9015k0370M5895
1400A37568j03674o8805M8851p1578J08496j4265L0327K8378p7301r9789N1988
1389b9804J41091J7619J6424j12524m084k1577L4452M4835j4187o4982n4119q1087
1377a27943J13670J54644N9841j90587M643P1304k0658O4131l9509o4728K2062
$$ plain form
1458 96488 -24557 -104878 32036 82681 37712 91375 38023 -8765 15815 73959 -32025
1447 -32025 -14833 -25015 47385 103958 91383 8928 -41194 -23166 -6805 -91481 113086 46468
1435 46468 -41992 -137119 -42592 -1847 1764 37927 69754 64248 92109 -2976 54896 207351
1423 207351 124498 173414 57025 -34579 -6416 -12938 -35926 32152 103179 109992 189020 204111
1411 204111 115004 -124 65358 113110 18255 30198 20236 161058 112043 91673 137568
1400 137568 33894 -34911 13940 -57638 50858 36593 66920 95298 17997 -81792 -29804
1389 -29804 111287 128906 145330 32806 28722 7145 41597 86432 72245 7263 -46856 -127943
1377 -127943 -14273 140371 200212 9625 14268 85572 64914 129045 89536 24808 46870
1366D6870o5046J0912Q7811p0468l3931J375L9747k7805p1031R5496P2345p5570
1354A0705M5926N3903q7939j44054k2251O4392j780J20638N238r6499M2059M4359
1342C4697O662o8536O3043q4334l3844P860m1511O6540J58540m4874j01840Q802
1330b8795q388L4862p2782o631J02744k2528m5290P2495P282L1200M833J5849
1318H4851j9885K1996p3607r8380Q9774n5101o3385k8449m0301J28209N6591n9827
1306e7514L8478M2785j22534N0661P9552m8902q545N2687K6959J2774p3360l1221
1294c8180J4469J3116N4544j01587M2964M135j49354O9435N0457o758n7514l2076
1282a36349J6769R2057j05312M2076L3589k588J13603m0525j16708L2831K3378
$$ plain form
1366 46870 -18176 -7264 80547 10079 -23852 -22477 17270 -10535 -81566 13930 86275 10705
1354 10705 56631 110534 22595 -121459 -143710 -79318 -81098 39540 44778 -51721 -9662 34697
1342 34697 41359 -27177 35866 -48468 -82312 -74452 -115963 -49423 109117 64243 -37597 -28795
1330 -28795 -37183 -2321 -75103 -81734 21010 -1518 -46808 25687 32969 64169 69002 84851
1318 84851 64966 86962 13355 -85025 4749 -50352 -113737 -142186 -182487 -54278 2313 -57514
1306 -57514 -19036 23749 -98785 -48124 31428 -17474 -26019 26668 53627 66401 -6959 -38180
1294 -38180 -23711 -10595 43949 -57638 -14674 -10539 -159893 -90458 -40001 -46759 -104273 -136349
1282 -136349 -119580 -27523 -132835 -90759 -57170 -59758 53845 13320 -103388 -70557 -47179
1271d7179m3576R4540l5316M3750o858j16521j20573J68286K9404p3826Q3965
1260b3904J21680p2899l5909j7246P7464k3851k013m8669j5439J34132q5297o7979
1248e9930R3813K1191k5149r5672l1068J6696M5107K4961J2946O1497j01097m0551
1236g7256L8760o873P2202Q642p3043n4189N3276n5944P5319k345k8660j0605
1224f0716k0181J05917J3928j0257m9445J6125J08429m6170k0723O7567m9531
1213E4943m1101k7818l3034J30282m496q7038m3538Q0235m6685Q3054j4633n3108
1201b937k5048l826J46375l1701p1866N6073J27171j57871m2089J6555q861N5483
1189E7458M6538m8208M0639j11340Q2524q1074K0325m7820n7551L6275l0163j7600
$$ plain form
1271 -47179 -90755 3785 -31531 12219 5361 -111160 -231733 -63447 -34043 -107869 -23904
1260 -23904 97776 24877 -11032 -28278 49186 25335 23322 -25347 -40786 93346 8049 -59930
1248 -59930 33883 55074 29925 -65747 -96815 -80119 -35012 -10051 2895 64392 -36705 -77256
1236 -77256 -38496 -45369 26833 35475 -37568 -91757 -38481 -94425 -19106 -21451 -50111 -60716
1224 -60716 -80897 25020 38948 28691 -20754 -4629 103800 57630 36907 104474 54943
1213 54943 13842 -13976 -47010 83272 78776 -8262 -51800 28435 -18250 64804 50171 -2937
1201 -2937 -27985 -31811 114564 82863 10997 67070 194241 36370 -5719 10836 1975 57458
1189 57458 103996 55788 96427 -14913 67611 -13463 6862 -40958 -98509 -62234 -92397 -109997
1177a09997J00045N6244j2805j5773N102J25425m1432r3954r366J133J41389L343
1165A49354j9966r8843J9259n8551N772Q243l9341q6349J25278K8003j3550k039
1153A7270n0658N0908p319R786L5174m2600o1121J0159M6865Q9817j60166J76778
1141A14893q4810m3539K0425K8104l3625j06779o2563J28973Q0538k4490j9243
1130b116r5485O7166K0550M7768r1148L7225j4987l3024L2765R5936L0210n7856
1118C7004r2453m467n8786Q3118J80447l1000j17236L7954J8708j35319R837Q8347
1106A6154Q7351k27q9909l3837l793n5394K6456J3679m10L9354k614r6543Q3108
1093a6625N49j34556m7632M3994L4303R8055m4441L4679p7913M0943r6139N87
$$ plain form
1177 -109997 -9952 46292 33487 17714 22816 148241 106809 12855 3489 4622 146011 149354
1165 149354 129388 30545 49804 -8747 -2975 5268 -34073 -120422 4856 32859 19309 17270
1153 17270 -33388 17520 10201 19987 55161 12561 -48560 -38401 8464 98281 -61885 114893
1141 114893 30083 -13456 6969 35073 1448 -105331 -167894 -38921 41617 17127 -2116
1130 -2116 -97601 -30435 -9885 37883 -53265 -16040 -31027 -64051 -31286 64650 94860 37004
1118 37004 -55449 -59916 -118702 -35584 144863 113863 -3373 34581 53289 -82030 -72193 16154
1106 16154 103505 103278 13369 -20468 -24261 -79655 -53199 -39520 -39930 -576 -3190 -99733 -16625
1093 -16625 -16076 -150632 -198264 -154270 -119967 -21912 -66353 -31674 -109587 -68644 -164783 -164196
1081a64196Q4694L4590R5221n3997r4390Q3493M3439L3124n6523k567n0729O6492
1069A8651K2733o5223o0179m6246P5815M0116L5721j48150J33493K3733o4468
1058c4004m9116M3882J953j15130J74990Q2020q8810k349o2412M934k7885J9279
1046e2648O1562L8204Q3373k9152R1033q7863o4646O018p2133M6232j8413r0676
1034h9109q8273Q6048J2653J14584L6062k35747K1044j2924N8542J07391P3795
1023H4066q3271M0896L3378j58757R7888k8504r9242J19780N3028N6090n9599
1012E5753j66133n8157R7161R0561j57517J27131M9620j14889j04363Q5833M0883
1001e4117j11485J48096O6639r2490O0418m5634L3522N8977p2828o2417R6473
$$ plain form
1081 -164196 -79502 -44912 50309 -3688 -98078 -14585 28854 61978 5455 2888 -47841 18651
1069 18651 41384 -23839 -84018 -130264 -54449 -14333 21388 -126762 6731 30464 -34004
1058 -34004 -83120 -39238 -37285 -152415 22575 104595 15785 13436 -48976 -44042 -71927 -52648
1046 -52648 8914 47118 130491 101339 192372 104509 39863 45881 -26252 19980 1567 -89109
1034 -89109 -177382 -91334 -78681 35903 71965 -163782 -142738 -155662 -97120 10271 84066
1023 84066 795 41691 75069 -83688 14200 -14304 -113546 6234 59262 115352 55753
1012 55753 -110380 -168537 -71376 19185 -138332 -11201 38419 -76470 -180833 -95000 -54117
1001 -54117 -165602 -17506 49133 -43357 17061 -28573 4949 63926 -8902 -71319 25154
990B5154j2478p2874o2514R5390j7255q012K4021L8377o3422o3140J02548j9310
978c3515O0767j8617r0982K8144O074p8665N057J06185J09896q2149r9463l7651
966a24919L7595J8825J0423J7326N5625l7838j13891n6103J03818K5111M852J06957
954D7781j16416M7240K0858m9658L2041k0010N1080M8260n6670N799j8845L9712
942C1172M4628l1252P6950j23249m6037k6938k5171M0522M2689l1635j28239J46607
930b9953J502r6335J22230P4278r365Q8873p5492l0887n4093k8012r5012N8615
918g3651M2293r0881J5114K4653J25215q1167j41737R6331J51706j15796m4769
907i2689k8219k742J883J37149J6103n1885M9625m3418r7177P4972K1087p6184
$$ plain form
990 25154 12676 -60198 -122712 -27322 -44577 -52589 -28568 9809 -53613 -116753 -14205 -33515
978 -33515 27252 8635 -82347 -54203 -48129 -126794 -121737 -15552 94344 12195 -87268 -124919
966 -124919 -87324 -68499 -58076 -40750 14875 -22963 -136854 -192957 -89139 -64028 -59176 47781
954 47781 -68635 -21395 -537 -50195 -18154 -38164 12916 61176 4506 10305 -8540 31172
942 31172 75800 44548 121498 -1751 -47788 -74726 -99897 -59375 -16686 -48321 -176560 -29953
930 -29953 -28451 -124786 -2556 71722 62357 151230 75738 44851 -9242 -37254 -132266 -73651
918 -73651 -31358 -122239 -107125 -82472 42743 -38424 -180161 -83830 67876 -47920 -92689
907 -92689 -120908 -123650 -121767 15382 31485 -20400 29225 -14193 -111370 -36398 -15311 -91495
895i1495O8220L7273k775m6658K9220K131K1177p3282k2668O9882m1974L6101
883a4848J1502k9255R6662L5597j41807o562L6943n7745j1386Q128K4413J29701
871H1343o3284j28830P7866n8688Q246K17184p1536p939j6686r4025K6983k0357
859d9723P1458l0810J6594K8161q5808m3585P4263k0316p3539J08346K1611q4116
847f7464l93R2332N1877o8779j9193J584p7427p235O3411J27166k6843k9401r2944
834e3309P825K5933m8140k6026J3503n919P8314r4063o0536P2047K5733L2337
822c2301q404k1619K7622O3009k1822R7081m164k6904m1304n6392K9236P9747
810H3785j6576j8888j19484P3976O1572j795J8053j50169J21515l9488n9051J32085
$$ plain form
895 -91495 -23275 13998 11223 -35435 -6215 -4084 17093 -56189 -78857 -8975 -50949 -14848
883 -14848 -3346 -32601 64061 99658 -42149 -48711 -11768 -69513 -80899 -72771 -48358 81343
871 81343 18059 -110771 -32905 -91593 -83347 133837 62301 54362 37676 -56349 -29366 -49723
859 -49723 21735 -9075 7519 35680 -50128 -93713 -19450 -39766 -113305 -4959 16652 -67464
847 -67464 -67857 24475 76352 7573 -11620 -10036 -87463 -94698 -31287 95879 69036 39635 -53309
834 -53309 -45484 -19551 -67691 -93717 -80214 -86133 -7819 -101882 -162418 -90371 -64638 -32301
822 -32301 -40705 -62324 -34702 28307 6485 103566 99402 72498 31194 -25198 4038 83785
810 83785 67209 48321 -71163 2813 64385 62590 80643 -69526 51989 12501 -46550 85535
798H5535o8454j30045R6089q943K1076o2200l9952P5636K2374n7993p8317K2249
786a22945J9130M1366P5787N3697J7612j09206n5985P2646j29694R7034J8957
775b1601l0804M9312N2135j18226J7991R3092J0016j3434N2338q1104k01791J46100
763d5976l2978k342Q4383L437K7883l7037q3335l6513J8223J1929M2201N5295
751E170J4021k658J114j28576O5059Q5695k2260j3470l5211J0520K2852M3368
739D5624l3119m7500L0826l0686m742J9850K3949q079M0922o0114J49478J5546
727A41955j47578P828k8980K1727j9905N8465p7473r4211K10084N6703n1498j1135
715F5982j52267m0102O7368J48290p712l8527O1101l5279o4267m0625J41215j5000
$$ plain form
798 85535 17081 -112964 -16875 -25818 -4742 -66942 -106894 -31258 -8884 -66877 -145194 -122945
786 -122945 -103815 -62449 13338 67035 84647 -24559 -80544 -7898 -137592 -40558 -21601
775 -21601 -52405 -3093 49042 -69184 -51193 41899 51915 38481 90819 9715 -192076 -45976
763 -45976 -78954 -81296 3087 6524 34407 -2630 -85965 -122478 -104255 -92326 -50125 5170
751 5170 19191 16533 17647 -110929 -45870 39825 17565 4095 -31116 -20596 2256 45624
739 45624 12505 -34995 -4169 -34855 -39597 -19747 4202 -3877 37045 -23069 126409 141955
727 141955 -5623 2205 -26775 -5048 -24953 33512 -43961 -138172 71912 128615 77117 65982
715 65982 -86285 -126387 -59019 89271 81559 43032 104133 68854 4587 -36038 105177 90177
703I0177j75103p423L0053j573Q0724n0462q1804P5682L1482j04294j8045P9256
691e1330J2674Q8867q3436m1306J4305R5730k9191o9332Q8596M1647K1294r9795
679a1277m3106M5504L4142o2243O4077j16828k9966M3135K6415J50861n5347N385
667E0752q7232N6953O0167p9555M766N5905J446L343l2277p0767j70957L1175
655a76281J12918N9081M7154j31742r2912J43026K292n7915r3739O9390m3410
644a62138L8953J22570q4354Q4685j51971P3527M9793m6887j7612j9295K6122
633h6607l8539p0490J42273q0953l447M9591M3782O6390j28105Q598P5911N1331
621B9735r2272J2978N0164K1896j03836Q8365n582R5521J7417j81253N1819P5293
$$ plain form
703 90177 -84926 -92349 -62296 -63869 16855 -33607 -115411 -39729 -8247 -112541 -130586 -51330
691 -51330 -38656 50211 -33225 -74531 -60226 35504 6313 -63019 25577 67224 88518 -11277
679 -11277 -54383 -8879 25263 -36980 27097 -89731 -119697 -76562 -50147 100714 45367 50752
667 50752 -36480 20473 80640 1085 5851 61756 63202 66545 34268 -36499 -207456 -176281
655 -176281 -63363 -4282 42872 -88870 -181782 -38756 -36464 -94379 -188118 -118728 -162138
644 -162138 -123185 -615 -84969 -284 -152255 -78728 -28935 -75822 -93434 -112729 -86607
633 -86607 -125146 -195636 -53363 -134316 -137763 -88172 -44390 22000 -106105 -97507 -21596 29735
621 29735 -62537 -49559 605 22501 -81335 7030 1448 96969 114386 -66867 -15048 60245
609F0245m9484k8323m7413J11431j5807l1774J5586r9326J5494k4476m483L8060
597f0270O7060m7029K5846l2293Q217j1486l7311n7243K5398J55989L4839L0710
585A02427n3053J4471j9887j9301M4561j7770m515m4916m2479L5919J03592r9900
573h51k5750O8262r9576L5915J25930k3034n9172o4130q4518K7155R3117N0885
561D4233p5151m8221J02304k6613j5675R5805o1768j9616J35008o3648k9696o7370
549c0408J4564K1671k8213Q204M3336n6136j6863j472k5561J94511j10778j48573
537a35718J42149n0009j03541P6803J05217L4475j7930k0739R0179j22523j71737
526a73374Q1252q1272P5154N086M1635J81271j7965q8181j15969j9623Q2969N158
$$ plain form
609 60245 10761 -17562 -64975 46456 30649 -1125 14461 -84865 -69371 -93847 -98330 -60270
597 -60270 6790 -40239 -14393 -46686 -38469 -49955 -87266 -144509 -119111 36878 71717 102427
585 102427 49374 63845 43958 24657 69218 51448 46933 2017 -40462 -4543 99049 -851
573 -851 -26601 41661 -57915 -22000 103930 80896 21724 -42406 -126924 -99769 -6652 44233
561 44233 -30918 -79139 23165 -3448 -19123 76682 14914 -4702 130306 66658 36962 -30408
549 -30408 -15844 5827 -22386 -14182 29154 -26982 -43845 -45317 -70878 123633 12855 -135718
537 -135718 6431 -43578 -147119 -70316 34901 69376 51446 30707 120886 -1637 -173374
526 -173374 -92122 -173394 -98240 -93154 -51519 129752 111787 23606 -92363 -111986 -29017 -23859
514b3859P7307j5886K6985m9292j15761r969P73p7422J44610J32718l6682o3771
502a0249J665J4873O782K6359J5444J42332j5989j07881n9781K2139l675O8917
490A00936q7964q4125j3473K5597L8942J05809l436j03328k5863J52521J18727
479B24343j18620r1507k4018r3343J8879J8787N5999j4195l7399o1819k0756Q2009
467f1640L4522n2777l6054N3315l5375R5581r8842K8026M8195M3224l4453J13457
455I7179j18119J7174K4059n3170Q2397j22604J5122Q694M5824P6058K3571l6328
443E9857l8253j43639K8032J1678N9733k9551N5943N6788q036l0670l491m1336
431b2945q8469n3159N4069O1492j6432L3397j0962Q65n042j00623P9596J4563
$$ plain form
514 -23859 53448 37562 64547 15255 -100506 -110475 -109702 -187124 -42514 90204 53522 -10249
502 -10249 -8584 6289 13071 39430 54874 197206 181217 73336 13555 35694 32019 100936
490 100936 12972 -71153 -84626 -59029 -20087 85722 82286 -21042 -46905 105616 224343
479 224343 105723 14216 -9802 -103145 -84266 -65479 -9480 -23675 -61074 -122893 -143649 -61640
467 -61640 -27118 -79895 -115949 -62634 -98009 -2428 -101270 -73244 -25049 18175 -16278 97179
455 97179 -20940 -3766 20293 -32877 49520 -73084 -57962 -49268 -3444 72614 96185 59857
443 59857 21604 -122035 -94003 -82325 -22592 -52143 3800 60588 52552 21882 18391 -22945
431 -22945 -111414 -164573 -110504 -49012 -65444 -32047 -43009 -42144 -47186 -147809 -68213 -53650
419e3650N1262J19498m2737n7444N4002j01976J02166r293p1789q9862J73522
408G3699p5278p8130P342o0014P9124L2562J68196n1967M097J2169M6220l5339
$$ plain form
419 -53650 -2388 117110 74373 16929 70931 -31045 71121 61828 -9961 -99823 73699
408 73699 -1579 -79709 -72367 -132381 -53257 -20695 147501 95534 99631 111800 158020 122681
$$ [...]
##END NTUPLES=NMR SPECTRUM
##END=
