##TITLE=1H_CG-1151-A2
 CDCl3, 8 sc, 
 26.08.2021
##JCAMPDX= 6.0         $$ Bruker NMR JCAMP-DX V2.0
##DATA TYPE= NMR SPECTRUM
##DATA CLASS= NTUPLES
##ORIGIN= UXNMR, Bruker Analytische Messtechnik GmbH
##OWNER= root
$$ XWIN-NMR		Version 3.5
$$ Thu Aug 26 09:11:52 2021 Russian Standard Time (UT+4h)  she@DPX200
##.OBSERVE FREQUENCY= 200.131506
##.OBSERVE NUCLEUS= ^1H
##.ACQUISITION MODE= SIMULTANEOUS
##.ACQUISITION SCHEME= undefined
##.AVERAGES= 8
##.DIGITISER RES= 18
##SPECTROMETER/DATA SYSTEM= spect
##.PULSE SEQUENCE= zg30
##.SOLVENT NAME= CDCl3
##.SHIFT REFERENCE= (INTERNAL, CDCl3, 0, 17.5252)
##AUDIT TRAIL= $$ (NUMBER, WHEN, WHO, WHERE, WHAT)
$$ ##TITLE= Audit trail, XWIN-NMR		Version 3.5
$$ ##JCAMPDX= 5.01
$$ ##ORIGIN= Bruker BioSpin GmbH
$$ ##OWNER= she
$$ F:/spectra/data/she/nmr/H-F/1/pdata/1/auditp.txt
$$ ##AUDIT TRAIL=  $$ (NUMBER, WHEN, WHO, WHERE, WHAT)
(   1,<2021-08-26 09:10:38.12 +0400>,<she>,<DPX200>,
      <created by zg, POWCHK disabled, PULCHK disabled
       configuration hash MD5:
       00 E9 B6 7A A2 85 ED C7 34 08 36 98 17 FE 4E 26
       data hash MD5: 16K
       14 B2 9C C6 34 57 18 CC CC A8 1C 93 0E 84 3B EE>)
(   2,<2021-08-26 09:10:40.67 +0400>,<she>,<DPX200>,
      <Start of raw data processing
       efp BC_mod = 2 LB = 0.24 FT_mod = 6 PKNL = 1 PHC0 = -13354.09 PHC1 = 10.40099 SI = 16K 
       data hash MD5: 16K
       37 69 C1 2D 14 32 E3 D9 7A 13 68 96 53 9D CA 8F>)
(   3,<2021-08-26 09:11:01.43 +0400>,<she>,<DPX200>,
      <pk PHC0 = -3.732937 PHC1 = 3.6 
       data hash MD5: 16K
       D3 BE 86 0D 3D 46 50 81 9B 2D D8 D3 C3 EB AC 64>)
(   4,<2021-08-26 09:11:04.75 +0400>,<she>,<DPX200>,
      <abs ABSG = 5 
       data hash MD5: 16K
       5C 79 72 0F AB 6D 8E 8B 4C 9F CB B1 18 69 5F 60>)
$$ ##END=
$$ 
$$ hash MD5
$$ 9E 2E 79 63 51 D3 78 9F 25 B5 29 C5 F0 95 F1 B8
##$RELAX= 
##$RELAX= 
##$RELAX= 
##$RELAX= 
##$RELAX= 
##$RELAX= 
$$ Bruker specific parameters
$$ --------------------------
##$DU= <F:/spectra>
##$EXPNO= 1
##$NAME= <H-F>
##$PROCNO= 1
##$TYPE= <nmr>
##$USER= <she>
##$AMP= (0..31)
100 100 100 100 100 100 100 100 100 100 100 100 100 100 100 100 100 100 
100 100 100 100 100 100 100 100 100 100 100 100 100 100 
##$AQSEQ= 0
##$AQ_mod= 1
##$AUNM= <au_zg>
##$AUTOPOS= <>
##$BF1= 200.13
##$BF2= 200.13
##$BF3= 200.13
##$BF4= 200.13
##$BF5= 200.13
##$BF6= 200.13
##$BF7= 200.13
##$BF8= 200.13
##$BYTORDA= 1
##$CFDGTYP= 0
##$CFRGTYP= 5
##$CHEMSTR= <none>
##$CNST= (0..31)
1 1 145 1 1 1 1 1 1 1 1 1 1 1 1 1 1 1 1 1 1 1 1 1 1 1 1 1 1 1 1 1 
##$CPDPRG= <>
##$CPDPRG1= <>
##$CPDPRG2= <>
##$CPDPRG3= <>
##$CPDPRG4= <mlev>
##$CPDPRG5= <mlev>
##$CPDPRG6= <mlev>
##$CPDPRG7= <mlev>
##$CPDPRG8= <mlev>
##$CPDPRGB= <>
##$CPDPRGT= <>
##$D= (0..31)
0 1.2 0 0 0 0 0 0 0 0.06 0 0.03 0 0 0 0 0.0002 0 0 0 0 0 0 0 0 0 0 0 0 
0 0 0 
##$DATE= 1629954637
##$DBL= (0..7)
120 120 120 120 120 120 120 120 
##$DBP= (0..7)
150 150 150 150 150 150 150 150 
##$DBP07= 0
##$DBPNAM0= <>
##$DBPNAM1= <>
##$DBPNAM2= <>
##$DBPNAM3= <>
##$DBPNAM4= <>
$$ [...]
##$SUBNAM3= <"">
##$SUBNAM4= <"">
##$SUBNAM5= <"">
##$SUBNAM6= <"">
##$SUBNAM7= <"">
##$SUBNAM8= <"">
##$SUBNAM9= <"">
##$SW= 20.0188882624521
##$SWIBOX= (0..15)
0 0 2 0 0 0 0 0 0 0 0 0 0 0 0 0 
##$SW_h= 4006.41025641026
##$TD= 16384
##$TD0= 1
##$TE= 0
##$TE2= 300
##$TE3= 300
##$TEG= 300
##$TL= (0..7)
0 120 120 120 120 120 120 120 
##$TP= (0..7)
150 150 150 150 150 150 150 150 
##$TP07= 0
##$TPNAME0= <>
##$TPNAME1= <>
##$TPNAME2= <>
##$TPNAME3= <>
##$TPNAME4= <>
##$TPNAME5= <>
##$TPNAME6= <>
##$TPNAME7= <>
##$TPOAL= (0..7)
0.5 0.5 0.5 0.5 0.5 0.5 0.5 0.5 
##$TPOFFS= (0..7)
0 0 0 0 0 0 0 0 
##$TUNHIN= 0
##$TUNHOUT= 0
##$TUNXOUT= 0
##$USERA1= <user>
##$USERA2= <user>
##$USERA3= <user>
##$USERA4= <user>
##$USERA5= <user>
##$V9= 5
##$VALIST= <valist>
##$VCLIST= <CCCCCCCCCCCCCCC>
##$VD= 0
##$VDLIST= <DDDDDDDDDDDDDDD>
##$VPLIST= <PPPPPPPPPPPPPPP>
##$VTLIST= <TTTTTTTTTTTTTTT>
##$WBST= 1024
##$WBSW= 4
##$XGAIN= (0..3)
0 0 0 0 
##$XL= 0
##$YL= 0
##$YMAX_a= 408582
##$YMIN_a= -546677
##$ZGOPTNS= <>
##$ZL1= 120
##$ZL2= 120
##$ZL3= 120
##$ZL4= 120
##$ABSF1= 17.48734
##$ABSF2= -2.531696
##$ABSG= 5
##$ABSL= 3
##$ALPHA= 0
##$AQORDER= 0
##$ASSFAC= 0
##$ASSFACI= 0
##$ASSFACX= 0
##$ASSWID= 0
##$AUNMP= <proc_1d>
##$AZFE= 0.1
##$AZFW= 0.1
##$BCFW= 0
##$BC_mod= 2
##$BYTORDP= 0
##$COROFFS= 0
##$CY= -3
##$DATMOD= 1
##$DC= 0
##$DFILT= <>
##$DTYPP= 0
##$F1P= 0
##$F2P= 0
##$FCOR= 1
##$FTSIZE= 16384
##$FT_mod= 6
##$GAMMA= 0
##$GB= 0
##$INTBC= 1
##$INTSCL= 1.334414e-10
##$ISEN= 128
##$LB= 0.24
##$LEV0= 0
##$LPBIN= 0
##$MAXI= 10000
##$MC2= 0
##$MEAN= 0
##$ME_mod= 0
##$MI= 1.114404
##$NCOEF= 0
##$NC_proc= -7
##$NLEV= 6
##$NOISF1= 3.799351
##$NOISF2= 2.8
##$NSP= 0
##$NTH_PI= 0
##$NZP= 0
##$OFFSET= 17.52521
##$PC= 1
##$PHC0= -13357.82
##$PHC1= 14.00099
##$PH_mod= 1
##$PKNL= yes
##$PPARMOD= 0
##$PSCAL= 0
##$PSIGN= 0
##$REVERSE= no
##$SF= 200.130001885283
##$SI= 16384
##$SIGF1= 3
##$SIGF2= 2
##$SINO= 5.538805
##$SIOLD= 16384
##$SREGLST= <1H.CDCl3>
##$SSB= 0
##$STSI= 16384
##$STSR= 0
##$SW_p= 4006.41025641026
##$SYMM= 0
##$S_DEV= 0
##$TDeff= 16384
##$TDoff= 0
##$TI= <>
##$TILT= no
##$TM1= 0
##$TM2= 0
##$TOPLEV= 0
##$USERP1= <user>
##$USERP2= <user>
##$USERP3= <user>
##$USERP4= <user>
##$USERP5= <user>
##$WDW= 1
##$XDIM= 16384
##$YMAX_p= 445055695
##$YMIN_p= -554400
$$ End of Bruker specific parameters
$$ ---------------------------------
##NTUPLES= NMR SPECTRUM
##VAR_NAME=  FREQUENCY,     SPECTRUM/REAL,   SPECTRUM/IMAG
##SYMBOL=    X,             R,               I
##VAR_TYPE=  INDEPENDENT,   DEPENDENT,       DEPENDENT
##VAR_FORM=  AFFN,          ASDF,            ASDF
##VAR_DIM=   16384,         16384,           16384
##UNITS=     HZ,            ARBITRARY UNITS, ARBITRARY UNITS
##FACTOR=    0.24454680195387, 1,            1
##FIRST=     3507.32019564145, 0,            0
##LAST=      -499.09006076881, 0,            0
##MIN=       -499.09006076881, -554400,      0
##MAX=       3507.32019564145, 445055695,    0
$$ Real data points
##PAGE= N=1
##DATA TABLE= (X++(R..R)), XYDATA
$$ [...]
7397E373K87016M2618k49807j38621m6887K62046L3475k31570J95329O3191k43792
7386b1629J33141l467p9819k2607p9582k20578J29944N9228J87355j14765M4384
7375A1605m4707p8161j03209j28990K2664K94034J89500p1290k8573k4066J07807
7364A46614o9626m2436r2587J51154m5190L3081M3388j38266l8299r8906J82274
7353C1201J71742j81034J2545J48614r6548j29850m6243O5015k36135J0118J07371
7342a43204k6990K12716l0724J00088r6664k8829Q7348J48338j72347n5415j19429
7331a25112K56965k3619J63906j34303j13945R0551P9651J41286j24559j06768
7321A04053j66237k6812K63668P4111j28278k26741l3734K28674L9428k08030
$$ plain form
7397 5373 292389 335007 85200 -53421 -100308 161738 195213 -36357 158972 222163 -21629
7386 -21629 111512 108045 28226 5619 -73963 -294541 -164597 -105369 81986 -32779 11605
7375 11605 -33102 -111263 -214472 -343462 -320798 -26764 162736 91446 62873 38807 146614
7364 146614 76988 34552 -58035 93119 47929 81010 124398 -13868 -52167 -151073 31201
7353 31201 202943 21909 34454 183068 86520 -43330 -89573 -24558 -260693 -250575 -143204
7342 -143204 -170194 42522 11798 111886 15222 -13607 73741 222079 49732 -5683 -125112
7331 -125112 131853 108234 272140 137837 23892 114443 194094 335380 210821 104053
7321 104053 -62184 -88996 174672 248783 120505 -106236 -139970 88704 128132 -79898
7311g9898J14375J21491j55420J0882j85861L3416J58834J29665j75904J08146
7301G9726k17901K2937O7228N7090j88777J21349K96803k19370j69781j4492M5275
7290a19913J41236J41007n1832N0712k01687M8066K5775k46683J54622J26922
7280F8225q9228K21517o1582k45355K82270l474j52779J42898P9885j77035K6016
7269I1358K76653k35928k67682J04997L92574R7936k33368J15356k09011R9412
7259B32297j3851q485M1837K9785j4438k76932J93610n6052J35490K61570j39779
7248C85052j19627K07623J31056j46686j21881j93869j14712J66929K5312N3655
7238B72852K624n5656k7009l31378J20138N2159K02493j2494j5932Q9765k60879
$$ plain form
7311 -79898 34477 155968 548 11430 -174431 -141015 17819 147484 -28420 79726
7301 79726 -138175 -115238 -48010 9080 -179697 -58348 238455 19085 -150696 -165188 -119913
7290 -119913 21323 162330 110498 161210 -40477 7589 33364 -213319 -58697 68225
7280 68225 -21003 200514 138932 -106423 175847 172373 19594 162492 242377 65342 91358
7269 91358 368011 132083 -135599 -30602 361972 459908 226540 341896 132885 232297
7259 232297 218446 209961 251798 281583 267145 -9787 183823 127771 263261 524831 385052
7248 385052 265425 473048 604104 457418 335537 141668 26956 193885 219197 272852
7238 272852 275476 219820 192811 -138567 -18429 33730 236223 223729 207797 297562 36683
7227C6683m6404J98136k7968J66690l6893j29999o9347O4229K12255p7868j54344
7216A35170J1167K15364p0602j31999p9264J07169O8130j24007J15711K83296
7206E30135k85708j6935j21852J08883J58957K5188M1419j65520J80978j32162
7196C23383o2155r0413L1809J52682l3710L849j48325J93347J35125k42026R0481
7185C54047j16597n7274M2525P158j90343n0462K72107K2994J31199j41386J23045
7174C97013k6295J45585p5721n4993P6436K2274k645K68640R8820Q6971O5348
7163A001433j43757J1466J46571K89988J74470L5987J97116K9435j45794O3172
7153A660087N2558J7520k95511j2565L01110j05084p9247k49055j35098p4112
$$ plain form
7227 36683 -9721 188415 160447 327137 290244 160245 90898 155127 367382 289514 135170
7216 135170 146337 361701 291099 159100 79836 187005 255135 131128 246839 530135
7206 530135 244427 227492 105640 214523 373480 398668 440087 274567 455545 323383
7196 323383 261228 170815 202624 355306 321596 325445 177120 370467 505592 263566 354047
7185 354047 237450 180176 222701 229859 39516 -10946 261161 284155 415354 273968 397013
7174 397013 370718 516303 440582 385589 462025 484299 481654 750294 849114 936085 1001433
7163 1001433 857676 869142 1015713 1305701 1480171 1516158 1713274 1742709 1596915 1660087
7153 1660087 1712645 1730165 1434654 1422089 1723199 1618115 1538868 1289813 1154715 1080603
7143A080603m5273M6469j78336k74457K18246O7964q2508k55680J37393K0545
7133G34966n485L3055j33043J14888j71915q1529K8359P7214M2254R4303j35664
7122E97403p4196j84847J26468J47866L6702q4244k2122p1649J73642K25368O69
7111H71060j61915j06233O6687q7698K27196J90944n4921o9093k25740M80200
7101A130487J50638J69023J01387J21257K25198J58604J02239K30739K39069K22537
7091B851178L90118K84229L88444M49088N4205l56859q1119J0380k10303J55868
7081C935229l5312k5375L0737l54497m86052m80009m23663j12095j04735k24534
7071A719694k97643o3874J37448K418k1629Q2871p3415r4400J02651p0930J73358
$$ plain form
7143 1080603 1035330 1081799 903463 629006 847252 915216 832708 577028 714421 734966
7133 734966 729481 762536 629493 744381 572466 490937 519296 596510 638764 733067 597403
7122 597403 523207 338360 464828 612694 649396 565152 543030 471381 645023 870391 871060
7111 871060 709145 602912 669599 581901 809097 1000041 945120 876027 650287 1130487
7101 1130487 1281125 1450148 1551535 1672792 1897990 2056594 2158833 2389572 2628641 2851178
7091 2851178 3241296 3525525 3913969 4363057 4417262 4060403 3979284 3989664 3779361 3935229
7081 3935229 3899917 3874542 3905279 3550782 3064730 2584721 2161058 2048963 1944228 1719694
7071 1719694 1422051 1358177 1495625 1498043 1476414 1559285 1485870 1391470 1494121 1423191 1596549
7060A596549j55637o0222j98041k8895K87866r6277j66304P7181K86427J023K13987
7049A757657j36759k89942j8463j86471J17530j66837R4250j87383J32128m3439
7039A072271K11796K6926j20744J41157j56711J69466K07787k1266K0854K26977
7029A778513m2177J72750M3339K75157L06301J90711L10453L43963P3420M43018
7019C895448K37534l27910l93827n06024k98241j3532j09407J11373J96435k34402
7009B557447k3464K86351j4504j24164P0222P4710P9389k06627R5196K04027N6016
6998C054599R8536Q6856j20854M6604j4443j4891K98820j76090K67038r2602k0714
6987C412859K66653L8366K87714J44272P8585K81569N04598N43271J00291k85906
$$ plain form
7060 1596549 1440912 1380690 1182649 1153754 1441620 1345343 1179039 1256220 1542647 1543670 1757657
7049 1757657 1620898 1330956 1312493 1126022 1243552 1076715 1170965 983582 1115710 1072271
7039 1072271 1284067 1310993 1190249 1331406 1174695 1344161 1551948 1530682 1551536 1778513
7029 1778513 1736336 1909086 1952425 2227582 2533883 2724594 3035047 3379010 3452430 3895448
7019 3895448 4132982 3805072 3411245 2905221 2606980 2593448 2484041 2595414 2791849 2557447
7009 2557447 2533983 2820334 2805830 2681666 2751888 2826598 2905987 2699360 2794556 2998583 3054599
6998 3054599 3153135 3239991 3119137 3165741 3151298 3136407 3435227 3259137 3526175 3433573 3412859
6987 3412859 3679512 3717878 4005592 4149864 4228449 4510018 5014616 5557887 5658178 5372272
6977E372272p86835p35627k25884m74674j31057J87526m3651K6112l61528k7697
6967B798957p3301l7246j16246j48489J2516m60431J28911j55237J4990J77422
6957B141846K07054m4138j87869K20221J59944K4028j07080q4141L8925k63326
6947B105464j60142O9271N3327l34322k11611J8817J48125j00951p4224j77541
6937A336213o0500j5785P9896m4090j4589K78248K323j09569P9540K21706j0498
6926A742895j69396L5533j32937j45191Q2265J5753n1945J00940K63525m4737
6916A696705R234N8426J58235K04389L7589n4650Q9697J93866J9859n14954l46407
6905A551989J6411l3281l9607q1795m8620j5076K57010K1k52450j85160K48398
$$ plain form
6977 5372272 4585437 3849810 3623926 3149252 3018195 3205721 3162070 3188182 2826654 2798957
6967 2798957 2725656 2688410 2572164 2423675 2436191 1975760 2104671 1949434 1964424 2141846
6957 2141846 2348900 2304762 2116893 2337114 2497058 2521086 2414006 2329865 2368790 2105464
6947 2105464 1945322 2014593 2067920 1733598 1521987 1540804 1688929 1587978 1513754 1336213
6937 1336213 1275713 1259928 1339824 1295734 1281145 1559393 1561716 1452147 1531687 1753393 1742895
6926 1742895 1573499 1609032 1476095 1330904 1413169 1428922 1376977 1477917 1741442 1696705
6916 1696705 1705939 1764365 1922600 2126989 2164578 2109928 2199625 2393491 2413350 1898396 1551989
6905 1551989 1568400 1535119 1495512 1413717 1365097 1350021 1607031 1607052 1354602 1169442 1417840
6894A417840n7608O8873m2532l9425r1639K9775L69J00478R3350j67095J86629
6883A499015k0170l0893o192K72568j09762j85190j6514J32717k36765j03581
6873A195233K06953K34269N8110k26465o4123j11435J61044K50412k01417K22428
6863A725009r6946r042J36135P9990J24675J87935J14664Q0194J15364l4784j43372
6852B279822Q3965j60780O6106J92495J98923Q0180q1667j81333K18311J28704
6842B824726Q3949l7690M1432j8855j35227p5075L6143R4828K4609J8597K29818
6831C087255r280r7318J77980k02950P2519J09945K50431J97917m4824j50509
6821C391166L72497K16869q8543R5315J54466k9921L9198J92213J15173K30199
$$ plain form
6894 1417840 1360232 1429105 1386573 1347148 1255509 1285284 1285653 1386131 1479481 1312386 1499015
6883 1499015 1478845 1447952 1441760 1714328 1604566 1419376 1402862 1535579 1298814 1195233
6873 1195233 1402186 1636455 1694565 1468100 1403977 1292542 1453586 1703998 1502581 1725009
6863 1725009 1628063 1619021 1755156 1835146 1959821 2147756 2262420 2342614 2457978 2423194 2279822
6852 2279822 2363787 2203007 2269113 2461608 2660531 2740711 2659044 2477711 2696022 2824726
6842 2824726 2908675 2870985 2912417 2893562 2758335 2683260 2719403 2814231 2838840 2857437 3087255
6831 3087255 3077975 2980657 3158637 2955687 3028206 3138151 3388582 3586499 3541675 3391166
6821 3391166 3763663 3980532 3891989 3987304 4141770 4111849 4151047 4343260 4458433 4688632
6811D688632o4343p3766J02228J87900R8172L62832K03881J34112M7074j66929
6801E519793L59769M21117N0112M06082L17774L879M81331K31354K93311N69780
6791H654302L05589J87101M32765L81121O80125N88185K71518O18855P76774O42306
6781A3538641P42582M66192R24889J074453J036862Q74791J126752J048481J221778
6772B2055421J450747J381714J350252J524555J285289J137439R95446R64818
6764C2145681P53047N05158N77470R0672k52691J8275k31233n84652l95604p54598
6754C1871525o57476n50170n74712r30943o97437j001385r53318j106591j019697
6745B4379796j251569j180922j054710j279066p66331j008605j007059q16961
$$ plain form
6811 4688632 4624289 4550523 4652751 4840651 4938823 5301655 5505536 5639648 5686722 5519793
6801 5519793 5879562 6300679 6350791 6756873 7074647 7078526 7559857 7791211 8084522 8654302
6791 8654302 8959891 9146992 9579757 9960878 10641003 11229188 11500706 12119561 12896335 13538641
6781 13538641 14281223 14747415 15672304 16746757 17783619 18658410 19785162 20833643 22055421
6772 22055421 23506168 24887882 26238134 27762689 29047978 30185417 31180863 32145681
6764 32145681 32898728 33403886 33981356 34072028 33819337 33837612 33606379 33021727 32626123 31871525
6754 31871525 31214049 30663879 30089167 29158224 28460787 27459402 26506084 25399493 24379796
6745 24379796 23128227 21947305 20892595 19613529 18847198 17838593 16831534 16014573
6737A6014573q80269r95878p07812p52026o13243o58756m52269n17837m67770
6728I968713m72225m12537l41720m39626l94843j94881l82701n23131j14885m7243
6718F644921k45872j49455l66866l78049k22779j137J1657k01859j75549n4341
6708D860671k89225j47531R6854j65042j72338j48911k03490j57589L649j06875
6698C570173r0093j80066k6128L49555l30364j29167n6614j33802K54630m18450
6688B809674j77033J7398k86040n1673j04505K19643J01527j68514n6882k74768
6678B028827J22725J67971j45635P1819J61829l03705j387j33049o335J52428
6668B115488K2703r3493O8042K02087k87555j6131L4366j8338R8804k63238L01636
$$ plain form
6737 16014573 15134304 14138426 13430614 12678588 12065345 11406589 10954320 10436483 9968713
6728 9968713 9496488 9083951 8742231 8302605 7907762 7712881 7330180 6807049 6692164 6644921
6718 6644921 6399049 6249594 5882728 5504679 5281900 5280763 5292420 5090561 4915012 4860671
6708 4860671 4571446 4423915 4520769 4355727 4183389 4034478 3830988 3673399 3677048 3570173
6698 3570173 3480080 3300014 3273886 3623441 3293077 3163910 3107296 2973494 3228124 2809674
6688 2809674 2632641 2650039 2363999 2312326 2207821 2427464 2528991 2360477 2303595 2028827
6678 2028827 2151552 2319523 2173888 2245707 2407536 2103831 2102444 1969395 1963060 2115488
6668 2115488 2138191 2044698 2112740 2314827 2027272 2011141 2045507 2027169 2125973 1862735 2164371
6657B164371J34922k29818j48374k63921K39867J19959l15381L7654J07697m17429
6647A429547K54408L11963J2457j23717k1530j14395Q3096J95108k44419N2775
6637A835293j9867j0960m19554L41754N3427j25915k7780k08870J85600L80866
6627A983994j76527R6880k04414M4735K91831k40052j69554L45022J24073k63541
6617A832447N1861J24643Q8789R3701J00359K91667J14551J20181K52302K85375
6607C355876M17248L37889P0923L09085m7019n826J25618j71290j82859R8396
6597D308041K11086j42404J79166L1714l09492m11507l14905r3139j88076m96441
6587B774043K5538J6523j74149J78053Q2526j71839j13492j9115K09580j42817
$$ plain form
6657 2164371 2299293 2069475 1921101 1657180 1897047 2017006 1701625 1739279 1846976 1429547
6647 1429547 1683955 1995918 2008375 1884658 1863128 1748733 1831829 2026937 1782518 1835293
6637 1835293 1815426 1804466 1384912 1726666 1780093 1654178 1626398 1417528 1603128 1983994
6627 1983994 1807467 1904347 1699933 1744668 2036499 1796447 1626893 1971915 2095988 1832447
6617 1832447 1884308 2008951 2097740 2191441 2291800 2583467 2698018 2818199 3070501 3355876
6607 3355876 3773124 4111013 4181936 4491021 4444002 4438176 4563794 4392504 4209645 4308041
6597 4308041 4519127 4376723 4555889 4587603 4278111 3866604 3551699 3458560 3270484 2774043
6587 2774043 2799581 2816104 2641955 2820008 2902534 2730695 2617203 2598088 2807668 2664851
6577B664851j7769p8860Q8092K14780K71331Q1778N4912j02238J90791L17606
6567C685274K93127j6802J15216J55551M1815J56180L5648j06196k61710j66152
6557C931951K4298j85074J49043Q5026l24693k91097j42672k97642j41201j60505
6547B647434o7651j82069k08282n2665J0535K53287J958J00696l4329k14871R3876
6536B347919j57934J2217n8939k79337K11060K39311J67808J41098k15092p5209
6526B332902l9153j59223K25772L1451R3737M5962j71440R8339Q9003p3727Q6075
6515B559698N8065j57961J39095K2496r3039J76841k0392k221M3239Q8450j46293
6504B667978K5996K13147L0283r8729j17732M1634M273n2454M9115P2406q2115
$$ plain form
6577 2664851 2647082 2568222 2656314 2871094 3142425 3224203 3279115 3176877 3367668 3685274
6567 3685274 3978401 3961599 4076815 4232366 4274181 4430361 4466009 4359813 4098103 3931951
6557 3931951 3956249 3771175 3920218 4005244 3680551 3389454 3246782 2949140 2807939 2647434
6547 2647434 2579783 2397714 2189432 2136767 2147302 2400589 2402547 2503243 2468914 2254043 2347919
6536 2347919 2189985 2202202 2143263 1863926 2074986 2314297 2482105 2623203 2408111 2332902
6526 2332902 2293749 2134526 2360298 2391749 2485486 2531448 2360008 2458347 2547350 2473623 2559698
6515 2559698 2617763 2459802 2598897 2621393 2528354 2705195 2684803 2682582 2725821 2814271 2667978
6504 2667978 2693974 2907121 2937404 2838675 2720943 2762577 2766850 2714396 2763511 2835917 2753802
6493B753802j16748J38400K07370K3233l46144j51599J9087L3142j465n7676j6720
6482B484682K1323j9173p9380j03928N0065m7265L56755M068q8881R3224q5208
6471B586282Q5018o0992k48951l4306P4738P9660J19409n9569J01425R3248M4580
6460B780542M5916k88830R9492J9869l0221n8552O2809J7855J5561n0452p1240
6449B542749J60382J82931Q1536j89423L7913k7693M7341r3783Q9824p7213M7093
6438B801657K12387k24277K2631O9930O8306N7486k72803J04146J04061J46425
6428C089949K2677J68865j68281l2241J46697m0317K3025q1574J64392j60351
6418C132841k44129K57100L68791K2224Q2131P8309k06993L9770m4963J32718
$$ plain form
6493 2753802 2637054 2775454 2982824 3006057 2659913 2508314 2527401 2560543 2559078 2501402 2484682
6482 2484682 2506005 2486832 2407452 2303524 2353589 2306324 2663079 2667147 2578266 2671490 2586282
6471 2586282 2671300 2610308 2361357 2327051 2401789 2481449 2600858 2541289 2642714 2735962 2780542
6460 2780542 2826458 2537628 2637120 2656989 2626768 2568216 2631025 2648880 2664441 2613989 2542749
6449 2542749 2703131 2886062 2967598 2778175 2816088 2788395 2835736 2741953 2831777 2754564 2801657
6438 2801657 3014044 2789767 2812398 2882328 2950634 3008120 2735317 2839463 2943524 3089949
6428 3089949 3112626 3281491 3113210 3080969 3227666 3187349 3210374 3128800 3293192 3132841
6418 3132841 2888712 3145812 3514603 3536827 3618958 3697267 3490274 3530044 3485081 3617799
6408C617799K89381j9747l4018M11793J79288J79010J51271n666L21880K95484
6398E386475j13050J37475N01316J66333M39414J26740N11483K48914M02629M95072
6388H302801L93912L49904M23839O96048Q55192M53415N74808R24958P60125P48623
6378A4483625O41462P15945O47671M84723L66684L48722K1446J45837o7046l45064
6368A7444005k01456l23379k99629k99128m62620o33609l40888l18229n74376
6359A3990691n48374o80410q35427l78889o96815q17376m73842m31867m31071
6350H696620m99081p77316l41100k85177m53338l38991k57048j55724n23145k88778
6340D776922l6244l05243j57669l2600n23937r2739N965J7497m03322j70268k80940
$$ plain form
6408 3617799 3907180 3887433 3853415 4265208 4444496 4623506 4774777 4769111 5090991 5386475
6398 5386475 5273425 5410900 5912216 6078549 6517963 6644703 7156186 7405100 7807729 8302801
6388 8302801 8696713 9046617 9470456 10166504 11021696 11475111 12049919 12974877 13735002 14483625
6378 14483625 15125087 15841032 16488703 16973426 17340110 17688832 17710278 17856115 17789069 17444005
6368 17444005 17242549 16919170 16619541 16320413 15857793 15224184 14883296 14565067 13990691
6359 13990691 13442317 12761907 11926480 11547591 10850776 10033400 9559558 9127691 8696620
6350 8696620 8197539 7420223 7079123 6793946 6340608 6001617 5744569 5588845 5065700 4776922
6340 4776922 4740678 4435435 4277766 4245166 3721229 3628490 3634455 3651952 3248630 3078362 2797422
6329B797422J9052Q9840l3533j72426l9313Q1478j07617k00945k11660q681m8640
6318B164977o0524k30866J71728k9716k9967L0449j09899k55898n6885P8987J79341
6307A851727m2030o03598P7166j77555K3163J51117M8776J53371k83087R731K3838
6296A232619j52099L6145P2869k40620j6583r5376J37693O2455o0288k52088j54682
6285E70045P4271m1882M7679j4068J24175j49364J77922r95m1195J25280r7886
6274G73982k34524J73794R905L5297K3355J79362k26780p7868J66871j0703j65073
6263F47618j48914J6607j62939K6854J10000K5041o849N7534k16371K58522j6557
6252E90546j00450Q9315q8708o7637j05130j2122J1021R6433P3659O091L3201
$$ plain form
6329 2797422 2816474 2906314 2872781 2700355 2661042 2742520 2634903 2433958 2222298 2213617 2164977
6318 2164977 2104453 1873587 2045315 2015599 1985632 2016081 1906182 1650284 1593399 1672386 1851727
6307 1851727 1809697 1206099 1283265 1105710 1128873 1279990 1328766 1482137 1199050 1208781 1232619
6296 1232619 1080520 1116665 1189534 948914 932331 836955 974648 1037103 976815 724727 570045
6285 570045 644316 602434 650113 636045 760220 610856 788778 787783 746588 871868 773982
6274 773982 539458 713252 723157 758454 781809 961171 734391 656523 823394 812691 647618
6263 647618 498704 515311 352372 379226 489226 514267 507418 564952 348581 607103 590546
6252 590546 490096 579411 490703 423066 317936 305814 316835 413268 486927 493018 526219
6241E26219J647j58997j81658K1253m3486K48635j03670j9129M0186K3256K5013
6230C79269j45717N871j54690J1738K06748M1072j12750j1955M4635j0113J3987
6219B68095J32150Q7117k34433k23506J08896J81886j31954j04823K09745Q7172
6209C80345l04513j01173j78317J51567J88060R9174P5858j08468J90823n98k09396
6198A83362j11576j74143J19302q4122K28468J01820l9978j96016o1301P5767
6188D1583P554J29284j29779K46880l0127k95036j01245o358J75183m6963O5174
6177E6150J10312j53770k8369K39426q6052q133P6740j59038J1329k28422J17655
6166e2172n9317J92429J1129R8455R5977j98341j1944j79165m5797K21417P3223
$$ plain form
6241 526219 527866 368869 187211 208464 164978 413613 309943 290814 331000 354256 379269
6230 379269 233552 239423 84733 96471 303219 344291 231541 219586 264221 254108 268095
6219 268095 400245 487362 252929 29423 138319 320205 188251 83428 293173 380345
6209 380345 75832 -25341 -203658 -52091 135969 235143 311001 202533 393356 392758 183362
6198 183362 71786 -102357 16945 -67177 161291 263111 223133 27117 -34184 41583
6188 41583 49137 178421 48642 295522 265395 -29641 -130886 -137244 37939 -9024 56150
6177 56150 166462 12692 -15677 223749 137697 129564 206304 47266 58595 -169827 -52172
6166 -52172 -111489 80940 92069 190524 286501 88160 76216 -102949 -148746 72671 145894
6155A45894j87021p7166j71755L4751L2386K21152J58883N6832r3827k24404R9594
6144d681o7065n7169r7930K09733J20796M1594j79518k218j26854J53011M27445
6133D17144k01603m07962L8270m8216Q8128J11061j82442K57189p0845o6287j6485
6122h2048j40839R187K09856P8532j80548O8316K47043m3172l44857o4968k306
6111b45804K5325N2675J0356L3610K05237l56010N4085N0468O4244j47956j40946
6100c94716L78050j32591J96880j74511J52014k4122J4952p8951k02365J05863
6090a59497K9028K1764J07681j23272Q6919J36936p91j83099q255J01253n1152
6079d2485o5074o272j12254N414L274J64631K4923l8000j17456O4320l3882J35829
$$ plain form
6155 145894 -41127 -118293 -290048 -255297 -222911 -1759 157124 213956 120129 -104275 -4681
6144 -4681 -71746 -128915 -226845 -17112 103684 145278 -34240 -36458 -163312 -10301 417144
6133 417144 215541 -192421 -154151 -202367 -114239 -3178 -185620 71569 724 -65563 -82048
6122 -82048 -222887 -213700 -3844 74688 -105860 -37544 209499 166327 -178530 -243498 -245804
6111 -245804 -220479 -167804 -157448 -123838 81399 -274611 -220526 -170058 -105814 -253770 -394716
6100 -394716 -16666 -149257 47623 -126888 25126 1004 15956 -62995 -265360 -159497
6090 -159497 -130469 -108705 -1024 -124296 -37377 99559 98768 -84331 -92586 8667 -42485
6079 -42485 -107559 -113831 -226085 -220671 -217397 -52766 -27843 -65843 -183299 -118979 -152861 -17032
6067a7032J9038J40139r699q6551O9852q7955K72003K9968j84287l02145L9991
6056a16678Q8115J35584j70399Q1587j72823J42767j34549Q4116p0275K367m4208
6045a74396o0819M3995J16333R1437M4679O6545j58778p0568j54349q6584L0901
6034c11604P0689K95468K05734o2822j00369J26247j17963k85517N0370J1270
6024a18497N4556k4191L6650j00625K0638J06637J89152J63523k13846r2527J44053
6013A65523j09380j28042K4723J59013k23304J5417R6269o1760o7439k18701N2169
6002b95512P1162Q9104O4219J35294m8705R2797p3298J5366J00538J2727J31192
5991B94884p0854j40141n1131K40679p1904l4865p3050k520K895q2145j54493
$$ plain form
6067 -17032 2006 142145 132446 45895 115747 27792 299795 329763 145476 -156669 -116678
6056 -116678 -28563 107021 -63378 18209 -154614 -11847 -146396 -62280 -132555 -130188 -174396
6045 -174396 -235215 -191220 -74887 16550 61229 127774 -31004 -101572 -255921 -342505 -311604
6034 -311604 -240915 54553 260287 197465 97096 223343 105380 -180137 -129767 -118497
6024 -118497 -63941 -88132 -51482 -152107 -131469 -24832 164320 327843 113997 21470 165523
6013 165523 56143 -71899 -47176 111837 -111467 -96050 219 -61541 -128980 -347681 -295512
6002 -295512 -224350 -135246 -71027 64267 15562 108359 35061 50427 150965 163692 294884
5991 294884 224030 83889 32758 273437 201533 166668 93618 91098 93993 11848 -142645
5980a42645J29278K24996j61161j16595L22054l8439j35825j2043j09027J16784
5970G7377j25398j43865j24624J35410O6070j1329J47191K9708J8538k899L3138
5959I9317M0997j41498k29385K3689K1397J94950p7472k3695L8940m2549J58290
5948F2981j11092J82082j37901m8418l4382J9069k0241q8867n9534k14259K99558
5937a51004J01705L9235j01314J41603j5024j65421l02811K08865J31606K0683
5927i1877R6905k55863J10761J21416p554q8811J13851l8930J79339M084k46482
5916a03161j04750K02735J3564q3025n1476J49055j48592Q5845M9014J34444Q3876
5905B27529j05888N6322k80304j35458l9965J31727Q4968L1082k34086N535K6895
$$ plain form
5980 -142645 -13367 211629 50468 -66127 255927 217488 81663 69620 -39407 77377
5970 77377 -48021 -191886 -316510 -181100 -115030 -126359 20832 50540 69078 66179 99317
5959 99317 140314 -1184 -230569 -206880 -185483 9467 -68005 -91700 -52760 -95309 62981
5948 62981 -48111 133971 -3930 -52348 -86730 -67661 -87902 -176769 -236303 -450562 -151004
5937 -151004 -49299 -10064 -111378 30225 15201 -150220 -453031 -244166 -112560 -91877
5927 -91877 5028 -250835 -140074 -18658 -26212 -115023 -1172 -40102 139237 143321 -103161
5916 -103161 -207911 -5176 8388 -74637 -126113 22942 -125650 -39805 9209 143653 227529
5905 227529 121641 177963 -102341 -237799 -277764 -146037 -61069 -29987 -264073 -258538 -231643
5894b31643K25343m7561p2903J36806P5439j3764r4463l8214J69945J48423p8562
5883A78846j0660n4208J12838K06458J48456j75504j14866K31388k77085M8252
5873B93915J15140N310N3728j52803N3266j33568l4953J21921l04267K997L4889
5862E5575J34786R1557L3498j21231k51569J9335Q3278o5423J61644o9176k23011
5851a50737K2715J88131N7929k7303L23398j45483m41898j06393K89711M7047
5841E7117M4413K38362n4382j37068j77197k81461K45846J5405M0776K08175l63962
5830a63976J37726l7116L8976K01388k5901K4400q9853J42218r5767q6547R4052
5819A39600j51266k3398R9522j33257K94617k19102k1074K23872l2317k33967
$$ plain form
5894 -231643 -6300 -53861 -126764 10042 85481 71717 -22746 -60960 108985 257408 178846
5883 178846 168186 113978 226816 433274 581730 406226 291360 522748 245663 293915
5873 293915 409055 414365 468093 315290 368556 234988 200035 321956 17689 20686 55575
5862 55575 190361 281918 315416 194185 -57384 -38049 45229 -20194 141450 72274 -150737
5851 -150737 -128022 60109 118038 90735 414133 268650 -173248 -279641 10070 57117
5841 57117 101530 339892 285510 148442 -28755 -310216 -64370 -48965 -8189 199986 -163976
5830 -163976 -26250 -63366 -24390 176998 151097 175497 85644 227862 132095 45548 139600
5819 139600 -11666 -35064 64458 -68799 225818 6716 -14358 209514 177197 -56770
5809e6770J04626P4663N4275n7236j24908P7069j05772k1595J30008k3502j265
5798D9593j54968J88010m968N2905m9926k6537R1087j3273k45969r3026j94134
5787d01206K78762J87654J19806j19117j47968J07948k8525K39036j16634J02403
5777B22159k4689J44928k32267l3798L592k45850O1064n5579m8060K37575M5532
5766G4607p3182R5148j39484N5916n6628J48751M8059j39794q0918Q0607j85111
5755a72029M1622N2016m3819J6926J11060O0889p8968L0274j61193L23649q1327
5744I9100L2878n9078K51829o2030j1705l0554k0879k21175m3937M5174O9066
5733D8689J06459n5423P4695j61033l6581j09935j14691K05060o3916k12150J56018
$$ plain form
5809 -56770 47856 122519 176794 119558 -5350 71719 -34053 -55648 74360 50858 49593
5798 49593 -105375 82635 77667 130572 80646 54109 145196 131923 -114046 -207072 -401206
5787 -401206 -122444 65210 185016 65899 -82069 25879 -2646 236390 119756 222159
5777 222159 197470 342398 110131 76333 79925 -165925 -104861 -160440 -208500 29075 74607
5766 74607 1425 96573 -42911 13005 -43623 105128 153187 13393 -67525 13082 -172029
5755 -172029 -130407 -78391 -122210 -105284 5776 66665 -12303 17971 -143222 180427 99100
5744 99100 131978 72900 324729 262699 250994 220440 199561 -21614 -65551 -20377 48689
5733 48689 155148 99725 174420 13387 -23194 -133129 -247820 -42760 -106676 -318826 -162808
5722a62808R6725j09836R0094J47069R5106m52313r1809K94051p8104j0135J72919
5711i041J55079k16257J12489L80041k28265j59280J81241q2882M931k32634k8841
5700a23419J19419k27469K96602P6147L57498q8776k91231k8273j19531l0300
5690e9333J50305Q9564j37492k53664N1066J72773j40871l3037J96067j43228
5680a07850N6588n3489o2518K17980J32035o029Q5879k19910K6350P5739q6319
5669E8456r896J36331l7565O9167L3028m4341j2803l13639J21739O9025n5757
5658A3745n0830m9163J0180M52756k6094l5990j8699o4907k55973J3116K48382
5647B36523l00524K46059M5735j92069k6092K80245K3218p4534k3677o8496M60142
$$ plain form
5722 -162808 -66083 -175919 -85825 61244 156350 -295963 -387772 -93721 -171825 -181960 -9041
5711 -9041 146038 -70219 42270 422311 194046 34766 216007 133125 138056 -94578 -123419
5700 -123419 -4000 -231469 65133 141280 498778 410002 118771 90498 -29033 -59333
5690 -59333 90972 180536 43044 -210620 -159554 13219 -127652 -160689 35378 -107850
5680 -107850 -51262 -104751 -167269 50711 182746 176717 262596 42686 69036 144775 58456
5669 58456 48560 184891 147326 216493 249521 205180 192377 -121262 477 69502 13745
5658 13745 -37085 -86248 -76068 376688 350594 314604 295905 230998 -24975 -11859 236523
5647 236523 -64001 182058 227793 35724 9632 289877 313095 238561 214884 146388 606530
5636F06530l47212J7777j00016j46050P1690l5845l11052R131P5479K58032j49008
5625e0544M0538J24449J11516J64193M007p8863l49518J40262L19267o9114l95
5614C55798j51762j54418J23987m9661J647J80523j24941o4219J31348J1562k11149
5603D8715L8372P5381L1543o6646N7493J8133k03322k1850M5606J8021J09880
5592A51326m2582q7644J73318J99350k53675j39878M4409l7756O2558K138n7607
5581A3957q2966J18983P4114j08817J33743J08343q9571J4906n2615N021m1276
5570I3822N6891k8524J82932n784j22073R3553k0658N7399j4691q7908L0369k07558
5558B7770k5209J58470j3192J98344j14923p437M2381p3966J32315j90323O4437
$$ plain form
5636 606530 259318 277095 177079 31029 102719 66874 -244178 -235047 -159568 98464 -50544
5625 -50544 -10006 114443 225959 390152 394159 315296 -34222 106040 425307 356193 355798
5614 355798 204036 49618 173605 123944 125591 306114 181173 116954 248302 259864 48715
5603 48715 87087 162468 194011 127365 184858 202991 -331 -22181 23425 41446 151326
5592 151326 108744 21100 194418 393768 140093 215 44624 6868 69426 71564 13957
5581 13957 -69009 49974 124088 15271 149014 257357 167786 182692 130077 135098 93822
5570 93822 150713 122189 305121 299337 177264 270817 250159 307558 292867 204959 235328 27770
5558 27770 2561 161031 147839 346183 231260 223823 266204 192238 324553 134230 198667
5547A98667j37759j39281K43399K7503p7008P0463N0257m7124K09954j67729j34314
5536I7028O4587K58485k29088o1244N1538R6308K32369j27235j52042j44607Q5588
5525A71687N8182J38335r6165J22479K19857j07808l59202J04692J02295K06811
5515E61163p7132m4002L0729o9799J925j17062j71068J11858K01975j2441J00634
5504E16780P7488p4734K5736j52598J12058j15130Q0488J55082J70143j38465
5494F56848L4109l1447K0466K10481j87664k23630k1496J43758P1760j7739j35212
5483E20234j32057q9041K5141J69195j42653K74862m2750L0569l0782n0736K0266
5472E52248M9033Q0404J14652m4893m02815K08208l4341j13089N6479R618J20793
$$ plain form
5547 198667 60908 -78373 165026 192529 115521 185984 236241 189117 399071 231342 97028
5536 97028 161615 420100 191012 129768 181306 277614 509983 382748 230706 86099 171687
5525 171687 229869 368204 272039 394518 614375 506567 147365 252057 354352 561163
5515 561163 484031 440029 470758 400959 402884 285822 114754 226612 428587 416146 516780
5504 516780 594268 519534 545270 392672 504730 389600 470088 625170 795313 656848
5494 656848 690957 659510 679976 890457 702793 479163 457667 601425 673185 655446 520234
5483 520234 388177 299136 324277 493472 350819 625681 582931 613500 582718 531982 552248
5472 552248 601281 681685 796337 751444 348629 556837 522496 409407 465886 475504 596297
5461E96297k6222j2954Q1593J18272n2657J62614p6504R3880q5312k05986J88371
5450G81392j25995q3865K41073j5785m6951K43694o1645m7112j02417J39234l8768
5439H82855L5752k21044r3816J13124J55513j0837J95339N5195k28947j28862
5429G54272K14383J74264R0568j05301l1258J79470O2445J6811K60095j79558
5419A436191q6776k27382J46071J59702n640K78420k55241k00784J98672j89424
5409A253809J63665J80669J94941j1519Q195N4554J57980K03894J42025M43342
5399B791555o921K85272R1068J34039M20697K20118k03447m66793l87077k05526
5389B672985J17426q4869j34478l7360j30234J4740J30703J45964K62099j29622
$$ plain form
5461 596297 570075 557121 638714 756986 704329 866943 790439 884319 799007 593021 781392
5450 781392 655397 571532 812605 796820 749869 993563 931918 884806 782389 921623 882855
5439 882855 918607 697563 603747 716871 872384 861547 1056886 1112081 883134 754272
5429 754272 968655 1142919 1233487 1128186 1096928 1276398 1338843 1355654 1615749 1436191
5419 1436191 1349415 1122033 1268104 1427806 1422166 1700586 1445345 1244561 1443233 1253809
5409 1253809 1417474 1598143 1793084 1781565 1789760 1844314 2002294 2206188 2348213 2791555
5399 2791555 2784634 3069906 3160974 3295013 3715710 3935828 3732381 3265588 2878511 2672985
5389 2672985 2790411 2705542 2571064 2533704 2403470 2418210 2548913 2694877 2956976 2827354
5379B827354M12141K97511K73397o3442K56998P49390M98037J17565O35237P31071
5369F735259k5507k73807p29010o92959o52560n89752m15884l50335j69888L588
5359B839145k53872j52579j08996M3060j49975P342J85264o0526J45865M5038
5349B539766L26192J17095M09725K76066M9669K10992j33626J31945l85869k62498
5339C279457n53479m74955k11513j35019j35515j17562o5819J73904j2691J57217
5329A904025k93758k48469j79046j12371L49877L6454p7793l71159R1195M1170
5319A140125J37242j5864j01866J89274n9471J0157j21866J88148J30265q7469
5309A408675j913Q584N7601Q3926l21357K33404l1967O3638J82820q2538J14269
$$ plain form
5379 2827354 3239495 3537006 3810403 3746961 4003959 4753349 5251386 5368951 6004188 6735259
5369 6735259 6709752 6435945 5706935 5013976 4361416 3771664 3355780 3005445 2835557 2839145
5359 2839145 2585273 2432694 2323698 2366758 2216783 2224125 2409389 2348863 2494728 2539766
5349 2539766 2865958 2983053 3392778 3668844 3718513 3929505 3795879 3927824 3541955 3279457
5339 3279457 2725978 2251023 2039510 1904491 1768976 1651414 1585595 1759499 1746808 1904025
5329 1904025 1610267 1361798 1182752 1070381 1420258 1456712 1378919 1007760 1098955 1140125
5319 1140125 1277367 1261503 1159637 1348911 1289440 1299597 1177731 1365879 1496144 1408675
5309 1408675 1406762 1415346 1472947 1556873 1235516 1468920 1436953 1500591 1683411 1600873 1715142
5298A715142j22531k71284j39921m5253O9893R9123r9277k17723L89391O7192
5288A444752k82509l8496K96424j93977j10559K60866p7057k53515K66993N4470
5278A367392m8420j68073k04358j6604m0865M74502M0680j04704J45454j98961
5268A246043l50875n5485k8980K06207N2904J29063j32857j61672j13620J98309
5258I89037L6118n5770j8730J10875p5010p0658P5289j50132J14990Q2388j3397
5247A025000L5010J4498j95647P5296J45145k97823J507R7956j6503J31858O4450
5236A080747k30855K42994J59149m1050k94128J14434K16094k81913L48691k7878
5226A286285o0465l1096k8553J0777J38119j49563r3831j9660l6752j0891l9780
$$ plain form
5298 1715142 1592611 1321327 1181406 1136153 1206046 1305169 1205892 988169 1377560 1444752
5288 1444752 1162243 1123747 1420171 1226194 1115635 1376501 1299444 1045929 1312922 1367392
5278 1367392 1318972 1150899 946541 929937 889072 1363574 1404254 1299550 1445004 1246043
5268 1246043 895168 839683 810703 1016910 1069814 1198877 1066020 904348 790728 989037
5258 989037 1025155 969385 950655 1061530 986520 915862 991151 841019 956009 1038397 1025000
5247 1025000 1060010 1074508 878861 954157 1099302 801479 802986 900942 884439 1016297 1080747
5236 1080747 849892 1092886 1252035 1210985 916857 1031291 1247385 965472 1314163 1286285
5226 1286285 1225820 1194724 1166171 1176948 1315067 1165504 1071673 1052013 1015261 1004370 964590
5215I64590K82119l4424J32127N986O8148j04499N1967p280k49372K35054J55180
5204A499596J61582p5919q0783K15009j59383j47318J84243Q2658J6378m6931
5194A649132J52079J58893K10668J15890J36079K05235K63083K63599J62126J42197
5184C458981l83977K9592l91413j78725k7770K3595J46916L9429J11003K37904
5174C065535R3446J0400p9976K18333L01643L05766L30894K31675K83541K8643
5164D789900k00491r656k24717l96109l68838k21394l29361M8904j69802O1310
5154B979746K34604m11033l4596K29167J15781j32884J67755l088J32600J5312
5144C293364P6326m0937L1046Q9852P6223m7505N84k58574J26582O7985J6655
$$ plain form
5215 964590 1246709 1212285 1344412 1350398 1418546 1314047 1366014 1358734 1109362 1344416 1499596
5204 1499596 1661178 1585259 1504476 1719485 1560102 1412784 1597027 1679685 1696063 1649132
5194 1649132 1801211 1960104 2170772 2286662 2422741 2627976 2891059 3154658 3316784 3458981
5184 3458981 3075004 3104596 2713183 2534458 2506688 2530283 2677199 2716628 2827631 3065535
5174 3065535 3158981 3169381 3089405 3307738 3609381 3915147 4246041 4477716 4761257 4789900
5164 4789900 4589409 4579753 4355036 3958927 3590089 3368695 3039334 3088238 2918436 2979746
5154 2979746 3214350 2803317 2768721 2997888 3113669 2980785 3148540 3145452 3278052 3293364
5144 3293364 3369690 3328753 3359799 3449651 3525874 3478369 3478953 3220379 3346961 3414946 3431601
5133C431601k70887q8595K91644J18529J01415j50027J95753K48376O865Q2377
5123C967051l1621j40910K57758L40535L0370Q330J30890j0766J31672J71772
5113D855081K43691L0408J71572n6922j9657j4984J2593J13116L17117p5528p9667
5102E496820J2328K81893J67808J45591J47339J21966J70645K51122R6612J95953
5092G088077J70166M9239M78481J14733K06481P1321K77206K29826M61946P3145
5082I220621K24783L69341L10424L48267K6184n8827K77239M94778M21027Q7758
5072A1721595M46906L71028K30017L66087N09454P60496N06825N19519R08930
5063A6340857M66936Q27833Q34412J303769J214302J338284J372614J430740J731079
$$ plain form
5133 3431601 3160714 3072119 3363763 3482292 3583707 3433680 3629433 3877809 3884674 3967051
5123 3967051 3935430 3794520 4052278 4392813 4423183 4431513 4562403 4551637 4683309 4855081
5113 4855081 5098772 5129180 5300752 5243830 5224173 5209189 5221782 5334898 5652015 5576487 5496820
5102 5496820 5509148 5791041 5958849 6104440 6251779 6373745 6544390 6795512 6892124 7088077
5092 7088077 7258243 7307482 7785963 7900696 8107177 8178498 8455704 8685530 9147476 9220621
5082 9220621 9445404 9814745 10125169 10473436 10499620 10440793 10718032 11212810 11633837 11721595
5072 11721595 12168501 12539529 12769546 13135633 13645087 14405583 14912408 15431927 16340857
5063 16340857 16807793 17635626 18470038 19773807 20988109 22326393 23699007 25129747 26860826
5054B6860826J776337K183408K605803K821883L495927L778888L896068M174545
5046E1593685M093105M480675M962743N212920L900051J279383j168470j917327
5038G2436765k655140k378459k071547j595003p92000n9678Q28137J719008K390884
5029F7822967L282287L641408M252031N200654O277719P199315P391826P055590
5021A12123797O626130N549198M717245N188493L729454k556355r199151j2697883
5013A13480928j3395556j1602071r460655p253537n179049m279062l274427j985656
5005E7050915j136259n46981m068N96812J048478K020876K335295K898418L073358
4996F7336844L024652L040018K451649J773819J460214o20718m665243p331058
$$ plain form
5054 26860826 28637163 30820571 33426374 36248257 39744184 43523072 47419140 51593685
5046 51593685 55686790 60167465 65130208 70343128 74243179 75522562 74354092 72436765
5038 72436765 69781625 67403166 65331619 63736616 62944616 62884938 63713075 65432083 67822967
5029 67822967 71105254 74746662 78998693 84199347 90477066 97676381 105068207 112123797
5021 112123797 118749927 124299125 129016370 134204863 137934317 135377962 126178811 113480928
5013 113480928 100085372 88483301 79022646 71769109 66590060 62310998 59036571 57050915
5005 57050915 55914656 55367675 55363607 55960419 57008897 59029773 61365068 64263486 67336844
4996 67336844 70361496 73401514 75853163 77626982 79087196 78466478 73801235 66470177
4988F6470177q693736p857981o389176n069116l965926l245652k487303j887812
4980B6873475k006074j293896j266161j416050p59005r02791r17285q28071m49259
4971A7034883n33761o93701l37680m69877n16129m18160n72276o68751l49616
4962A2474932k45281l75786j89272k56889n05921l38139l09520k3369j8012j25717
4952A0087026k2844j79172j79465l41837j08739k73222k43529j70494k35645o1310
4942H270769q1288j25390J92722l4216j45494r7758j43223L24186J28990l26638
4932G962660p8267Q9196l05872n22J19962r3138n4233K50940J41777l5740K02678
4921H199441M632j97698l8775J54870O1124R6847k22885L59124K34118M6602J69509
$$ plain form
4988 66470177 57776441 49918460 43529284 38460168 34494242 31248590 28761287 26873475
4980 26873475 24867401 23573505 22307344 20891294 20132289 19229498 18312213 17484142 17034883
4971 17034883 16501122 15807421 15469741 14999864 14483735 14065575 13493299 12824548 12474932
4962 12474932 12229651 11853865 11664593 11407704 10901783 10563644 10254124 10230755 10212743 10087026
4952 10087026 10064182 9885010 9705545 9363708 9254969 8981747 8738218 8567724 8332079 8270769
4942 8270769 8189481 8064091 8256813 8222597 8077103 7979345 7836122 8160308 8289298 7962660
4932 7962660 7884393 7973589 7667717 7667195 7787157 7694019 7639786 7890726 8032503 7996763 8199441
4921 8199441 8204073 8006375 7967600 8122470 8183594 8280441 8057556 8416680 8650798 8697400 8866909
4910H866909K6107M25909K5390P9360K90052J44770K29276J25854K11823L33931
4900A0759381M13577M63167K95829K98839L77604l0685N1879M03901M02666L68998
4890A3805156L18530K57199L05910N96634Q35577O27133O40629O94967Q98114
4881A8979849Q99325P78771J256786J039744J616224K094245K191280K279042
4873C1135266K607184L211326L899119M457731N361320O096942O451072O781568
4865G0001528O558295P080399Q063138L689110m882131j0676367j1436333q937934
4857E9459705n591683m041516k566510j263811p67485j60503O66359J175688J748750
4848D8658994L003970L635061L776911M733243N798666P424669R303111J0816514
$$ plain form
4910 8866909 8893016 9318925 9344315 9423675 9713727 9858497 10087773 10213627 10425450 10759381
4900 10759381 11172958 11636125 11931954 12230793 12608397 12577712 12629591 13033492 13436158 13805156
4890 13805156 14123686 14380885 14686795 15283429 16119006 16746139 17386768 18081735 18979849
4881 18979849 19879174 20657945 21914731 22954475 24570699 26664944 28856224 31135266
4873 31135266 33742450 36953776 40852895 45310626 50671946 56768888 63219960 70001528
4865 70001528 76559823 83640222 91703360 95392470 90510339 79833972 68397639 59459705
4857 59459705 53868022 49826506 47259996 45996185 45228700 45068197 45734556 46910244 48658994
4848 48658994 51662964 55298025 59074936 63808179 69606845 77031514 86334625 97151139
4840I7151139J2330205J2630096J2534705J2513667J4269060J4054814k89141
4833A75194545j8608625k6292045k4396051j7879458j2441570q795733o591113
4826F0189950m317295l705963k417007k087464j428232p99726K72294N45009O92650
4817D6944216J697027K275578L357256M353730N233506N898781N605657N501785
4809H0867536O097413O894342M073564m376872j1686926j4028685j2068087q791358
4801D6980927o247199m926024l300660k813518k507095k038753j822775j296857
4793B2028046j461252j378952r79291q17668r08508p44802n36429p05533p31756
4784A3763855l86949m23344m21271l97624k44071m15876m77639n08559k38633
$$ plain form
4840 97151139 109481344 122111440 134646145 147159812 161428872 175483686 175194545
4833 175194545 156585920 130293875 105897824 88018366 75576796 66781063 60189950
4826 60189950 55872655 52166692 49749685 47662221 46233989 45434263 45706557 46251566 46944216
4817 46944216 48641243 50916821 54274077 58627807 63861313 69760094 75365751 80867536
4809 80867536 86964949 93859291 97932855 93555983 81869057 67840372 55772285 46980927
4801 46980927 40733728 35807704 32507044 29693526 27186431 25147678 23324903 22028046
4793 22028046 20566794 19187842 18208551 17390883 16482375 15737573 15201144 14495611 13763855
4784 13763855 13376906 12953562 12532291 12134667 11890596 11474720 10997081 10488522 10249889
4775A0249889k99971j48683j63815l82144l34206j80485k93080j38539m49044
4766G859922k63912J4268j93703k25812m5749k8404m4917k19959l8698l2740l27553
4755F452743J67887K11927k87106l26989l02811m61447K37087J92098Q0079l09382
4745E654086r5342L2648J507r5822Q5923L26151N6583j62191j37468M16718J51584
4734F234377J91860L16103L46400M13710J47311K88754N01452K93224l19611p3004
4724H340576o14567p56524k85760n36525n78255j97159j80459m16325j21740o389
4714D646873j06035q5223r2334L2492k07174R3924r7507J22471J84899q5656k81319
4703D125411K87314J43640j0115k10403j48152k3956k2373M2225l74287j61986
$$ plain form
4775 10249889 9949918 9801235 9637420 9255276 8921070 8740585 8447505 8308966 7859922
4766 7859922 7596010 7610278 7416575 7190763 7145014 7116610 7071693 6851734 6813036 6780296 6452743
4755 6452743 6620630 6832557 6545451 6218462 5915651 5454204 5691291 5883389 5963468 5654086
4745 5654086 5558744 5591392 5592899 5497077 5583000 5909151 5965734 5803543 5666075 6082793 6234377
4734 6234377 6426237 6742340 7088740 7502450 7649761 7938515 8439967 8733191 8413580 8340576
4724 8340576 7726009 6969485 6683725 6147200 5568945 5371786 5191327 4775002 4653262 4646873
4714 4646873 4540838 4455615 4363281 4395773 4188599 4282523 4185016 4307487 4492386 4406730 4125411
4703 4125411 4412725 4556365 4546250 4335847 4187695 4163739 4141366 4183591 3809304 3647318
4693C647318j95341R223K1666j29036L8515l09489l8866L17296j12012J46942
4683C396216K1785l02028Q9856m1834J40286J90325m7376k3639M4695j11043j15513
4672C241730L55075K92671K15164L52445N2834P4596L02434j08127L3997j242
4662D811577j60454m06420k02867j73827l28285l15627n9944L4547k9537J76580
4652C345743q3006j09852J99611J03442j93446j28222r6937J36373N8474O2567
4642C294747r4479k04737K42827N265O2538o474j21468J59655N5732K61640M5519
4631C700765J8877M8134k23009J09737M7480k04157J39409J51696l837R529P4471
4620C869095L0089L3455j88635R9242J11507o4947N1512R9046j27881L7485j1427
$$ plain form
4693 3647318 3451977 3461200 3482866 3353830 3392345 3082856 3043990 3361286 3249274 3396216
4683 3396216 3418001 3115973 3205829 3163995 3304281 3494606 3447230 3423591 3468286 3357243 3241730
4672 3241730 3596805 3889476 4104640 4457085 4509919 4584515 4886949 4778822 4812819 4811577
4662 4811577 4651123 4244703 4041836 3868009 3539724 3224097 3164153 3198700 3169163 3345743
4652 3345743 3262737 3152885 3352496 3455938 3262492 3134270 3037333 3173706 3232180 3294747
4642 3294747 3200268 2995531 3238358 3243623 3306161 3299687 3178219 3337874 3393606 3655246 3700765
4631 3700765 3719642 3767776 3544767 3654504 3701984 3497827 3637236 3788932 3785095 3794624 3869095
4620 3869095 3899184 3932639 3744004 3843246 3954753 3889806 3941318 4040364 3912483 3949968 3938541
4609C938541k0971K10448j9747J78181J45214K56595j57468K200L28508j9173
4599D842328K25680J57739n2912K33525K05469M7691j27436R5255K61566L61473
4589F250378L86503K50204J88822P6875K71798L51034J18060K89304L28768K85056
4579H796802J20040M95134K53620J51801Q7294K90644J66886M06468J87691J0098
4569A0966478J22751L59543j7037J68262L78538K59796O5774K20936J01602J36380
4559A2763023K19652L08465J32233l37738J21779J76199L36909M51746L44489
4550A4516757K27263J83565M49619L88459L87148J01106N87019M40666N28070
4541A7809672L36607K66291N68856N26166N44816N83519K08876L09467M00810
$$ plain form
4609 3938541 3917570 4128018 4108271 4286452 4431666 4688261 4530793 4532993 4861501 4842328
4599 4842328 5068008 5225747 5172835 5406360 5611829 5659520 5532084 5627339 5888905 6250378
4589 6250378 6636881 6887085 7075907 7152782 7424580 7775614 7893674 8182978 8511746 8796802
4579 8796802 8916842 9411976 9665596 9817397 9904691 10195335 10362221 10768689 10956380 10966478
4569 10966478 11089229 11448772 11431735 11599997 11978535 12238331 12304105 12525041 12626643 12763023
4559 12763023 12982675 13291140 13423373 13085635 13207414 13383613 13720522 14172268 14516757
4550 14516757 14744020 14927585 15377204 15765663 16152811 16253917 16840936 17281602 17809672
4541 17809672 18146279 18412570 18981426 19507592 20052408 20635927 20844803 21154270 21555080
4532B1555080j3468k681K44442J31053K29873K96648J10165M65338M34146J59962
4522B3610558J79008N07812j90880M32823L99060M63479L33155J60470L91398
4513B6286883K26211O87703O70169L67816K66324M70865P78546O13793N96320
4504C0964630M48444N69494K92812K37061M14276O51714M00344K01008M78727
4495C4658510M87256O06702O77232M68002L88666M38804P87616N62617L61733
4486C9437138M00798O84824M22604O83220P02002N95864P89595J330635J071601
4477D6118281J103262J031450Q11804J082225J375749J620701J662045J955286
4469E6760803K286198K524969K800389L055829L938715M450868M800982N477820
$$ plain form
4532 21555080 21541612 21538931 21783373 21914426 22144299 22440947 22551112 23016450 23450596 23610558
4522 23610558 23789566 24297378 24106498 24539321 24938381 25401860 25735015 25895485 26286883
4513 26286883 26513094 27200797 27870966 28238782 28505106 28975971 29754517 30368310 30964630
4504 30964630 31413074 31982568 32275380 32512441 32926717 33578431 33978775 34179783 34658510
4495 34658510 35145766 35752468 36429700 36897702 37286368 37725172 38512788 39075405 39437138
4486 39437138 39837936 40522760 40945364 41628584 42330586 42926450 43716045 45046680 46118281
4477 46118281 47221543 48252993 49064797 50147022 51522771 53143472 54805517 56760803
4469 56760803 59047001 61571970 64372359 67428188 71366903 75817771 80618753 86096573
4461H6096573O962475P893588R450557J1125461J2883064J4489920J7598116K1042911
4453A87542665K6125216K9784249L2398960L2228076L1484847L5594123M2180662
4446D17338798K6517737J199160l3832891o3774897o4773242n4565249l8477275
4439A89632141k7028150j9300721j5308976j1907701r799572q213873o942901
4432I1130247n619543n123510m127229l597844k885512k503219j960701j744952
4424F3567737j563947j099003j122029r72322n87070o82242p42015q36553n50700
4415E5411856k60469m3965j5161O05992K19865N08448P10184R92544J221158J591052
4405F0941504J949764K194132K531200L072660L536239M222804M989549O085048
$$ plain form
4461 86096573 93059048 100952636 110403193 121528654 134411718 148901638 166499754 187542665
4453 187542665 213667881 243452130 275851090 308079166 339564013 375158136 417338798
4446 417338798 443856535 445055695 411222804 347447907 282674665 228109416 189632141
4439 189632141 162603991 143303270 127994294 116086593 106287021 98073148 91130247
4432 91130247 85510704 80387194 76259965 72662121 69776609 67273390 65312689 63567737
4424 63567737 62003790 60904787 59782758 58810436 58223366 57541124 56799109 55962556 55411856
4415 55411856 55151387 55107422 55092261 55698253 55918118 56426566 57136750 58129294 59350452 60941504
4405 60941504 62891268 65085400 67616600 70689260 74225499 78448303 83437852 89522900
4397H9522900P627694R066764J0030665J2304465J5061845J8264767K2780206
4390A84659306K6482537K8393445L0913987L0390184L1400934M0365033L1747047
4383D04352473M322541o703150l2121974n5180979n6360640n0787641l6805143
4376A70715487k5868638j8659349j4825184j1638109r080238p307047o094787
4369G7242135n303887m585043l658979l142570k404249k603165k955323l158188
4361D9430731k803852k816237k343538k187960j741797j827633j640568j632118
4353C2437028j317437j465665j142812r73851r95146q10767p53132p30725p33043
4344B3514450p65837o56786n47270m72852p76745n92195q17352p07259n81528
$$ plain form
4397 89522900 97150594 106217358 116248023 128552488 143614333 161879100 184659306
4390 184659306 211141843 239535288 270449275 300839459 332240393 372605426 404352473
4383 404352473 408675014 401971864 369849890 314668911 258308271 207520630 170715487
4376 170715487 144846849 126187500 111362316 99724207 90643969 83336922 77242135
4369 77242135 71938248 67353205 63694226 60551656 58147407 55544242 52588919 49430731
4361 49430731 46626879 43810642 41467104 39279144 37537347 35709714 34069146 32437028
4353 32437028 31119591 29653926 28511114 27537263 26542117 25731350 24978218 24247493 23514450
4344 23514450 22748613 22091827 21544557 21071705 20294960 19702765 18885413 18178154 17596626
4335A7596626m95685o45609n00573m54718l14588k64701l98148k50199k96447
4326A3975958m50360k00983k84331k89973l55152m09774o5782l02556k89782l15443
4316A1011822k7033l45410m46225k25084j86639k45744l95776P4200n7416q0256
4306I076439k98748j30116m53633n8509J54599k09594k00802j93141K0414j46252
4296G560657l62949P0799j88912k97562J48143L4251r6334L59762j39507k3139
4286G065209k31776R4914J76840k79152p6479o2885m3836J12043n8569J55525
4276F851834j2179p4599O2907k00071J37736k21266j36943l6450j45P3900j59016
4265F285708m714j50123l4157N0033J04439o430j44236L9404R5059M7890P993
$$ plain form
4335 17596626 17100941 16455332 15954759 15500041 15185453 14920752 14522604 14272405 13975958
4326 13975958 13525598 13324615 13040284 12750311 12395159 11985385 11919603 11617047 11327265 11011822
4316 11011822 10984789 10639379 10193154 9968070 9781431 9535687 9139911 9214111 9156695 9076439
4306 9076439 8777691 8647575 8193942 8135433 8290032 8080438 7879636 7686495 7706909 7560657
4296 7560657 7197708 7268507 7079595 6782033 6930176 6964427 6868093 7227855 7088348 7065209
4286 7065209 6833433 6928347 7105187 6826035 6749556 6686671 6642835 6754878 6696309 6851834
4276 6851834 6839655 6765056 6827963 6627892 6765628 6544362 6407419 6370969 6370824 6444724 6285708
4265 6285708 6280994 6130871 6096714 6146747 6251186 6244756 6100520 6139924 6234983 6282873 6290866
4254F290866j43655J64705r8334r8255R744M7982k09519k4124J30063q8964J30272
4243F110781M1605J97631J31802n245m4249J14717k49096j63495L07029p1034
4233F370446j91381Q7834r9071k20277q5912O5401J06917O6070J91253j04720
4223F186560n6944K47165j12967r908P3001J49070j52143J63766o1760J10133
4213F535973N7923J65285n1126J71146l1750K3812J36614J26162R3835P0922j29911
4202G168885k00662M5555M68148M43079j37474P7636J61144R4797N33984K95455
4192H950547N01773K52341L32123L81935O31442O48085L74123l27161p46629o09654
4182A0388925p67576j63343k81048j89171j8454J73514P0260K44590M6237j73380
$$ plain form
4254 6290866 6147211 6311916 6213582 6115327 6125071 6173053 5963534 5939410 6069473 5980509 6110781
4243 6110781 6152386 6350017 6481819 6476574 6432325 6547042 6297946 6134451 6441480 6370446
4233 6370446 6179065 6266899 6167828 5947551 5861639 5927040 6033957 6100027 6291280 6186560
4223 6186560 6129616 6376781 6263814 6253906 6326907 6475977 6323834 6487600 6425840 6535973
4213 6535973 6593896 6759181 6708055 6879201 6847451 6871263 7007877 7134039 7227874 7298796 7168885
4202 7168885 6968223 7013778 7481926 7925005 7787531 7865167 8026311 8121108 8655092 8950547
4192 8950547 9452320 9704661 10036784 10418719 11050161 11698246 12072369 11745208 10998579 10388925
4182 10388925 9621349 9458006 9176958 8987787 8969333 9142847 9213107 9457697 9503934 9330554
4172I330554N29808M35584L38707K77063K31957j2101k17971j89197J00562n6666
4162A0768300l478q0816l64657j38650j62403k96057k01918j2520k1395m6482
4152I439924P3645J8262K6163K97524J4565o894K2625l693j37796M380K01237
4141I949942p8975J25793N9704L32778J40033j6724J51456J94024L5196J96460
4131A1089687M0910L989k34808k77646L68359M6435j72798R1628J4502j7145M0046
4120A0993159j01250K18683K90421J96263k1413r515L86778L12705j29414j7418
4110A2118999n0358J91640J54318L10410J29182M90576L17218K79926R9770K99990
4100A4341671M32510M14096M5444p4380j51170m90755j76146j69817q0818l24602
$$ plain form
4172 9330554 9860362 10295946 10634653 10911716 11143673 11131572 10913601 10724404 10824966 10768300
4162 10768300 10764822 10684006 10319349 10180699 10018296 9722239 9520321 9507801 9486406 9439924
4152 9439924 9513569 9531831 9557994 9855518 9870083 9863189 9885814 9882121 9744325 9748705 9949942
4141 9949942 9870967 9996760 10056464 10389242 10529275 10512551 10664007 10858031 10893227 11089687
4131 11089687 11130597 11134586 10899778 10622132 10990491 11036926 10864128 10955756 10970258 10953113 10993159
4120 10993159 10891909 11110592 11401013 11597276 11575863 11566348 11953126 12265831 12136417 12118999
4110 12118999 12068641 12260281 12414599 12725009 12854191 13344767 13661985 13941911 14041681 14341671
4100 14341671 14774181 15188277 15233721 15159341 15008171 14517416 14341270 14171453 14090635 13766033
4090A3766033N1472M05304n0981Q5028J64770K41178K15444J55720K61289K62250
4080A5557507j32940M19351J83513L07660J41374J50848q6232j00886j2319o6247
4070A6361629l19311p9569K37175r1031m1692K23928j40643k91623n2851j10932
4060A5695080K77686J14702o0284j30285L2289J91432M2801K76163K13068P0658
4050A6723310K36717L83609N98660J10225L17923J04692K4530K22095J3217L0939
4040A8765917K00691K11414J72950K75815P2785k94618j96595K07547R7186L273
4030A9516365j26748J33947K45411J15923J89186L6716M07527M04820M96927L20191
4020B1740265J93260q6127p0283l4450k22281n4188r3156j8215Q3259m0373K60576
$$ plain form
4090 13766033 13817505 14222809 14171828 14256856 14421626 14662804 14878248 15033968 15295257 15557507
4080 15557507 15424567 15843918 16027431 16335091 16476465 16627313 16541081 16440195 16427876 16361629
4070 16361629 16042318 15962749 16199924 16108893 16067201 16291129 16150486 15858863 15806012 15695080
4060 15695080 15972766 16087468 16027184 15896899 15929188 16120620 16163421 16439584 16652652 16723310
4050 16723310 16960027 17343636 17942296 18052521 18370444 18475136 18499666 18721761 18734978 18765917
4040 18765917 18966608 19178022 19350972 19626787 19699572 19404954 19208359 19415906 19513092 19516365
4030 19516365 19389617 19523564 19768975 19884898 20074084 20110800 20518327 20923147 21420074 21740265
4020 21740265 21933525 21847398 21777115 21742665 21520384 21466196 21373040 21354825 21438084 21397711 21658287
4009B1658287J59126p4302J39784P6624j39937O5951J29422J86871j01989J48369
3999B2248206L30743Q0936j92944M7519n5811M174L43583N29576L9600K3410P5764
3988B3474756N13414R8596J81919J30911q6481N3199r2403K66916J21046J99499
3978B4861372K36771L09858J25631L10626K63813O14521M44302N72676O36114
3969B8375684P02309P44682Q46685J119791R47220J268614J357637J223710J100842
3960C7687174J501143J489449J622255J907403J945491J844991J008568m19784
3952D8586690j799077k344837j773142j392926q72328n67458n09483j50399n28205
3943C8648835n59383l20984k06226l33246J42582N97561M65650N56955P02647
$$ plain form
4009 21658287 21817413 21743111 21882895 21959519 21819582 21885533 22014955 22201826 22099837 22248206
3999 22248206 22578949 22659885 22466941 22514460 22458649 22462823 22806406 23335982 23375582 23398992 23474756
3988 23474756 23988170 24086766 24268685 24399596 24313115 24366314 24273911 24540827 24661873 24861372
3978 24861372 25098143 25408001 25533632 25844258 26108071 26722592 27166894 27739570 28375684
3969 28375684 29077993 29822675 30669360 31789151 32736371 34004985 35362622 36586332 37687174
3960 37687174 39188317 40677766 42300021 44207424 46152915 47997906 49006474 48586690
3952 48586690 46787613 44442776 42669634 41276708 40404380 39836922 39327439 39177040 38648835
3943 38648835 38089452 37768468 37562242 37228996 37371578 37969139 38434789 38991744 39694391
3934C9694391R82804Q23975R53895J615491J079253J172103J080857P54808P93971
3925D8951548j78569k95506m45951n52838o60411o78739p99139p07496k62751
3916D4370148Q2137J01272K1443L27714P05518Q07560R71621Q71845J214449J415905
3906E0889612J303950J561298J194858R99374L18466P28401J038603J029941J486414
3897F0550917J668487J518059J679458J596696J020405N93717M62357p9158m71329
3888F8539609p65296j685261k565627k390406k358784j886984j207151l25616
3880E5354484q3753L58128P58621N84414J031103J007759J201252J171197J369558
3871F2752763J316917J010017M26366k37758l72824o11829l47617N02445R03689
$$ plain form
3934 39694391 40677195 41501170 42455065 44070556 45149809 46321912 47402769 48157577 48951548
3925 48951548 48772979 48477473 48031522 47478684 46818273 46139534 45340395 44632899 44370148
3916 44370148 44452285 44553557 44575000 44902714 45608232 46415792 47387413 48259258 49473707 50889612
3906 50889612 52193562 53754860 54949718 55949092 56267558 56995959 58034562 59064503 60550917
3897 60550917 62219404 63737463 65416921 67013617 68034022 68627739 69090096 69010938 68539609
3888 68539609 67774313 66089052 63523425 61133019 58774235 56887251 55680100 55354484
3880 55354484 55270731 55628859 56387480 56971894 58002997 59010756 60212008 61383205 62752763
3871 62752763 64069680 65079697 65506063 65268305 64895481 64283652 63936035 64438480 65342169
3862F5342169J448252J401020J686079K324797K499843K014345L51625j64332
3854G6903798j87794j83424J40261J39243K11290k84512m02757j21296k74629
3845G5940180n63679n44440n16826m90401q9495K55953O91862Q13880Q80139J336413
3835G7713586J896339K142137K210523K536328K900309L269262L399160M161914
3827A00229558M246118M888247M939745N524613O423917O834459Q242559J0644877
3819A51974093J3364299J6826295K0339045K1432399K1803338K1293466K0853647
3812B87886582K5447968K0323996j0996164l6404561m2443058l5779375k5790479
3805A82244909j9513349j4591095j1215389q320596o669121m835461m059469k885801
$$ plain form
3862 65342169 66790421 68191441 69877520 72202317 74702160 76716505 77068130 76903798
3854 76903798 76716004 76532580 76672841 76812084 77023374 76738862 76336105 76214809 75940180
3845 75940180 75376501 74832061 74315235 73824834 73735339 73991292 74683154 75497034 76377173 77713586
3835 77713586 79609925 81752062 83962585 86498913 89399222 92668484 96067644 100229558
3827 100229558 104475676 109363923 114303668 119828281 126252198 133086657 141329216 151974093
3819 151974093 165338392 182164687 202503732 223936131 245739469 267032935 287886582
3812 287886582 313334550 333658546 322662382 286257821 243814763 208035388 182244909
3805 182244909 162731560 148140465 136925076 128604480 121935359 117099898 113040429 110154628
3797A10154628j668001j066973o52094J54150J128979J128428J798389K624524
3789A13602030L551652M662670N264055N777315O332956O250365O297437N691846
3781A57430326N062416J951735m286129p863572q447604o931810n317836m499895
3773A27097631l812655l289170k449305j683224j433579p34951l66132J09253
3765A13437868O26125Q18443J256908J467115J468441K345238K391499K805936
3757A26617573K575768K655801K346942K384969K482794K799404L018321K967265
3749A47848837L214984L229076L484776L284233L404613L325996L072702L107831
3741A73973048K922453K477049K348930K346789K233381J661643J253638J142403
$$ plain form
3797 110154628 108486627 107419654 106767560 106921710 108050689 109179117 110977506 113602030
3789 113602030 117153682 121816352 127080407 132857722 139190678 145441043 151738480 157430326
3781 157430326 162492742 164444477 160158348 152294776 143847172 136915362 131597526 127097631
3773 127097631 123284976 119995806 117546501 115863277 114429698 113694747 113328615 113437868
3765 113437868 114063993 114882436 116139344 117606459 119074900 121420138 123811637 126617573
3757 126617573 129193341 131849142 134196084 136581053 139063847 141863251 144881572 147848837
3749 147848837 151063821 154292897 157777673 161061906 164466519 167792515 170865217 173973048
3741 173973048 176895501 179372550 181721480 184068269 186301650 187963293 189216931 190359334
3733A90359334N76926P28395Q99392P33678Q50669J073067J563246J785284J903064
3724B00473055K131963K121964K130439K303753K325685o19759l355794m229486
3716B03281820l442461k589104k080523j615792j327437r41678o99445j60676
3708A90424704J37146Q8824J95573J87626O8785j42358o43948j081905j415936
3699A87818511j799854j803571j790444j805545j438778j171971o72189n52414
3691A76783745l69804J04976L26312R88269J552125J817824K940888L274319M414501
3682A91833155N360007O299574P717340R478202J1083999J2791728J4145543J5762221
3674B74471769J6664152J7383435J7631166J6874387J4654123J1694135P470223
$$ plain form
3733 190359334 190936260 191664655 192564047 193297725 194148394 195221461 196784707 198569991 200473055
3724 200473055 202605018 204726982 206857421 209161174 211486859 210867100 207511306 203281820
3716 203281820 199839359 197250255 195169732 193553940 192226503 191284825 190585380 190424704
3708 190424704 190561850 190650674 190846247 191033873 191102658 190960300 190316352 189234447 187818511
3699 187818511 186018657 184215086 182424642 180619097 179180319 178008348 177336159 176783745
3691 176783745 176413941 176518917 176845229 177833498 179385623 181203447 184144335 187418654 191833155
3682 191833155 197193162 203492736 211210076 220688278 231772277 244564005 258709548 274471769
3674 274471769 291135921 308519356 326150522 343024909 357679032 369373167 376843390
3667C76843390L086814p18468m471243o535081p482294p898321p506708p093875
3659C38224214p065737p279536q109043r413155j1132896j2878840j4740892j5418024
3651B52186091j6106515j5237635j3717710j2171106j0750281r132481p874000
3644A67196363p001945n777844m697534m406102m176794l918757m209165m032611
3636A28975611l524850l018355k646700j934599j659467q47040n06836m74658
3628A14363106J17951L76963N45767P94552R73073J362390J748751K090767K728243
3619A25101563L469152L572521M425063M975314N259011M966927N016226N238884
3611A62024661M769065M012803L305912L057353L628181M251553N318930O075800
$$ plain form
3667 376843390 379930204 379211736 374740493 368205412 360723118 352824797 345318089 338224214
3659 338224214 331158477 323878941 315769898 306356743 295223847 282345007 267604115 252186091
3651 252186091 236079576 220841941 207124231 194953125 184202844 175070363 167196363
3644 167196363 160194418 154416574 149719040 145312938 141136144 137217387 133008222 128975611
3636 128975611 125450761 122432406 119785706 117851107 116191640 115344600 114837764 114363106
3628 114363106 114481057 114858020 115403787 116198339 117171412 118533802 120282553 122373320 125101563
3619 125101563 128570715 132143236 136568299 141543613 146802624 151769551 156785777 162024661
3611 162024661 166793726 170806529 174112441 177169794 180797975 185049528 190368458 196444258
3603A96444258O743966P172147P123047O783941N803052M475615L010994K150162
3595B39707182J499157J168386R81307R76227P18602R68103J150853J024032N79424
3586B48773273n53255k021372l585718o051545q152768j0454521j1836193j2410914
3578A93706987j2266282j1190678j0191891q728414o966122n148009m270051l349415
3570A31596125k127502j280011p47695m61964p21997j117567j014148j043494
3562A23081747r20799m04942M36702J056061O89989J05821m94267o96070j259054
3553A21595188k051908l390727m395686m612380m818089m077787l779854l200669
3545I1268088k690904k547840k363872j686675j164565r91292l57314p391J20642
$$ plain form
3603 196444258 203188224 210360371 217483418 224267359 230070411 234546026 237557020 239707182
3595 239707182 241206339 242374725 243356032 244332259 245050861 246018964 247169817 248193849 248773273
3586 248773273 248220018 246198646 242612928 236561383 228408615 217954094 206117901 193706987
3578 193706987 181440705 170250027 160058136 151329722 144363600 139215591 134945540 131596125
3570 131596125 129468623 128188612 127440917 126978953 126256956 125139389 124125241 123081747
3562 123081747 122160948 121756006 122192708 123248769 123938758 124044579 123550312 122854242 121595188
3553 121595188 119543280 116152553 111756867 107144487 102326398 98248611 94468757 91268088
3545 91268088 88577184 86029344 83665472 81978797 80814232 79822940 79465626 79458235 79578877
3536G9578877K99117Q5119j3945o30898o36466r54717j184821j547855j507751
3527G3486660j468660j343195j505554j922142k121574k235851j513922r62442
3519F0413320m31125k94377k34034L7692o28985p31021q88610r13079p38960o05252
3509E4985569l44776p07383r97289j253171j367775j449293j111648j257459j095284
3500D5401491q98904q35075r32908o60999k81109m28669l03687j28565L2795K17758
3490D1182128K51148M46677O92425P37034O19023L65517O56520Q38248M78210
3481D6266930K38953L79739L50571K47862J46640M61446O35783P62692J255893
3472E0746509J047866J269501J040823J007018J083009J076311J057145J334786
$$ plain form
3536 79578877 79877994 79963113 79949168 79318270 78681804 77727087 76542266 74994411 73486660
3527 73486660 72018000 70674805 69169251 67247109 65125535 62889684 61375762 60413320
3519 60413320 59982195 59687818 59453784 59491476 58862491 58131470 57242860 56329781 55590821 54985569
3509 54985569 54640793 53933410 52936121 51682950 50315175 48865882 47754234 46496775 45401491
3500 45401491 44502587 43667512 42734604 42073605 41792496 41363827 41060140 40931575 40964370 41182128
3490 41182128 41433276 41879953 42572378 43309412 43928435 44293952 44950472 45788720 46266930
3481 46266930 46505883 46885622 47236193 47484055 47630695 48092141 48727924 49490616 50746509
3472 50746509 51794375 53063876 54104699 55111717 56194726 57271037 58328182 59662968
3464E9662968J310079J382348J504976J492603J297039J477550J246638J340231
3456G0714432J014257J055145J010764R43682J144714Q37978P52148Q54615J145299
3447G9473034J040531J183327J331003J414286J485708J715216J918917J945045
3439I1507067K147209K747981L048611L479350M070831M113802M862423N594669
3431A21571943O149388O652348P289853P905559Q525286R340968J0274405J0866466
3423A88576216J1607000J2836088J3214351J3716910J3865820J2990915J1636413
3416B78443713J0204709Q491042P690219P271869P682744P977987Q431843Q707579
3408C44901705Q455676P239717N916960K967908K16674k667528n529135p281054
$$ plain form
3464 59662968 60973047 62355395 63860371 65352974 66650013 68127563 69374201 70714432
3456 70714432 71728689 72783834 73794598 74738280 75882994 76720972 77473120 78327735 79473034
3447 79473034 80513565 81696892 83027895 84442181 85927889 87643105 89562022 91507067
3439 91507067 93654276 96402257 99450868 102930218 107001049 111114851 115977274 121571943
3431 121571943 127721331 134373679 141663532 149569091 158094377 167435345 177709750 188576216
3423 188576216 200183216 213019304 226233655 239950565 253816385 266807300 278443713
3416 278443713 288648422 297139464 304829683 312101552 319784296 327762283 336194126 344901705
3408 344901705 353357381 360597098 366514058 369481966 369698640 367031112 361501977 354220923
3400C54220923q336988q007348p021342n875188n017171l877666l193851k981159
3392C09910210l671722n110980o418983p216050q025120q001077p605607o560343
3384B57300328n623086m338652k664827j775276p93557q52850j494162j899718
3376B37858200k789899l794522m917496n876100n635220o004733o107738n807144
3368A96925348n192347m305790m353718m182558m668994n152539n488200o297193
3360A57284009o556347o373327n676119m709939m112070l246172k615965k020628
3352A21973442j699283j378292r05143m38196K8615K30420O20424P99520Q46184
3343A20077691J196174J506445J676520J812681J243767M19538j77243l04227
$$ plain form
3400 354220923 345883935 337876587 330855245 324980057 319962886 316085220 312891369 309910210
3392 309910210 306238488 301127508 294708525 287492475 279467355 271466278 263860671 257300328
3384 257300328 251677242 247338590 244673763 242898487 242104930 241252080 239757918 237858200
3376 237858200 235068301 231273779 226356283 220480183 214844963 208840230 202732492 196925348
3368 196925348 191733001 187427211 183073493 178890935 174221941 169069402 163581202 157284009
3360 157284009 150727662 144354335 138678216 133968277 129856207 126610035 123994070 121973442
3352 121973442 120274159 118895867 117990724 117552528 117581143 117811563 118431987 119231507 120077691
3343 120077691 121273865 122780310 124456830 126269511 127513278 127932816 127755573 127451346
3335A27451346l55125j048415r38647o06070L38063J138019J606873K041504K369777
3326A31997325K457634K883100L392423L099128L345483L257136K868265K976109
3318A56276603L170704K649628J474927J133253M46482K02938J71822L2383r33086
3309A64625654j425188j357290j003503j729583m236502o085004o636295n041191
3301A37111098k722691j294409n42860k12152K35713R02149J349206J132390K46657
3292A36205101r11578k580706l867690m758074m891287m653871m301909m254705
3284A05985281m608403m870860m736454l773973k493956j290437q37020j021302
3276H2352876p86023o11173n30702l80008R0200N07963N72430K48919K43012m60403
$$ plain form
3335 127451346 127096221 126047806 125109159 124503089 124841152 125979171 127586044 129627548 131997325
3326 131997325 134454959 137338059 140730482 143829610 147175093 150432229 153300494 156276603
3318 156276603 159447307 162096935 163571862 164705115 165151597 165354535 165526357 165558740 164625654
3309 164625654 163200466 161843176 160839673 159110090 154873588 148788584 142152289 137111098
3301 137111098 134388407 133093998 132551138 132338986 132574699 133476848 134826054 135958444 136205101
3292 136205101 135293523 132712817 128845127 124087053 119195766 114541895 110239986 105985281
3284 105985281 101376878 96506018 91769564 87995591 85501635 84211198 83374178 82352876
3276 82352876 81566853 80955680 80424978 80044970 80135170 80643133 81215563 81464482 81707494 81247091
3266H1247091j269440j875769k697616l248337l261216k803587l093883l000797
3258E9996446k873301k501875j443421j084671n82650l69340l81606J09574j70065
3249E0699091m69190j014705j388736j449749j438486j096661j122735o28186
3241D2090643q66462p92767j024399j050578j259729j219860p26158p29695j45405
3232C4275590j28743m94840q67187j085954j057780q38142o14062p55196o29456
3223B7804230j050593j180242r08099j174876r82959p70773m09012k36039m58510
3214B0633127j87075n56882l10359l12962r25041o73469p48530m64447j27129
3205A6327233q7013l94620j63183k65188P610O8660k76048j03907m92434p04300
$$ plain form
3266 81247091 79977651 78101882 75404266 72155929 68894713 66091126 62997243 59996446
3258 59996446 57123145 54621270 53177849 52093178 51510528 51141188 50759582 50869156 50699091
3249 50699091 50229901 49215196 47826460 46376711 44938225 43841564 42718829 42090643
3241 42090643 41224181 40431414 39407015 38356437 37096708 35876848 35150690 34420995 34275590
3232 34275590 34146847 33652007 32784820 31698866 30641086 29802944 29188882 28433686 27804230
3223 27804230 26753637 25573395 24665296 23490420 22507461 21736688 21327676 21091637 20633127
3214 20633127 20446052 19889170 19578811 19265849 18340808 17667339 16918809 16454362 16327233
3205 16327233 16240220 15845600 15682417 15417229 15424839 15493499 15217451 15113544 14621110 13916810
3195A3916810n18739n78674p13537k01293l25661j91410m6722m4326l49609k31925
3185A0714914j50299p5789m9254m2506j34018j22296k26554r1677J19757R4192
3175A0036470J46847l15101J0245J69969k7439n0824K21887J37849j44895p9918
3165A0105090K2173R9948J58790K51943J09992N6966O3523L56991K13432M3592
3155A1482440J093J21323O0242K162K87289J43286J72970K74346J3213N428K43798
3144A2807590J1710K31555j18740P5712M38389K22038j7295J28748M3790J07472
3134A3930969J54705K99727J47149K42948P0962J72270K23557N4620K90057M67424
3124A6054388K09576R4487K59072N99567M66147K24681N16847N18177J53467L62523
$$ plain form
3195 13916810 13398071 12819397 12105860 11904567 11578906 11387496 11340774 11296448 10946839 10714914
3185 10714914 10564615 10488826 10439572 10397066 10263048 10140752 9914198 9822521 9942278 10036470
3175 10036470 10183317 9868216 9878461 10048430 10020991 9970167 10192054 10329903 10185008 10105090
3165 10105090 10127263 10227211 10386001 10637944 10747936 10804902 10868425 11225416 11438848 11482440
3155 11482440 11483533 11604856 11665098 11667260 11954549 12097835 12270805 12545151 12558364 12563792 12807590
3144 12807590 12819300 13050855 12932115 13007827 13446216 13668254 13650959 13779707 13823497 13930969
3134 13930969 14085674 14385401 14532550 14775498 14846460 15018730 15242287 15296907 15586964 16054388
3124 16054388 16263964 16358451 16617523 17217090 17683237 17907918 18424765 18942942 19096409 19458932
3114A9458932M31484M55079M57215L93310K29967K77855L07410N64495M11409
3105B2987156N03282N23712M55912J39758P23816N63483L79984M95282O98584
3096B7470969N93556N93142J017582J058551Q40825Q39701J180007J026732J438342
3087C6059407J502766J472846J716360J733176J843075K131705K185565K629338
3079E1274238K939159L178892L515434M047710M276783M546632N122845N151625
3071H4053318M701738M373357L229279J827386r37410l494205n703587p753552
3063H0296324q373198p723221p087988o207929m904921m059909l303831k837036
3055C5798291k889601k219748j952472j765326j630368j380552j100437p35653
$$ plain form
3114 19458932 19890416 20345495 20802710 21196020 21425987 21703842 22011252 22575747 22987156
3105 22987156 23490438 24014150 24470062 24609820 25333636 25897119 26277103 26772385 27470969
3096 27470969 28064525 28657667 29675249 30733800 31574625 32414326 33594333 34621065 36059407
3087 36059407 37562173 39035019 40751379 42484555 44327630 46459335 48644900 51274238
3079 51274238 54213397 57392289 60907723 64955433 69232216 73778848 78901693 84053318
3071 84053318 88755056 93128413 96357692 98185078 97247668 93753463 88049876 80296324
3063 80296324 71923126 64199905 57111917 50903988 45999067 41939158 38635327 35798291
3055 35798291 32908690 30688942 28736470 26971144 25340776 23960224 22859787 22124134
3047B2124134j022554p87641p92027o61033n29852o13327o45034n09087o64356
3038A5899223o61164q24739l75873n46913l63864l39149l61665m24233j11588
3029A1890035j06661j65920m46513m84616l21226k48311k92142k96792j26443
3020I401411l22287k36664j19277j03730N5688o3116n87902L0495l14716o5167
3010G674735j51152l21431k31622O057j72155l40957j42479P4603j39506j19858
3000F136235k08554k68157m4739j62345p6090j96249j73750n9513k11879L0858
2990D765817J42719j28793j65690k04804j8742N7362m66965j05155O7672j28197
2980C815224M0001R838M6904l23155k32594J55551L217J64532k15399O745k80334
$$ plain form
3047 22124134 21101580 20313939 19521912 18860879 18331027 17717700 17072666 16563579 15899223
3038 15899223 15238059 14413320 14037447 13490534 13126670 12787521 12425856 12001623 11890035
3029 11890035 11783374 11617454 11170941 10686325 10365099 10116788 9824646 9527854 9401411
3020 9401411 9079124 8842460 8723183 8619453 8675141 8612025 8024123 8054618 7739902 7674735
3010 7674735 7523583 7202152 6970530 6976587 6804432 6463475 6320996 6395599 6256093 6136235
3000 6136235 5927681 5659524 5614785 5452440 5376350 5180101 5006351 4946838 4734959 4765817
2990 4765817 4908536 4779743 4614053 4409249 4390507 4447869 3980904 3875749 3943421 3815224
2980 3815224 3855225 3865063 3911967 3588812 3356218 3511769 3514986 3679518 3464119 3470864 3190530
2969C190530r7120J17751N3341j3653k97080J11699K664j91160n8586J13250L9907
2958B971543l06966J3559K51299l748j77497j07209M0730J8499l68524j9703Q4129
2947B396112N1432L3606k99773n1554k6238J81672o8326o0460K22375j54722j37640
2936B086484R6131m795n339K76901j22717l66744K87923J48328k59110k55901
2926A881161R5119J73649j22694N0746j38230m6421n804J04954j21677n4036o125
2915A810642O129N5225k41959O6339p6050l6069J69900l6614r3715k27960J16427
2904A512295J64378n3447k4207q9354J27131K55812j17203J20384n7472k02208
2894A636109N2000j41710K1873K64481O954k55725j64580K23928j94615K3051
$$ plain form
2969 3190530 3093410 3211161 3264502 3250849 2953769 3065468 3068132 2876972 2818386 2931636 2971543
2958 2971543 2664577 2678136 2929435 2925687 2748190 2640981 2681711 2700210 2331686 2311983 2396112
2947 2396112 2447544 2481150 2181377 2129823 2103585 2285257 2216931 2156471 2378846 2224124 2086484
2936 2086484 2182615 2177820 2172481 2449382 2326665 1959921 2247844 2396172 2137062 1881161
2926 1881161 1976280 2149929 2027235 2077981 1939751 1893330 1887526 1992480 1870803 1816767 1810642
2915 1810642 1816771 1871996 1630037 1696376 1620326 1584257 1754157 1717543 1623828 1395868 1512295
2904 1512295 1676673 1623226 1599019 1509665 1636796 1892608 1775405 1895789 1838317 1636109
2894 1636109 1688109 1546399 1568272 1832753 1839707 1583982 1419402 1643330 1448715 1471766
2884A471766J23784Q1523j02899l0837q0765J82782K10635k73307m7506K44943
2874A780119M763j45750j6642J92894L9821j53004L2398k08283k1974P5843n9122
2863A521063o3864K92821m7808o5306m6666J03546J73717j39703j42528J97759
2853A783031l592J60142j56301O223L5680J2766J71840q6358p5574o8779k45790
2842A533288K64368J08500K9145J48460n4262j54584K5934j02266J29424j9171
2832A908836M4440P4530J33363M4106J65121J11640k01276j26514K94030R5511
2822B543787j17210N8214j34834j83411J12876K69128m2901L88300L3784j30705
2812B797028r3064k29147J76422J60765N0000J36038l6391r6786p9004J21499
$$ plain form
2884 1471766 1595550 1677073 1574174 1543337 1462572 1645354 1855989 1582682 1535176 1780119
2874 1780119 1784882 1639132 1622490 1815384 1855205 1702201 1734599 1526316 1504342 1580185 1521063
2863 1521063 1457199 1750020 1702212 1636906 1590240 1693786 1867503 1727800 1585272 1783031
2853 1783031 1779439 1939581 1783280 1789503 1825183 1837949 2009789 1923431 1847857 1779078 1533288
2842 1533288 1797656 1906156 1935301 2083761 2029499 1874915 1900849 1798583 1928007 1908836
2832 1908836 1953276 2027806 2161169 2205275 2370396 2482036 2280760 2154246 2448276 2543787
2822 2543787 2426577 2484791 2349957 2166546 2279422 2548550 2505649 2893949 2927733 2797028
2812 2797028 2703964 2474817 2651239 2812004 2862004 2998042 2961651 2864865 2785861 2907360
2802B907360L06761J24393K28833q590J3180K77058K01356p0669L48991N37948
2792D866621J61699l3127K24526O3210M63214L16961n1329k3468q7138J05405
2782F006574j8468J1599K24925j20901j12238L18464J64689l29158j10599L09394
2772F344281J79539J00613o9938M02647L50447L11394M2143L91964N72157M97407
2762I122654L99578M16917o8773m7010o45254r17988o73926m61603n91169l86837
2752F146589k7168j13088m08986l0385n783j24026K15942l24610j38348J41185
2742E331322J56422K16046P6181K7407l2907L06673Q2897k5355j47804j76294
2732E814588J78724j92269k27704j55050m14088m92652j43100k36890r0571k73174
$$ plain form
2802 2907360 3214121 3338514 3567347 3558757 3571937 3848995 4050351 3979682 4328673 4866621
2792 4866621 5028320 4995193 5219719 5282929 5746143 6063104 6011775 5988307 5901169 6006574
2782 6006574 5988106 5999705 6224630 6103729 5991491 6309955 6474644 6145486 6034887 6344281
2772 6344281 6523820 6624433 6554495 6957142 7307589 7618983 7661126 8053090 8625247 9122654
2762 9122654 9522232 9939149 9870376 9823366 9178112 8260124 7586198 7124595 6533426 6146589
2752 6146589 6119421 6006333 5597347 5566962 5561179 5437153 5653095 5328485 5190137 5331322
2742 5331322 5487744 5703790 5779971 5807378 5774471 6081144 6164041 6138686 5990882 5814588
2732 5814588 5993312 5801043 5573339 5418289 5004201 4511549 4368449 4131559 4040988 3767814
2722C767814l43580R5897P3531k18422k76799L8631k65121k86622p9341k6072
2712B479916k76807J34750J08438k46360J54160j15444k58535J52210o4064M363
2702B072627J03486q681m68927q1997j27948K12787M2024j38293J3104q6544k27845
2691A303793N2287O5055j74423j5448o9002J26055J22193R174j89155P2665J10567
2680A413761P606j71680j92983Q8549l248J8746k0150j11505Q8085j00938O4019
2669A080262k27172O4944q5050J24054J58360l07537r8098J47051j78083j00279
2659E78452o1569J33709J32533l6734j09387k6562j66810K61486P1347l6262n596
2648G34607l26096J16871M0177P4798j03881j62205J18560O4167P648P4008j47810
$$ plain form
2722 3767814 3424234 3520131 3593662 3375240 3098441 3137072 2871951 2585329 2505988 2479916
2712 2479916 2203109 2337859 2446297 2199937 2354097 2238653 1980118 2132328 2068264 2072627
2702 2072627 2176113 2167432 1698505 1616508 1488560 1701347 1743371 1605078 1618182 1531638 1303793
2691 1303793 1356080 1421135 1246712 1231264 1162262 1288317 1410510 1419684 1230529 1303194 1413761
2680 1413761 1421367 1249687 1056704 1145253 1142005 1160751 1140601 1029096 1117181 1016243 1080262
2669 1080262 853090 918034 832984 957038 1115398 807861 709763 856814 678731 578452
2659 578452 516883 650592 783125 746391 637004 610442 443632 705118 776465 740203 734607
2648 734607 408511 525382 565559 640357 536476 374271 492831 556998 564646 638654 490844
2637D90844r9371j09645r20L62688M9568j39241j07186J73805o2997q0702n5687
2626D21156m1276j8403J69455p9896k3195N1789j62299j92697j34729K69071k5577
2615B33399J5759K34338j12846j33586N9146J7139K07925L2474m2340j3072j11621
2604C86715J24841k10575l9482J47131m4602j33193K21907q65j06265J7672J96999
2593E60283J02472k49257k21511j38574L67755j45508l2986J21211j11428K8220
2583B80677j5051n4698R2349k50611J34684K4913p938q5690l2628J27663j01174
2572A12496J7146L1631M2139O9765p5155q3987J10483j12117K11640J63077j20379
2561C66739j30935N9625K47534n4735j96624j16707k39586k405J38106j70981
$$ plain form
2637 490844 391473 281828 280908 643596 693164 553923 446737 620542 557545 476843 421156
2626 421156 379880 361477 530932 451036 427841 479630 317331 124634 -10095 258976 233399
2615 233399 249158 483496 370650 237064 296210 313349 521274 553748 511408 498336 386715
2604 386715 511556 300981 261499 408630 364028 230835 452742 451877 345612 363284 560283
2593 560283 662755 413498 191987 53413 421168 275660 242674 363885 252457 280677
2583 280677 265626 210928 303277 52666 187350 212263 204325 118635 86007 213670 112496
2572 112496 129642 161273 203412 273177 198022 114035 224518 112401 324041 487118 366739
2561 366739 235804 295429 542963 488228 291604 174897 -64689 -67094 71012 -99969
2551i9969j02270K03122m3801q5012Q4839O7965j13623J33997k1271k18768J90652
2540d139N6438J77304L80347j23336J1678J11818k66558j32356p5568J44628m6842
2529B33414J77660J28743n9749j17879J4096N7831j54090J7585k17534J53668
2519B33745J16794k05202j16835j23041Q6506K07790j47324P9917P0519j32284
2509G0585m2217k01305j02790J46729K6746J11682O7132j86335J92445p5656n7713
2498e0697N4162J67308J56704m6220j49489M388k49689o527J12595J60385P1862
2487B24782K835j06829j2285J9099J00916j11007J49799R4664j67570j32064n5655
2476F685K08553r0187r0880O0147J24340j49539l5469N9018l513O4688R9095q0500
$$ plain form
2551 -99969 -202239 883 -42918 -127930 -43091 24874 -88749 45248 23977 -194791 -4139
2540 -4139 52299 229603 609950 486614 498292 610110 343552 211196 135628 280256 233414
2529 233414 411074 539817 480068 362189 376285 434116 280026 297611 80077 233745
2519 233745 350539 145337 28502 -94539 -8033 199757 52433 132350 202869 70585
2509 70585 28368 -172937 -275727 -128998 -102252 9430 76562 -109773 82672 7016 -50697
2498 -50697 3465 170773 327477 281257 131768 136156 -113533 -120060 -7465 152920 224782
2487 224782 227617 120788 108503 127602 228518 117511 267310 361974 194404 62340 6685
2476 6685 215238 125051 34171 94318 218658 69119 33650 92668 89155 153843 252938 172438
2464A72438j67232J24574O7637J27895j90850j70770J11112j3776P2537j1739
2454A21826M5716J4295j8691j11989J33047l23307n3138J65868q1540r940J47151
2443B9298L4734N8369o4409l1918K12918p742P4135O492r2762k14283p7356k7343
2431i9867l8427J21099l038m9369J10434k7979J97823j34033j38100p4137N3109
2420h2485R371j64413j20688J31117P6976j03796q1929r2582J46895J55754J99066
2409G3286J63422k33365l7330L1922L8472J46160o7342N9399j39599L5361Q030
2398G8416K13549N3400k81319o7905J12413K30683r4656k92111N6359J638k8776
2387a8309j53343J61192l0499k6297N1551P0097k1366N763j35136J20480p0791
$$ plain form
2464 172438 5206 129780 197417 325312 134462 -36308 74804 61028 133565 121826
2454 121826 167542 181837 163146 51157 184204 -139103 -192241 -26373 -107913 -117853 29298
2443 29298 64032 122401 57992 26074 238992 231250 305385 311877 219115 4832 -72524 -99867
2431 -99867 -138294 -17195 -20233 -69602 40832 12853 210676 76643 -61457 -135594 -82485
2420 -82485 -73114 -237527 -358215 -227098 -150122 -253918 -335847 -428429 -281534 -125780 73286
2409 73286 236708 3343 -33987 -2065 36407 182567 115225 174624 35025 70386 78416
2398 78416 291965 345365 64046 -3859 108554 339237 244581 -47530 8829 10467 -18309
2387 -18309 -171652 -10460 -40959 -67256 -15705 54392 33026 38789 -96347 24133 -46658
2376d6658P0400J17230j24942j30168N4159K14449J66191M0473k79223k25186
2366a43275K16644N9282j31761j61624O2278P6746M559N9971m5621k85249J66986
2355a21064n2517J09335j34170j356K46847j80674J83667j23312J34945l672k62846
2344b04817K7438K97576q9785J27515k59010k8816j40543K49133L07318l13813
2334b7804j20490p1729J78502N3606K4215J05722J6417r0896k74141j23663K63519
2323f6742Q6494O4227l6838j2994Q5416p8671M5270j33685O2470L5726m936N3109
2311I8846j35922L3197O5190J18731r5708K8028N9952m0180P502j97743J20876
2300F2769j38969o5097K34291Q0846k17375J57898L52427r6865j47023M5647j66946
$$ plain form
2376 -46658 23742 140972 16030 -114138 -59979 154470 320661 361134 81911 -143275
2366 -143275 73369 132651 890 -160734 -98456 -21710 -17151 42820 -2801 -288050 -121064
2355 -121064 -173581 -64246 -198416 -199772 47075 -133599 50068 -73244 61701 58029 -204817
2344 -204817 -177379 120197 30412 157927 -101083 -129899 -270442 -21309 286009 -27804
2334 -27804 -148294 -220023 -41521 12085 36300 142022 158439 67543 -206598 -330261 -66742
2323 -66742 19752 83979 47141 34147 119563 40892 86162 -47523 14947 50673 45737 98846
2311 98846 -37076 -3879 61311 180042 84334 112362 172314 132134 139636 -58107 62769
2300 62769 -76200 -141297 92994 173840 -43535 114363 466790 369925 222902 268549 101603
2289A01603L12793J39543r1547j4179Q5504N8913J31557n3652j01204j14140k25935
2278B29256O8439j61337J52077J87170j3729j000j92586j09670O7536j21298L568
2267A08426K63805k63409J21100l442k33628M2394K12050P7251L73k7448k6632
2256B70840j10262P8718p3792J28349K6564j19026J51424k00896k5133K05931
2246C32717o6834J2312M4868j43998k36272J52193J06080j5114q3862k96560J24072
2235g0398P8470J08281O0957k017Q261J93713k48980j51352O9424L9044K585Q0451
2223A68439L8142J27633l38776k21306K26040J03600j7147R6991O0530K2042j59624
2212A06564J07396N5779j43586q4661j45759J07236j8071k99893J17351K52055
$$ plain form
2289 101603 414396 553939 462392 448213 533717 592630 724187 670535 569331 455191 229256
2278 229256 297695 136358 288435 475605 461876 460876 268290 158620 226156 104858 108426
2267 108426 372231 108822 229922 226480 -7148 35246 247296 324547 324920 297472 270840
2256 270840 160578 239296 165504 293853 320417 201391 352815 151919 126786 332717
2246 332717 265883 278195 323063 179065 -57207 94986 201066 185952 102090 -194470 -70398
2235 -70398 8072 116353 177310 175293 183554 377267 128287 -23065 46359 85403 87988 168439
2223 168439 206581 334214 -4562 -225868 172 103772 86625 183616 244146 266188 106564
2212 106564 213960 269739 126153 41492 -104267 2969 -15102 -314995 -197644 54411
2202E4411K23426j20957Q1044j8445J7867K86762l69567k05701J49468J59703
2192B58011J6671j794j22494N5083K2385o5627J71927J01436k08054k70147J45567
2181A02964J57219K496o621J60774k39605k6786J26272L6809P2845L9223q9175
2170C36415j18271J63429M56J08261p9643Q6083j44526j41328K07367J44450q5817
2159D76876n2855O4012J3667l1807O4148p5622K075n5328Q354L6089m6962k8801
2147C73846R0116L37667j26462p6713j48753N9378N140Q2402p9353P9825M7035
2136F44128J45244k4712J77824k3860r516O0105J69766k30523j93623K34623N0192
2125I99648K14858k2273j03457o8813J16277r6597q8282J43944M35132l7954J77505
$$ plain form
2202 54411 277837 156880 237924 219479 237346 524108 154541 -51160 98308 258011
2192 258011 274682 272888 150394 205477 227862 162235 334162 435598 227544 -42603 102964
2181 102964 260183 262679 256058 416832 177227 150441 276713 313522 386367 425590 336415
2170 336415 218144 381573 382029 490290 410647 496730 352204 210876 418243 562693 476876
2159 476876 424021 488033 501700 469893 534041 458419 460494 405166 413520 449609 402647 373846
2147 373846 463962 801629 675167 598454 449701 509079 514219 596621 517268 597093 644128
2136 644128 789372 764660 942484 918624 909108 969213 1138979 908456 714833 949456 999648
2125 999648 1214506 1192233 1088776 1019963 1136240 1039643 951361 1095305 1530437 1492483 1669988
2114A669988m3394k43294K26154J56150J61332K66394M5305k22962o9756Q9931
2104B035848J1767J24834K7027L71661N5056R7879M081M5083k95523J48670J82173
2093B808556j48423K89337L62942J13754o5114J27090l2500L75255J70782J15084
2083D116763R9689M0795K53317L65188m0412J06180K68199N90629P3071K29787
2073F103206M13471L19305K79537K72123K83000J43084P67384Q39159N98046L35090
2063A0353405N32281Q56875R81479R76576J164553J368535J638236J639178K086075
2054B1597193K522817K348926K541394K774027L523333M713157O109199P501437
2046E3631483R526286J0035716J0117811J0180480J2108776J4994419o973462
$$ plain form
2114 1669988 1626594 1383300 1609454 1765604 1926936 2193330 2238635 2015673 1945917 2035848
2104 2035848 2047615 2172449 2199476 2571137 2626193 2724072 2728153 2773236 2477713 2626383 2808556
2093 2808556 2660133 2949470 3312412 3426166 3361052 3488142 3455642 3830897 4001679 4116763
2083 4116763 4216452 4257247 4510564 4875752 4835340 4941520 5209719 5800348 5873419 6103206
2073 6103206 6516677 6835982 7115519 7387642 7670642 7813726 8581110 9420269 10018315 10353405
2063 10353405 10885686 11742561 12724040 13700616 14865169 16233704 17871940 19511118 21597193
2054 21597193 24120010 26468936 29010330 31784357 35307690 40020847 46130046 53631483
2046 53631483 63157769 73193485 83311296 93491776 105600552 120594971 113621509
2039A13621509k5460125k1853891j4121379q936260o717513m931600l787045k502004
2031B5311692k163613j856115j508332r72942j071738j490711j473915j148361
2023A3625965j139253q91887o80157n75795o54763l28380n07023l41179m94199
2014H013329k68892n10866m01281l52124l08343k48161j58288j51673q7427l62271
2004E164003k13493N6981k80018m8588k24930l82047J26183m76517j59809k3316
1994C538449k35764N1158q4498j44739q3373q3385J57898j61978k41676j42524
1984B569568l36272o2033L47738l3126j24161l17694k21740M0928J56157k13876
1974A805489j28095l3801j30522P1271M4051j76452o5973j44525J2649j4358k80719
$$ plain form
2039 113621509 88161384 66307493 52186114 43249854 36532341 31600741 27813696 25311692
2031 25311692 23148079 21291964 19783632 18810690 17738952 16248241 14774326 13625965
2023 13625965 12486712 11594825 10914668 10338873 9684110 9355730 8848707 8507528 8013329
2014 8013329 7744437 7233571 6832290 6480166 6171823 5923662 5765374 5613701 5526274 5164003
2004 5164003 4950510 5007491 4727473 4678885 4453955 4071908 4198091 3721574 3561765 3538449
1994 3538449 3302685 3353843 3269345 3124606 3041233 2957848 3115746 2953768 2712092 2569568
1984 2569568 2233296 2171263 2519001 2485875 2361714 2044020 1822280 1863208 2019365 1805489
1974 1805489 1677394 1643593 1513071 1584342 1628393 1451941 1385968 1241443 1254092 1239734 959015
1963I59015Q1683m8430m9512J15929O9326j22424j3971N6308J05882k08617j26039
1952H19150J54597j31212K8543L2095q9957J51539J00393m5973m9287k30070q6269
1941F53549J04132q1555j12086R7769r7274j9812J07279o7893o563j86108J33574
1930E25012r9805O6722j47868J17248K83093k91797r9689l6059M3330N1195j02021
1919C09361L10683m9345j42490J9348N169L4166l7430J25592j69036J81996J50048
1908G38062m6563l04508K59501l8389k72142N8441R3074j34643L339K24967j62450
1897D18689j19417O5377j39494J34953J79551j30876j17805k0997K7518R6427
1887C93926K08537k80768p2781K2862J55759j02291j61330J42696N0479R808j54464
$$ plain form
1963 959015 1040698 992268 942756 1058685 1128011 1005587 991616 1047924 1153806 945189 819150
1952 819150 973747 842535 871078 903173 813216 964755 1065148 1019175 969888 739818 653549
1941 653549 757681 676126 564040 661809 564535 544723 652002 584109 577546 391438 525012
1930 525012 425207 491929 344061 461309 744402 452605 352916 316857 360187 411382 309361
1919 309361 620044 570699 428209 447557 452726 486892 449462 575054 406018 588014 738062
1908 738062 691499 386991 646492 608103 335961 394402 487476 352833 356172 581139 418689
1897 418689 299272 364649 225155 360108 539659 408783 290978 269981 297499 393926
1887 393926 602463 321695 248914 271776 427535 325244 163914 306610 357089 366897 212433
1876B12433O4610K07625j25583j81589j07920O2341J16962q1805j00629q1366
1866a4921o9208P524o0609M96202l0630j19444j21560J63687m7232J08027J2416
1855C24252r8782j32644J07542m1339k1463J76868k5637m2653n3012J85643k18731
1844A60044j60323K20690j49959o4098J98748K06684j47371l4976j26597j09367
1834f525K24173k30706J52268L2561J64659Q5183Q133j17087q219O2085O0360
1823D26885k21541k77274k34001K60690J62972k8529J00520P4333j08530J14211
1813B69736O3116j35770n7433j47699P170J34600K13316j84743K1194K06451K45684
1802F35622j45264K54149r6848J00189J55970j65537k06746k18746J79173o2338
$$ plain form
1876 212433 277043 484668 359085 177496 69576 131917 248879 167074 66445 -14921
1866 -14921 -84129 -76605 -137214 358988 328358 208914 87354 251041 203809 311836 324252
1855 324252 225470 92826 200368 159029 137566 314434 288797 246144 193132 378775 160044
1844 160044 -279 220411 70452 6354 205102 411786 264415 229439 102842 -6525
1834 -6525 217648 -13058 139210 171771 336430 421613 429746 312659 304440 366525 426885
1823 426885 205344 -71930 -305931 -45241 117731 89202 189722 264055 155525 269736
1813 269736 332852 197082 139649 -8050 -880 133720 347036 162293 183487 389938 635622
1802 635622 490358 744507 647659 747848 903818 738281 531535 312789 491962 429624
1792D29624L1881j03044l3954k13986j37734L19716k595j37605m5399p8353J96609
1781B25160n5480J1616J12639j90654n2722J16594j44033n1995o8961K05119K23813
1770C31096j49968j67958K0552P5703J17565l5531K90498j67539l37616J30524
1760A07326J38394K0598j40793j85914j5285J52231Q8211j57432o2838J328J03499
1749D9325J22664j80712J50073Q3332l70437p7690L128K39458m7373q6936J33096
1738A7928J8907j5312o9378l2557J76962l3257k76998J13735k20387j19908K22424
1727b17841J69725J3418m3370M9661N7783M4957P2460P8209P523j81924j04143
1716e3542P7355O0353J86730P5340n37764m9693L14760o6550j88783j08432R9965
$$ plain form
1792 429624 461505 358461 324507 110521 -27213 292503 289908 152303 106904 28551 225160
1781 225160 169680 181296 293935 103281 50559 167153 23120 -28875 -97836 107283 331096
1770 331096 181128 13170 33722 109425 226990 191459 481957 314418 -23198 107326
1760 107326 245720 266318 125525 -60389 -75674 76557 164768 7336 -55502 -54174 49325
1749 49325 171989 -8723 141350 224682 -145755 -223445 -220317 19141 -28232 -115168 17928
1738 17928 36835 21523 -47855 -80412 96550 63293 -213705 -99970 -320357 -440265 -217841
1727 -217841 -48116 -34698 -78068 -28407 29376 74333 146793 225002 232525 50601 -53542
1716 -53542 23813 84166 270896 346236 -191528 -241221 73539 6989 -181794 -290226 -190261
1705a90261J92198J37106J9102j34510r9526q156j07467J5410J28629r5009J3634
1694a28850J96966k1983K3453J14396j96054J03392k92009l7662k6336J00938
1684a63749L93355j93494p7791n5598j89032J05815J95564J61254K32514k27212
1674A81626n9449o2388K1731j89502l7913K60429J59752q2891q9142k0485q6293
1663d525Q88O0724m2657r164J1093N9958J03451j55202j39079k83781R3829Q8177
$$ plain form
1705 -190261 1937 139043 158145 23635 -75891 -84047 -191514 -176104 -47475 -142484 -128850
1694 -128850 68116 46133 69586 183982 -12072 91320 -200689 -238351 -264687 -163749
1684 -163749 229606 36112 -41679 -97277 -286309 -180494 15070 176324 408838 181626
1674 181626 122177 59789 81520 -107982 -145895 114534 274286 191395 102253 81768 -4525
1663 -4525 -3637 57087 14430 5266 16359 76317 179768 24566 -114513 -398294 -304465 -216288
$$ [...]
##END NTUPLES=NMR SPECTRUM
##END=
