##TITLE=1H_CG-1151-A
 CDCl3, 8 sc, 
 25.08.2021
##JCAMPDX= 6.0         $$ Bruker NMR JCAMP-DX V2.0
##DATA TYPE= NMR SPECTRUM
##DATA CLASS= NTUPLES
##ORIGIN= UXNMR, Bruker Analytische Messtechnik GmbH
##OWNER= root
$$ XWIN-NMR		Version 3.5
$$ Wed Aug 25 13:07:21 2021 Russian Standard Time (UT+4h)  she@DPX200
##.OBSERVE FREQUENCY= 200.131506
##.OBSERVE NUCLEUS= ^1H
##.ACQUISITION MODE= SIMULTANEOUS
##.ACQUISITION SCHEME= undefined
##.AVERAGES= 8
##.DIGITISER RES= 18
##SPECTROMETER/DATA SYSTEM= spect
##.PULSE SEQUENCE= zg30
##.SOLVENT NAME= CDCl3
##.SHIFT REFERENCE= (INTERNAL, CDCl3, 0, 17.4873)
##AUDIT TRAIL= $$ (NUMBER, WHEN, WHO, WHERE, WHAT)
$$ ##TITLE= Audit trail, XWIN-NMR		Version 3.5
$$ ##JCAMPDX= 5.01
$$ ##ORIGIN= Bruker BioSpin GmbH
$$ ##OWNER= she
$$ F:/spectra/data/she/nmr/H-F/1/pdata/1/auditp.txt
$$ ##AUDIT TRAIL=  $$ (NUMBER, WHEN, WHO, WHERE, WHAT)
(   1,<2021-08-25 13:05:47.37 +0400>,<she>,<DPX200>,
      <created by zg, POWCHK disabled, PULCHK disabled
       configuration hash MD5:
       00 E9 B6 7A A2 85 ED C7 34 08 36 98 17 FE 4E 26
       data hash MD5: 16K
       23 54 7B 1D 9D 67 47 AB 24 E5 FD C2 E5 21 30 52>)
(   2,<2021-08-25 13:05:49.70 +0400>,<she>,<DPX200>,
      <Start of raw data processing
       efp BC_mod = 2 LB = 0.24 FT_mod = 6 PKNL = 1 PHC0 = -13363.89 PHC1 = 16.20099 SI = 16K 
       data hash MD5: 16K
       26 B0 FB 71 F5 43 1F 8F CA DB FC 07 73 98 D3 3E>)
(   3,<2021-08-25 13:06:20.53 +0400>,<she>,<DPX200>,
      <pk PHC0 = 9.797623 PHC1 = -5.799999 
       data hash MD5: 16K
       0D CF 59 FE 36 28 DC 58 D1 74 50 C0 FA 29 84 25>)
(   4,<2021-08-25 13:06:24.09 +0400>,<she>,<DPX200>,
      <abs ABSG = 5 
       data hash MD5: 16K
       55 D5 61 85 A6 8B 6F B0 23 AC 8D AE 1D 2B A6 C0>)
$$ ##END=
$$ 
$$ hash MD5
$$ 25 2C 9F 31 56 39 70 38 A0 AD 7C 3E CD 87 5F 96
##$RELAX= 
##$RELAX= 
##$RELAX= 
##$RELAX= 
##$RELAX= 
##$RELAX= 
$$ Bruker specific parameters
$$ --------------------------
##$DU= <F:/spectra>
##$EXPNO= 1
##$NAME= <H-F>
##$PROCNO= 1
##$TYPE= <nmr>
##$USER= <she>
##$AMP= (0..31)
100 100 100 100 100 100 100 100 100 100 100 100 100 100 100 100 100 100 
100 100 100 100 100 100 100 100 100 100 100 100 100 100 
##$AQSEQ= 0
##$AQ_mod= 1
##$AUNM= <au_zg>
##$AUTOPOS= <>
##$BF1= 200.13
##$BF2= 200.13
##$BF3= 200.13
##$BF4= 200.13
##$BF5= 200.13
##$BF6= 200.13
##$BF7= 200.13
##$BF8= 200.13
##$BYTORDA= 1
##$CFDGTYP= 0
##$CFRGTYP= 5
##$CHEMSTR= <none>
##$CNST= (0..31)
1 1 145 1 1 1 1 1 1 1 1 1 1 1 1 1 1 1 1 1 1 1 1 1 1 1 1 1 1 1 1 1 
##$CPDPRG= <>
##$CPDPRG1= <>
##$CPDPRG2= <>
##$CPDPRG3= <>
##$CPDPRG4= <mlev>
##$CPDPRG5= <mlev>
##$CPDPRG6= <mlev>
##$CPDPRG7= <mlev>
##$CPDPRG8= <mlev>
##$CPDPRGB= <>
##$CPDPRGT= <>
##$D= (0..31)
0 1.2 0 0 0 0 0 0 0 0.06 0 0.03 0 0 0 0 0.0002 0 0 0 0 0 0 0 0 0 0 0 0 
0 0 0 
##$DATE= 1629882346
##$DBL= (0..7)
120 120 120 120 120 120 120 120 
##$DBP= (0..7)
150 150 150 150 150 150 150 150 
##$DBP07= 0
##$DBPNAM0= <>
##$DBPNAM1= <>
##$DBPNAM2= <>
##$DBPNAM3= <>
##$DBPNAM4= <>
$$ [...]
##$SUBNAM3= <"">
##$SUBNAM4= <"">
##$SUBNAM5= <"">
##$SUBNAM6= <"">
##$SUBNAM7= <"">
##$SUBNAM8= <"">
##$SUBNAM9= <"">
##$SW= 20.0188882624521
##$SWIBOX= (0..15)
0 0 2 0 0 0 0 0 0 0 0 0 0 0 0 0 
##$SW_h= 4006.41025641026
##$TD= 16384
##$TD0= 1
##$TE= 0
##$TE2= 300
##$TE3= 300
##$TEG= 300
##$TL= (0..7)
0 120 120 120 120 120 120 120 
##$TP= (0..7)
150 150 150 150 150 150 150 150 
##$TP07= 0
##$TPNAME0= <>
##$TPNAME1= <>
##$TPNAME2= <>
##$TPNAME3= <>
##$TPNAME4= <>
##$TPNAME5= <>
##$TPNAME6= <>
##$TPNAME7= <>
##$TPOAL= (0..7)
0.5 0.5 0.5 0.5 0.5 0.5 0.5 0.5 
##$TPOFFS= (0..7)
0 0 0 0 0 0 0 0 
##$TUNHIN= 0
##$TUNHOUT= 0
##$TUNXOUT= 0
##$USERA1= <user>
##$USERA2= <user>
##$USERA3= <user>
##$USERA4= <user>
##$USERA5= <user>
##$V9= 5
##$VALIST= <valist>
##$VCLIST= <CCCCCCCCCCCCCCC>
##$VD= 0
##$VDLIST= <DDDDDDDDDDDDDDD>
##$VPLIST= <PPPPPPPPPPPPPPP>
##$VTLIST= <TTTTTTTTTTTTTTT>
##$WBST= 1024
##$WBSW= 4
##$XGAIN= (0..3)
0 0 0 0 
##$XL= 0
##$YL= 0
##$YMAX_a= 327749
##$YMIN_a= -383852
##$ZGOPTNS= <>
##$ZL1= 120
##$ZL2= 120
##$ZL3= 120
##$ZL4= 120
##$ABSF1= 17.55209
##$ABSF2= -2.466949
##$ABSG= 5
##$ABSL= 3
##$ALPHA= 0
##$AQORDER= 0
##$ASSFAC= 0
##$ASSFACI= 0
##$ASSFACX= 0
##$ASSWID= 0
##$AUNMP= <proc_1d>
##$AZFE= 0.1
##$AZFW= 0.1
##$BCFW= 0
##$BC_mod= 2
##$BYTORDP= 0
##$COROFFS= 0
##$CY= -3
##$DATMOD= 1
##$DC= 0
##$DFILT= <>
##$DTYPP= 0
##$F1P= 0
##$F2P= 0
##$FCOR= 1
##$FTSIZE= 16384
##$FT_mod= 6
##$GAMMA= 0
##$GB= 0
##$INTBC= 1
##$INTSCL= 1.334414e-10
##$ISEN= 128
##$LB= 0.24
##$LEV0= 0
##$LPBIN= 0
##$MAXI= 10000
##$MC2= 0
##$MEAN= 0
##$ME_mod= 0
##$MI= 1.114404
##$NCOEF= 0
##$NC_proc= -7
##$NLEV= 6
##$NOISF1= 3.799351
##$NOISF2= 2.8
##$NSP= 0
##$NTH_PI= 0
##$NZP= 0
##$OFFSET= 17.48733
##$PC= 1
##$PHC0= -13354.09
##$PHC1= 10.40099
##$PH_mod= 1
##$PKNL= yes
##$PPARMOD= 0
##$PSCAL= 0
##$PSIGN= 0
##$REVERSE= no
##$SF= 200.130009464275
##$SI= 16384
##$SIGF1= 3
##$SIGF2= 2
##$SINO= 5.538805
##$SIOLD= 16384
##$SREGLST= <1H.CDCl3>
##$SSB= 0
##$STSI= 16384
##$STSR= 0
##$SW_p= 4006.41025641026
##$SYMM= 0
##$S_DEV= 0
##$TDeff= 16384
##$TDoff= 0
##$TI= <>
##$TILT= no
##$TM1= 0
##$TM2= 0
##$TOPLEV= 0
##$USERP1= <user>
##$USERP2= <user>
##$USERP3= <user>
##$USERP4= <user>
##$USERP5= <user>
##$WDW= 1
##$XDIM= 16384
##$YMAX_p= 521982789
##$YMIN_p= -642404
$$ End of Bruker specific parameters
$$ ---------------------------------
##NTUPLES= NMR SPECTRUM
##VAR_NAME=  FREQUENCY,     SPECTRUM/REAL,   SPECTRUM/IMAG
##SYMBOL=    X,             R,               I
##VAR_TYPE=  INDEPENDENT,   DEPENDENT,       DEPENDENT
##VAR_FORM=  AFFN,          ASDF,            ASDF
##VAR_DIM=   16384,         16384,           16384
##UNITS=     HZ,            ARBITRARY UNITS, ARBITRARY UNITS
##FACTOR=    0.24454680195387, 1,            1
##FIRST=     3499.73941494413, 0,            0
##LAST=      -506.670841466125, 0,           0
##MIN=       -506.670841466125, -642404,     0
##MAX=       3499.73941494413, 521982789,    0
$$ Real data points
##PAGE= N=1
##DATA TABLE= (X++(R..R)), XYDATA
$$ [...]
$$ plain form
6690 2318338 2374797 2463921 2772369 2706470 2633528 2745988 3064738 2981259 2987253 3048740 2824159
6679 2824159 2812930 3178470 3223278 3106687 3236734 3374426 3311332 3687250 3861947 3699882
6669 3699882 3990285 4146335 4336749 4546998 4905418 4890656 5158243 5312319 5612758 5782694
6659 5782694 5865506 6117107 6516731 7110539 7631186 7929592 8118916 8721067 9291132 10078047
6649 10078047 10784255 11905065 13157072 14666466 16409396 18520844 20772275 23796337
6641 23796337 27854241 32830762 39272134 46369732 51110139 52088191 50931230 48234110
6633 48234110 46162552 46770118 49099046 51730678 52284316 49753057 44866015 38686884
6625 38686884 33284669 28869864 25542247 22851524 21204313 19823844 18359243 17310970
$$ packed form
6690B318338N6459Q9124L08448o5899p2942J12460L18750q3479N994O1487k24581
6679B824159j1229L65540M4808j16591J30047J37692o3094L75918J74697j62065
6669C699882K90403J56050J90414K10249L58420j4762K67587J54076L00439J69936
6659E782694Q2812K51601L99624N93808N20647K98406J89324O02151N70065P86915
6649A0078047P06208J120810J252007J509394J742930K111448K251431L024062
6641B3796337M057904M976521O441372P097598M740407R78052j156961k697120
6633D8234110k071558O07566K328928K631632N53638k531259m887042o179131
6625C8686884n402215m414805l327617k690723j647211j380469j464601j048273
$$ plain form
6617 17310970 16388572 15828601 15359954 15138592 14698512 14583109 14609990 14744224 14867713 15311434
6607 15311434 15958083 16753922 17611851 18830420 20439112 22384489 25004123 28487421 32557926
6598 32557926 37572319 42473515 44768936 44298459 42497275 40511456 39637579 40268459 42803110
6589 42803110 44253507 42819689 39152758 34197455 28815182 24677618 21586451 19088585
6581 19088585 17226908 15820397 14644511 13251581 12357124 11613945 11129512 10439701 9886316
6572 9886316 9653177 9232138 8845815 8638593 8409722 8109029 7789468 7617423 7503784 7275483
6562 7275483 7038670 6992474 6971747 6637574 6461377 6481277 6313568 6067236 5678306 5526894
6552 5526894 5723891 5926828 5454027 5444541 5379324 5167172 5159918 5197171 5276200 5012297 4800403
$$ packed form
6617A7310970r22398n59971m68647k21362m40080j15403K6881J34234J23489M43721
6607A5311434O46649P95839Q57929J218569J608692J945377K619634L483298M070505
6598C2557926N014393M901196K295421m70477j801184j985819q73877O30880K534651
6589D2803110J450397j433818l666931m955303n382273m137564l091167k497866
6581A9088585j861677j406511j175886j392930q94457p43179m84433o89811n53385
6572I886316k33139m21039l86323k07222k28871l00693l19561j72045j13639k28301
6562G275483k36813m6196k0727l34173j76197J9900j67709k46332l88930j51412
6552E526894J96997K02937m72801r486o5217k12152p254L7253P9029k63903k11894
$$ plain form
6541 4800403 5000030 5171208 5108553 4983327 5166391 5303221 5241257 4932294 4939255 5123212
6531 5123212 4892913 4846029 5021374 5023701 5075001 5217723 5089097 5114198 5049731 4920787 5246682
6520 5246682 5214433 5318379 5184953 5231376 5275014 5485836 5697736 5651577 5857757 5699581
6510 5699581 5777765 5987772 6007781 5999246 6278870 6374659 6386688 6616370 6606803 6815982 6849539
6499 6849539 6895432 7053325 7207037 7412098 7620363 7675047 7785406 7884145 8080255 8205805
6489 8205805 8347393 8546888 9051642 9366685 9412233 9566666 9631454 9970991 10344576 10707735
6479 10707735 10783474 10949462 11362906 11604601 11787801 12152465 12248103 12655636 13006871 13151821
6469 13151821 13767879 14148183 14431394 15010582 15066592 15224692 15631318 16072742 16510159 16983491
$$ packed form
6541D800403J99627J71178o2655j25226J83064J36830o1964l08963O961J83957
6531E123212k30299m6884J75345K327N1300J42722j28626K5101o4467j28944L25895
6520E246682l2249J03946j33426M6423M3638K10822K11900m6159K06180j58176
6510E699581P8184K10007K0009q535K79624R5789J2029K29682r567K09179L3557
6499F849539M5893J57893J53712K05061K08265N4684J10359R8739J96110J25550
6489H205805J41588J99495N04754L15043M5548J54433O4788L39537L73585L63159
6479A0707735P5739J65988M13444K41695J83200L64664R5638M07533L51235J44950
6469A3151821O16058L80304K83211N79188N6010J58100M06626M41424M37417M73332
$$ plain form
6459 16983491 17250130 17745859 18321045 18788937 19247115 19527856 20057189 20265749 20542131
6450 20542131 21212920 21414390 21557732 21970943 22271134 22416520 22693343 22921850 23034289
6441 23034289 23359799 23364879 23542365 23384917 23105010 23150503 23172014 22946577 22923900 22772834
6431 22772834 22388645 22156065 22153421 21870201 21548226 21263868 20760131 20693684 20339468 19975087
6421 19975087 19582043 19074936 18483549 18134908 17756475 17417614 16964503 16700331 16264757
6412 16264757 15823171 15439312 15250944 14790505 14241417 13908731 13604837 13299937 12950583
6403 12950583 12316127 12054817 12121442 11845160 11726437 11303530 10918377 10931048 10755906 10391099
6393 10391099 10196869 9921172 9692054 9544554 9396163 9304385 8970690 8814571 8566439 8371177
$$ packed form
6459A6983491K66639M95729N75186M67892M58178K80741N29333K08560K76382
6450B0542131O70789K01470J43342M13211L00191J45386K76823K28507J12439
6441B3034289L25510N080J77486j57448k79907M5493K1511k25437k2677j51066
6431B2772834l84189k32580k644k83220l21975k84358n03737o6447l54216l64381
6421A9975087l93044n07107n91387l48641l78433l38861m53111k64172m35574
6412A6264757m41586l83859j88368m60439n49088l32686l03894l04900l49354
6403A2950583o34456k61310O6625k76282j18723m22907l85153J2671j75142l64807
6393A0391099j94230k75697k29118j47500j48391r1778l33695j56119k48132j95262
$$ plain form
6383 8371177 8177190 7859055 7757044 7459723 7250938 7155880 7095162 6947634 6906126 6606503
6373 6606503 6686151 6554564 6541112 6689266 6460670 6400864 6291645 6306048 6491384 6504134
6363 6504134 6586117 6604490 6428127 6107238 6022292 6010699 5824752 5482657 5149272 5163057
6353 5163057 5086332 4827643 4625755 4679940 4571723 4636978 4518943 4593158 4747801 4652827
6343 4652827 4503535 4425077 4474247 4238496 4348744 4674787 4660105 4891225 4793586 4741865
6333 4741865 4478923 4178080 4212868 4023787 3738418 3636531 3542316 3297009 3477526 3236547
6323 3236547 3298085 3180420 2843231 2927359 2887804 3059859 3238031 2946689 2962522 3013690
6313 3013690 2957550 3122493 2868123 2942922 3104342 2962161 2971887 2866540 2927036 2846162 2795555
$$ packed form
6383H371177j93987l18135j02011k97321k08785r5058o0718j47528m1508k99623
6373F606503P9648j31587j3452J48154k28596n9806j09219J4403J85336J2750
6363F504134Q1983J8373j76363l20889q4946j1593j85947l42095l33385J3785
6353E163057p6725k58689k01888N4185j08217O5255j18035P4215J54643r4974
6343D652827j49292p8458M9170k35751J10248L26043j4682K31120r7639n1721
6333D741865k62942l00843L4788j89081k85369j01887r4215k45307J80517k40979
6323C236547O1538j17665l37189Q4128l9555J72055J78172k91342J5833N1168
6313C013690n6140J64943k54370P4799J61420j42181R726j05347O0496q0874n0607
$$ plain form
6302 2795555 2736373 2631322 2636414 2700356 2847517 2586678 2348687 2202352 2201736 2352965 2371374
6291 2371374 2301686 2445377 2241575 2123220 2367041 2501617 2424446 2259345 2371252 2190980
6281 2190980 2306682 1939940 1974416 1993079 1816488 1815382 1818697 1907050 1783681 1903774 1901400
6270 1901400 1723237 1767215 1898533 1814359 1966977 1967168 1925902 1876877 1988317 1973173 1980057
6259 1980057 1955680 1752256 1579073 1707857 1816869 1541001 1295017 1363404 1361871 1422234
6249 1422234 1355509 1377969 1250300 1203882 1468927 1293157 1182643 1084344 1374950 1083544
6239 1083544 1282402 1159177 1173319 1314374 1211945 1096911 1067548 946206 860996 1141176
6229 1141176 1095323 1092770 996673 962464 801459 880863 1019005 1136259 971255 1012101 1057592
$$ packed form
6302B795555n9182j05051N092O3942J47161k60839k37991j46335o16J51229J8409
6291B371374o9688J43691k03802j18355K43821J34576p7171j65101J11907j80272
6281B190980J15702l66742L4476J8663j76591j106L315Q8353j23369J20093k374
6270A901400j78163M3978J31318q4174J52618J91m1266m9025J11440j5144O884
6259A980057k4377k03424j73183J28784J09012k75868k45984O8387j533O0363
6249A422234o6725K2460j27669m6418K65045j75770j10514r8299K90606k91406
6239A083544J98858j23225J4142J41055j02429j15034k9363j21342q5210K80180
6229A141176m5853k553r6097l4209j61005P9404J38142J17254j65004M0846M5491
$$ plain form
6218 1057592 785639 833311 1057730 816044 891043 866852 696139 585167 632872 960989
6208 960989 918838 679772 800330 719835 786736 773373 807191 624715 762757 769077 753031
6197 753031 800428 746443 770895 787534 871355 853645 918536 889735 832955 677129 604631
6186 604631 406051 357399 696200 745311 777718 888410 621984 717941 871936 877728 836773
6175 836773 562291 568901 637322 816336 799684 526035 663507 631082 535735 398232 683477
6164 683477 905828 645876 591846 659685 803957 595684 685876 844368 812020 829354 864159
6153 864159 766271 447490 539617 329769 345914 474554 652801 764505 942304 648595
6143 648595 577990 446677 641773 630795 875812 827014 565714 862109 701838 431705
$$ packed form
6218A057592k71953M7672K24419k41686P4999k4191j70713j10972M7705L28117
6208I60989m2151k39066J20558q0495O6901j3363L3818j82476J38042O320j6046
6197G53031M7397n3985K4452J6639Q3821j7710O4891k8801n6780j55826p2498
6186F04631j98580m8652L38801M9111L2407J10692k66426R5957J53995N792m0955
6175H36773k74482O610O8421J79014j6652k73649J37472l2425r5347j37503K85245
6164F83477K22351k59952n4030O7839J44272k08273R0192J58492l2348J7334L4805
6153H64159r7888l18781R2127k09848J6145J28640J78247J11704J77799k93709
6143F48595p0605j31313J95096j0978K45017m8798k61300K96395j60271k70133
$$ plain form
6133 431705 388632 421411 380381 519296 507249 440238 642132 589090 658713 806319 826369
6122 826369 805032 835961 598946 581508 748349 606423 578228 688733 713767 700066 705041
6111 705041 731253 612323 665779 592335 500633 701418 572639 596838 582137 824483 1019817
6100 1019817 957069 524178 641631 804830 827384 578580 834382 837873 716373 779166
6090 779166 736249 604152 740801 847979 702801 624831 817723 760113 754617 697534 621994
6079 621994 621244 800988 691702 660998 788133 864551 767546 764914 730191 669557 858675
6068 858675 1023567 744170 756447 1000518 1100867 1108172 954483 730446 795850 895762 705263
6057 705263 469923 503761 656484 699967 804718 613744 919739 760451 603050 951385
$$ packed form
6133D31705m3073L2779m1030J38915j2047o7011K01894n3042O9623J47606K0050
6122H26369k1337L0929k37015j7438J66841j41926k8195J10505K5034j3701M975
6111G05041K6212j18930N3456p3444r1702K00785j28779K4199j4701K42346J95334
6100A019817o2748m32891J17453J63199K2554k48804K55802L491j21500O2793
6090G79166m2917j32097J36649J07178j45178p7970J92892n7610n496n7083p5540
6079F21994p50J79744j09286l0704J27135P6418r7005k632l4723o0634J89118
6068H58675J64892k79397J2277K44071J00349P305j53689k24037O5404R9912j90499
6057G05263k35340L3838J52723M3483J04751j90974L05995j59288j57401L48335
$$ plain form
6047 951385 885979 667978 555239 707494 926427 1142916 1416292 1134053 1125884 1107018
6037 1107018 1218812 1175085 1059571 866192 1004347 814909 916454 1042540 960922 918552
6027 918552 880927 857104 926566 943982 838220 988005 919064 837448 935365 1050575 905865
6016 905865 870657 926495 815172 795957 801331 826968 615468 502611 698954 891535 805460
6005 805460 807014 813113 740712 870945 877109 911849 866456 1043900 1023024 989977 801592 866146
5993 866146 814546 878141 706677 715300 646181 623170 930036 941693 766432 568581 622381
5982 622381 619059 824472 883195 984725 842231 736156 571926 773530 729705 931989
5972 931989 893436 840939 1035415 1124363 1013573 750613 801983 825911 829347 796010 572990
$$ packed form
6047I51385o5406k18001j12739J52255K18933K16489K73376k82239q169j8866
6037A107018J11794m3727j15514j93379J38155j89438J01545J26086q1618m2370
6027I18552l7625k3823O9462J7416j05762J49785o8941q1616R7917J15210j44710
6016I05865l5208N5838j11323j9215N374K5637k11500j12857J96343J92581q6075
6005H05460J554O099p2401J30233O164L4740m5393J77444k0876l3047j88385O4554
5993H66146n1600O3595j71464Q623o9119k3011L06866J1657j75261j97851N3800
5982F22381l322K05413N8723J01530j42494j06075j64230K01604m3825K02284
5972I31989l8553n2497J94476Q8948j10790k62960N1370K3928L436l3337k23020
$$ plain form
5961 572990 488933 478064 719096 499995 222665 344536 447017 335364 493469 654506
5951 654506 671654 744700 829639 645539 500302 497513 616871 452286 324537 469542 466501
5940 466501 396373 438759 635143 474681 607224 656920 803935 893907 839313 762366 492050
5929 492050 667193 613275 662533 642233 377015 775170 794027 676386 503077 466383 642648
5918 642648 713326 629539 631730 678212 765184 743637 849575 974270 883964 878527 1011462
5907 1011462 831046 1040238 916718 846499 662294 649914 717198 883393 791264 601092
5897 601092 656012 524845 593121 670594 628987 755145 764861 729020 781985 685759 657254
5886 657254 570928 350588 364856 455865 415080 395906 416248 307485 459195 636048 588201
$$ packed form
5961E72990q4057j0869K41032k19101k77330J21871J02481j11653J58105J61037
5951F54506J7148P3046Q4939j84100j45237k789J19358j64585j27749J45005l041
5940D66501p0128M2386J96384j60462J32543M9696J47015Q9972n4594p6947k70316
5929D92050J75143n3918M9258k0300k65218L98155J8857j17641j73309l6694J76265
5918F42648P0678q3787K191M6482Q6972k1547J05938J24695r0306n437J32935
5907A011462j80416K09192j23520p0219j84205j2380O7284J66195r2129j90172
5897F01092N4920j31167O8276P7473m1607J26158R716l5841N2965r6226k8505
5886F57254q6326k20340J4268R1009m0785j9174K0342j08763J51710J76853m7847
$$ plain form
5875 588201 452547 395703 440947 608416 517997 397097 327908 364047 623622 706873 638603
5864 638603 475723 600110 512791 565184 575575 392678 431610 432255 272476 139733 373818
5853 373818 506525 502772 317720 397758 505537 501895 383458 668629 621591 268534 116638
5842 116638 77657 285206 410694 470207 562063 419698 355358 388760 439224 793892 728037
5831 728037 688027 717858 486302 577416 736317 607831 524746 564356 700006 605861 666433
5820 666433 643354 763153 694782 631734 707943 915322 697967 622837 788097 1119907 1173003
5809 1173003 1332735 1213118 1276251 1371409 1452435 1493289 1362676 1676746 1756633 1916900
5799 1916900 1784907 1935792 1945459 1668097 1947199 2029889 1961286 2017884 2028736 2118437 2297104
$$ packed form
5875E88201j35654n6844M5244J67469r0419j20900o9189L6139K59575Q3251o8270
5864F38603j62880J24387q7319N2393J0391j82897L8932O45j59779j32743K34085
5853C73818J32707l753j85052Q0038J07779l642j18437K85171m7038l53057j51896
5842A16638l8981K07549J25488N9513R1856j42365o4340L3402N0464L54668o5855
5831G28037m0010K9831k31556R1114J58901j28486q3085L9610J35650r4145O0572
5820F66433k3079J19799o8371o3048P6209K07379k17355p5130J65260L31810N3096
5809A173003J59732j19617O3133R5158Q1026M0854j30613L14070P9887J60267
5799A916900j31993J50885R667k77362K79102Q2690o8603N6598J0852Q9701J78667
$$ plain form
5788 2297104 2198486 2290599 2170732 2073433 2131198 2039012 1981288 1824161 1667461 1783917 1959662
5777 1959662 2096517 1881922 1703080 1816224 1820386 1510076 1437260 1077789 870417 866692
5767 866692 1110745 1057507 735664 742627 748380 783771 895512 869701 751933 821622 639204
5756 639204 683881 755215 711470 728024 837827 864767 748449 850007 886332 899029 877691
5745 877691 677304 722830 859647 755364 659352 729393 690893 785884 727360 888239 897243
5734 897243 700408 756852 786427 729453 860799 907193 784504 714299 691258 854147 639842
5723 639842 671465 917941 864044 615593 644379 713638 675506 557845 728090 690876 532855
5712 532855 802944 679558 829390 895004 999657 799705 725563 766947 696942 483373
$$ packed form
5788B297104r8618R2113j19867r7299N7765r2186n7724j57127j56700J16456J75745
5777A959662J36855k14595j78842J13144M162l10310p2816l59471k07372l725
5767H66692K44053n3238l21843O963N753L5391J11741k5811j17768O9689j82418
5756F39204M4677P1334m3745J6554J09803K6940j16318J01558L6325J2697k1338
5745H77691k00387M5526J36817j04283r6012P0041l8500R4991n8524J60879R004
5734H97243j96835N6444K9575n6974J31346M6394j22689p0205k3041J62889k14305
5723F39842L1623K46476n3897k48451K8786O9259l8132j17661J70245l7214j58021
5712E32855K70089j23386J49832O5614J04653j99952p4142M1384p0005k13569
$$ plain form
5702 483373 638295 802833 812108 869895 945215 814353 893769 873916 801416 817441 750266
5691 750266 877302 840426 583769 742773 847972 487259 716911 868544 772675 905430
5681 905430 859897 803772 807090 760482 495553 539590 668843 746409 664840 639911 706625
5670 706625 854879 763433 574310 652863 768393 584514 444644 504973 723421 762508
5660 762508 809096 874074 886985 846864 744845 708520 952397 881472 939073 1114087 1065941
5649 1065941 1042634 882019 770717 952279 1092845 1045559 934742 589442 760216 840294
5639 840294 700728 1056608 882155 507049 664344 545444 656474 812554 939414 1050464
5629 1050464 954030 796851 1005566 1124326 1029308 1164187 1307514 1368402 1203778 1042673
$$ packed form
5702D83373J54922J64538R275N7787P5320j30862P9416j9853p2500J6025o7175
5691G50266J27036l6876k56657J59004J05199l60713K29652J51633r5869J32755
5681I05430m5533n6125L318m6608k64929M4037J29253P7566q1569k4929O6714
5670G06625J48254r1446j89123P8553J15530j83879j39870O0329K18448L9087
5660G62508M6588O4978J2911m0121j02019l6325K43877p0925N7601J75014m8146
5649A065941k3307j60615j11302J81562J40566m7286j10817l45300J70774Q0078
5639H40294j39566L55880j74453l75106J57295j18900J11030J56080J26860J11050
5629A050464r6434j57179K08715J18760r5018J34879J43327O0888j64624j61105
$$ plain form
5619 1042673 1111302 1121766 1214310 1084523 1088865 928301 999165 907085 949494 1138465 1092125
5608 1092125 1024799 946789 931156 872313 810939 1145818 997791 1123303 1317021 1170243
5598 1170243 1121374 1385242 1484140 1370049 1421659 1591843 1408082 1252646 1313947 1232403
5588 1232403 1284543 1234298 1424658 1348228 1013572 977359 964206 1161369 1311184 1264726 1136936
5577 1136936 1191230 1218946 1169782 1069321 1245006 1268386 1508462 1621227 1608040 1658149 1423785
5566 1423785 1458750 1271527 1125862 1296906 1313650 1230936 1322418 1235997 1274435 1067976 1088443
5555 1088443 847848 985528 926544 928537 1062708 1096007 1098459 1003948 1014714 986411 1045110
5544 1045110 1085313 985718 1191808 1179778 1110506 1150828 1481638 1557594 1400863 1669228 1584951
$$ packed form
5619A042673O8629J0464R2544j29787M342j60564P0864r2080M2409J88971m6340
5608A092125o7326p8010j5633n8843o1374L34879j48027J25512J93718j46778
5598A170243m8869K63868R8898j14091N1610J70184j83761j55436O1301q1544
5588A232403N2140n0245J90360p6430l34656l6213j3153J97163J49815m6458j27790
5577A136936N4294K7716m9164j00461J75685K3380K40076J12765j3187N0109k34364
5566A423785L4965j87223j45665J71044J6744q2714R1482q6421L8438k06459K0467
5555A088443k40595J37680n8984J993J34171L3299K452r4511J0766k8303N8699
5544A045110M0203r9595K06090j2030o9272M0322L30810P5956j56731K68365q4277
$$ plain form
5533 1584951 1509448 1486553 1356653 1313497 1279187 1283086 1556623 1616617 1467118 1418385 1493542
5522 1493542 1422571 1561723 1606537 1567381 1598209 1594314 1450513 1428454 1424675 1396184 1395134 1466778
5510 1466778 1505218 1435181 1406233 1626617 1807638 1625471 1379818 1339726 1426623 1633645
5500 1633645 1474633 1403173 1626470 1760368 1921902 2006280 1980131 1951650 1779074 1554310
5490 1554310 1704278 1988387 2249360 2384371 2148168 2185471 2453580 2445635 2410331 2432260
5480 2432260 2068679 2045752 2166717 1868122 1890752 2005169 2113671 2173527 2071655 2135487
5470 2135487 1916804 2077211 2281714 2222422 2212072 2222127 2302528 2335071 2741995 2675895 2872921
5459 2872921 3032345 3274366 3529636 3853656 3977716 4051165 3900631 3351043 3230412 2990845
$$ packed form
5533A584951p5503k2895j29900m3156l4310L899K73537N9994j49499m8733P5157
5522A493542p0971J39152M4814l9156L0828l895j43801k2059l779k8491j050P1644
5510A466778L8440p0037k8948K20384J81021j82167k45653m0092Q6897K07022
5500A633645j59012p1460K23297J33898J61534Q4378k6149k8481j72576k24764
5490A554310J49968K84109K60973J35011k36203L7303K68109p945l5304K1929
5480B432260l63581k2927J20965k98595K2630J14417J08502N9856j01872O3832
5470B135487k18683J60407K04503n9292j0350J0055Q0401L2543M06924o6100J97026
5459B872921J59424K42021K55270L24020J24060P3449j50534n49588j20631k39567
$$ plain form
5449 2990845 2848322 2709899 2638841 2699206 2691913 2712825 2801919 2742245 2461718 2417118 2507187
5438 2507187 2808857 2839283 2782078 3028624 2985194 2741864 3157745 3226479 3412296 3757271
5428 3757271 4024301 4212562 4379049 4365153 4195866 3815857 3563281 3487281 3286503 3214308
5418 3214308 2942009 2978561 3098458 3285346 3159438 3181103 3209890 3002182 2970744 2936571
5408 2936571 3035235 2817042 2839792 3075161 3152583 3111033 3097271 3301330 3311139 3403535 3641663
5397 3641663 3785756 3690130 3436077 3280879 3253858 3278990 3390162 3355884 3162042 3230521
5387 3230521 3099662 3248827 3190119 3383214 3370221 3178581 3422420 3569295 3605619 3234849
5377 3234849 3202546 3135315 3159125 3096775 3077856 3265252 3400158 3417787 3246620 3347299 3487099
$$ packed form
5449B990845j42523j38423p1058O0365p293K0912Q9094n9674k80527m4600R0069
5438B507187L01670L0426n7205K46546m3430k43330M15881O8734J85817L44975
5428C757271K67030J88261J66487j3896j69287l80009k52576p6000k00778p2195
5418C214308k72299L6552J19897J86888j25908K1665K8787k07708l1438l4173
5408B936571R8664k18193K2750K35369P7422m1550j3762K04059R809R2396K38128
5397C641663J44093r5626k54053j55198k7021K5132J11172l4278j93842O8479
5387C230521j30859J49165n8708J93095j2993j91640K43839J46875L6324l70770
5377C234849l2303o7231K3810o2350j8919J87396J34906J7629j71167J00679J39800
$$ plain form
5366 3487099 3574357 3654156 3644651 3735179 3738245 3690601 3863873 3852478 3813057 4018586 4077767
5355 4077767 4157707 4061720 3832864 3684629 4031925 4109921 4083742 4165739 4567769 4672169
5345 4672169 4441435 4438027 4232664 4142019 4375440 4408241 4099910 4296274 4569894 4412943
5335 4412943 4265307 4329190 4593483 4756666 4643370 4569087 4524079 4559740 4796528 4812312
5325 4812312 4787791 4680431 4888767 5050188 5247490 5283274 5391313 5433675 5390473 5463914
5315 5463914 5547975 5389820 5631460 5673893 5567162 5605814 5722815 5916543 6057688 5980935
5305 5980935 5823321 6102160 6300980 6247912 6236791 6129182 6293209 6178689 6592937 6570826
5295 6570826 6682796 6721260 6622772 6592831 6895842 7121799 7127753 7185078 7297668 7249501 7221513
$$ packed form
5366C487099Q7258P9799r505R0528L066m7644J73272j1395l9421K05529N9181
5355D077767P9940r5987k28856j48235L47296P7996k6179Q1997M02030J04400
5345D672169k30734l408k05363r0645K33421L2801l08331J96364K73620j56951
5335D412943j47636O3883K64293J63183j13296p4283m5008L5661K36788J5784
5325D812312k4521j07360K08336J61421J97302L5784J08039M2362m3202P3441
5315E463914Q4061j58155K41640M2433j06731L8652J17001J93728J41145p6753
5305E980935j57614K78839J98820n3068j1121j07609J64027j14520M14248k2111
5295F570826J11970L8464r8488k9941L03011K25957N954N7325J12590m8167k7988
$$ plain form
5284 7221513 7387872 7218307 7354561 7715263 7676922 7877292 8079447 7824212 8122063 8126234
5274 8126234 8308672 8426323 8510928 8481975 8663399 8631343 8990842 9099696 9219200 9104368
5264 9104368 9059654 9278244 9613928 9575339 9776331 9906316 10115505 10215123 10234892 10359719
5254 10359719 10440148 10504678 10847472 11069791 11313920 11247318 11558225 11699502 12055441 12098394
5244 12098394 12262200 12198239 12306031 12379012 12498339 12573089 12719572 13125025 13222866 13478469
5234 13478469 13744506 14105826 14229404 14202589 14197642 14338863 14564140 14811555 15106639 15403806
5224 15403806 15413231 15421641 15452358 15796783 15986874 16191479 16415527 16634078 16737069 17019469
5214 17019469 17156308 17298555 17369717 17408258 17597337 17931646 18142354 18521958 18339665 18414681
$$ packed form
5284G221513J66359j69565J36254L60702l8341K00370K02155k55235K97851M171
5274H126234J82438J17651Q4605k8953J81424l2056L59499J08854J19504j14832
5264I104368m4714K18590L35684l8589K00992J29985K09189R9618J9769J24827
5254A0359719Q0429O4530L42794K22319K44129o6602L10907J41277L55939M2953
5244A2098394J63806o3961J07792P2981J19327P4750J46483M05453R7841K55603
5234A3478469K66037L61320J23578k6815m947J41221K25277K47415K95084K97167
5224A5403806R425Q410L0717L44425J90091K04605K24048K18551J02991K82400
5214A7019469J36839J42247P1162L8541J89079L34309K10708L79604j82293P5016
$$ plain form
5204 18414681 18666274 18821262 18838866 19177368 19461259 19794976 19900738 20006650 20238772 20316980
5194 20316980 20776059 20722579 20793214 21065787 21101695 21250726 21638103 21547822 21317324 21429338
5184 21429338 21643844 21797581 22009505 22098420 22077910 22291799 22402971 22439120 22529921 22504291
5174 22504291 22702647 22656970 22653039 22746050 22845732 22700223 22682108 22809050 22915041 23170164
5164 23170164 22869669 22843063 22889481 22929079 22818974 22853148 22864936 23086635 22829536 22718579
5154 22718579 22625728 22510668 22648182 22860692 23032617 22843506 22566417 22149275 21930493 21988830
5144 21988830 21786965 21642240 21574683 21329111 20969424 20689604 20561004 20694903 20508028 20082421
5134 20082421 20148440 19678888 19334740 19246570 19087716 19084501 18854419 18773863 18456268 18183691
$$ packed form
5204A8414681K51593J54988J7604L38502K83891L33717J05762J05912K32122P8208
5194B0316980M59079n3480P0635K72573L5908J49031L87377r0281k30498J12014
5184B1429338K14506J53737K11924Q8915k0510K13889J11172L6149R0801k5630
5174B2504291J98356m5677l931R3011R9682j45509j8115J26942J05991K55123
5164B3170164l00495k6606M6418L9598j10105L4174J1788K21699k57099j10957
5154B2718579r2851j15060J37514K12510J71925j89111k77089m17142k18782N8337
5144B1988830k01865j44725o7557k45572l59687k79820j28600J33899j86875m25607
5134B0082421O6019m69552l44148q8170j58854l215k30082q0556l17595k72577
$$ plain form
5124 18183691 18188793 18020809 17775079 17673544 17673924 17542951 17434991 17443950 17095399 16777794 16693910
5113 16693910 16681089 16512843 16241355 15990078 15818775 15662524 15469406 15455480 15362622 15129886
5103 15129886 14743057 14434913 14270399 14321687 14172498 14133863 14143655 14013096 13738306 13584408
5093 13584408 13467712 13574786 13680664 13381159 13381372 13283490 13245394 13405104 13544553 13547480 13127523
5082 13127523 13067447 12735479 12325066 12160974 12126537 12031839 11796503 11629631 11531640 11300417
5072 11300417 11304012 11259258 11137233 10811224 10597909 10499127 10297146 10359923 10169429 10388878
5062 10388878 10372661 10085673 10163729 10180745 10002428 10156564 10291972 10228131 10157599 10069640
5052 10069640 10291521 10143811 10141373 9816724 9380323 9292062 8775921 8616181 8382919 8394947
$$ packed form
5124A8183691N102j67984k45730j01535L80j30973j07960Q959l48551l17605q3884
5113A6693910j2821j68246k71488k51277j71303j56251j93118j3926r2858k32736
5103A5129886l86829l08144j64514N1288j49189l8635R792j30559k74790j53898
5093A3584408j16696J07074J05878k99505K13r7882l8096J59710J39449K927m19957
5082A3127523o0076l31968m10413j64092l4437r4698k35336j66872r7991k31223
5072A1300417L595m4754j22025l26009k13315r8782k01981O2777j90494K19449
5062A0388878j6217k86988P8056J7016j78317J54136J35408o3841p0532q7959
5052A0069640K21881j47710k438l24649m36401q8261n16141j59740k33262J2028
$$ plain form
5042 8394947 8354468 8433512 8538468 8387620 8294620 8137086 7873403 7983925 8029633 7755830
5032 7755830 7798927 7664249 7655350 7618202 7818317 7639334 7538486 7456175 7229550 7169128 7140409
5021 7140409 6944346 7047029 6862972 6750675 6850524 6937587 6714296 6481352 6358888 6374527
5011 6374527 6588698 6348577 6432248 6225562 5878346 5867204 5799691 5786451 5510242 5559276
5001 5559276 5727107 5668654 5728503 5570331 5518006 5531223 5254026 5256380 5581305 5691805 5635858
4990 5635858 5568684 5303627 5194713 5187385 5083816 5072771 4813277 4686061 4556046 4472848
4980 4472848 4527531 4567775 4526629 4797034 4433928 4322446 4333206 4083615 4085381 4163600 4264988
4969 4264988 4503578 4655563 4538312 4369599 4247716 4292384 4287597 4237656 4256914 4250967 4057594
$$ packed form
5042H394947m0479P9044J04956j50848r3000j57534k63683J10522M5708k73803
5032G755830M3097j34678q899l7148K00115j78983j00848q2311k26625o0422k8719
5021G140409j96063J02683j84057j12297R9849Q7063k23291k32944j22464J5639
5011F374527K14171k40121Q3671k06686l47216j1142o7513j3240k76209M9034
5001E559276J67831n8453N9849j58172n2325J3217k77197K354L24925J10500n5947
4990E635858o7174k65057j08914p328j03569j1045k59494j27216j30015q3198
4980D472848N4683M0244m1146K70405l63106j11482J0760k49591J766P8219J01388
4969D264988K38590J51985j17251j68713j21883M4668m787m9941J9258n947j93373
$$ plain form
4958 4057594 3977172 4058901 3964039 3966697 3805200 3802433 4014753 3910010 3717604 3778815 3861678
4947 3861678 3976531 3978361 3734482 3671516 3693070 3711499 4076221 4109899 3589374 3738888 3689241
4936 3689241 3611627 3827607 3672584 3563540 3717146 3616308 3769119 3614462 3522032 3699457
4926 3699457 3744956 3649817 3421929 3666533 3861249 3682920 3383960 3628154 3691441 3614748
4916 3614748 3865614 3759186 3855994 4052403 3714444 3620794 3872345 4078019 4289526 4366255
4906 4366255 4271946 4549382 4361945 4644335 4859858 4805536 5159646 5397710 5789116 6220009
4896 6220009 6345310 6672324 7091282 7192381 7294805 7111782 7338225 7431908 7205164 6887226
4886 6887226 6220217 5983461 5596657 5410965 5183371 4692177 4473396 4433037 4234749 3889017
$$ packed form
4958D057594q0422Q1729r4862K658j61497k767K12320j04743j92406O1211Q2863
4947C861678J14853J830k43879o2966K1554J8429L64722L3678n20525J49514m9647
4936C689241p7614K15980j55023j09044J53606j00838J52811j54657r2430J77425
4926C699457M5499r5139k27888K44604J94716j78329k98960K44194O3287p6693
4916C614748K50866j06428R6808J96409l37959r3650K51551K05674K11507P6729
4906D366255r4309K77436j87437K82390K15523n4322L54110K38064L91406M30893
4896F220009J25301L27014M18958J01099J02424j83023K26443R3683k26744l17938
4886F887226o67009k36756l86804j85692k27594m91194k18781m0359j98288l45732
$$ plain form
4876 3889017 3956559 3920952 3939653 4055900 4147167 3979772 4040221 4008965 4055469 4288665 4475813
4865 4475813 4579445 4948569 5122746 5166380 5216691 5301939 5206257 4962534 4520633 3953142
4855 3953142 3938535 3926565 3815294 3671649 3479687 3494423 3185804 3120887 3156453 3136061 3259977
4844 3259977 3332154 3409857 3512477 3487872 3585011 3579487 3597699 4122581 4507594 4762690 5026114
4833 5026114 5136350 5289209 5573307 5712832 6027844 6446193 6878754 6986482 7445719 8360257
4823 8360257 8399298 8276342 8397645 8246652 8376671 8392632 8312223 7701773 7257109 6757158
4813 6757158 6044487 5803275 5445587 4892353 4274658 3915913 3914361 3717567 3338610 3141708
4803 3141708 3121117 3019287 2933829 2989258 2797465 2678802 2594497 2652331 2779483 2296447
$$ packed form
4876C889017O7542l5607J8701J16247R1267j67395O0449l1256M6504K33196J87148
4865D475813J03632L69124J74177M3634N0311Q5248r5682k43723m41901n67491
4855C953142j4607j1970j11271j43645j91962J4736l08619o4917L5566k0392J23916
4844C259977P2177P7703J02620k4605R7139n524J8212N24882L85013K55096K63424
4833E026114J10236J52859K84098J39525L15012M18349M32561J07728M59237R14538
4823H360257L9041j22956J21303j50993J30019J5961q0409o10450m44664m99951
4813F757158p12671k41212l57688n53234o17695l58745j552j96794l78957j96902
4803C141708k0591j01830q5458N5429j91793j18663q4305N7834J27152m83036
$$ plain form
4793 2296447 2369213 2485272 2129252 2245291 2341481 2396077 2317512 2227705 2198295 2125001 2159743
4782 2159743 2260005 1899084 1722439 1958578 2170989 2107425 1823371 1792080 1515496 1695947
4772 1695947 1832026 1905809 1716651 1618638 1554303 1491868 1603202 1542717 1457446 1631778 1622589
4761 1622589 1491992 1715174 1781724 1534759 1577754 1474077 1328029 1364767 1586856 1717596
4751 1717596 1805690 1823181 1571298 1568359 1494358 1416192 1526085 1706043 1290214 1175034 1555930
4740 1555930 1813566 1739682 1651403 1646897 1739710 1693705 1661410 1704969 1411277 1332322 1412519
4729 1412519 1476053 1635131 1642380 1689626 1627814 1572825 1488464 1539593 1196679 1284163 1449515
4718 1449515 1561370 1740786 1770086 1533047 1728477 1803659 1685445 1713600 1850442 1984209
$$ packed form
4793B296447P2766J16059l56020J16039R6190N4596p8565q9807k9410p3294L4742
4782B159743J00262l60921j76645K36139K12411o3564k84054l1291k76584J80451
4772A695947J36079P3783j89158r8013o4335o2435J11334o0485q5271J74332r189
4761A622589j30597K23182O6550k46965M2995j03677j46048L6738K22089J30740
4751A717596Q8094J7491k51883k939p4001p8166J09893J79958m15829j15180L80896
4740A555930K57636p3884q8279m506R2813m6005l2295M3559k93692p8955Q0197
4729A412519O3534J59078P249M7246o1812n4989q4361N1129l42914Q7484J65352
4718A449515J11855J79416K9300k37039J95430P5182j18214K8155J36842J33767
$$ plain form
4708 1984209 1963362 1684671 1592096 1800897 1831967 1848528 1729402 1659702 1474526 1484445 1735454
4697 1735454 1931644 1941386 1899438 1815988 1773907 1682786 1815241 2028185 1954524 2069776 2179889
4686 2179889 2256975 2311530 2517099 2614457 2491334 2643534 3191306 3239520 3387080 3694337
4676 3694337 4255586 4711762 5227340 5966657 6597595 7222225 7597181 8118067 8295878 8395154
4666 8395154 8374317 8200904 8049734 7684863 7102473 6556290 5987769 5426820 4893928 4569005
4656 4569005 4147551 3830769 3388207 3274775 3184862 3070581 2828624 2807866 2664428 2770289
4646 2770289 2671158 2336692 2321378 2274549 2186616 2127935 2091829 2059927 1997958 2030987 2242404
4635 2242404 2531063 2519089 2022214 1885692 1976848 1989923 1911828 1698703 2069051 2208759
$$ packed form
4708A984209k0847k78691r2575K08801L1070J6561j19126o9700j85176R919K51009
4697A735454J96190R742m1948q3450m2081r1121J32455K12944p3661J15252J10113
4686B179889P7086N4555K05569R7358j23123J52200N47772M8214J47560L07257
4676C694337N61249M56176N15578P39317O30938O24630L74956N20886J77811R9276
4666H395154k0837j73413j51170l64871n82390n46183n68521n60949n32892l24923
4656D569005m21454l16782m42562j13432q9913j14281k41957k0758j43438J05861
4646B770289r9131l34466j5314m6829q7933n8681l6106l1902o1969L3029K11417
4635B242404K88659j1974m96875j36522R1156J3075p8095k13125L70348J39708
$$ plain form
4625 2208759 2045370 2025644 2069778 1939919 2067777 2013051 1914295 1942028 2041114 2064562 1987592
4614 1987592 2083875 2330770 2687175 2528710 2407625 2340174 2597531 2636488 2807481 3074263
4604 3074263 3108283 3650035 3954135 4268467 4503105 4644198 4912018 5079377 5134527 5363269
4594 5363269 5376080 5152126 5037434 4787476 4531936 4467934 4061085 3623094 3411540 3176609
4584 3176609 2966548 2916415 2799749 2755243 2340365 2305837 2345597 2373548 2492995 2426478 2148929
4573 2148929 2119604 2438576 2185788 2200503 2235133 2180353 1978116 2186337 2229573 2214550 1926611
4562 1926611 1756410 1922627 2109513 1991829 1985464 1916811 1994752 2058805 2136850 2000976 2114775
4551 2114775 2107058 1999963 1932677 2093948 2109618 2110304 2161060 2013705 1961411 1932090 2064651
$$ packed form
4625B208759j63389j9726M4134j29859J27858n4726r8756K7733R9086K3448p6970
4614A987592R6283K46895L56405j58465j21085o7451K57357L8957J70993K66782
4604C074263L4020N41752L04100L14332K34638J41093K67820J67359N5150K28742
4594E363269J2811k23954j14692k49958k55540o4002m06849m37991k11554k34931
4584C176609k10061n0133j16666m4506m14878l4528L9760K7951J19447o6517k77549
4573B148929k9325L18972k52788J4715L4630n4780k02237K08221M3236j5023k87939
4562A926611j70201J66217J86886j17684o365o8653P7941O4053P8045j35874J13799
4551B114775p717j07095o7286J61271J5670O86N0756j47355n2294k9321J32561
$$ plain form
4540 2064651 2068920 1995217 1787016 1632921 1702622 1763649 1532674 1576459 1859651 1877191 1722068
4529 1722068 1807882 1899274 1616438 1636749 1868005 1765787 1548739 1709048 1729739 1609175
4519 1609175 1622183 1792121 2063900 2013376 1969684 1784895 1777915 2048831 1830515 1592564
4509 1592564 1642161 1797529 1663552 1580807 1751764 1622083 1762967 1839168 1823302 2031690
4499 2031690 2003785 1965289 2046664 1982248 2082757 2018553 1807100 1829174 1961304 1887391 1867447
4488 1867447 1981566 2200221 2237438 1923937 1699244 1505865 1574304 1645556 1798087 1935980
4478 1935980 2200159 2013007 1849178 1873358 1906803 1758077 1672448 1582824 1738414 1865317
4468 1865317 1864156 1922986 1826916 2058784 2171451 2031774 2206477 2263446 2288800 2174133 2095166
$$ packed form
4540B064651M269p3703k08201j54095O9701O1027k30975M3785K83192J7540j55123
4529A722068Q5814R1392k82836K0311K31256j02218k17048J60309K0691j20564
4519A609175J3008J69938K71779n0524m3692j84789o980K70916k18316k37951
4509A592564M9597J55368j33977q2745J70957j29681J40884P6201j5866K08388
4499B031690k7905l8496Q1375o4416J00509o4204k11453K2074J32130p3913j9944
4488A867447J14119K18655L7217l13501k24693j93379O8439P1252J52531J37893
4478A935980K64179j87152j63829K4180L3445j48726q5629q9624J55590J26903
4468A865317j161N8830r6070K31868J12667j39677J74703N6969K5354j14667p8967
$$ plain form
4457 2095166 2278552 2141184 2569721 2335180 2335509 2691199 2948906 3029877 3156733 3194254
4447 3194254 3261717 3371311 3538501 3396870 3497555 3608812 3820659 3580782 3645565 3482613
4437 3482613 3217666 3190362 3152538 2764007 2760289 2771979 2544391 2781884 2702727 2551968 2318571
4426 2318571 2114058 2201747 2603302 2598119 2446257 2729890 2838521 2657429 2543496 2251478
4416 2251478 2332927 2412195 2322554 2227621 2026696 1944557 2345240 2076655 1939751 2114889
4406 2114889 2127289 1944689 1823109 1862908 1995370 2129129 2078159 2099608 2262726 2235163
4396 2235163 2010325 2121851 2231622 2284971 2122977 2347299 2154687 1949396 2239282 2164992
4386 2164992 2248385 2058917 2181285 2299490 2336227 2147402 2115819 2103188 2232969 2489307
$$ packed form
4457B095166J83386j37368M28537k34541L29L55690K57707Q0971J26856L7521
4447C194254O7463J09594J67190j41631J00685J11257K11847k39877O4783j62952
4437C482613k64947k7304l7824l88531l718J1690k27588K37493p9157j50759k33397
4426B318571k04513Q7689M01555n183j51862K83633J08631j81092j13933k92018
4416B251478Q1449P9268q9641r4933k00925q2139M00683k68585j36904J75138
4406B114889J2400j82600j21580L9799J32462J33759n0970K1449J63118k7563
4396B235163k24838J11526J09771N3349j61994K24322j92612k05291K89886p4290
4386B164992Q3393j89468J22368J18205L6737j88825l1583j2631J29781K56338
$$ plain form
4376 2489307 2265980 2331196 2094738 2131373 2011231 2073204 2294394 2239088 2294589 2469258
4366 2469258 2459321 2218654 2357890 2223857 2145392 2111413 2311495 2460598 2384917 2219741
4356 2219741 2288909 2349203 2214242 2083317 2038239 2229696 2213464 2374287 2535549 2381659
4346 2381659 2427258 2362594 2375117 2580071 2643251 2581935 2567022 2480697 2463786 2526452 2604341
4335 2604341 2630249 2759977 2604844 2655051 2852555 2613897 2590995 2444849 2709125 2744166
4325 2744166 2730266 2811032 2922025 3143262 2984362 2982904 2987042 2819466 2948520 2832835 2704718
4314 2704718 2910325 2854908 2964144 2834322 2974185 3026695 2852886 2667479 2794301 2632458
4304 2632458 2555890 2688769 2747133 2677940 2549112 2763763 2760410 2930726 2722704 2753685 2858240
$$ packed form
4376B489307k23327O5216k36458L6635j20142O1973K21190n5306N5501J74669
4366B469258r937k40667J39236j34033p8465l3979K00082J49103p5681j65176
4356B219741O9168O0294j34961j30925m5078J91457j6232J60823J61262j53890
4346B381659M5599o4664J2523K04954O3180o1316j4913q6325j6911O2666P7889
4335B604341K5908J29728j55133N0207J97504k38658k2902j46146K64276L5041
4325B744166j3900Q0766J10993K21237j58900j458M138j67576J29054j15685j28117
4314B704718K05607n5417J09236j29822J39863N2510j73809j85407J26822j61843
4304B632458p6568J32879N8364o9193j28828K14651l353J70316k08022L0981J04555
$$ plain form
4293 2858240 2554975 2716038 2767473 2750559 2680485 2764122 2846982 2899510 3013830 2917401 3009347
4282 3009347 3021589 2889637 3057038 3100207 3071066 3113982 3111812 3312524 3247050 3287238 3434207
4271 3434207 3547274 3565516 3418766 3337961 3421013 3656242 3619858 3447341 3429548 3556560
4261 3556560 3516035 3696770 3973972 4024489 3754542 3997466 4014263 3693815 4001116 4086690
4251 4086690 3846801 3678674 3762200 3668335 3710980 3798957 3699914 3952681 4032922 3891278 3891507
4240 3891507 3928216 3828540 3909632 4186032 3979506 4136134 4150364 4436857 4574461 4510879
4230 4510879 4721056 4820349 4707315 4806428 4826631 4766847 4780804 4835830 4680409 4591972 4844460
4219 4844460 4855166 4845748 5198236 5120424 4980722 5004610 5076052 5111676 5105848 5603100 5486003
$$ packed form
4293B858240l03265J61063N1435j6914p0074Q3637Q2860N2528J14320r6429R1946
4282C009347J2242j31952J67401M3169k9141M2916k170K00712o5474M0188J46969
4271C434207J13067J8242j46750q0805Q3052K35229l6384j72517j7793J27012
4261C556560m0525J80735K77202N0517k69947K42924J6797l20448L07301Q5574
4251D086690k39889j68127Q3526r3865M2645Q7977r9043K52767Q0241j41644K29
4240C891507L6709r9676Q1092K76400k06526J56628J4230K86493J37604o3582
4230D510879K10177R9293j13034R9113K0203n9784J3957N5026j55421q8437K52488
4219D844460J0706r418L52488p7812j39702K3888P1442L5624n828M97252j17097
$$ plain form
4208 5486003 5225801 5762366 6112560 6441338 6441752 6575785 7220092 7782905 8428877 9336810
4198 9336810 9897318 9570081 9042691 8357692 7829834 7250169 6566095 6278929 6126094 5985306
4188 5985306 6016420 5934288 5725663 5467723 5334870 5676550 5663073 5364059 5365249 5562848
4178 5562848 5765271 5436745 5404483 5505616 5251243 5048171 5089168 5403707 5309451 5302756
4168 5302756 5210482 5156199 5239381 5188817 5325874 5352548 5219812 5243004 5300942 5208522 4937768
4157 4937768 4947912 4975628 4956914 4625996 4767515 5025422 4947297 5015106 5064011 5271412 5268912
4146 5268912 5108524 5183703 5276198 5173820 5222684 4962109 4975079 4855387 4898502 4964567 4820997
4135 4820997 4891901 5006518 4982381 4877584 4697765 4857742 4967999 5049053 5105455 5192956
$$ packed form
4208E486003k60202N36565L50194L28778M14J34033O44307N62813O45972R07933
4198I336810N60508l27237n27390o84999n27858n79665o84074k87166j52835j40788
4188E985306L1114q2132k08625k57940j32853L41680j3477k99014J190J97599
4178E562848K02423l28526l2262J01133k54373k03072M0997L14539r4256o695
4168E302756r2274n4283Q3182n0564J37057K6674j32736K3192N7938r2420k70754
4157D937768J0144K7716j8714l30918J41519K57907p8125O7809M8905K07401k500
4146E268912j60388P5179R2495j02378M8864k60575J2970j19692M3115O6065j43570
4135D820997P0904J14617k4137j04797j79819J59977J10257Q1054N6402Q7501
$$ plain form
4125 5192956 4819655 4820262 5047064 4978461 4907208 4872011 4863693 4866248 4955938 5296229 5469044
4114 5469044 5646568 5518550 5453469 5531774 5806298 6251280 6301511 6406244 6435110 6740919
4104 6740919 6817277 7043168 6990232 6955778 6718885 6339316 6402872 6246554 6357188 6276671
4094 6276671 6258218 6203927 6249175 6103074 6098066 6066971 6139221 6069849 5863707 5859688 5896570
4083 5896570 5878899 5699429 5910497 5880653 5976213 6060485 5828521 5912598 5972951 5914261 6124597
4072 6124597 6144675 6240577 6193690 6276105 6177362 6317485 6149238 5875435 6125986 6309342
4062 6309342 6233275 6313051 6167561 6011278 6224786 6589867 6849718 6655809 6868179 6908914
4052 6908914 6948700 7056231 7137878 7267397 7385352 7707327 7593865 7568275 7474644 7586879
$$ packed form
4125E192956l73301O07K26802o8603p1253l5197q318K555Q9690L40291J72815
4114E469044J77524j28018o5081P8305K74524M44982N0231J04733K8866L05809
4104F740919P6358K25891n2936l4454k36893l79569O3556j56318J10634q0517
4094F276671j8453n4291M5248j46101n008l1095P2250o9372k06142m019L6882
4083E896570j7671j79470K11068k9844R5560Q4272k31964Q4077O0353n8690K10336
4072F124597K0078R5902m6887Q2415r8743J40123j68247k73803K50551J83356
4062F309342p6067P9776j45490j56283K13508L65081K59851j93909K12370M0735
4052F908914L9786J07531Q1647J29519J17955L21975j13462k5590r3631J12235
$$ plain form
4042 7586879 7658966 7843202 8032575 8045146 8303344 8435025 8488342 8593362 8577254 8902912
4032 8902912 9367892 9724522 9892083 10602876 10944127 11342750 12247912 12807578 13892319
4023 13892319 15343758 16856018 18725651 21161405 23923893 27820853 32127831 35808247
4015 35808247 36641571 34899281 31550478 27252143 23959588 21108871 18978688 17737076
4007 17737076 16511751 15545678 14857373 14037311 13401327 12778036 12122348 11620475 11264098
3998 11264098 11089628 10895062 10747358 10264479 10011101 9831097 9904485 9832298 9533278 9379392
3988 9379392 9137487 9296419 9027192 8973857 9159255 9379350 9320009 9397544 9599700 9242327
3978 9242327 9115030 9000962 8956157 8827099 8776542 9121268 9449759 9625764 9881462 10212201
$$ packed form
4042G586879P2087J84236J89373J2571K58198J31681N3317J05020j6108L25658
4032H902912M64980L56630J67561P10793L41251L98623R05162N59666J084741
4023A3892319J451439J512260J869633K435754K762488L896960M306978L680416
4015C5808247Q33324j742290l348803m298335l292555k850717k130183j241612
4007A7737076j225325r66073o88305q20062o35984o23291o55688n01873l56377
3998A1264098j74470j94566j47704m82879k53378j80004P3388p2187k99020j53886
3988I379392k41905J58932k69227n3335J85398K20095n9341P7535K02156l57373
3978I242327j27297j14068m4805j29058n0557L44726L28491J76005K55698L30739
$$ plain form
3968 10212201 10718090 11260125 11232542 11077221 10794913 10591240 10180924 9945686 9795250 9554185
3958 9554185 9634024 9432286 9504807 9851289 9903815 9952113 9771171 9533629 9451970 9441413 9341116
3947 9341116 9503744 9538277 9026547 9000454 9118602 9118609 9200410 9478302 9192047 9184180 9062924
3936 9062924 8862981 8947562 8974555 8936893 9068424 8803156 8777931 8633624 8361211 8465016
3926 8465016 8333836 8299872 8177140 8459597 8715877 8401861 8503361 8396416 8380208 8587952
3916 8587952 8374069 8440173 8140306 8194780 8332125 8638228 8708434 8794548 9042103 9023699
3906 9023699 8820180 8968467 9170516 9195970 9493027 9983252 10202514 10401363 10496623 10392864
3896 10392864 10325729 10245336 10207124 9885260 9814637 9807747 9867090 10116304 10191049 10209529 10096559
$$ packed form
3968A0212201N05889N42035k7583j55321k82308k03673m10316k35238j50436k41065
3958I554185P9839k01738P2521L46482N2526M8298j80942k37542q1659j0557j00297
3947I341116J62628L4533n11730k6093J18148PQ1801K77892k86255p867j21256
3936I062924j99943Q4581K6993l7662J31531k65268k5225j44307k72413J03805
3926H465016j31180l3964j22732K82457K56280l14016J01500j06945j6208K07744
3916H587952k13883O6104k99867N4474J37345L06103P0206Q6114K47555j8404
3906I023699k03519J48287K02049K5454K97057M90225K19262J98849R5260j03759
3896A0392864o7135q0393l8212l21864p0623o890N9343K49214P4745J8480j12970
$$ plain form
3885 10096559 10118855 10202565 10297338 10431741 10418201 10341864 10411324 10529550 10696821 10697232 10683986
3874 10683986 10729466 10751575 10811087 10700920 10857845 11010860 11018823 11063739 11121646 10940873 11259179
3863 11259179 11309215 11445574 11550243 11857400 12277309 12409000 12602236 12717490 12794270 13166265
3853 13166265 13162892 13488175 14112923 14572428 14970716 15168822 15724215 15835261 16327199 16771285
3843 16771285 17451431 18102459 18455844 18933148 19607252 20438582 21227121 22188824 23241295
3834 23241295 24182908 24799081 25370683 26333112 27364662 28214804 29244196 30250958 31533607
3825 31533607 33239397 35334494 37564023 40065871 43483036 47368418 50979388 54464888
3817 54464888 57969166 61549273 64970261 67220852 68133486 68169373 67798491 67290442 66578929
$$ packed form
3885A0096559K2296Q3710R4773J34403j3540p6337O9460J18226J67271M11j3246
3874A0683986M5480K2109N9512j10167J56925J53015P963M4916N7907j80773L18306
3863A1259179N0036J36359J04669L07157M19909J31691J93236J15254P6780L71995
3853A3166265l373L25283O24748M59505L98288J98106N55393J11046M91938M44086
3843A6771285O80146O51028L53385M77304O74104Q31330P88539R61703J052471
3834B3241295R41613O16173N71602R62429J031550Q50142J029392J006762J282649
3825C1533607J705790K095097K229529K501848L417165L885382L610970L485500
3817E4464888L504278L580107L420988K250591R12634L5887l70882n08049p11513
$$ plain form
3808 66578929 65921446 65627076 65531954 66142036 67172074 68772620 70656225 72728709 75258867
3799 75258867 77872960 80957468 84065897 87335904 91281958 95320774 99254944 103598746
3791 103598746 108246781 113018093 118020401 122716309 127433195 131563260 135120622 138663038
3783 138663038 141636361 144600347 147741201 150884438 154255988 157453792 160432824 163470116
3775 163470116 165921035 168130988 169797846 171612182 173208747 174977180 176688623 178475317
3767 178475317 180521546 182786537 185026426 187331488 190145443 193302827 197070100 201288363
3759 201288363 206465354 212901027 220664058 229161279 238457967 249177704 261722435 277209795
3751 277209795 296166734 318962876 345902639 376619451 409692706 443055103 473947310
$$ packed form
3808F6578929o57483k94370r5122O10082J030038J600546J883605K072484K530158
3799G5258867K614093L084508L108429L270007L946054M038816L934170M343802
3791A03598746M648035M771312N002308M695908M716886M130065L557362L542416
3783A38663038K973323K963986L140854L143237L371550L197804K979032L037292
3775A63470116K450919K209953J666858J814336J596565J768433J711443J786694
3767A78475317K046229K264991K239889K305062K813955L157384L767273M218263
3759B01288363N176991O435673P763031Q497221R296688J0719737J2544731J5487360
3751B77209795J8956939K2796142K6939763L0716812L3073255L3362397L0892207
$$ plain form
3744 473947310 498641190 515438994 521982789 518381570 507262231 491416940 473183309
3737 473183309 455113937 438492015 423844245 410156072 396977301 382866882 366891388
3730 366891388 348719496 328824687 307556916 286223005 265598580 247142252 231652342
3723 231652342 218674316 209178284 203088440 196404653 185325244 172045670 157624453
3716 157624453 144243420 133145602 123603992 115856451 109359423 103810083 98764901 94664221
3708 94664221 90987033 87772693 85068783 82627573 80424298 78641844 77191238 76321698
3700 76321698 75436470 74808235 74359267 73434226 72177395 70220824 67703100 64764208 62692035
3691 62692035 60194031 58120034 56345696 54649636 53108576 51929026 50833826 49863240
$$ packed form
3744D73947310K4693880J6797804O543795l601219j1119339j5845291j8233631
3737D73183309j8069372j6621922j4647770j3688173j3178771j4110419j5975494
3730C66891388j8171892j9894809k1267771k1333911k0624425j8456328j5489910
3723B31652342j2978026r496032o089844o683787j1079409j3279574j4421217
3716A57624453j3381033j1097818r541610p747541o497028n549340n045182m100680
3708I4664221l677188l214340k703910k441210k203275j782454j450606q69540
3700G6321698q85228o28235m48968r25041j256831j956571k517724k938892k072173
3691F2692035k498004k073997j774338j696060j541060j179550j095200r70586
$$ plain form
3683 49863240 49265087 48846976 48497057 48239622 48374576 48907403 49625541 50134685 50163188 49862703
3673 49862703 48547601 46748152 44802928 42925652 41100624 39641612 38261575 37289704
3665 37289704 36106530 34918139 33780258 32889598 32071968 31384134 30796922 30153951 29703620
3656 29703620 28749744 28301625 27515763 27069844 26543261 26025907 25565052 25279127 24729399
3647 24729399 24504197 24259799 24082122 23952434 23712985 23501791 23224113 22867000 22481203
3638 22481203 22462768 22277058 22009504 21746382 21697123 21331737 20889916 20748375 20644490 20465014
3628 20465014 20505440 20421599 20333495 20381934 20344848 20088295 20205280 20400654 20503339 20477970
3618 20477970 20446441 20920271 21054351 21274132 21833298 22333078 22841400 23437529 24239250 25172095
$$ packed form
3683D9863240n98153m18111l49919k57435J34954N32827P18138N09144K8503l00485
3673D9862703j315102j799449j945224j877276j825028j459012j380037r71871
3665C7289704j183174j188391j137881q90660q17630o87834n87212o42971m50331
3656B9703620r53876m48119p85862m45919n26583n17354m60855k85925n49728
3647B4729399k25202k44398j77677j29688k39449k11194k77678l57113l85797
3638B2481203j8435j85710k67554k63122m9259l65386m41821j41541j03885j79476
3628B0465014M0426q3841q8104M8439l7086k56553J16985J95374J02685k5369
3618B0477970l1529M73830J34080K19781N59166M99780N08322N96129Q01721R32845
$$ plain form
3608 25172095 26005272 26741702 27982055 29129049 29801560 30195575 30107372 29185039 28161903
3599 28161903 26871111 25430872 24567256 24055730 23266838 22808449 22601585 22436450 22833386
3590 22833386 22765773 22912271 23403504 24193474 24889076 25727211 26396606 27224974 28057102 28411066
3580 28411066 28101620 27291441 26076810 24890583 23956065 22904109 22170730 21475784 20867454
3571 20867454 20301310 19937009 19481090 19277023 18672817 18297476 18067639 17826201 17693598
3562 17693598 17495756 17289499 17186141 17301470 16978611 16660501 16764103 17008849 17121069
3553 17121069 17090318 16917811 16979653 16980163 16878598 16987831 17059110 17148900 17105169 17327347 17625912
3542 17625912 17387193 17385007 17551878 18076991 18257736 18324758 18370380 18442634 18836306 19160847
$$ packed form
3608B5172095Q33177P36430J240353J146994O72511L94015q8203r22333j023136
3599B8161903j290792j440239q63616n11526p88892m58389k06864j65135L96936
3590B2833386o7613J46498M91233P89970O95602Q38135O69395Q28368Q32128L53964
3580B8411066l09446q10179j214631j186227r34518j051956p33379o94946o08330
3571B0867454n66144l64301m55919k04067o04206l75341k29837k41438j32603
3562A7693598j97842k06257j03358J15329l22859l18110J03602K44746J12220
3553A7121069l0751j72507O1842N10j01565J09233P1279Q9790m3731K22178K98565
3542A7625912k38719k186J66871N25113J80745O7022M5622P2254L93672L24541
$$ plain form
3532 19160847 19243529 19758111 20078200 20424554 20796387 21062283 21207587 21551756 21890897 22285499
3522 22285499 22769184 23208115 23606111 23938189 24470801 25093871 25741012 26149958 26618321
3513 26618321 27261406 27854477 28450567 29065179 29502573 30190446 30973079 31740389 32289467
3504 32289467 33492756 34513719 35096966 35916980 36784726 37572206 38441270 39576011 40444852
3495 40444852 41361545 42001143 43004504 44267182 45398539 46838819 48134619 49371835
3487 49371835 50973860 52744792 54294346 55920658 57932868 60311697 62742161 65382655
3479 65382655 68495403 72061438 75903774 80259628 85058069 90446221 96724853 103749227
3471 103749227 112226393 121833063 132853055 145724711 160429061 177094386 195769463
$$ packed form
3532A9160847Q2682N14582L20089L46354L71833K65896J45304L44169L39141L94602
3522B2285499M83685M38931L97996L32078N32612O23070O47141M08946M68363
3513B6618321O43085N93071N96090O14612M37394O87873P82633P67310N49078
3504C2289467J203289J020963N83247Q20014Q67746P87480Q69064J134741Q68841
3495D0444852R16693O39598J003361J262678J131357J440280J295800J237216
3487D9371835J602025J770932J549554J626312K012210K378829K430464K640494
3479F5382655L112748L566035L842336M355854M798441N388152O278632P024374
3471A03749227Q477166R606670J1019992J2871656J4704350J6665325J8675077
$$ plain form
3464 195769463 215178459 233518027 249934737 263592838 274629252 284200699 293257609
3457 293257609 303208068 314915149 328251861 343747356 359662872 374851030 387055700
3450 387055700 394965862 397293269 394064959 385779385 373496051 359244382 344380770 330313713
3442 330313713 318425999 308181106 299270908 290460012 280747520 269262103 255090762
3435 255090762 238536227 220840089 202828110 186261788 171333551 157838765 145868909
3428 145868909 135326143 126217674 118118339 111129752 104693479 99414004 94651841 90401827
3420 90401827 86480777 82733259 79984001 77390944 75003807 72767156 70467937 68578011
3412 68578011 66893693 65425748 63739702 62032118 60725531 59591766 58320730 57277058
$$ packed form
3464A95769463J9408996J8339568J6416710J3658101J1036414R571447R056910
3457B93257609R950459J1707081J3336712J5495495J5915516J5188158J2204670
3450C87055700P910162K327407l228310q285574j2283334j4251669j4863612j4067057
3442C30313713j1887714j0244893q910198q810896r712492j1485417j4171341
3435B55090762j6554535j7696138j8011979j6566322j4928237j3494786j1969856
3428A45868909j0542766r108469q099335o988587o436273n279475m762163m250014
3420I0401827l921050l747518k749258k593057k387137k236651k299219j889926
3412F8578011j684318j467945j686046j707584j306587j133765j271036j043672
$$ plain form
3404 57277058 56349083 55396279 54094750 52695583 51518812 50191885 49106045 48145636 47104433
3395 47104433 46220898 45203077 44440595 43923798 43348468 42682323 41949856 41146141 40587131
3386 40587131 40041394 39334762 38733285 38179263 37572171 37242107 37099036 36877233 36303299
3377 36303299 35808232 35233676 35014713 34895771 34653140 34263316 34182279 33780268 33828576 33547853
3367 33547853 33482701 33733266 34027681 34725459 35116950 35075277 34740488 33924656 33090031 32295271
3357 32295271 31528689 31127198 30803536 30498100 29966689 29867767 29635843 29158547 29019686 28847437
3347 28847437 29087107 28977757 28683142 28887874 28821777 28910211 28977658 29315322 29918548 30271772
3337 30271772 30675194 30802060 30390907 29523403 28503147 27756539 27268612 26663601 26323219
$$ packed form
3404E7277058r27975r52804j301529j399167j176771j326927j085840r60409j041203
3395D7104433q83535j017821p62482n16797n75330o66145p32467q03715n59010
3386D0587131n45737p06632o01477n54022o07092l30064j43071k21803n73934
3377C6303299m95067n74556k18963j18942k42631l89824q1037m02011M8308k80723
3367C3547853o5152K50565K94415O97778L91491m1673l34789q15832q34625p94760
3357C2295271p66582m01491l23662l05436n31411r8922k31924m77296j38861j72249
3347B8847437K39670j09350k94615K04732o6097Q8434O7447L37664O03226L53224
3337C0271772M03422J26866m11153q67504j020256p46608m87927o05011l40382
$$ plain form
3328 26323219 26034326 25756925 25562514 25119003 24965072 24641011 24424363 24122585 24054080 24097798
3318 24097798 23666457 23341805 23109864 22888935 22838067 22735072 22457175 22283956 22082628 22179290
3308 22179290 22217603 21782734 21950112 22157529 22074997 22181784 22218088 22166953 22146863 21924783
3298 21924783 21910292 21878791 22065166 22011245 21883687 21813133 21765703 21722068 21622055 21660206 21940506
3287 21940506 21809031 21899014 21858336 21684343 21618344 21773917 21718157 21711823 21828020 21764480 21544728
3276 21544728 21287253 21081911 21251010 21298059 21285553 21138717 21058233 21194170 20990648 20977497
3266 20977497 20921153 20902556 21021172 21017593 21101241 21065918 20905372 20716404 20870572 20982904
3256 20982904 21213665 21304411 21411428 21431739 21471540 21719845 21603597 21681528 21940795 22087544
$$ packed form
3328B6323219k88893k77401j94411m43511j53931l24061k16648l01778o8505M3718
3318B4097798m31341l24652k31941k20929n0868j02995k77897j73219k01328R6662
3308B2179290L8313m34869J67378K07417q2532J06787L6304n1135k0090k22080
3298B1924783j4491l1501J86375n3921j27558p0554m7430m3635j00013L8151K80300
3287B1940506j31475Q9983m0678j73993o5999J55573n5760o334J16197o3540k19752
3276B1544728k57475k05342J69099M7049j2506j46836q0484J35937k03522j3151
3266B0977497n6344j8597J18616l579Q3648l5323j60546j88968J54168J12332
3256B0982904K30761R0746J07017K0311L9801K48305j16248P7931K59267J46749
$$ plain form
3246 22087544 22451639 22937004 23013847 23228897 23134185 23308470 23766555 23733675 23657322 23797352
3236 23797352 23736555 23676360 23722039 23708593 23610874 23601972 23666421 23592468 23334947 23582306 23716923
3225 23716923 23773089 23519115 23845606 24080654 24266660 24384578 24533873 24678408 24753553 24703342
3215 24703342 24951804 25036531 25117179 25502482 25829321 26028883 26007511 26195971 26287412 26702712
3205 26702712 27028339 27287471 27659243 27947132 28277815 28449861 28956805 29137063 29280480
3196 29280480 29763315 30221774 30573129 30942541 31262193 31490873 31844331 32307818 32684591
3187 32684591 33155866 33374736 33516955 33924091 34353918 34760811 35050071 35312072 35816738
3178 35816738 36346802 36535757 36982835 37290138 37864130 38256663 38455211 38923823 39272524
$$ packed form
3246B2087544L64095M85365P6843K15050r4712J74285M58085l2880p6353J40030
3236B3797352o0797o0195M5679j3446r7719q902O4449p3953k57521K47359J34617
3225B3716923N6166k53974L26491K35048J86006J17918J49295J44535P5145n0211
3215B4703342K48462Q4727Q0648L85303L26839J99562k1372J88460R1441M15300
3205B6702712L25627K59132L71772K87889L30683J72046N06944J80258J43417
3196B9280480M82835M58459L51355L69412L19652K28680L53458M63487L76773
3187C2684591M71275K18870J42219M07136M29827M06893K89260K62001N04666
3178C5816738N30064J88955M47078L07303N73992L92533J98548M68612L48701
$$ plain form
3169 39272524 39615155 40032339 40564265 41196169 41672996 42090426 42511704 43001499 43611648
3160 43611648 44490987 45171901 46069987 46887677 47492714 48245588 49102532 49918734 50565570
3151 50565570 51012228 51649144 52273385 53041481 54028550 54757649 55444258 56158691 57056425
3142 57056425 57692945 58501179 59350578 60080421 61069582 61963434 62811517 63931609 64974385
3133 64974385 66222737 67742882 69250958 70824205 72861380 74781517 76305076 77755632
3125 77755632 79240818 80524773 82077085 84222861 86373076 88897646 92040804 95484956
3117 95484956 99269776 103804438 108264048 113549321 118915470 124506672 129998332 135672616
3109 135672616 141346082 146931299 152223901 156589360 160728874 164823196 168165844 170699787
$$ packed form
3169C9272524L42631M17184N31926O31904M76827M17430M21278M89795O10149
3160D3611648Q79339O80914Q98086Q17690O05037P52874Q56944Q16202O46836
3151E0565570M46658O36916O24241P68096R87069P29099O86609P14433Q97734
3142E7056425O36520Q08234Q49399P29843R89161Q93852Q48083J120092J042776
3133F4974385J248352J520145J508076J573247K037175J920137J523559J450556
3125G7755632J485186J283955J552312K145776K150215K524570L143158L444152
3117I5484956L784820M534662M459610N285273N366149N591202N491660N674284
3109A35672616N673466N585217N292602M365459M139514M094322L342648K533943
$$ plain form
3101 170699787 171907352 171838908 170296651 166070740 159546426 152090823 144273960 137127101
3093 137127101 130525672 124239843 119055196 114356990 109879970 105917237 102624576 99575986
3085 99575986 96514591 93993750 91958992 89756219 87768382 85915835 84529086 83169832
3077 83169832 82025789 80852758 79473373 77910817 76214276 74321841 72801109 71551746
3069 71551746 69961835 68308179 66818940 65251089 63963526 62620244 61138731 60100987
3061 60100987 59215764 58262552 57746664 57172644 56635453 56100226 55614732 55110100 54515509
3052 54515509 54138644 53897440 53261118 52728310 51785256 50360986 49168104 47893459 46888428
3043 46888428 46010271 45138830 44506959 43880337 43050762 42307093 41933697 41578744 41129170
$$ packed form
3101A70699787J207565o8444j542257m225911o524314p455603p816863p146859
3093A37127101o601429o285829n184647m698206m477020l962733l292661l048590
3085I9575986l061395k520841k034758k202773j987837j852547j386749j359254
3077H3169832j144043j173031j379385j562556j696541j892435j520732j249363
3069G1551746j589911j653656j489239j567851j287563j343282j481513j037744
3061F0100987q85223r53212n15888n74020n37191n35227m85494n04632n94591
3052E4515509l76865k41204o36322n32808r43054j424270j192882j274645j005031
3043D6888428q78157q71441o31871o26622q29575p43669l73396l54953m49574
$$ plain form
3034 41129170 40503236 40213212 39978782 39452819 39189959 38595416 38592159 38275791 37702247 37407082
3024 37407082 37176824 36692784 36500782 36443907 36191167 35954276 35588505 35500806 35196242 34669872
3014 34669872 34439544 34076548 33751408 33454781 33104690 32901788 32316804 31886370 31740650
3005 31740650 31404660 30934743 30640158 30314627 29764484 29323668 29257591 29118848 28863165 28843342
2995 28843342 28672831 28269340 28196733 27810231 27618711 27392915 26973228 27002917 26991390 26887846
2985 26887846 26634583 26498730 26302080 25996178 25785718 25546781 25541584 25210533 25050534 24766657
2975 24766657 24574972 24727353 24435781 24290518 24125232 23939007 23665023 23525874 23322189
2966 23322189 23261591 22997873 22952691 22852403 22730907 22857465 22659508 22378053 22168406 22188120
$$ packed form
3034D1129170o25934k90024k34430n25963k62860n94543l257l16368n73544k95165
3024C7407082k30258m84040j92002n6875k52740k36891l65771q7699l04564n26370
3014C4669872k30328l62996l25140k96627l50091k02902n84984m30434j45720
3005C1740650l35990m69917k94585l25531n50143m40816o6077j38743k55683j9823
2995B8843342j70511m03491p2607l86502j91520k25796m19687K9689j1527j03544
2985B6887846k53263j35853j96650l05902k10460k38937n197l31051j59999k83877
2975B4766657j91685J52381k91572j45263j65286j86225k73984j39149k03685
2966B3322189o0598k63718m5182j00288j21496J26558j97957k81455k09647J9714
$$ plain form
2956 22188120 22085928 21871717 21947956 22042755 21900008 21852494 21670789 21406861 21403875 21396908 21266925
2945 21266925 21112334 21203064 21094503 20968647 20868930 20576650 20403177 20319177 20183485 19978491
2935 19978491 20079546 20191644 20111344 19939815 19863192 19920858 20088108 19921655 19772693 19364465
2925 19364465 19431876 19363758 19185215 19124361 19251443 19132950 19080368 18950394 18997322 18879467
2915 18879467 18865100 18919931 18720906 18833318 18690035 18552797 18541971 18786991 18738958 18668151
2905 18668151 18574642 18542871 18356310 18461599 18498406 18411798 18523128 18685490 18597098 18633946
2895 18633946 18658492 18850478 18948809 19090195 19018141 19206700 19370302 19501343 19638375 19934326
2885 19934326 20258471 20199816 20348121 20335695 20553324 20870705 20915869 21397779 21664147 21858134
$$ packed form
2956B2188120j02192k14211P6239R4799j42747m7514j81705k63928k986o967j29983
2945B1266925j54591R0730j08561j25856r9717k92280j73473q4000j35692k04994
2935A9978491J01055J12098q0300j71529p6623N7666J67250j66453j48962m08228
2925A9364465O7411o8118j78543o0854J27082j18493n2582j29974M6928j17855
2915A8879467j4367N4831j99025J12412j43283j37238j0826K45020m8033p0807
2905A8668151r3509l1771j86561J05289L6807q6608J11330J62362q8392L6848
2895A8633946K4546J91986R8331J41386p2054J88559J63602J31041J37032K95951
2885A9934326L24145n8655J48305j2426K17629L17381M5164M81910K66368J93987
$$ plain form
2875 21858134 21944568 22189238 22241905 22546355 22904177 23163392 23220011 23345392 23677454 23923345
2865 23923345 24515324 24751608 25035632 25426082 25958535 26223625 26486710 26732063 26959254
2856 26959254 27437410 27674059 27922382 28419353 28480068 28944543 29109639 29275297 29620072 30108072
2846 30108072 30143428 30228188 30918931 31350314 31911594 32692647 33227874 33608012 34262268 34948860
2836 34948860 35785792 36579802 37286251 38143609 39064660 40134716 41048475 42082985 43580721
2827 43580721 44750433 46204976 47812246 49446158 51239319 52899175 54316077 55562594
2819 55562594 56544670 57130589 58027513 58682299 58981977 59678065 60378443 61081143 61710870
2810 61710870 62186084 63142812 64007949 65117780 66519845 68001813 70084605 71892579 74329043
$$ packed form
2875B1858134Q6434K44670N2667L04450L57822K59215N6619J25381L32062K45891
2865B3923345N91979K36284K84024L90450N32453K65090K63085K45353K27191
2856B6959254M78156K36649K48323M96971O0715M64475J65096J65658L44775M88000
2846C0108072L5356Q4760O90743M31383N61280P81053N35227L80138O54256O86592
2836C4948860Q36932P94010P06449Q57358R21051J070056R13759J034510J497736
2827D3580721J169712J454543J607270J633912J793161J659856J416902J246517
2819E5562594R82076N85919Q96924O54786K99678O96088P00378P02700O29727
2810F1710870M75214R56728Q65137J109831J402065J481968K082792J807974K436464
$$ plain form
2801 74329043 77447881 80630567 84239306 88314859 92974795 97952295 102189968 104057562
2793 104057562 103869911 102218583 99051033 95013700 91301412 87862919 84972299 82565516
2785 82565516 80713194 79560206 78636919 77955301 78136221 78314491 79092786 79941504 80997820
2776 80997820 82263752 83411109 84590455 85675034 86804769 87998355 89095581 90126323
2768 90126323 90868013 90622379 89550185 87691162 85231133 82671241 79708643 76818366
2760 76818366 74500401 72199954 70386233 68591887 66958446 65421578 64347925 63232286
2752 63232286 62381254 61355883 60289936 59390535 58322502 57347566 56094458 54440577 52728832
2743 52728832 51120994 49648937 47858406 46475845 45016596 43355748 42210804 40862726
$$ packed form
2801G4329043L118838L182686L608739M075553M659936M977500M237673J867594
2793A04057562j87651j651328l167550m037333l712288l438493k890620k406783
2785H2565516j852322j152988r23287o81618J80920J78270P78295Q48718J056316
2776H0997820J265932J147357J179346J084579J129735J193586J097226J030742
2768I0126323P41690k45634j072194j859023k460029k559892k962598k890277
2760G6818366k317965k300447j813721j794346j633441j536868j073653j115639
2752F3232286q51032j025371j065947q99401j068033r74936j253108j653881j711745
2743E2728832j607838j472057j790531j382561j459249j660848j144944j348078
$$ plain form
2735 40862726 39645632 38781217 37818035 37077372 36078281 35305259 34563305 33651267 33162081
2726 33162081 32662441 31984240 31418337 31035320 30458365 30007811 29200632 28529337 27763730
2717 27763730 27236492 26924301 26211454 25697837 25225941 24828416 24512634 23940605 23600437
2708 23600437 23107101 22505001 22227684 22031250 21620616 20971125 20641411 20242034 19838790
2699 19838790 19559122 19173668 18715617 18185049 17939359 17897089 17721036 17539559 17214205 16842178
2689 16842178 16599683 16503997 16179458 16065250 15787324 15292876 14833031 14573062 14319436 14116352
2679 14116352 14152023 13713553 13479926 13125899 12879019 12725276 12285418 11905631 11916603 11705834
2669 11705834 11565170 11423913 11319039 11490821 11249094 10819399 10690955 10483665 10172478
$$ packed form
2735D0862726j217094q64415r63182p40663r99091p73022p41954r12038m89186
2726C3162081m99640o78201n65903l83017n76955m50554q07179o71295p65607
2717B7763730n27238l12191p12847n13617m71896l97525l15782n72029l40168
2708B3600437m93336o02100k77317j96434m10634o49491l29714l99377m03244
2699A9838790k79668l85454m58051n30568k45690m2270j76053j81477l25354l72027
2689A6842178k42495r5686l24539j14208k77926m94448m59845k59969k53626k03084
2679A4116352L5671m38470k33627l54027k46880j53743m39858l79787J0972k10769
2669A1705834j40664j41257j04874J71782k41727m29695j28444k07290l11187
$$ plain form
2660 10172478 10161225 10130395 9955353 9812833 9737351 9538197 9250118 8888312 8683680 8666528
2650 8666528 8820264 8566879 8296895 8207031 7952876 7587003 7631490 7662245 7797493 7453861
2640 7453861 7290550 7146813 6967084 6850914 6745747 6682592 6599036 6503569 6182921 6438168
2630 6438168 6310286 6216762 5956349 5750025 5865743 5795174 5806283 5666775 5416744 5224337
2620 5224337 5298634 5074330 4849288 5047596 4820739 4752580 4730002 4859424 4770904 4986616
2610 4986616 4753506 4572812 4626769 4557183 4568937 4203675 4275354 4284369 4232436 3925194 3987520
2599 3987520 4254921 4291530 4301002 3986896 3972453 3968360 3939783 3863623 3786892 3701350 3694545 3548720
2587 3548720 3345829 3509652 3636977 3400861 3208652 3253300 3267922 3200985 3126326 3129059 3133140
$$ packed form
2660A0172478j1253l0830j75042j42520p5482j99154k88079l61806k04632j7152
2650H666528J53736k53385k69984q9864k54155l65873M4487L0755J35248l43632
2640G453861j63311j43737j79729j16170j05167o3155q3556r5467l20648K55247
2630F438168j27882r3524k60413k06324J15718p0569J1109j39508k50031j92407
2620E224337P4297k24304k25042J98308k26857o8159k2578J29422q8520K15712
2610D986616k33110j80694N3957o9586J1754l65262P1679R015n1933l07242O2326
2599C987520K67401L6609R472l14106j4443m093k8577p6160p6731q5542o805j45825
2587C548720k02891J63823J27325k36116j92209M4648J4622o6937p4659K733M081
$$ plain form
2576 3133140 3141262 3176244 3186338 3133275 2966279 2972542 3225801 3176366 3157171 3295153 3122598
2565 3122598 2787738 2787150 2778052 2847361 3045396 3093462 3034463 2946526 2667398 2581040 2728604
2554 2728604 2568976 2581845 2748574 2757345 2651114 2660204 2663099 2571419 2711878 2708591 2614710
2543 2614710 2590096 2692150 2673155 2403764 2489653 2462228 2670752 2532443 2679608 2527588
2533 2527588 2556934 2723320 2527596 2563444 2479945 2542759 2514888 2339682 2031083 2059699 2244645
2522 2244645 2176714 2193744 2172833 2196445 2142841 2323060 2293194 2158853 2188578 2153983 2228660
2511 2228660 2009592 2168825 2230110 2199744 2073246 2076485 1857049 2006123 2113618 2200501
2501 2200501 2111410 2047372 1825608 1754499 1828203 1861249 2081031 1922045 1685552 1740982 1726472
$$ packed form
2576C133140Q122L4982J0094n3063j66996O263K53259m9435j9195J37982j72555
2565C122598l34860n88r098O9309J98035M8066n8999q7937k79128q6358J47564
2554B728604j59628J2869J66729Q771j06231R090K895r1680J40459l287r3881
2543B614710k4614J02054j8995k69391Q5889k7425K08524j38309J47165j52020
2533B527588K9346J66386j95724L5848q3499O2814k7871j75206l08599K8616J84946
2522B244645o7931J7030k0911K3612n3604J80219k9866j34341K9725l4595P4677
2511B228660k19068J59233O1285l0366j26498L239k19436J49074J07495Q6883
2501B200501q9091o4038k21764p1109P3704L3046K19782j58986k36493N5430j4510
$$ plain form
2490 1726472 1891623 1788424 1774346 1765344 1754414 1608130 1611487 1484702 1356717 1457416 1708219
2479 1708219 1885492 1713405 1532202 1547866 1525653 1319913 1436998 1468415 1546194 1560771
2469 1560771 1519389 1331497 1130926 1229882 1254517 1288705 1071849 1092185 1087310 1103595 1235128
2458 1235128 1188106 1254038 1296899 1302375 1060077 1036252 964809 980982 1229071 1308502 1149974
2447 1149974 1190694 1278880 1421516 1123083 1051156 1029458 1064557 1029345 983319 821190 846231
2436 846231 957743 774803 555950 770313 835127 839972 807593 736728 708002 687894 770420
2425 770420 821741 773313 773151 576885 696323 925259 786513 859924 651998 584998 580113
2414 580113 685738 867561 626527 581798 730241 755615 685754 707279 505247 431164 492467
$$ packed form
2490A726472J65151j03199j4078r002j0930j46284L357j26785j27985J00699K50803
2479A708219J77273j72087j81203J5664k2213k05740J17085L1417P7779J4577
2469A560771m1382j87892k00571R8956K4635L4188k16856K0336m875J6285J31533
2458A235128m7022O5932M2861N476k42298k3825p1443J6173K48089P9431j58528
2447A149974M0720Q8186J42636k98433p1927k1698L5099l5212m6026j62129K5041
2436H46231J11512j82940k18853K14363O4814M845l2379p0865k8726k0108Q2526
2425G70420N1321m8428j62j96266J19438K28936j38746P3411k07926o7000m885
2414E80113J05625J81823k41034m4729J48443K5374o9861K1525k02032p4083O1303
$$ plain form
2403 492467 675961 642667 660135 508606 288988 501861 618054 796276 940423 673657
2393 673657 816023 810356 554360 736478 697465 437567 557232 648453 584940 604687 429832
2382 429832 635213 616607 799302 784751 493236 382152 501662 556026 450112 637890
2372 637890 630193 515917 628242 549831 709389 507826 356500 365284 476929 785943 700141
2361 700141 611434 275131 428167 393882 396726 343836 305300 152067 308518 417632 238724
2350 238724 239975 423052 584156 154188 165751 349869 392516 566492 568107 491430 496656
2339 496656 238716 361623 381231 229341 415 261646 355611 446676 276469 115179
2329 115179 240345 275970 374779 493737 395992 365906 504515 629933 512601 540619 498794
$$ packed form
2403D92467J83494l3294J7468j51529k19618K12873J16193J78222J44147k66766
2393F73657J42366n667k55996J82118l9013k59898J19665R1221o3513J9747j74855
2382D29832K05381j8606J82695j4551k91515j11084J19510N4364j05914J87778
2372F37890p697j14276J12325p8411J59558k01563j51326Q784J11645L09014q5802
2361G00141q8707l36303J53036l4285K844n2890l8536j53233J56451J09114j78908
2350B38724J251J83077J61104m29968J1563J84118M2647J73976J615p6677N226
2339D96656k57940J22907J9608j51890k28926K61231R3965R1065j70207j61290
2329A15179J25166L5625R8809J18958r7745l0086J38609J25418j17332K8018m1825
$$ plain form
2318 498794 548575 733570 824940 719889 738083 921448 865510 704726 927006 836177 744500
2307 744500 733909 652669 807567 573149 288108 289762 511550 595671 655786 668929 421162
2296 421162 480631 86967 206966 357779 158496 135031 332366 428498 413329 391815 415303
2285 415303 449119 299049 186126 111204 244844 437897 476112 444310 225788 120432
2275 120432 274579 250962 340936 339826 132747 230559 667044 295106 309423 238371 405780
2264 405780 233664 255478 163448 142993 76310 -11842 335255 342207 166789 334911 370841
2253 370841 294886 310789 213192 120963 -62630 -155027 119627 -11787 50678 -149430 -212791
2242 -212791 46572 255102 239712 224880 120774 209236 249006 244894 187600 120871 66946
$$ packed form
2318D98794M9781J84995R1370j05051J8194J83365n5938j60784K22280r0829r1677
2307G44500j0591q1240J54898k34418k85041J654K21788Q4121O0115J3143k47767
2296D21162N9469l93664J19999J50813j99283k3465J97335R6132j5169k1514K3488
2285D15303L3816j50070j12923p4922J33640J93053L8215l1802k18522j05356
2275A20432J54147k3617Q9974j110k07079R7812M36485l71938J4317p1052J67409
2264D05780j72116K1814r2030k0455o6683q8152L47097O952j75418J68122L5930
2253C70841p5955J5903r7597r2229j83593r2397K74654j31414O2465k00108o3361
2242b12791K59363K08530j5390j4832j04106Q8462L9770m112n7294o6729n3925
$$ plain form
2231 66946 306250 313866 15178 201828 288717 255650 186994 269043 270368 236520 481604
2220 481604 489071 485185 414339 253766 182907 400471 447951 200602 93522 107345 7115
2209 7115 318475 270501 367884 370408 417948 581699 364416 450059 288004 248563 235463
2198 235463 385154 267996 303975 230113 533661 296757 386312 176981 326077 389727
2188 389727 301070 184899 324731 423139 444035 246521 245596 -16869 66747 218797 242839
2177 242839 218458 310722 320369 296657 475290 467698 426909 190570 115160 400403 690838
2166 690838 696144 677874 566227 602636 590374 696399 794455 616423 569920 638728 629602
2155 629602 652720 858933 744701 586452 863240 705021 817293 895133 694593 741864
$$ packed form
2231F6946K39304P616k98688J86650Q6889l3067o8656Q2049J325l3848K45084
2220D81604P467l886p0846j60573p0859K17564M7480k47349j07080J3823j00230
2209G115L11360m7974R7383K524M7540J63751k17283Q5643j62055l9441j3100
2198B35463J49691j17158L5979p3862L03548k36904Q9555k09331J49096O3650
2188C89727q8657j16171J39832R8408K0896j97514r25k62465Q3616J52050K4042
2177B42839k4381R2264R647k3712J78633p592m0789k36339p5410K85243K90435
2166F90838N306j8270j11647L6409j2262J06025R8056j78032m6503O8808r126
2155F29602K3118K06213j14232j58249K76788j58219J12272P7840k00540M7271
$$ plain form
2145 741864 1003982 992797 968043 1106481 1216673 1175629 1084670 1143911 1352094 1489176 1298736
2134 1298736 1465811 1681049 1591045 1523560 1494180 1706190 1656650 1712402 1902902 2038238
2124 2038238 2017351 2031899 1989157 2103665 2125183 2176282 2437735 2658764 2605334 2566464 2783179
2113 2783179 3103734 3211290 3094083 3058735 3435324 3486919 3472932 3399618 3770309 4165163
2103 4165163 4176372 4434410 4451868 4797564 5367499 5770205 6156859 6411617 6757229 7074309
2093 7074309 7226460 7982899 8727028 9414936 10437133 11639284 13215489 14820528 16030454
2084 16030454 17289753 19427687 21561846 24525337 28407810 32963363 38405379 45503337
2076 45503337 54474576 67186322 84366154 106422193 112702949 100956278 87767475
$$ packed form
2145G41864K62118j1185k4754J38438J10192m1044r0959N9241K08183J37082j90440
2134A298736J67075K15238r0004o7485k9380K12010m9540N5752J90500J35336
2124B038238k0887J4548m2742J14508K1518N1099K61453K21029n3430l8870K16715
2113B783179L20555J07556j17207l5348L76589N1595j3987p3314L70691L94854
2103D165163J1209K58038J7458L45696N69935M02706L86654K54758L45612L17080
2093G074309J52151P56439P44129O87908J022197J202151J576205J605039J209926
2084A6030454J259299K137934K134159K963491L882473M555553N442016P097958
2076D5503337Q971239J2711746J7179832K2056039O280756j1746671j3188803
$$ plain form
2069 87767475 71793520 57248529 46851030 39704623 34447660 30211596 26950465 24541356
2061 24541356 22486254 21049359 19631844 18321210 16526103 15023357 13589194 12674851
2053 12674851 11749001 11081781 10249334 9700186 9057873 8562104 8473194 7955792 7577964 7429958
2043 7429958 7188509 6920849 6564849 6493538 6329259 5921334 5600234 5619074 5493142 5418896
2033 5418896 5114763 4654916 4452837 4366288 4214372 4045884 3870268 3644625 3584399 3637500
2023 3637500 3495778 3550111 3299170 2909926 3163373 3224311 2813920 2813711 2839636 2664682 2507108
2012 2507108 2478776 2552913 2346127 2643440 2428662 2508494 2472564 2384283 2002923 1871623
2002 1871623 1828380 1947010 1978531 1656314 1627886 1879375 1994877 1831550 1924246 1928569 1791562
$$ packed form
2069H7767475j5973955j4544991j0397499p146407n256963m236064l261131k409109
2061B4541356k055102j436895j417515j310634j795107j502746j434163r14343
2053A2674851r25850o67220q32447n49148o42313m95769q8910n17402l77828j48006
2043G429958k41449k67660l56000p1311j64279m07925l21100J8840j25932p4246
2033E418896l04133m59847k02079q6549j51916j68488j75616k25643o0226N3101
2023C637500j41722N4333k50941l89244K53447O0938m10391k09K5925j74954j57574
2012B507108k8332P4137k06786K97313k14778P9832l5930q8281l81360j31300
2002A871623m3243J18630L1521l22217k8428K51489J15502j63327R2696M323j37007
$$ plain form
1991 1791562 1585624 1374445 1507928 1447612 1505942 1402794 1301667 1234388 1160246 1154228 1322425
1980 1322425 1192357 902401 960760 1163889 1033642 982587 1186752 940748 1028665 1130279
1970 1130279 1073530 925200 1046612 945982 845389 969843 859745 1042524 979131 814385
1960 814385 761256 595100 600285 1018418 1054584 825544 708045 600974 716901 636500 457147
1949 457147 759672 672511 669229 929092 600387 610096 572334 466314 512329 433425 377151
1938 377151 246822 410226 587303 284031 362294 462844 507646 693557 582684 571097
1928 571097 747637 584496 288743 148780 314269 399346 473990 423104 624835 740117
1918 740117 664003 372128 401290 716986 362498 187302 253702 377039 422883 454292 427595
$$ packed form
1991A791562k05938k11179J33483o0316N8330j03148j01127o7279p4142o018J68197
1980A322425j30068k89956N8359K03129j30247n1055K04165k46004Q7917J01614
1970A130279n6749j48330J21412j00630j00593J24454j10098J82779o3393j64746
1960H14385n3129j66156N185M18133L6166k29040j17499j07071J15927q0401j79353
1949D57147L02525q7161l282K59863l28705R709l7762j06020M6015p8904n6274
1938C77151j30329J63404J77077l03272P8263J00550M4802J85911j10873j1587
1928E71097J76540j63141k95753j39963J65489Q5077P4644n0886K01731J15282
1918G40117p6114k91875K9162L15696l54488j75196O6400J23337M5844L1409k6697
$$ plain form
1907 427595 298341 467077 568546 247718 204519 374855 496518 454131 360015 418425
1897 418425 457374 382853 252781 259321 108793 -8672 235504 129546 70095 241664 331812
1886 331812 326993 298653 386070 361315 267099 422126 355282 201378 447925 355685 152208
1875 152208 131312 291567 82782 -19597 234020 133852 165025 345640 272243 289829
1865 289829 92891 136289 160938 193867 380072 396966 347148 113016 42666 -10929 358685
1854 358685 388833 205149 249325 112869 97411 -50875 -103227 -139512 80123 221263 143717
1843 143717 -1154 71835 83877 172930 225937 543430 479477 405279 173214 257222 349245
1832 349245 363972 441035 494658 824641 718576 403220 351760 400380 205829 380903 326604
$$ packed form
1907D27595j29254J68736J01469l20828m3199J70336J21663m2387r4116N8410
1897D18425L8949p4521j30072O540j50528j17465K44176j05958n9451J71569R0148
1886C31812m819k8340Q7417k4755r4216J55027o6844j53904K46547r2240k03477
1875A52208k0896J60255k08785j02379K53617j00168L1173J80615p3397J7586
1865B89829j96938M3398K4649L2929J86205J6894m9818k34132p0350n3595L69614
1854C58685L0148j83684M4176j36456j5458j48286n2352l6285K19635J41140p7546
1843A43717j44871P2989J2042Q9053N3007L17493o3953p4198k32065Q4008R2023
1832C49245J4727P7063N3623L29983j06065l15356n1460M8620j94551J75074n4299
$$ plain form
1821 326604 378990 254312 216653 278223 175509 -126212 116870 268729 173115 113442 73355
1810 73355 8117 179347 261907 284554 174759 140528 179062 120020 51600 83716 -12253
1799 -12253 -90602 136582 337280 255808 129368 205848 332989 202290 133111 291538 506192
1788 506192 504224 481549 294832 396683 189159 29388 130215 348148 365357 8582
1778 8582 161982 49394 -120069 -55201 33414 114269 449271 371980 56177 126887 67490
1767 67490 11131 98926 102643 24749 168523 70381 70374 23195 -32134 -194073 -169973 33746
1755 33746 10988 95749 200838 94092 97252 87320 -73927 79452 135050 44760 -219401
1744 -219401 48768 -9892 158377 -11344 -39334 81669 34493 -14350 188048 175018 -18745
$$ packed form
1821C26604N2386j24678l7659O1570j02714l01721K43082J51859r5614n9673m0087
1810G3355o5238J71230Q2560K2647j09795l4231L8534n9042o8420L2116r5969
1799a2253p8349K27184K00698q1472j26440P6480J27141j30699o9179J58427K14654
1788E06192j968k2675j86717J01851k07524j59771J00827K17933J7209l56775
1778H582J53400j12588j69463O4868Q8615Q0855L35002p7291l15803P0710n9397
1767F7490n6359Q7795L717p7894J43774r8142pm7179n5329j61939K4100K03719
1755C3746k2758Q4761J05089j06746L160r932j61247J53379N5598r0290k64161
1744b19401K68169n8660J68269j69721k7990J21003m7176m8843K02398j3030j93763
$$ plain form
1733 -18745 33110 480983 444187 9562 -50566 302668 379539 164711 -15933 -188352 -53511
1722 -53511 -62789 -47231 32521 -85629 -66167 -13090 15692 220176 200820 260080 88502
1711 88502 -137832 -88576 -232188 -173517 89567 91865 100811 259847 153596 -66807 -13577
1700 -13577 -107502 -2379 -21968 -131288 -153379 57522 -36819 274708 433560 293825 8387
1689 8387 -47120 123186 200148 355928 322604 298286 255717 256968 147053 -51893 -33057
1678 -33057 71100 114352 197520 107743 217910 106940 75725 54866 183917 141323 46917
1667 46917 -110853 -111807 -12867 -131186 -62404 54285 137917 231972 116352 25275 54741
1656 54741 24276 90600 17942 162737 -45068 -103276 -9663 37244 61294 66777 98973 181055
$$ packed form
1733a8745N1855M47873l6796m34625o0128L53234P6871k14828j80644j72419J34841
1722e3511r278J5558P9752j18150J9462N3077K8782K04484j9356N9260j71578
1711H8502k26334M9256j43612N8671K63084K298Q946J59036j06251k20403N3230
1700a3577r3925J05123j9589j09320k2091K10901r4341L11527J58852j39735k85438
1689H387n5507J70306P6962J55780l3324k4318m2569J251j09915j98946J8836
1678c3057J04157M3252Q3168q9777J10167j10970l1215k0859J29051m2594r4406
1667D6917j57770r54R8940j18319O8782J16689Q3632R4055j15620r1077K9466
1656E4741l0465O6324p2658J44795k07805n8208R3613M6907K4050N483L2196Q2082
$$ plain form
1644 181055 167544 166474 220875 63219 81914 -29809 74851 16126 -46543 -106846 81565
1633 81565 187307 -21384 -75206 -164291 -116225 -94894 -228150 -124538 -174197 -222768 -96566
1622 -96566 27419 74032 364680 169905 -136309 10162 33404 60932 138326 51767 -74123
1611 -74123 105382 211584 157787 74280 74919 121813 325258 196294 143921 148781 71066 -169841
1599 -169841 579 13685 104152 59858 145967 327985 255933 19424 -220095 -113310 207869
1588 207869 83945 -17944 40136 105587 207954 -67020 -35927 222493 149931 -30804
1578 -30804 -116021 -27762 176091 120381 -11486 -170724 -226942 -425358 -268920 -114438 111424
1567 111424 146773 140275 50664 58880 254363 126534 172200 98384 121188 123027 128183 68976
$$ packed form
1644A81055j3511j070N4401j57656J8695j11723J04660n8725o2669o0303J88411
1633H1565J05742k08691n3822q9085M8066K1331j33256J03612m9659m8571J26202
1622i6566J23985M6613K90648j94775l06214J46471K3242K7528P7394q6559j25890
1611g4123J79505J06202n3797q3507O39M6894K03445j28964n2373M860p7715k40907
1599a69841J70420J3106R0467m4294Q6109J82018p2052k36509k39519J06785L21179
1588B07869j23924j01889N8080O5451J02367k74974L1093K58420p2562j80735
1578c0804q5217Q8259K03853n5710j31867j59238n6218j98416J56438J54482K25862
1567A11424L5349o498q9611Q216J95483j27829M5666p3816K2804J839N156n9207
$$ plain form
1555 68976 185067 203168 44113 14315 -30814 6364 16574 182059 -26215 -124195 -306512
1544 -306512 -239951 -109740 -83691 -125454 -50550 -200908 -342242 -192647 -20619 -35190 34683
1533 34683 177627 60313 19963 112531 93270 68841 199361 -191685 264747 639645 252074
1522 252074 112298 -99221 -16250 88115 -24175 -20485 1370 117739 156156 25478 -27977
1511 -27977 280617 25605 -148264 -53690 158402 162100 153340 -10495 77519 170212 -138833
1500 -138833 -154473 25158 244351 247381 22482 76098 177620 1308 50030 47602 231377
1489 231377 19525 -178044 -111046 11184 60449 -131097 -115572 33300 207273 -23966
1479 -23966 24670 -29854 -5918 367982 174026 -20761 19559 225550 98537 126276 -15004
$$ packed form
1555F8976J16091J8101j59055k9798m5129L7178J0210J65485k08274r7980j82317
1544c06512O6561J30211K6049m1763P4904j50358j41334J49595J72028j4571O9873
1533C4683J42944j17314m0350R2568j9261k4429J30520l91046M56432L74898l87571
1522B52074j39776k11519Q2971J04365j12290L690K1855J16369L8417j30678n3455
1511b7977L08594k55012j73869R4574K12092L698q760j63835Q8014R2693l09045
1500a38833j5640J79631K19193L030k24899N3616J01522j76312M8722k428J83775
1489B31377k11852j97569O6998J22230M9265j91546J5525J48872J73973k31239
1479b3966M8636n4524K3936L73900j93956j94787M0320K05991j27013K7739j41280
$$ plain form
1468 -15004 -5182 154746 165147 66808 161022 -49882 -151309 -75694 -243075 -171943 22648
1457 22648 157888 41916 -70746 90498 363310 71442 -16317 86043 -165028 11353
1447 11353 103584 232923 312549 58290 -3430 -18524 -22754 -54102 152078 46323 -125053
1436 -125053 -184646 -112851 -134478 -189327 18406 203323 189532 118911 -52832 -2124 61300
1425 61300 -348559 -319367 -164367 -108330 -55348 3243 172690 150795 -161678 -274964 4500
1414 4500 -215012 -224240 -166769 -105813 -73846 -86530 190865 175719 105113 147472 102858 -5283
1402 -5283 -33862 111032 135537 -169640 -124333 -60710 7225 -3859 9725 -25648 39558 192143
1390 192143 264941 56320 -26603 61189 75192 45314 -248157 -31864 -39136 -24893 -23778
$$ packed form
1468a5004R822J59928J0401r8339R4214k10904j01427P5615j67381P1132J94591
1457B2648J35240j15972j12662J61244K72812k91868q7759J02360k51071J76381
1447A1353R2231J29339P9626k54259o1720j5094m230l1348K06180j05755j71376
1436a25053n9593P1795k1627n4849K07733J84917j3791p0621j71743N0708O3424
1425F1300m09859K9192J55000N6037N2982N8591J69447k1895l12473j13286K79464
1414D500k19512r228N7471O0956L1967j2684K77395j5146p0606M2359m4614j08141
1402e283k8579J44894K4505l05177M5307O3623O7935j1084J3584l5373O5206J52585
1390A92143P2798k08621q2923Q7792J4003k9878k93471K16293p272J4243J115
$$ plain form
1379 -23778 -29735 -43198 -114961 -17428 -140123 101107 41365 42441 12137 -24878 -9302 -103200
1367 -103200 107607 76298 -87650 -106774 -134053 282293 233193 147003 123487 127924 167506
1356 167506 -104079 -84155 -56277 -136616 -274504 -189531 112209 166519 -69120 -36659 -152306
1345 -152306 -181901 -13901 -167671 106122 178963 -180329 -193258 -4480 -128942 -83471
1335 -83471 -59621 -128964 -77647 -116102 -54660 -108136 131874 135802 -52925 -57441 -34930 -43453
1323 -43453 28332 3651 -84734 -238172 -81768 37424 168503 101106 70328 16806 4146
1312 4146 -28419 -16634 -83012 3973 62207 120653 35773 9335 -80578 13288 -40008 -145598
1300 -145598 -59948 10151 -42559 -70873 -94239 -29848 -45586 -34696 109898 168118 -119896
$$ packed form
1379b3778n957j3463p1763R7533j22695K41230n9742J076l0304l7015J5576r3898
1367a03200K10807l1309j63948j9124k7279M16346m9100q6190k3516M437L9582
1356A67506k71585J9924K7878q0339j37888Q4973L01740N4310k35639L2461j15647
1345a52306k9595J68000j53770K73793P2841l59292j2929J88778j24462M5471
1335h3471K3850o9343N1317l8455O1442n3476K40010L928j88727m516K2511q523
1323d3453P1785k4681q8385j53438J56404J19192J31079o7397l0778n3522j2660
1312D146l2565J1785o6378Q6985N8234N8446q4880k6438q9913R3866n3296j05590
1300a45598Q5650P0099n2710k8314k3366O4391j5738J0890J44594N8220k88014
$$ plain form
1289 -119896 -198207 28412 82021 93516 -52547 -58123 42953 1391 -32778 -157829 -150509
1278 -150509 -20693 -287314 -154165 -108700 -326065 -431238 -310072 -204310 -215501 -227455
1268 -227455 -35720 137933 123107 -114269 60218 149460 -7782 -103729 -13202 70876 -110502
1257 -110502 -91420 90647 242868 206094 109205 215145 56535 -21528 451 230124 -56363
1246 -56363 -76436 -58856 -46788 4495 -90740 -4033 -36920 -214532 -123545 11525 -200006
1235 -200006 -298553 -151997 -76018 91553 -85403 -154287 -62760 -3768 -106286 -1368 86456
1224 86456 23389 -33282 85016 -62948 -83402 -73002 -47876 36021 -176518 -36125 67004
1213 67004 54872 85626 -36009 -264444 -191572 -166530 64596 17820 -87770 99537 68133
$$ packed form
1289a19896p8311K26619N3609J1495j46063n576J01076m1562l4169j25051P320
1278a50509J29816k66621J33149M5465k17365j05173J21166J05762j1191j1954
1268b27455J91735J73653j4826k37376J74487Q9242j57242r5947R0527Q4078j81378
1257a10502J9082J82067J52221l6774r6889J05940j58610p8063K1979K29673k86487
1246e6363k0073J7580J2068N1283r5235Q6707l2887j77612R0987J35070k11531
1235b00006r8547J46556P5979J67571j76956o8884R1527N8992j02518J04918Q7824
1224H6456o3067n6671J18298j47964k0454J0400K5126Q3897k12539J40393J03129
1213F7004j2132L0754j21635k28435P2872K5042K31126m6776j05590J87307l1404
$$ plain form
1202 68133 122066 120157 308148 171191 -18607 -133613 -292691 69516 57554 46570 -107621
1191 -107621 -225750 -263842 -279199 -101135 -143117 -149357 63472 -88761 -39370 55410 -59308
1180 -59308 26320 255223 42270 103689 52431 -34225 169891 -40553 -114950 -37784 -223617
1169 -223617 -172163 -120064 103609 302900 109350 -82446 -139348 -165646 -114437 25053 82799
1158 82799 4128 87546 -32880 -93750 733 -10424 24004 150079 -71281 -306612 -293305
1147 -293305 -59739 242329 -25725 -50254 20326 -178290 -190954 -248607 -136101 -82379 -603
1136 -603 -142318 -14999 310961 151140 -11646 15707 157585 181487 114978 -614 81731
1125 81731 136146 -19153 -50800 12133 203576 219125 -254772 -519067 -431269 -115065 -93479
$$ packed form
1202F8133N3933j909J87991j36957j89798j15006j59078L62207j1962j0984j54191
1191a07621j18129l8092j5357J78064m1982o240K12829j52233M9391R4780j14718
1180e9308Q5628K28903k12953O1419n1258q6656K04116k10444p4397P7166j85833
1169b23617N1454N2099K23673J99291j93550j91796n6902k6298N1209J39490N7746
1158H2799p8671Q3418j20426o0870R4483j1157L4428J26075k21360k35331J3307
1147b93305K33566L02068k68054k4529P0580j98616j2664n7653J12506N3722Q1776
1136f03j41715J27319L25960j59821j62786K7353J41878K3902o6509j15592Q2345
1125H1731N4415j55299l1647O2933J91443J5549m73897k64295Q7798L16204K1586
$$ plain form
1114 -93479 -160199 -258056 58004 88501 134267 -182884 -302724 -37676 -68889 40515 -148631
1103 -148631 -87498 -117446 27581 126925 169800 112838 85988 245138 123584 125558 207992
1092 207992 -123813 -127876 10512 -57401 -189973 -319172 -146845 -128976 -180299 -84419 -37662
1081 -37662 -86955 -112410 -53867 176273 -3642 -66579 -18486 40141 129796 49447 144504
1070 144504 170144 -149852 -254745 -200575 80271 30095 34685 234210 -29731 -78402 -160028
1059 -160028 209831 185093 101968 183869 217097 245432 76571 296863 287930 204382 162789
1048 162789 20607 120194 121224 -38835 -111363 -71472 -120737 272473 56422 -157632 5430
1037 5430 -151557 -130139 111600 145006 123670 148874 36382 51576 176771 13768 -28553
$$ packed form
1114i3479o6720r7857L16060L0497M5766l17151j19840K65048l1213J09404j89146
1103a48631O1133k9948J45027R9344M2875n6962k6850J59150j21554J974Q2434
1092B07992l31805m063J38388o7913j32572j29199J72327J7869n1323R5880M6757
1081c7662m9293k5455N8543K30140j79915o2937M8093N8627Q9655q0349R5057
1070A44504K5640l19996j04893N4170K80846n0176M590J99525k63941m8671q1626
1059a60028L69859k4738q3125Q1901L3228K8335j68861K20292q933q3548m1593
1048A62789j42182R9587J030j60059p2528L9891m9265L93210k16051k14054J63062
1037E430j56987K1418K41739L3406k1336K5204j12492J5194J25195j63003m2321
$$ plain form
1026 -28553 36983 -15909 74990 -111828 -21851 168399 -69187 -133788 -149636 -101489 26589
1015 26589 -173955 14395 -113301 84487 170497 22571 141511 64146 -147675 -43932
1005 -43932 96172 42024 34852 39884 44745 305520 183568 201474 184741 286319 184632
994 184632 -133937 8908 -119928 -395516 -151727 -129477 -45550 -153312 18083 3816
984 3816 -115360 -28829 -79134 -40707 59570 53306 -194485 109058 -98842 -137590 87435
973 87435 136020 -78368 -65896 30175 -38226 66380 134576 99441 249703 29803 -69766
962 -69766 -59881 35234 19125 25025 162176 106452 -217983 -327906 -138916 40311 161631
951 161631 -93719 -193704 -52061 60859 -21580 -100762 54495 57392 -42169 7208 108042
$$ packed form
1026b8553O5536n2892R0899j86818Q9977J90250k37586o4601j5848M8147J28078
1015B6589k00544J88350j27696J97788Q6010j47926J18940p7365k11821J03743
1005d3932J40104n4148p172N032M861K60775j21952J7906j6733J01578j01687
994A84632l18569J42845j28836k75588K43789K2250Q3927j07762J71395j4267
984C816j19176Q6531n0305L8427J00277o264k47791L03543k07900l8748K25025
973H7435M8585k14388J2472R6071o8401J04606O8196l5135J50262k19900r9569
962f9766R885R5115j6109N900J37151n5724l24435j09923J88990J79227J21320
951A61631k55350r9985J41643J12920q2439p9182J55257K897r9561M9377J00834
$$ plain form
940 108042 29813 77364 -4024 -180955 -43558 155468 -78745 -177157 -55731 -211123 -51650
929 -51650 12971 -8512 121292 104264 134570 11148 -66502 67615 150151 -48941 -217303
918 -217303 -139911 -129084 -119126 22267 100518 78500 45082 -75172 -118569 -155023 -286282
907 -286282 -108196 -128869 -71147 -125874 -233636 -229414 47477 54487 -91000 -242885 -301509
896 -301509 255083 197731 -32530 -53628 -80269 -187714 -21656 100651 3995 -56647 -71430
885 -71430 68362 164727 219946 208832 -3168 115414 -95334 55642 197391 -192587 -180383
874 -180383 -125902 -170064 -21718 368011 287683 72765 95720 -173505 -120214 -13206 42702
863 42702 91523 33980 -11229 1200 90299 -117049 17111 45795 -38695 -71961 39039
$$ packed form
940A08042p8229M7551q1388j76931J37397J99026k34213r8412J21426j55392J59473
929e1650O4621k1483J29804j7028L0306j23422p7650J34117Q2536j99092j68362
918b17303P7392J0827R958J41393P8251k2018l3418j20254m3397l6454j31259
907b86282J78086k0673N7722n4727j07762M222K76891P010j45487j51885n8624
896c01509N56592n7352k30261k1098k6641j07445J66058J22307r6656o0642j4783
885g1430J39792R6365N5219j1114k12000J18582k10748J50976J41749l89978J2204
874a80383N4481m4162J48346L89729q0328k14918K2955k69225N3291J07008N5908
863D2702M8821n7543m5209J2429Q9099k07348J34160K8684q4490l3266J11000
$$ plain form
852 39039 -16606 -217372 -303280 88688 146045 128301 -30540 -190704 -8213 -134284 -28909
$$ packed form
852C9039n5645k00766q5908L91968N7357j7744j58841j60164J82491j26071J05375
$$ [...]
##END NTUPLES=NMR SPECTRUM
##END=
