##TITLE=1H_CG-1151-4Y
 CDCl3, 8 sc, 
 23.08.2021
##JCAMPDX= 6.0         $$ Bruker NMR JCAMP-DX V2.0
##DATA TYPE= NMR SPECTRUM
##DATA CLASS= NTUPLES
##ORIGIN= UXNMR, Bruker Analytische Messtechnik GmbH
##OWNER= root
$$ XWIN-NMR		Version 3.5
$$ Mon Aug 23 10:07:58 2021 Russian Standard Time (UT+4h)  she@DPX200
##.OBSERVE FREQUENCY= 200.131506
##.OBSERVE NUCLEUS= ^1H
##.ACQUISITION MODE= SIMULTANEOUS
##.ACQUISITION SCHEME= undefined
##.AVERAGES= 8
##.DIGITISER RES= 18
##SPECTROMETER/DATA SYSTEM= spect
##.PULSE SEQUENCE= zg30
##.SOLVENT NAME= CDCl3
##.SHIFT REFERENCE= (INTERNAL, CDCl3, 0, 17.4971)
##AUDIT TRAIL= $$ (NUMBER, WHEN, WHO, WHERE, WHAT)
$$ ##TITLE= Audit trail, XWIN-NMR		Version 3.5
$$ ##JCAMPDX= 5.01
$$ ##ORIGIN= Bruker BioSpin GmbH
$$ ##OWNER= she
$$ F:/spectra/data/she/nmr/H-F/1/pdata/1/auditp.txt
$$ ##AUDIT TRAIL=  $$ (NUMBER, WHEN, WHO, WHERE, WHAT)
(   1,<2021-08-23 10:06:20.40 +0400>,<she>,<DPX200>,
      <created by zg, POWCHK disabled, PULCHK disabled
       configuration hash MD5:
       00 E9 B6 7A A2 85 ED C7 34 08 36 98 17 FE 4E 26
       data hash MD5: 16K
       55 57 64 2D A8 08 F3 54 10 B5 B2 AB FB 2F EF 80>)
(   2,<2021-08-23 10:06:22.67 +0400>,<she>,<DPX200>,
      <Start of raw data processing
       efp BC_mod = 2 LB = 0.24 FT_mod = 6 PKNL = 1 PHC0 = -13358.03 PHC1 = 16.40099 SI = 16K 
       data hash MD5: 16K
       AC 66 6D 51 5A E5 89 40 BF 82 D4 AA 48 BE 64 E4>)
(   3,<2021-08-23 10:06:57.96 +0400>,<she>,<DPX200>,
      <pk PHC0 = 1.46797 PHC1 = -2.6 
       data hash MD5: 16K
       8A 4D CD 8A B9 59 95 C9 DA 5C E6 18 AA 57 A3 E2>)
(   4,<2021-08-23 10:07:01.28 +0400>,<she>,<DPX200>,
      <abs ABSG = 5 
       data hash MD5: 16K
       81 FE 75 98 E1 16 DA 09 FB 92 9E 42 F1 53 F8 E7>)
$$ ##END=
$$ 
$$ hash MD5
$$ BB B4 75 6F D1 6D FD F9 67 81 2F 4E 58 EB CF 28
##$RELAX= 
##$RELAX= 
##$RELAX= 
##$RELAX= 
##$RELAX= 
##$RELAX= 
$$ Bruker specific parameters
$$ --------------------------
##$DU= <F:/spectra>
##$EXPNO= 1
##$NAME= <H-F>
##$PROCNO= 1
##$TYPE= <nmr>
##$USER= <she>
##$AMP= (0..31)
100 100 100 100 100 100 100 100 100 100 100 100 100 100 100 100 100 100 
100 100 100 100 100 100 100 100 100 100 100 100 100 100 
##$AQSEQ= 0
##$AQ_mod= 1
##$AUNM= <au_zg>
##$AUTOPOS= <>
##$BF1= 200.13
##$BF2= 200.13
##$BF3= 200.13
##$BF4= 200.13
##$BF5= 200.13
##$BF6= 200.13
##$BF7= 200.13
##$BF8= 200.13
##$BYTORDA= 1
##$CFDGTYP= 0
##$CFRGTYP= 5
##$CHEMSTR= <none>
##$CNST= (0..31)
1 1 145 1 1 1 1 1 1 1 1 1 1 1 1 1 1 1 1 1 1 1 1 1 1 1 1 1 1 1 1 1 
##$CPDPRG= <>
##$CPDPRG1= <>
##$CPDPRG2= <>
##$CPDPRG3= <>
##$CPDPRG4= <mlev>
##$CPDPRG5= <mlev>
##$CPDPRG6= <mlev>
##$CPDPRG7= <mlev>
##$CPDPRG8= <mlev>
##$CPDPRGB= <>
##$CPDPRGT= <>
##$D= (0..31)
0 1.2 0 0 0 0 0 0 0 0.06 0 0.03 0 0 0 0 0.0002 0 0 0 0 0 0 0 0 0 0 0 0 
0 0 0 
##$DATE= 1629698779
##$DBL= (0..7)
120 120 120 120 120 120 120 120 
##$DBP= (0..7)
150 150 150 150 150 150 150 150 
##$DBP07= 0
##$DBPNAM0= <>
##$DBPNAM1= <>
##$DBPNAM2= <>
##$DBPNAM3= <>
##$DBPNAM4= <>
$$ [...]
##$SUBNAM3= <"">
##$SUBNAM4= <"">
##$SUBNAM5= <"">
##$SUBNAM6= <"">
##$SUBNAM7= <"">
##$SUBNAM8= <"">
##$SUBNAM9= <"">
##$SW= 20.0188882624521
##$SWIBOX= (0..15)
0 0 2 0 0 0 0 0 0 0 0 0 0 0 0 0 
##$SW_h= 4006.41025641026
##$TD= 16384
##$TD0= 1
##$TE= 0
##$TE2= 300
##$TE3= 300
##$TEG= 300
##$TL= (0..7)
0 120 120 120 120 120 120 120 
##$TP= (0..7)
150 150 150 150 150 150 150 150 
##$TP07= 0
##$TPNAME0= <>
##$TPNAME1= <>
##$TPNAME2= <>
##$TPNAME3= <>
##$TPNAME4= <>
##$TPNAME5= <>
##$TPNAME6= <>
##$TPNAME7= <>
##$TPOAL= (0..7)
0.5 0.5 0.5 0.5 0.5 0.5 0.5 0.5 
##$TPOFFS= (0..7)
0 0 0 0 0 0 0 0 
##$TUNHIN= 0
##$TUNHOUT= 0
##$TUNXOUT= 0
##$USERA1= <user>
##$USERA2= <user>
##$USERA3= <user>
##$USERA4= <user>
##$USERA5= <user>
##$V9= 5
##$VALIST= <valist>
##$VCLIST= <CCCCCCCCCCCCCCC>
##$VD= 0
##$VDLIST= <DDDDDDDDDDDDDDD>
##$VPLIST= <PPPPPPPPPPPPPPP>
##$VTLIST= <TTTTTTTTTTTTTTT>
##$WBST= 1024
##$WBSW= 4
##$XGAIN= (0..3)
0 0 0 0 
##$XL= 0
##$YL= 0
##$YMAX_a= 394857
##$YMIN_a= -302231
##$ZGOPTNS= <>
##$ZL1= 120
##$ZL2= 120
##$ZL3= 120
##$ZL4= 120
##$ABSF1= 17.49955
##$ABSF2= -2.519489
##$ABSG= 5
##$ABSL= 3
##$ALPHA= 0
##$AQORDER= 0
##$ASSFAC= 0
##$ASSFACI= 0
##$ASSFACX= 0
##$ASSWID= 0
##$AUNMP= <proc_1d>
##$AZFE= 0.1
##$AZFW= 0.1
##$BCFW= 0
##$BC_mod= 2
##$BYTORDP= 0
##$COROFFS= 0
##$CY= -3
##$DATMOD= 1
##$DC= 0
##$DFILT= <>
##$DTYPP= 0
##$F1P= 0
##$F2P= 0
##$FCOR= 1
##$FTSIZE= 16384
##$FT_mod= 6
##$GAMMA= 0
##$GB= 0
##$INTBC= 1
##$INTSCL= 1.334414e-10
##$ISEN= 128
##$LB= 0.24
##$LEV0= 0
##$LPBIN= 0
##$MAXI= 10000
##$MC2= 0
##$MEAN= 0
##$ME_mod= 0
##$MI= 1.114404
##$NCOEF= 0
##$NC_proc= -7
##$NLEV= 6
##$NOISF1= 3.799351
##$NOISF2= 2.8
##$NSP= 0
##$NTH_PI= 0
##$NZP= 0
##$OFFSET= 17.49711
##$PC= 1
##$PHC0= -13356.56
##$PHC1= 13.80099
##$PH_mod= 1
##$PKNL= yes
##$PPARMOD= 0
##$PSCAL= 0
##$PSIGN= 0
##$REVERSE= no
##$SF= 200.130007508274
##$SI= 16384
##$SIGF1= 3
##$SIGF2= 2
##$SINO= 5.538805
##$SIOLD= 16384
##$SREGLST= <1H.CDCl3>
##$SSB= 0
##$STSI= 16384
##$STSR= 0
##$SW_p= 4006.41025641026
##$SYMM= 0
##$S_DEV= 0
##$TDeff= 16384
##$TDoff= 0
##$TI= <>
##$TILT= no
##$TM1= 0
##$TM2= 0
##$TOPLEV= 0
##$USERP1= <user>
##$USERP2= <user>
##$USERP3= <user>
##$USERP4= <user>
##$USERP5= <user>
##$WDW= 1
##$XDIM= 16384
##$YMAX_p= 296394485
##$YMIN_p= -1139798
$$ End of Bruker specific parameters
$$ ---------------------------------
##NTUPLES= NMR SPECTRUM
##VAR_NAME=  FREQUENCY,     SPECTRUM/REAL,   SPECTRUM/IMAG
##SYMBOL=    X,             R,               I
##VAR_TYPE=  INDEPENDENT,   DEPENDENT,       DEPENDENT
##VAR_FORM=  AFFN,          ASDF,            ASDF
##VAR_DIM=   16384,         16384,           16384
##UNITS=     HZ,            ARBITRARY UNITS, ARBITRARY UNITS
##FACTOR=    0.24454680195387, 1,            1
##FIRST=     3501.69682908504, 0,            0
##LAST=      -504.713427325217, 0,           0
##MIN=       -504.713427325217, -1139798,    0
##MAX=       3501.69682908504, 296394485,    0
$$ Real data points
##PAGE= N=1
##DATA TABLE= (X++(R..R)), XYDATA
$$ [...]
$$ plain form
6587 -254552 -455380 -178043 -62320 -103495 161281 196866 76333 -281214 -668262 -681775
6577 -681775 -184115 53395 -374375 -510790 -404443 -293854 -206901 -109841 -258157 -417237
6567 -417237 102197 -15166 -392499 -249554 -363475 -443308 -219206 175400 492234 17955
6557 17955 -536966 -747679 -426009 83958 233291 -32509 19491 -19474 -381539 -577554
6547 -577554 -591964 -145299 67508 274482 498882 59191 -346220 -648692 -485978 -139246
6537 -139246 179435 -85928 -542511 -878142 -691901 -184613 -51657 252898 448278 -124600
6527 -124600 -477470 -368274 -264193 -19153 204485 214837 -588727 -760518 -483576 -623949
6517 -623949 -323023 236207 77894 -99037 -148368 -390060 -194654 -144696 -44147 -258310
$$ packed form
6587b54552k00828K77337J15723m1175K64776L5585j20533l57547l87048j3513
6577f81775M97660K37510m27770j36415J06347J10589Q6953R7060j48316j59080
6567d17237N19434j17363l77333J42945j13921p9833K24102L94606L16834m74279
6557A7955n54921k10713L21670N09967J49333k65800N2000l8965l62065j96015
6547e77554j4410M46665K12807K06974K24400m39691m05411l02472J62714L46732
6537a39246L18681k65363m56583l35631J86241N07288J32956L04555J95380n72878
6527a24600l52870J09196J04081K45040K23638J0352q03564j71791K76942j40373
6517f23949L00926N59230j58313j76931m9331k41692J95406M9958J00549k14163
$$ plain form
6507 -258310 -560820 -700206 -828628 -557536 -277417 -167304 -80905 165718 18330 -419565
6497 -419565 -137938 -155572 -586353 -366692 166059 509605 82701 39947 -221122 -253592
6487 -253592 231792 340180 87907 -68983 -157878 -379287 -61098 322916 91263 23154
6477 23154 43351 -130875 -281995 104164 -100482 -483942 -152469 -11615 -479413 -547869
6467 -547869 -231963 -164002 -88878 208736 185178 -47047 -42912 152393 -193582 -408163 -535527
6456 -535527 -629173 -442051 -57798 -16978 206781 -38517 -101619 -391934 130393 831107
6446 831107 481726 -185790 -327898 -327803 -430418 -89408 -113564 -74348 -130023 -212390 -628122
6435 -628122 -513129 -364436 82731 511127 442121 1144 -825691 -971536 -800279 -204452
$$ packed form
6507b58310l02510j39386j28422K71092K80119J10113Q6399K46623j47388m37895
6497d19565K81627j7634m30781K19661N32751L43546m26904m2754k61069l2470
6487b53592M85384J08388k52273j56890q8895k21409L18189L84014k31653o8109
6477B3154K0197j74226j51120L86159k04646l83460L31473J40854m67798o8456
6467e47869L15906O7961P5124K97614k3558k32225M135J95305l45975k14581j27364
6456e35527r3646J87122L84253M0820K23759k45298o3102k90315N22327P00714
6446H31107l49381o67516j42108R5j02615L41010k4156L9216n5675q2367m15732
6435f28122J14993J48693M47167M28396o9006m40977q26835j45845J71257N95827
$$ plain form
6425 -204452 501593 330917 -12816 -636468 -364451 289698 243855 102630 201802 45092
6415 45092 -109399 -253092 47431 274896 420405 345454 39449 -911 -280490 -548094
6405 -548094 -222092 -88685 399329 761492 222805 -343132 -25648 182627 26064 124838
6395 124838 479897 219258 254126 369938 -48025 -269052 -122243 -117118 -74305 260185
6385 260185 91165 -565113 -433064 78245 317355 255130 48301 -22551 -40958 -54020
6375 -54020 -54075 -344537 -435525 -77419 6717 88647 -9235 -125531 -375677 -212519 -221323 -80267
6363 -80267 213408 95641 -330913 83410 217806 -210181 -248985 53390 -86978 -196853
6353 -196853 -192825 -250289 -200469 254970 537620 330928 52533 -195503 -288593 -198079 -78328
$$ packed form
6425b04452P06045j70676l43733o23652K72017O54149m5843j41225R9172j56710
6415D5092j54491j43693L00523K27465J45509p4951l06005m0360k79579k67604
6405e48094L26002J33407M88014L62163n38687n65937L17484K08275j56563R8774
6395A24838L55059k60639L4868J15812m17963k21027J46809N125M2813L34490
6385B60185j69020o56278J32049N11309K39110o2225k06829p0852j8407j3062
6375e4020n5k90462r0988L58106Q4136Q1930r7882j16296k50146J63158q804J41056
6363h0267K93675j17767m26554M14323J34396m27987l8804L02375j40368j09875
6353a96853M028n7464M9820M55439K82650k06692k78395k48036r3090R0514J19751
$$ plain form
6342 -78328 -121174 -146480 -83985 -234643 -252674 -166648 67980 330460 -29003 -140555 17814
6331 17814 -180736 27958 -152878 -353816 -348336 -296225 -96888 -254757 -60072 197545
6321 197545 224315 216934 61793 -197273 -40745 -371291 -404362 -451934 -572649 -152644 -57212
6310 -57212 90322 75648 -153369 -242007 -276123 157477 278314 -100181 -424532 -490823 -267483
6299 -267483 243370 97944 147827 43089 -288560 -395571 -310908 -106914 51451 214506
6289 214506 -93537 -243618 -151569 -10366 -18810 3541 189984 -38990 -59814 -74184 -272852
6278 -272852 -374517 -297564 -79217 122833 -83324 -510356 -522929 -132570 39855 -164334
6268 -164334 -46717 -370012 -274871 -16986 -390782 -523433 -120001 48361 226042 -13267
$$ packed form
6342g8328m2846k5306O2495j50658j8031Q6026K34628K62480l59463j11552J58369
6331A7814j98550K08694j80836k00938N480N2111J99337j57869J94685K57617
6321A97545K6770p381j55141k59066J56528l30546l3071m7572j20715M20005R5432
6310e7212J47534j4674k29017q8638l4116M33600J20837l78495l24351o6291K23340
6299b67483N10853j45426M9883j04738l31649j07011Q4663K03994J58365J63055
6289B14506l08043j50081R2049J41203q444K2351J86443k28974k0824j4370j98668
6278b72852j01665P6953K18347K02050k06157m27032j2573L90359J72425k04189
6268a64334J17617l23295R5141K57885l73796j32651M03432J68362J77681k39309
$$ plain form
6258 -13267 -468939 -606293 -411444 -274039 -134227 -272012 -352184 -367207 -450947 -288585
6248 -288585 57436 289233 110145 102991 -76752 -260816 -93855 86336 -320446 -166641
6238 -166641 -212924 -803305 -595329 -290810 -537279 -335077 111958 88167 -327071 -305498
6228 -305498 -68081 71053 139006 -235612 -618430 -380310 -366614 -92444 149747 212292
6218 212292 -89708 -324906 -447083 -185927 375641 -22467 -328176 -581059 -465533 -36348
6208 -36348 -176119 -558072 -213633 -48470 -136329 -157387 12453 167363 -28723 -186995
6198 -186995 -266555 -489777 -262287 -111855 -353138 -8451 329747 119953 -179219 -541620
6188 -541620 -183014 3088 -223363 -398032 -547956 -366960 -6153 -254775 -119899 -215344
$$ packed form
6258a3267m55672j37354J94849J37405J39812j37785q0172j5023q3740J62362
6248b88585L46021K31797j79088p154j79743j84064J66961J80191m06782J53805
6238a66641m6283n90381K07976L04519k46469K02202M47035k3791m15238K1573
6228c05498K37417J39134O7953l74618l82818K38120J3696K74170K42191O2545
6218B12292l02000k35198j22177K61156N61568l98108l05709k52883J15526M29185
6208c6348j39771l81953L44439J65163q7859k1058J69840J54910j96086j58272
6198a86995p9560k23222K27490J50432k41283L44687L38198k09794k99172l62401
6188e41620L58606J86102k26451j74669j49924J80996L60807k48622J34876r5445
$$ plain form
6178 -215344 -499664 -294520 -326038 -288857 -359562 -567461 -196307 131369 -33163 -64780
6168 -64780 -198138 -112061 -177734 -261266 -406229 -383910 -247350 -256939 -101166 110682 58231
6157 58231 -254763 -280673 -138306 -208896 -203048 -155206 -323889 -98426 -251374 -469783 -258600
6146 -258600 -161553 -24141 -233134 -262409 24636 160192 -61856 -532167 -311683 -131109
6136 -131109 124380 62422 -190292 -224552 254029 245834 -185417 -123665 -105985 -371214 -521631
6125 -521631 -118153 35174 337430 47307 -363654 -960404 -843095 -289621 -328207 -156710
6115 -156710 162483 -151378 -400772 -703651 -697897 -255475 -107011 159196 -233433 -719085
6105 -719085 -625873 -510079 -8114 393696 575214 328637 -279036 -509852 -165072 -231757
$$ packed form
6178b15344k84320K05144l1518L7181p0705k07899L71154L27676j64532l1617
6168f4780j33358Q6077o5673q3532j44963K2319J36560r589J55773K11848n2451
6157E8231l12994k5910J42367p0590N848M7842j68683K25463j52948k18409K11183
6146b58600R7047J37412k08993k9275K87045J35556k22048m70311K20484J80574
6136a31109K55489o1958k52714l4260M78581q195m31251O1752J7680k65229j50417
6125e21631M03478J53327L02256k90123m10961n96750J17309N53474l8586J71497
6115a56710L19193l13861k49394l02879N754M42422J48464K66207l92629m85652
6105g19085R3212J15794N01965M01810J81518k46577o07673k30816L44780o6685
$$ plain form
6095 -231757 -19607 -79761 -267467 -153868 -383646 -365108 -219659 120569 179105 128333
6085 128333 -53739 -325301 -495454 -458410 -269793 -285851 -410427 -80513 78229 132589
6075 132589 -106080 -310428 -143663 -55282 114758 -65730 -186193 -144351 -463984 -496239
6065 -496239 -340375 -69317 365944 290608 257951 -81305 -590031 -128359 -8584 -410085
6055 -410085 -33803 322247 -314871 -923600 -493664 -137591 -64831 84137 -370877 -665540
6045 -665540 -19834 243825 -13141 -202064 55275 -321041 -612337 -337211 -209115 4493
6035 4493 -78917 271634 154752 -50029 38085 -624049 -893071 -407489 -418518 -412314 -333479
6024 -333479 -229577 -25673 -213320 -212787 209412 102402 -135452 -9120 -191644 -637083
$$ packed form
6095b31757K12150o0154j87706J13599k29778J8538J45449L40228N8536n0772
6085A28333j82072k71562j70153L7044J88617j6058j24576L29914J58742N4360
6075A32589k38669k04348J66765Q8381J70040j80488j20463M1842l19633l2255
6065d96239J55864K71058M35261p5336l2657l39256n08726M61672J19775m01501
6055d10085L76282L56050o37118o08729M29936L56073P2760J48968m55014k94663
6045f65540O45706K63659k56966j88923K57339l76316k91296K75126J28096K13608
6035D493q3410L50551j16882k04781Q8114o62134k69022M85582j1029O204P8835
6024c33479J03902K03904j87647N33M22199j07010k37854J26332j82524m45439
$$ plain form
6014 -637083 -587500 -348018 -126286 40774 85629 -360495 -687668 -260658 -338330 -291561
6004 -291561 -154883 -327484 -483168 -428320 -284325 -423118 -489388 -276596 6574 -76797
5994 -76797 69349 167280 -406351 -352883 -206846 -255954 -105128 115936 -28738 -400696
5984 -400696 -255646 136063 -43049 16889 221623 -416659 -471475 12577 -98306 -302743
5974 -302743 -81033 -60720 -353297 -537458 -508779 -741318 -634475 -375922 -296143 -396733
5964 -396733 -473939 -118926 -310756 -644080 4460 -22331 -468877 -369921 348936 167469
5954 167469 -38614 252803 145648 -318317 -176145 -420108 -920179 -549180 -386331 -569352
5944 -569352 -386985 190537 -76717 -115725 143401 -86062 -284680 -246920 -386640 -411937
$$ packed form
6014f37083M9583K39482K21732J67060M4855m46124l27173M27010p7672M6769
6004b91561J36678j72601j55684N4848J43995j38793o6270K12792K83170q3371
5994g6797J46146R7931n73631N3468J46037m9108J50826K21064j44674l71958
5984d00696J45050L91709j79112N9938K04734o38282n4816M84052j10883k04437
5974c02743K21710K0313k92577j84161K8679k32539J06843K58553P9779j00590
5964c96733p7206L55013j91830l33324O48540k6791m46546R8956P18857j81467
5954A67469k06083K91417j07155m63965J42172k43963n00071L70999J62849j83021
5944e69352J82367N77522k67254l9008K59126k29463j98618L7760j39720k5297
$$ plain form
5934 -411937 -281514 240955 108895 -282831 -108872 188484 224284 136538 218100 -144173
5924 -144173 -457915 -294997 -716504 -627980 -166125 -390017 -789709 -335242 -22108 -44232
5914 -44232 179192 379822 -90900 -254402 -90368 -595896 -732653 -208678 -104303 -630531
5904 -630531 -598752 -506647 -690574 -186814 374354 216383 314224 323056 -241821 -484352 -275297
5893 -275297 92564 -156969 -369251 -272046 -418453 -402414 -468666 -120958 -206616 -642334
5883 -642334 -468376 -307861 -271487 -100167 168529 34684 -609748 -214581 -20859 -176022
5873 -176022 -188611 172533 -29761 -557467 -488496 -288498 -108275 -211874 -460368 -442556
5863 -442556 -624888 -453409 -138829 33952 512337 202724 -234824 -367062 -371513 -324668
$$ packed form
5934d11937J30423N22469j32060l91726J73959K97356L5800q7746Q1562l62273
5924a44173l13742J62918m21507Q8524M61855k23892l99692M54467L13134k2124
5914d4232K23424K00630m70722j63502J64034n05528j36757N23975J04375n26228
5904f30531L1779R2105j83927N03760N61168j57971R7841Q832n64877k42531K09055
5893b75297L67861k49533k12282R7205j46407J6039o6252L47708q5658m35718
5883f42334J73958J60515L6374J71320K68696j33845o44432L95167J93722j55163
5873a76022j2589L61144k02294n27706O8971J99998J80223j03599k48494J7812
5863d42556j82332J71479L14580J72781M78385l09613m37548j32238m451M6845
$$ plain form
5853 -324668 237220 -7838 -480626 -499979 -596152 -473546 -41459 352442 354434 176846
5843 176846 15218 -281279 -269683 122979 238755 -230407 -369821 -405204 -438984 -277216
5833 -277216 -185963 63296 -34079 -166126 -12434 -151251 -2518 319864 405006 30591
5823 30591 -358242 -373021 -400612 -149358 39936 -179864 -519014 -747665 -1139798 -826414
5813 -826414 -469770 -43163 762628 377828 -366237 -462341 -495495 -478776 -58725 224589
5803 224589 -49605 -394313 -481485 -685697 -380158 381877 117735 -167946 -59747 -483088
5793 -483088 -746809 -217941 309020 360461 285665 -187089 -407072 -2117 155035 413292
5783 413292 238886 -287408 -299564 -321523 -368690 -297629 78390 -197549 -438871 54815
$$ packed form
5853c24668N61888k45058m72788j9353r6173J22606M32087L93901J992j77588
5843A76846j61628k96497J1596L92662J15776m69162j39414l5383l3780J61768
5833b77216R1253K49259r7375j32047J53692j38817J48733L22382Q5142l74415
5823C0591l88833j4779k7591K51254J89294k19800l39150k28651l92133L13384
5813h26414L56644M26607Q05791l84800p44065r6104l3154J6719M20051K83314
5803B24589k74194l44708q7172k04212L05539P62035k64142k85681J08199m23341
5793d83088k63721N28868N26961N1441p4796m72754k19983M04955J57152K58257
5783D13292j74406n26294j2156k1959m7167P1061L76019k75939k41322M93686
$$ plain form
5773 54815 40589 -255373 -113107 -169055 -254090 -324533 -386888 -431645 -243475 118368 507112
5762 507112 419491 61876 -187714 -137488 -163962 -590435 -426795 -265238 -428823 -389887
5752 -389887 -151779 25382 69974 179318 110137 233862 101260 -355642 -635594 -544146
5742 -544146 15735 187369 310057 -72722 -199450 -335515 -151320 68487 -11701 -527577
5732 -527577 -736707 -612481 -298698 166332 312229 438156 173212 -8044 69632 86709
5722 86709 -14429 -235459 -117776 -191551 -455456 -720531 -311826 -119203 110650 486303
5712 486303 176687 -298137 -343920 -1150 388975 299992 138199 266145 -87410 -420648
5702 -420648 -255490 48803 -78519 -151450 -408339 -159757 21406 -126502 -257620 207928
$$ packed form
5773E4815j4226k95962J42266n5948q5035p0443o2355m4757J88170L61843L88744
5762E07112q7621l57615k49590N0226k6474m26473J63640J61557j63585L8936
5752c89887K38108J77161M4592J09344o9181J23725j32602m56902k79952R1448
5742e44146N59881J71634J22688l82779j26728j36065J84195K19807q0188n15876
5732e27577k09130J24226L13783M65030J45897J25927k64944j81256P7676J7077
5722H6709j01138k21030J17683p3775k63905k65075M08705J92623K29853L75653
5712D86303l09616m74824m5783L42770L90125q8983j61793J27946l53555l33238
5702d20648J65158L04293j27322p2931k56889K48582J81163j47908j31118M65548
$$ plain form
5692 207928 310769 126908 51538 -77344 -375422 -542021 -123620 -153964 -209062 -353630
5682 -353630 -481459 40587 149720 42050 280819 21012 -377063 -286137 -204216 -133363
5672 -133363 -329508 -175294 -303690 -26675 129043 -426319 -137681 46726 -9056 -86176
5662 -86176 369312 248704 -287610 -326769 136648 93107 35345 81161 169803 -462254 -424573
5651 -424573 -300429 -176816 -30131 -217139 10630 -56265 -195864 169267 148185 -467860
5641 -467860 -241781 -118044 179354 218992 -148598 -25618 273094 273559 301877 110477 11800
5630 11800 -485473 -348087 -113072 -123912 -78408 447579 406561 49366 -21060 -183392 -301766
5619 -301766 -345227 -496959 -526935 -251254 -372455 -454179 -252015 220516 381035 -49072
$$ packed form
5692B07928J02841j83861p5370j28882k98078j66599M18401l0344n5098j44568
5682c53630j27829N22046J09133j07670K38769k59807l98075R0926Q1921P0853
5672a33363j96145J54214j28396K77015J55718n55362K88638J84407n5782p7120
5662h6176M55488j20608n36314l9159M63417m3541n7762M5816Q8642o32057L7681
5651d24573J24144J23613J46685j87008K27769o6895j39599L65131k1082o16045
5641d67860K26079J23737K97398L9638l67590J22980K98712M65K8318j91400r8677
5630A1800m97273J37386K35015j0840M5504N25987m1018l57195p0426j62332j18374
5619c01766m3461j51732k9976K75681j21201q1724K02164M72531J60519m30107
$$ plain form
5609 -49072 -250831 -636162 -2014 231374 210900 306645 33360 -329075 -205133 -458031
5599 -458031 -319455 12696 -109432 49964 -218721 -157507 -23671 149369 237819 59547
5589 59547 -13317 -143013 -553422 -518409 -220363 59781 309564 191446 -102751 -71914
5579 -71914 -21587 202356 143130 -19184 -251564 -88650 -203850 -159676 -125657 -151063 -234516
5568 -234516 -49022 330042 257541 38506 145588 -25948 -174068 76732 190319 117910
5558 117910 -96993 -186643 -105425 -13083 127604 31908 -312124 -462454 -774259 -613858
5548 -613858 -46442 471200 419097 179526 378011 179656 90489 206790 9609 -315368
5538 -315368 -270017 -369183 -588944 -562257 -408757 -399144 -289821 -140037 -195281 -366237 134829
$$ packed form
5609d9072k01759l85331O34148K33388k0474R5745k73285l62435J23942k52898
5599d58031J38576L32151j22128J59396k68685O1214J33836J73040Q8450j78272
5589E9547p2864j29696m10409L5013K98046K80144K49783j18118k94197L0837
5579g1914N0327K23943n9226j62314k32380J62914j15200M4174L4019k5406q3453
5568b34516J85494L79064p2501k19035J07082j71536j48120K50800J13587p2409
5558A17910k14903q9650Q1218R2342J40687r5696l44032j50330l11805J60401
5548f13858N67416N17642n2103k39571J98485j98355q9167J16301j97181l24977
5538c15368M5351r9166k19761K6687J53500R613J09323J49784n5244j70956N01066
$$ plain form
5527 134829 347899 89093 24050 415474 164655 -100959 -178638 -259025 -742144 -574469
5517 -574469 -355135 -256117 333176 307091 -154416 -226766 -256008 -328369 165508 271647 14212
5506 14212 -172992 226651 -220263 -400189 -24597 -172 -361365 -280849 -72151 -108428
5496 -108428 -121616 -51272 -475980 -235661 204531 -241609 -355944 -339402 -297827 -260733 21688
5485 21688 292712 42792 334842 164212 -620680 -437257 -251510 -271498 92393 534577
5475 534577 385986 -120429 -178115 -230447 -570526 -326784 -94432 -411400 -345796 -356338
5465 -356338 -270570 -159694 386196 236714 -101021 -47283 -222686 -464605 2004 337225
5455 337225 57975 -112767 144039 62133 -405132 -303419 -218525 -180448 158160 424447
$$ packed form
5527A34829K13070k58806o5043L91424k50819k65614p7679q0387m83119J67675
5517e74469K19334R9018N89293k6085m61507p2350k9242p2361M93877J06139k57435
5506A4212j87204L99643m46914j79926L75592K4425l61193Q0516K08698l6277
5496a08428j3188P0344m24708K40319M40192m46140j14335J6542M1575L7094K82421
5485B1688K71024k49920K92050j70630p84892J83423J85747j9988L63891M42184
5475E34577j48591n06415n7686n2332l40079K43742K32352l16968O5604j0542
5465c56338Q5768J10876N45890j49482l37735N3738j75403k41919M66609L35221
5455C37225k79250j70742K56806q1906m67265J01713Q4894L8077L38608K66287
$$ plain form
5445 424447 303772 247965 395675 192631 -213744 -178251 -377905 -198748 -121463 -236553
5435 -236553 -228155 -363237 -108802 58998 95785 9106 146103 170056 -102586 -99721 315571
5424 315571 245351 -84483 22833 -281111 -129215 -104682 -46080 -184805 -66082 348433
5414 348433 -87031 -61177 10636 -102027 -120333 -43837 -65902 -138088 259753 52213 -567085
5403 -567085 -388158 -62180 -206880 -77012 397774 395334 365210 369738 280929 -361167 -308039
5392 -308039 197531 -497293 -603160 -520660 -592443 -101148 378603 639528 432885 121080
5382 121080 -113158 -471281 10994 728203 402141 138462 -113721 -532283 -580513 -459004
5372 -459004 -249299 134737 270455 -60524 -413370 -464575 39694 71473 34642 -180434
$$ packed form
5445D24447j20675n5807J47710k03044m06375L5493j99654J79157P7285j15090
5435b36553Q398j35082K54435J67800L6787q6679J36997K3953k72642K865M15292
5424C15571p0220l29834J07316l03944J51896K4533N8602j38725J18723M14515
5414C48433m35464K5854P1813j12663j8306P6496k2065p2186L97841k07540o19298
5403e67085J78927L25978j44700J29868M74786k440l0124M528q8809o42096N3128
5392c08039N05570o94824j05867Q2500p1783M91295M79751K60925k06643l11805
5382A21080k34238l58123M82275P17209l26062k63679k52183m18562m8230J21509
5372d59004K09705L84036J35718l30979l52846n1205N04269L1779l6831k15076
$$ plain form
5362 -180434 -298826 -294765 -316 -65971 -186457 180014 75345 216223 -158957 -291502
5352 -291502 -263599 -189888 -46913 -231102 30135 496021 339615 7033 -115387 -120766
5342 -120766 -223720 -304715 -162651 -68500 61975 -11895 32553 207496 584169 477730
5332 477730 55185 -412041 -287410 -158312 -31892 20721 111104 -142629 -307154 182289
5322 182289 40766 95830 317200 -202054 -255456 -215140 -95128 185452 -436875 -623271
5312 -623271 -198062 -205811 -25960 -10158 -146985 171514 -117576 -35556 -128537 -469804 -371237
5301 -371237 -337734 -229638 -287394 -166200 292224 369768 340766 489703 474541 -123183 -343348
5290 -343348 -89943 25134 220568 -165149 -400881 -193194 -76506 378561 431821 21701
$$ packed form
5362a80434j18392M061K94449o5655j20486L66471j04669J40878l75180j32545
5352b91502K7903P3711J42975j84189K61237M65886j56406l32582j22420n379
5342a20766j02954q0995J42064R4151J30475p3870M4448J74943L76673j06439
5332D77730m22545m67226J24631J29098J26420N2613R0383k53733j64525M89443
5322A82289j41523N5064K21370n19254n3402M0316J20012K80580o22327j86396
5312f23271M25209p749J79851J5802j36827L18499k89090Q2020r2981l41267R8567
5301c71237L3503J08096n7756J21194M58424P7544k9002J48937j5162n97724k20165
5290c43348K53405J15077J95434l85717k35732K07687J16688M55067N3260m10120
$$ plain form
5280 21701 -154374 -243056 82423 176723 26397 -61946 -53553 -67360 -108798 -118449 -151996 -79018
5268 -79018 64783 171747 276330 20613 -198436 -351343 -148553 332930 233127 199615
5258 199615 289085 341724 4099 23531 -17673 -55436 -224390 65670 -76387 -324970 -328988
5247 -328988 -122871 86586 292202 312852 225338 192919 -205691 -643144 -556602 6703
5237 6703 135358 209831 313808 387191 -222075 -661685 -342655 -280991 -131614 190506 144690
5226 144690 -54922 -148582 144428 -49694 -261182 109239 -9576 -274350 -494351 -467295
5216 -467295 -261817 -138537 232472 372695 66537 212742 -124948 -336091 -30690 140363
5206 140363 -43723 -87507 10098 -406731 -630776 -453915 -295518 120629 623608 440936
$$ packed form
5280B1701j76075q8682L25479R4300j50326q8343Q393j3807m1438r651l3547P2978
5268g9018J43801J06964J04583k55717k19049j52907K02790M81483r9803l3512
5258A99615Q9470N2639l37625J9432m1204l7763j68954K90060j42057k48583m018
5247c28988K06117K09457K05616K0650q7514l2419l98610m37453Q6542N63305
5237F703J28655P4473J03977P3383o09266m39610L19030O1664J49377L22120m5816
5226A44690j99612r3660K93010j94122k11488L70421j18815k64774k20001K7056
5216d67295K05478J23280L71009J40223l06158J46205l37690k11143L05401J71053
5206A40363j84086m3784R7605m16829k24045J76861J58397M16147N02979j82672
$$ plain form
5196 440936 114095 -142123 50004 -3823 -84887 -18500 -298512 -360123 -162781 -41187
5186 -41187 293489 147461 -120849 -350297 -475168 -564015 -476294 -154236 228482 481649
5176 481649 323944 437419 275456 8048 -167299 -161556 -319858 -559786 -596084 -373636
5166 -373636 -72476 -162100 194077 261583 125964 -237208 -126442 -101527 238729 599757
5156 599757 433522 -100043 -157210 -207391 -486854 -477177 -414605 -257387 43020 -56119 -308299
5145 -308299 -160074 264699 854562 601654 139351 217824 195245 145058 -91613 104255
5135 104255 294016 -34217 -573956 -502419 -213946 49504 351480 492255 368341 183902
5125 183902 240639 -19268 -3844 233816 208386 41687 47759 -397619 -354798 156629 455931
$$ packed form
5196D40936l26841k56218J92127n3827q1064O6387k80012o1611J97342J21594
5186d1187L34676j46028k68310k29448j24871q8847Q7721L22058L82718K53167
5176D81649j57705J13475j61963k67408j75347N743j58302k39928l6298K22448
5166c73636L01160q9624L56177O7506j35619l63172J10766K4915L40256L61028
5156E99757j66235n33565n7167n0181k79463R677O2572J57218L00407r9139k52180
5145c08299J48225M24773N89863k52908m62303P8473k2579n0187k36671J95868
5135A04255J89761l28233n39739P1537K88473K63450L01976J40775j23914j84439
5125A83902N6737k59907J5424K37660k5430j66699O072m45378M2821N11427K99302
$$ plain form
5114 455931 538117 54664 -374418 -93223 -72670 153647 369227 674884 481621 197071
5104 197071 246069 -7185 -212412 -210879 -234094 118040 195673 353898 -34414 -23038 331400
5093 331400 234727 90004 -237044 -146514 114036 234743 523116 387144 18937 -187310
5083 -187310 -245440 -124423 106447 99507 -15478 -58054 -137645 -83258 249380 560900 270796
5072 270796 -312319 -207769 -8849 40850 466190 671471 444319 581205 446187 -126624
5062 -126624 -526007 -148127 139242 233198 448572 231285 -123807 -217112 134251 371950
5052 371950 653810 569732 205482 -126875 37085 -27352 -92777 100240 140324 38122
5042 38122 -67496 -66475 -31683 82101 676775 710343 246912 163364 380184 323453 188170
$$ packed form
5114D55931Q2186m83453m29082K81195K0553K26317K15580L05657j93263k84550
5104A97071M8998k53254k05227J533k3215L52134P7633J58225l88312J1376L54438
5093C31400r6673j44723l27048R0530K60550J20707K88373j35972l68207k06247
5083a87310n8130J21017K30870o940j14985m2576p9591N4387L32638L11520k90104
5072B70796n83115J04550J98920M9699M25340K05281k27152J36886j35018n72811
5062a26624l99383L77880K87369R3956K15374k17287l55092r3305L51363K37699
5052C71950K81860q4078l64250l32357J63960o4437o5425J93017M0084j02202
5042C8122j05618J021L4792J13784N94674L3568m63431q3548K16820n6731j35283
$$ plain form
5031 188170 478439 606478 68224 -40903 224214 163007 -204743 -103014 172481 166008
5021 166008 126408 212488 139884 135969 277887 560424 566886 477844 435683 111093 -152869
5010 -152869 -31619 -32816 88310 181544 36916 167823 341722 265596 -135242 297226
5000 297226 580221 286745 99141 243027 149303 -331771 -108236 -2564 -16164 114060
4990 114060 -37227 -366736 -386992 -38166 -186993 -26954 769516 851087 251943 350942
4980 350942 450477 236010 290166 330067 108009 -65169 149007 121180 102103 107987 49686
4969 49686 364284 303949 334418 372580 599142 536556 203769 508566 719265 290268 34533
4958 34533 164416 151533 68316 59894 512927 219377 -157407 79118 90354 52662 515475
$$ packed form
5031A88170K90269J28039n38254j09127K65117o1207l67750J01729K75495o473
5021A66008l9600Q6080p2604l915J41918K82537O462q9042m2161l24590k63962
5010a52869J21250j197J21126R3234j44628J30907J73899p6126m00838M32468
5000B97226K82995k93476j87604J43886r3724m81074K23535J05672j3600J30224
4990A14060j51287l29509k0256L48826j48827J60039P96470Q1571n99144R8999
4980C50942R9535k14467N4156L9901k22058j73178K14176k7827j9077N884n8301
4969D9686L14598o0335L0469L8162K26562o2586l32787L04797K10699m28997k55735
4958C4533J29883j2883q3217q422M53033k93550l76784K36525J1236l7692M62813
$$ plain form
4947 515475 695698 564758 464178 399399 246058 470590 723453 747574 509137 271879
4937 271879 114308 142543 323294 429739 519127 403687 264507 -114421 -122036 157908
4927 157908 417806 632321 543023 369618 211911 439381 551613 168834 157297 130089
4917 130089 258290 296230 122733 92375 248651 264957 532826 281926 -54160 210784
4907 210784 206356 -101880 -305350 -87092 237334 264041 229100 289079 247926 361612 457798
4896 457798 367760 536418 318523 -74059 -207288 -585415 -364414 -31244 117941 92773
4886 92773 221956 227947 657781 447992 266279 170439 31109 104318 -250167 -160091 301460
4875 301460 364040 253260 476290 -2161 140198 268040 -250830 -482004 -147346 124583
$$ packed form
4947E15475J80223j30940j00580o4779j53341K24532K52863K4121k38437k37258
4937B71879j57571K8235J80751J06445Q9388j15440j39180l78928p615K79944
4927A57908K59898K14515q9298j73405j57707K27470J12232l82779j1537k7208
4917A30089J28201L7940j73497l0358J56276J6306K67869k50900l36086K64944
4907B10784m428l08236k03470K18258L24426K6707l4941N9979m1153J13686R6186
4896D57798r0038J68658k17895l92582j33229l78127K21001L33170J49185k5168
4886I2773J29183N991M29834k09789j81713r5840j39330P3209l54485R0076M61551
4875C01460O2580j10780K23030m78451J42359J27842n18870k31174L34658K71929
$$ plain form
4865 124583 4324 -158972 153868 280977 436494 335763 -311014 -135878 650978 142200
4855 142200 285924 298255 130253 191172 480636 312336 218960 568810 704184 84072
4845 84072 -148304 437544 300027 126105 210605 -61652 -300527 -180234 -76041 -119496
4835 -119496 14289 585829 678205 -52389 7199 289726 -32668 311270 399244 267197
4825 267197 192408 237712 140084 -75261 -222276 156050 312417 525407 274873 441432
4815 441432 485308 230271 -200518 115288 441485 207602 -248815 -123194 217164 350023
4805 350023 172715 130877 480804 509917 402789 53639 -151629 -117714 154683 551400
4795 551400 315721 148039 298967 112166 225682 119192 208077 264590 543025 673433
$$ packed form
4865A24583j20259j63296L12840J27109J55517j00731o46777J75136P86856n08778
4855A42200J43724J2331j68002O0919K89464j68300r3376L49850J35374o20112
4845H4072k32376N85848j37517j73922Q4500k72257k38875J20293J04193m3455
4835a19496J33785N71540R2376p30594N9588K82527l22394L43938Q7974j32047
4825B67197p4789M5304r7628k15345j47015L78326J56367K12990k50534J66559
4815D41432M3876k55037m30789L15806L26197k33883m56417J25621L40358J32859
4805C50023j77308m1838L49927K9113j07128l49150k05268L3915K72397L96717
4795E51400k35679j67682J50928j86801J13516j06490Q8885N6513K78435J30408
$$ plain form
4785 673433 656353 345816 172936 404722 74242 4713 292092 382125 200412 5674
4775 5674 118867 502716 404878 320918 829161 756219 464697 596811 364733 386581 549458
4764 549458 989732 1046248 483218 487481 594252 553649 483398 546819 944437 1088941 837374
4753 837374 462086 557279 963745 934626 448124 430601 809852 883522 777619 752516 976814
4742 976814 1066108 1027973 941909 980580 992929 1098664 1204024 872461 693961 910031 1264599
4731 1264599 1109986 842496 1178559 1363265 991374 1060354 1379080 1603145 1474561 1123501
4721 1123501 933093 990690 1290183 1016706 1362172 1476326 1421533 1515378 1643510 1670450
4711 1670450 1534731 1771907 1816130 1717619 2051940 2221294 2156488 2156934 2192521 2282415 2254164
$$ packed form
4785F73433j7080l10537j72880K31786l30480o9529K87379R0033j81713j94738
4775E674J13193L83849r7838q3960N08243p2942k91522J32114k32078K1848J62877
4764E49458M40274N6516n63030M263J06771m0603p0251O3421L97618J44504k51567
4753H37374l75288R5193M06466k9119m86502j7523L79251P3670j05903k5103K24298
4742I76814Q9294l8135q6064L8671J2349J05735J05360l31563j78500K16070L54568
4731A264599j54613k67490L36063J84706l71891O8980L18726K24065j28584l51060
4721A123501j90408N7597K99493k73477L45466J14154n4793R3845J28132K6940
4711A670450j35719K37176M4223r8511L34321J69354o4806M46L5587Q9894k8251
$$ plain form
4700 2254164 2481400 2322356 2081990 2296187 2354526 2603213 3036918 3527194 3580073 3008612
4690 3008612 2999845 3365133 3481034 4099546 4348944 4290571 4603705 4675226 4656843 4679105 4979840
4679 4979840 5048719 4645801 4517352 4385650 4847017 5434868 5733478 5705843 5577883 5412118
4669 5412118 5408604 5727669 5783860 5554804 5678018 5299821 4957297 5442915 5887973 6239487
4659 6239487 6714020 6976703 7157584 7356765 7747258 8125343 7833940 8486919 8327718 7803280
4649 7803280 8024552 8357755 8501250 8325741 8540587 8885897 8825957 8990196 9136241 9140530
4639 9140530 9151859 9335099 9540941 9386087 9772632 10072420 9967470 9883034 9908005 10184447
4629 10184447 10925143 11068899 10810225 10679660 11294835 11621892 12109604 12604787 12721535
$$ packed form
4700B254164K27236j59044k40366K14197N8339K48687M33705M90276N2879n71461
4690C008612q767L65288J15901O18512K49398n8373L13134P1521j8383K2262L00735
4679D979840O8879m02918j28449j31702M61367N87851K98610k7635j27960j65765
4669E412118l514L19065N6191k29056J23214l78197l42524M85618M45058L51514
4659F239487M74533K62683J80881J99181L90493L78085k91403O52979j59201n24438
4649G803280K21272L33203J43495j75509K14846L45310n9940J64239J46045M289
4639I140530J1329J83240K05842j54854L86545K99788j04950q4436K4971K76442
4629A0184447P40696J43756k58674j30565O15175L27057M87712M95183J16748
$$ plain form
4620 12721535 13132937 13357619 13360890 13297354 13367289 13518485 13227330 12424537 12310702 12212026
4610 12212026 12121081 12021490 11455180 10863590 10768461 10926863 10796018 11319257 11535089 11247756
4600 11247756 11063841 10447825 10264279 10341766 10834563 11352126 11361118 11307367 11300214 11326173 11482692
4589 11482692 11291331 11511873 11170795 10307238 9456479 9632525 9553597 9407045 9389251 8921011
4579 8921011 8389245 8017349 8025775 7753659 7625479 7601598 7269249 6971052 6974469 6837459
4569 6837459 7095126 6984269 6789072 6671317 6561776 6527843 6695163 6592650 6724880 6732460
4559 6732460 6472448 6114911 6039626 6643761 7017585 6958929 7007829 6553366 6385631 6361797
4549 6361797 6193041 6075233 5816798 5687708 5134810 4749303 4444824 5048989 5222831 4804191
$$ packed form
4620A2721535M11402K24682L271o3536O9935J51196k91155q02793j13835r8676
4610A2212026r0945r9591n66310n91590r5129J58402j30845N23239K15832k87333
4600A1247756j83915o16016j83546P7487M92797N17563Q992n3751p153K5959J56519
4589A1482692j91361K20542l41078q63557q50759J76046p8928j46552j7794m68240
4579H921011n31766l71896Q426k72116j28180k3881l32349k98197L417j37010
4569F837459K57667j10857j95197j17755j09541l3933J67320j02513J32230P580
4559F732460k60012l57537p5285O04135L73824n8656M8900m54463j67735k3834
4549F361797j68756j17808k58435j29090n52898l85507l04479O04165J73842m18640
$$ plain form
4539 4804191 5156617 5067750 4652112 4414290 4053232 4158001 4278251 4588226 4710922 4172949
4529 4172949 3996049 3967792 3675988 4184601 4814585 5406536 5644873 5761393 5650299 5783820
4519 5783820 6391821 6196839 5880313 5657551 4938756 4157790 3643393 3421908 3738985 3616170
4509 3616170 3006877 2474232 2411806 2250529 2386379 2993946 2699968 1988174 1699785 1804957
4499 1804957 2003572 2067714 1960741 1726532 1224688 1683563 2114529 2057615 2055192 1441531
4489 1441531 1176757 1010664 1105016 1508573 1491303 1410946 1574614 1824759 1915017 1680528
4479 1680528 1591471 1445285 1207015 903674 535267 868101 1012262 1086675 1036823 1091779
4469 1091779 1038721 875811 1236053 1203942 1532733 1740205 817788 542009 1150738 1233208
$$ packed form
4539D804191L52426q8867m15638k37822l61058J04769J20250L09975J22696n37973
4529D172949j76900k8257k91804N08613O29984N91951K38337J16520j11094J33521
4519E783820O08001j94982l16526k22762p18795p80966n14397k21485L17077j22815
4509C616170o09293n32645o2426j61277J35850O07567k93978p11794k88389J05172
4499A804957J98615O4142j06973k34209n01844M58875M30966n6914k423o13661
4489A441531k64774j66093R4352M03557j7270q0357J63668K50145R0258k34489
4479A680528q9057j46186k38270l03341l68407L32834J44161P4413m9852N4956
4469A091779n3058j62910L60242l2111L28791K07472r22417k75779O08729Q2470
$$ plain form
4459 1233208 1165339 1189208 1445571 809392 255969 588703 866655 833553 1190382 965792
4449 965792 1093604 1447373 1386983 913038 560799 656236 812652 751948 811628 669900
4439 669900 860289 1125933 714426 870123 1369794 1454041 1247952 1401436 1672959 1537789
4429 1537789 1150347 1215786 1736895 1790342 1487266 1320109 1281530 1971884 2526491 2248581
4419 2248581 2150578 1941521 1671339 2006994 2180608 2350134 2089579 2237364 2383805 2000371
4409 2000371 2182716 2650648 2483582 2259249 2393375 2761022 2900983 2761920 2618755 2642282
4399 2642282 2980541 3185978 2954197 2850323 3085108 3029041 3145366 3022668 3022117 3366200
4389 3366200 3610623 3644173 3549097 3631765 3769573 3874095 3826218 3663312 3713595 3548058
$$ packed form
4459A233208o7869K3869K56363o36179n53423L32734K77952l3102L56829k24590
4449I65792J27812L53769o0390m73945l52239R5437J56416o0704N9680j41728
4439F69900J90389K65644m11507J55697M99671Q4247k06089J53484K71523j35170
4429A537789l87442O5439N21109N3447l03076j67157l8579O90354N54607k77910
4419B248581r8003k09057k70182L35655J73614J69526k60555J47785J46441l83434
4409B000371J82345M67932j67066k24333J34126L67647J39961j39063j43165K3527
4399B642282L38259K05437k31781j03874K34785n6067J16325j22698n51L44083
4389C366200K44423L3550r5076Q2668J37808J04522m7877j62906N0283j65537
$$ plain form
4379 3548058 3422687 3445353 3826619 3856279 3562139 3644319 3345236 3597032 4115243 4134697
4369 4134697 4334462 4213491 4130787 4601073 4655604 4520000 4313831 4470261 4636181 4377686
4359 4377686 4325681 4305165 4465261 4689615 4564386 4747281 4861296 4804835 4648037 4572951
4349 4572951 4534520 4878976 4968735 4284205 4559745 5366988 5714752 5493996 5317757 5284777
4339 5284777 5227647 5333508 5174940 4792551 4534346 4712127 4523920 4472913 4735397 4548768
4329 4548768 4477146 4671143 4615617 4420179 4670435 4867902 4823070 4984263 5441178 5561698
4319 5561698 5531853 5458089 5307252 5605612 5749331 5437679 5685816 6047296 6038342 6356091
4309 6356091 6189078 6116876 6152650 6260493 6344792 6377487 6445112 6883909 6370714 6200096
$$ packed form
4379C548058j25371K2666L81266K9660k94140Q2180k99083K51796N18211J9454
4369D134697J99765j20971q2704M70286N4531j35604k06169J56430J65920k58495
4359D377686n2005k0516J60096K24354j25229J82895J14015n6461j56798p5086
4349D572951l8431L44456Q9759o84530K75540Q07243L47764k20756j76239l2980
4339E284777n7130J05861j58568l82389k58205J77781j88207n1007K62484j86629
4329D548768p1622J93997n5526j95438K50256J97467m4832J61193M56915J20520
4319E561698k9845p3764j50837K98360J43719l11652K48137L61480q954L17749
4309F356091j67013p2202L5774J07843Q4299L2695O7625M38797n13195j70618
$$ plain form
4299 6200096 6626187 6804392 7100804 7148227 7320506 7538088 7780833 7852814 7659595 7970388
4289 7970388 8464148 8102165 7818455 7993571 8068518 8201171 8085951 8062462 7859156 8040243
4279 8040243 7797859 7979727 8215678 8069675 8151793 8053439 7686559 7727543 7492301 7633693
4269 7633693 7536455 6935844 7247403 7547519 7782000 7921575 8499433 8690062 8707623 9175443
4259 9175443 9403437 8818752 9240247 9893094 10114565 10496053 10997114 11199389 11331875 11640563
4249 11640563 11964098 12330833 12523753 12480603 12649664 12433500 12194770 11954602 11716165 11243082
4239 11243082 11188093 11258316 10874185 10659663 10926573 10591981 10634320 10871688 10696888 10673060
4229 10673060 10926269 10929771 10998185 11233138 11331408 11286331 11515974 11610539 11235124 10872035
$$ packed form
4299F200096M26091J78205K96412M7423J72279K17582K42745P1981j93219L10793
4289G970388M93760l61983k83710J75116P4947J32653j15220k3489k03306J81087
4279H040243k42384J81868K35951j46003Q2118r8354l66880M0984k35242J41392
4269G633693r7238o00611L11559L00116K34481J39575N77858J90629J7561M67820
4259I175443K27994n84685M21495O52847K21471L81488N01061K02275J32486L08688
4249A1640563L23535L66735J92920m3150J69061k16164k38730k40168k38437m73083
4239A1243082n4989P0223l84131k14522K66910l34592M2339K37368j74800k3828
4229A0673060K53209L502O8414K34953R8270m5077K29643R4565l75415l63089
$$ plain form
4219 10872035 11110630 10850580 10722199 10577294 10449150 10094709 9589736 9258031 8775664
4210 8775664 8460604 8614419 8387886 7682632 7228737 7690290 7674873 7280393 7638474 7123685
4200 7123685 6550624 6746374 6514842 6242664 6421139 6591348 6551485 6259690 6335098 6453556
4190 6453556 6664023 6775785 6620582 6815735 6803266 6576654 6605470 6508776 6556686 6416142
4180 6416142 6271028 5953510 5961871 5913336 6157190 6275237 5903196 5975256 6231998 5989992
4170 5989992 5726646 5896713 5921456 5532244 5048349 5171294 5522510 5804962 5826099 5407127
4160 5407127 5404515 5735535 5754991 5725258 5779415 6134147 6713986 6753405 6347480 5876973 6028892
4149 6028892 6310655 6549497 6662918 6487820 6070458 6209413 6250510 6774534 7225853 7422265
$$ packed form
4219A0872035K38595k60050j28381j44905j28144l54441n04973l31705m82367
4210H775664l15060J53815k26533p05254m53895M61553j5417l94480L58081n14789
4200G123685n73061J95750k31532k72178J78475J70209l9863k91795P5408J18458
4190F453556K10467J11762j55203J95153j2469k26612K8816r6694M7910j40544
4180F416142j45114l17518Q361m8535K43854J18047l72041P2060K56742k42006
4170E989992k63346J70067K4743l89212m83895J22945L51216K82452K1137m18972
4160E407127k612L31020J9456k9733N4157L54732N79839L9419m05925m70507J51919
4149F028892K81763K38842J13421j75098m17362J38955M1097N24024M51319J96412
$$ plain form
4139 7422265 7078160 6349704 6325775 6809343 7262879 7489051 7484218 7373890 7436320 7529442
4129 7529442 7061176 7192933 7670061 7756167 7587233 7510811 7317656 7455276 7716916 7852679
4119 7852679 7876675 7830817 7787878 7759580 7871506 8760145 8622406 8156016 8192432 7997425
4109 7997425 8545466 8808346 8563388 8379156 8418545 8772965 8953212 9302175 9131097 9165810
4099 9165810 9465946 9367252 9358091 9524953 9808707 10002334 10108216 10429364 10646246 10540337
4089 10540337 10316158 10225415 10639137 11000569 11459598 11915797 12103630 12506712 12837709 12749567
4079 12749567 12930927 13235468 13887564 13860722 13742746 13993501 13875619 13539606 13332000 13603576
4069 13603576 13802766 13269397 13272503 13343440 13939988 14317775 14544013 14329680 14152023 14452514
$$ packed form
4139G422265l44105p28456k3929M83568M53536K26172m833j10328O2430R3122
4129G529442m68266J31757M77128Q6106j68934p6422j93155J37620K61640J35763
4119G852679K3996m5858m2939k8298J11926Q88639j37739m66390L6416j95007
4109G997425N48041K62880k44958j84232L9389L54420J80247L48963j71078L4713
4099I165810L00136r8694r161J66862K83754J93627J05882L21148K16882j05909
4089A0540337k24179r0743M13722L61432M59029M56199J87833M03082L30997q8142
4079A2749567J81360L04541O52096k6842j17976K50755j17882l36013k07606K71576
4069A3603576J99190n33369L106P0937N96548L77787K26238k14333j77657L00491
$$ plain form
4059 14452514 14463402 13905003 14270645 15017733 14875485 15353684 15633249 15883305 16369522 16391683
4049 16391683 16419946 16742561 17343700 17702795 18371929 19160376 19531160 19731554 19945819 19535180
4039 19535180 19307354 19798086 19759396 19259683 19252721 19063625 18636876 18564611 18519987 18521831 18451094
4028 18451094 17933515 18079800 18045630 18025122 18522155 18733613 19073355 18783352 18044614 18027509
4018 18027509 18056553 18301406 18685238 18849242 18778253 18501314 18521985 18783648 18925320 19324935
4008 19324935 19566278 19199722 19026258 19122220 19419528 19480072 19205880 19321786 19462103 19232460
3998 19232460 18793286 18891765 19130842 19583637 19958283 20138642 20810729 21044142 21115569 21018976
3988 21018976 21204025 22190739 22944639 23512046 24230155 25160645 26773877 27853427 28733107
$$ packed form
4059A4452514J0888n58399L65642P47088j42248M78199K79565K50056M86217K2161
4049A6391683K8263L22615O01139L59095O69134P88447L70784K00394K14265m10639
4039A9535180k27826M90732l8690m99713o962j89096m26749p2265m4624J844p0737
4028A8451094n17579J46285l4170k0508M97033K11458L39742k90003p38738j7105
4018A8027509K9044K44853L83832J64004p0989k76939K0671K61663J41672L99615
4008A9324935K41343l66556j73464R5962K97308O0544k74192J15906J40317k29643
3998A9232460m39174R8479K39077M52795L74646J80359O72087K33413P1427r6593
3988B1018976J85049R86714P53900N67407P18109R30490J613232J079550Q79680
$$ plain form
3979 28733107 30214093 31645623 32388850 32467170 32234005 32332775 31564636 30170817 28550082
3970 28550082 26276356 24906822 24182665 22865061 22139298 22065292 21635477 21189207 20688276
3961 20688276 20783444 20707453 20483801 20305143 19756367 19543346 20246655 20391561 20309954 20743285
3951 20743285 20983542 21085491 20690320 20375855 20454882 21240560 21846934 21775235 22100854 23260801
3941 23260801 24340445 25234129 26140916 27371988 28962208 31631440 35181331 38666282
3933 38666282 39505332 38195704 36895831 35493030 34066075 32279590 30205041 29314924
3925 29314924 28480868 27885451 27880039 28000924 28184001 29128816 30191758 30867793 31651189 32987010
3915 32987010 34827029 37190799 39467508 41909137 44599003 47683844 50751840 53108730
$$ packed form
3979B8733107J480986J431530P43227P8320k33165R8770p68139j393819j620735
3970B8550082k273726j369534p24157j317604p25763p4006m29815m46270n00931
3961B0688276R5168p5991k23652j78658n48776k13021P03309J44906q1607M33331
3951B0743285K40257J01949l95171l14465P9027P85678O06374p1699L25619J159947
3941B3260801J079644Q93684R06787J231072J590220K669232L549891L484951
3933C8666282Q39050j309628j299873j402801j426955j786485k074549q90117
3925B9314924q34056n95417n412J20885J83077R44815J062942O76035P83396J335821
3915C2987010J840019K363770K276709K441629K689866L084841L067996K356890
$$ plain form
3907 53108730 54454584 54494758 53133184 50970506 48625922 45520116 42184978 38830709
3899 38830709 36237317 33706359 31553849 29710120 27876735 26981395 25932935 24696673
3891 24696673 24204856 23546476 22554721 21957077 21670127 20833397 20209872 20031942 19393445
3882 19393445 19428379 20155231 19991472 19553371 19319671 19583789 19840074 20440867 20949123 21001830
3872 21001830 21142758 20996338 21059931 22052233 22951475 23325685 23794263 24765849 25893724
3863 25893724 27158671 28680204 30278075 32214268 34836399 36918882 39480257 43000786
3855 43000786 46145605 47312540 46175586 44163285 41223691 37929857 35267310 33045160
3847 33045160 31401127 30182250 28765660 28192346 28005947 27966767 27853638 27588966 27427651
$$ packed form
3907E3108730J345854M0174j361574k162678k344584l105806l335138l354269
3899C8830709k593392k530958k152510j843729j833385q95340j048460j236262
3891B4696673m91817o58380r91755n97644k86950q36730o23525j77930o38497
3882A9393445L4934P26852j63759m38101k33700K64118K56285O00793N08256N2707
3872B1001830J40928j46420O3593R92302Q99242L74210M68578R71586J127875
3863B5893724J264947J521533J597871J936193K622131K082483K561375L520529
3855D3000786L144819J166935j136954k012301k939594l293834k662547k222150
3847C3045160j644033j218877j416590n73314j86399l9180j13129k64672j61315
$$ plain form
3838 27427651 27424411 27460865 27434481 27179707 27148109 26853605 26526394 26506596 27148909 27571439
3828 27571439 27412008 27537021 27689780 27867935 28602273 29479513 30137861 30496474 31375974
3819 31375974 32239064 32432376 33617820 34689676 35619800 36825429 37748575 38786729 39997572
3810 39997572 41479259 42860849 43964679 45918595 47251294 48148386 50073187 51731969
3802 51731969 53122291 55033843 57008534 58745317 60093346 62183736 64525051 66428779
3794 66428779 68410159 70919257 73160050 75658956 78632212 81026129 82974777 85977463
3786 85977463 88395090 90813108 93483864 96024891 98416909 100557181 103168228 105520321
3778 105520321 108066732 110814506 112713482 114410310 116921223 119241561 120899209 122259141
$$ packed form
3838B7427651l240L6454k6384k54774l1598k94504l27211j9798O42313M22530
3828B7571439j59431J25013J52759J78155P34338Q77240O58348L58613Q79500
3819C1375974Q63090J93312J185444J071856R30124J205629R23146J038154J210843
3810C9997572J481687J381590J103830J953916J332699Q97092J924801J658782
3802E1731969J390322J911552J974691J736783J348029K090390K341315J903728
3794F6428779J981380K509098K240793K498906K973256K393917J948648L002686
3786H5977463K417627K418018K670756K541027K392018K140272K611047K352093
3778A05520321K546411K747774J898976J696828K510913K320338J657648J359932
$$ plain form
3770 122259141 123593824 125012287 126159182 127087299 127482083 127306269 127740483 128192216 127914801
3761 127914801 128024752 127731798 126766861 125652166 124633383 123832988 122494995 120316723 118118447
3752 118118447 116091112 114489797 113075770 110681961 108207065 106224112 104286085 102175270
3744 102175270 100040186 98409338 96886989 95143274 93628311 91873689 90260363 88733522
3736 88733522 87399938 86205581 85024655 83988722 82850190 81313684 80298945 80035793
3728 80035793 79839533 79243060 78826404 78704544 78804360 79259603 79755474 80700820 81873684
3719 81873684 83111761 83972511 85212176 87145896 88855176 90971455 93985470 97304832
3711 97304832 100400175 104251606 108416983 112743408 117975843 124572204 131615067 138752170
$$ packed form
3770A22259141J334683J418463J146895R28117L94784j75814M34214M51733k77415
3761A27914801J09951k92954r64937j114695j018783q00395j337993k178272k198276
3752A18118447k027335j601315j414027k393809k474896j982953j938027k110815
3744A02175270k135084j630848j522349j743715j514963j754622j613326j526841
3736H8733522j333584j194357j180926j035933j138532j536506j014739k63152
3728H0035793j96260n96473m16656j21860R9816M55243M95871R45346J172864
3719H1873684J238077Q60750J239665J933720J709280K116279L014015L319362
3711I7304832L095343L851431M165377M326425N232435O596361P042863P137103
$$ plain form
3703 138752170 146729050 155519295 164948511 175129522 186267838 198031159 209862529
3696 209862529 221960545 232958572 241503904 244483694 243061047 241229584 239532450 236850758
3688 236850758 232586931 226069312 217898209 209630318 202764683 196295569 190333846 185296097
3680 185296097 181041513 177520960 174823675 172884938 171282561 170465155 170022187 170515551
3672 170515551 172099525 175045277 178382253 183057433 189190356 195701489 203160112 211937847
3664 211937847 221678033 232185048 243096597 254362076 264871376 274646344 283191742
3657 283191742 289186988 293321095 295909192 296394485 295029742 293148294 290324552 286554382
3649 286554382 282554675 278760219 273735548 267865223 261641814 253824602 244380764 233965471
$$ packed form
3703A38752170P976880Q790245R429216J0181011J1138316J1763321J1831370
3696B09862529J2098016J0998027Q545332K979790j422647j831463j697134k681692
3688B36850758m263827o517619q171103q267891o865635o469114n961723n037749
3680A85296097m254584l520553k697285j938737j602377q17406m42968M93364
3672A70515551J583974K945752L336976M675180O132923O511133P458623Q777735
3664B11937847R740186J0507015J0911549J1265479J0509300R774968Q545398
3657B83191742N995246M134107K588097M85293j364743j881448k823742l770170
3649B86554382l999707l794456n024671n870325o223409p817212r443838j0415293
$$ plain form
3641 233965471 222189231 210286535 198601398 186700452 175218601 164827499 154824948
3634 154824948 145631611 137817266 130911719 124271257 118574122 113652504 108387643 103511687
3626 103511687 99835453 96383544 92811324 89590906 86440731 83402210 80713393 78109822
3618 78109822 75177586 72862262 71058402 69026495 66488780 64816345 63025562 60964412
3610 60964412 59459635 58178299 56559911 54844750 53106680 51300957 49689157 48614201
3602 48614201 47641782 46285678 45451705 44953779 43561051 42769494 41718195 40499299 39811205
3593 39811205 39125885 38002116 36630864 35547765 34907903 34058432 33517302 33182984 32503219
3584 32503219 31861434 31362431 30786429 30512051 30030942 29200450 27961194 26786924 26216813
$$ packed form
3641B33965471j1776240j1902696j1685137j1900946j1481851j0391102j0002551
3634A54824948r193337p814345o905547o640462n697135m921618n264861m875956
3626A03511687l676234l451909l572220l220418l150175l038521k688817k603571
3618G8109822k932236k315324j803860k031907k537715j672435j790783k061150
3610F0964412j504777j281336j618388j715161j738070j805723j611800j074956
3602D8614201r72419j356104q33973m97926j392728p91557j051299j218896o88094
3593C9811205o85320j123769j371252j083099o39862q49471n41130l34318o79765
3584C2503219o41785m99003n76002k74378m81109q30492j239256j174270n70111
$$ plain form
3575 26216813 25962720 25564511 25257199 24556746 24023683 23642229 23421029 23264031 23080587
3566 23080587 22379779 21743095 20970069 21002707 21055999 20628978 20465132 20361179 19745257 19567375
3556 19567375 19240092 18940334 19044698 18690764 18559926 18081131 17482948 17411477 17576126 17940303
3546 17940303 18099238 17548942 17216794 16909478 16845410 16777429 16827518 16712782 16398015 16291898
3536 16291898 16391457 16427893 16887451 16929670 16440272 16099440 16283072 16120454 16184851 16313891
3526 16313891 16498887 16472712 16628238 16533940 16455213 16417469 16578175 16743482 17357447 17674506
3516 17674506 17776630 18169656 18708775 18861353 19281654 19320127 18820124 18867766 19607189 20186670
3506 20186670 20624843 21204378 22017384 22348661 22908434 23618494 23897260 24356035 24935171
$$ packed form
3575B6216813k54093l98209l07312p00453n33063l81454k21200j56998j83444
3566B3080587p00808o36684p73026L2638N3292m27021j63846j03953o15922j77882
3556A9567375l27283k99758J04364l53934j30838m78795n98183p1471J64649L64177
3546A7940303J58935n50296l32148l07316o4068o7981N0089j14736l14767j06117
3536A6291898R9559L6436M59558M2219m89398l40832J83632j62618O4397J29040
3526A6313891J84996k6175J55526r4298p8727l7744J60706J65307O13965L17059
3516A7674506J02124L93026N39119J52578M20301L8473n00003M7642P39423N79481
3506B0186670M38173N79535Q13006L31277N59773P10060K78766M58775N79136
$$ plain form
3497 24935171 25434826 25765927 26147611 26672702 27291704 28183330 29390413 29877258 30459024
3488 30459024 30908676 31376573 32075574 32958887 33923330 34445304 34938037 35546954 36765852
3479 36765852 38174864 39092232 40099541 40865462 41564945 42353846 43280349 44307258 45363587
3470 45363587 46930329 48462201 49596884 51504112 53524964 55507092 57751698 59631433
3462 59631433 61840977 64363644 67222441 70485892 73992789 77713951 81602360 85403289
3454 85403289 89799683 94277796 98773036 104043688 109157823 113961345 119744520 126053403
3446 126053403 132490555 138854418 145434320 152637118 159988060 167313666 175273160 183797461
3438 183797461 192160139 200504571 208097759 215153351 221647055 227300909 232270097 236531835
$$ packed form
3497B4935171M99655L31101L81684N25091O19002Q91626J207083M86845N81766
3488C0459024M49652M67897O99001Q83313R64443N21974M92733O08917J218898
3479C6765852J409012R17368J007309P65921O99483P88901R26503J026909J056329
3470D5363587J566742J531872J134683J907228K020852J982128K244606J879735
3462E9631433K209544K522667K858797L263451L506897L721162L888409L800929
3454H5403289M396394M478113M495240N270652N114135M803522N783175O308883
3446A26053403O437152O363863O579902P202798P350942P325606P959494Q524301
3438A83797461Q362678Q344432P593188P055592O493704N653854M969188M261738
$$ plain form
3430 236531835 240717790 244486829 247626039 251095748 253311178 254999593 256485899 256492839
3422 256492839 255509956 253615882 249670770 244561954 238521496 232022222 224854730 216981416
3414 216981416 209299963 201583840 193965297 186258826 178199573 170517197 162739422 154550103
3406 154550103 146479338 138909508 130563635 122805023 115397025 108123709 102083767 96394267
3398 96394267 91089581 86233919 81503427 77544291 73563540 70213054 67327595 64433192
3390 64433192 62257620 59944492 57752028 55957128 54218125 52668891 51339331 49818372
3382 49818372 48370882 47083906 45929167 44797256 43603014 42477688 41292483 39927286
3374 39927286 38867667 37963644 37144087 36283477 35688243 34483937 34116329 34025450 33492586
$$ packed form
3430B36531835M185955L769039L139210L469709K215430J688415J486306O940
3422B56492839r82883j894074l945112n108816o040458o499274p167492p873314
3414B16981416p681453p716123p618543p706471q059253p682376p777775q189319
3406A54550103q070765p569830q345873p758612p407998p273316o039942n689500
3398I6394267n304686m855662m730492l959136l980751l350486k885459k894403
3390F4433192k175572k313128k192464j794900j739003j549234j329560j520959
3382D9818372j447490j286976j154739j131911j194242j125326j185205j365197
3374C9927286j059619r04023q19557q60610n95234j204306l67608r0879n32864
$$ plain form
3365 33492586 32401700 30994434 29834349 28689654 27864628 27560337 27104236 26456548 25769523
3356 25769523 24552830 23806532 23904750 23641974 23048650 22429070 22005962 21123847 20336451
3347 20336451 20313769 20028371 19645487 18797777 17940304 17010108 16657791 16711672 16431794 16400422
3337 16400422 16257510 15664911 15130819 14750170 14480907 14056256 14029180 13911944 13263193 13033408
3327 13033408 13168265 12862407 12555493 12338694 12194847 11733425 11429210 11347883 11009572 10843316
3317 10843316 10781436 10435084 10055919 9920636 9826737 9518668 9453143 9232668 9078544 9196382
3307 9196382 9148127 8596165 8255189 8209292 7853938 7495410 7892553 8130435 7833720 7869639
3297 7869639 7787619 7236353 6790768 6793230 6766284 6673597 6618790 6476975 6411645 6794866 6818458
$$ packed form
3365C3492586j090886j407266j160085j144695q25026l04291m56101o47688o87025
3356B5769523j216693p46298R8218k62776n93324o19580m23108q82115p87396
3347B0336451k2682k85398l82884q47710q57473r30196l52317N3881k79878l1372
3337A6400422j42912n92599n34092l80649k69263m24651k7076j17236o48751k29785
3327A3033408J34857l05858l06914k16799j43847m61422l04215q1327l38311j66256
3317A0843316o1880l46352l79165j35283r3899l08069o5525k20475j54124J17838
3307I196382m8255n51962l40976m5897l55354l58528L97143K37882k96715L5919
3297G869639q2020n51266m45585K462k6946r2687n4807j41815o5330L83221K3592
$$ plain form
3286 6818458 6676258 6451552 6584549 6325083 6217979 5830058 5727363 5942725 6069685 5831548
3276 5831548 6043413 6198600 5761714 5750835 5712215 5639055 5886675 5890456 5427999 5132771
3266 5132771 5266817 5279193 5134929 5013684 5335336 5473337 5306522 5429392 5671580 5831625
3256 5831625 5360150 4980323 5151858 5387247 5299263 5231624 5335014 5370706 5328635 5411198
3246 5411198 5489417 5300997 5565843 5660486 5593558 5814217 6467723 6650423 6908208 7560554
3236 7560554 7842506 8061660 8665884 8984712 8723092 8427091 7890247 7267467 7203525 7336440
3226 7336440 6609715 6138039 6003690 5777529 5110321 5037391 5617226 5754743 5614318 5672876
3216 5672876 5843081 5943644 5982463 5954888 5637124 5565145 5476419 5245065 5429812 5564603
$$ packed form
3286F818458j42200k24706J32997k59466j07104l87921j02695K15362J26960k38137
3276E831548K11865J55187m36886j0879l8620p3160K47620L781m62457k95228
3266E132771J34046J2376j44264j21245L21652J38001j66815J22870K42188J60045
3256E831625m71475l79827J71535K35389q7984o7639J03390L5692m2071Q2563
3246E411198P8219j88420K64846R4643o6928K20659O53506J82700K57785O52346
3236G560554K81952K19154O04224L18828k61620k96001n36844o22780o3942J32915
3226G336440p26725m71676j34349k26161o67208p2930N79835J37517j40425N8558
3216E672876J70205J00563L8819k7575l17764p1979q8726k31354J84747J34791
$$ plain form
3206 5564603 5639446 5842877 5911016 5843556 6176938 6290687 6532897 6651270 6643011 6836394
3196 6836394 6739345 6709352 6789236 6883240 6971668 6995577 7055377 7760751 8072250 8184625 8322822
3185 8322822 8216005 8247609 8772978 9104055 9270769 9675612 10068556 10211262 10265840 10356350
3175 10356350 10853328 11286507 11892419 11704164 11730844 12266670 12764911 13280455 13838474 14012686
3165 14012686 14049437 13850704 14072338 14235414 14356563 15131699 15762991 15930173 16442990 16994680
3155 16994680 17233795 17583202 17963530 18579395 19185946 19802667 20268962 21003197 21930864
3146 21930864 22647563 22799766 23120795 23785249 24328407 24935529 25460233 25833720 26441605
3137 26441605 27182604 28014597 28315870 28975529 30126910 31050195 31928075 32924955 33824254
$$ packed form
3206E564603P4843K03431O8139o7460L33382J13749K42210J18373q259J93383
3196F836394r7049k9993P9884R4004Q8428K3909N9800P05374L11499J12375J38197
3185H322822j06817L1604N25369L31077J66714M04843L92944J42706N4578R0510
3175A0356350M96978M33179O05912j88255K6680N35826M98241N15544N58019J74212
3165A4012686L6751j98733K21634J63076J21149P75136O31292J67182N12817N51690
3155A6994680K39115L49407L80328O15865O06551O16721M66295P34235R27667
3146B1930864P16699J52203L21029O64454N43158O07122N24704L73487O07885
3137B6441605P40999Q31993L01273O59659J151381R23285Q77880R96880Q99299
$$ plain form
3128 33824254 35629838 36943594 38181362 39616119 41044735 42397040 43950071 45367508
3120 45367508 46870516 48933655 50929660 53005177 55150068 57875031 61263620 64330559
3112 64330559 67831922 72227462 76584899 80771167 84517749 87925449 91225312 93429159
3104 93429159 93923545 93197777 91251049 88913626 85643618 82033897 78629524 74879242
3096 74879242 71410704 68072688 64658987 61174343 57788061 54586788 51961832 49436399
3088 49436399 46937732 44481926 41877433 39170945 36717917 35047944 33741359 31511101
3080 31511101 29622048 28422510 26766360 25368625 24326921 23284445 22222070 21132804
3072 21132804 20421046 19326322 18280808 18047282 17520982 17072636 16431535 15513142 14649681
$$ packed form
3128C3824254J805584J313756J237768J434757J428616J352305J553031J417437
3120D5367508J503008K063139J996005K075517K144891K724963L388589L066939
3112F4330559L501363M395540M357437M186268L746582L407700L299863K203847
3104I3429159M94386p25768j946728k337423l270008l609721l404373l750282
3096G4879242l468538l338016l413701l484644l386282l201273k624956k525433
3088D9436399k498667k455806k604493k706488k453028j669973j306585k230258
3080C1511101j889053j199538j656150j397735j041704j042476j062375j089266
3072B1132804p11758j094724j045514k33526n26300m48346o41101r18393q63461
$$ plain form
3063 14649681 14201181 13996866 13528046 13115565 12750984 12285932 11887533 11111469 10728639
3054 10728639 10623390 10200073 9747678 9313066 9106457 8756722 8340904 8423575 8212066 8150122
3044 8150122 8284375 7797154 7313613 7120710 7281998 7213223 7209784 7122670 6464447 6090660
3034 6090660 6010391 5440774 5537106 5659675 5417009 5114982 5001530 5179443 5237237 5349742
3024 5349742 5107913 4887713 4771797 4675122 4530535 4418974 4262485 4009571 3842677 4212379
3014 4212379 4001259 3699943 3729588 3790539 3547500 3422934 3438346 3760873 3236125 3545332
3004 3545332 3387214 2911961 3312786 3525015 3214388 3021451 3150861 2659182 2316851 2631573
2994 2631573 2836639 2655033 2787050 2350292 1598247 1878643 2239669 2196910 2481032 2493546
$$ packed form
3063A4649681m48500k04315m68820m12481l64581m65052l98399p76064l82830
3054A0728639j05249m23317m52395m34612k06609l49735m15818Q2671k11509o1944
3044H150122J34253m87221m83541j92903J61288o8775l439q7114o58223l73787
3034F090660q0269n69617R6332J22569k42666l02027j13452J77913N7794J12505
3024E349742k41829k20200j15916r6675j44587j11561j56489k52914j66894L69702
3014D212379k11120l01316K9645O0951k43039j24566J5412L22527n24748L09207
3004C545332j58118m75253M00825K12229l10627j92937J29410m91679l42331L14722
2994B631573K05066j81606J32017m36758p52045K80396L61026m2759K84122J2514
$$ plain form
2984 2493546 2479367 2116368 2051054 1986553 2296120 2418872 1964997 1575284 1978271 2307847
2974 2307847 2371834 2377435 1888511 1731435 2224463 1883806 1734616 1833312 1755371 1550573
2964 1550573 1422665 1785925 1668490 1624794 1737813 1671266 1477680 1506255 1531911 1418137
2954 1418137 1720998 2031434 2070919 1436754 1406396 1434650 1548284 1807614 1796476 1385723
2944 1385723 1568740 1870308 1888089 2059087 1954006 1660675 1457870 1819483 1756089 1770499
2934 1770499 1925574 1776283 1443279 1737670 1972531 1581247 1682552 1533970 1391583 1625927
2924 1625927 1871578 1791082 1441902 1573376 1863032 2101446 1777917 1676432 1868957 1812916
2914 1812916 1763076 1678425 1623310 1848740 1834537 1534821 1277731 1566078 2094863 2038917
$$ packed form
2984B493546j4179l62999o5314o4501L09567J22752m53875l89713M02987L29576
2974B307847O3987N601m88924j57076M93028l40657j49190R8696p7941k04798
2964A550573j27908L63260j17435m3696J13019o6547j93586K8575K5656j13774
2954A418137L02861L10436L9485o34165l0358K8254J13634K59330j1138m10753
2944A385723J83017L01568J7781J70998j05081k93331k02805L61613o3394J4410
2934A770499J55075j49291l33004K94391K34861l91284J01305j48582j42387K34344
2924A625927K45651q0496l49180J31474K89656K38414l23529j01485J92525n6041
2914A812916m9840q4651n5115K25430j4203k99716k57090K88347N28785n5946
$$ plain form
2904 2038917 2224685 2661742 2432052 2131835 1927823 2141369 2123977 2247565 2256699 1647713
2894 1647713 1806871 2041214 1725488 1637035 2213886 2329779 2455769 2850227 2837402 2705956
2884 2705956 2815186 2895367 2309777 2570134 3554935 3548549 3145905 2967115 2926353 2840359
2874 2840359 3278383 3689016 3809966 4361088 4070572 3558137 3306036 4001507 4437221 4575491
2864 4575491 4444809 3738810 3469439 4069197 4242990 4552760 5368776 5435151 5129486 4935870
2854 4935870 5441085 5893145 5877899 5992862 6021286 6017528 6213420 6350200 6718358 7669757
2844 7669757 8116460 8013140 8122804 8321160 8432630 8672523 9134175 9605194 9776379 10148559
2834 10148559 10609548 11564597 12649673 13010924 13197629 13764636 14447529 15281860 16898009
$$ packed form
2904B038917J85768M37057k29690l00217k04012K13546j7392J23588R134o08986
2894A647713J59158K34343l15726q8453N76851J15893J25990L94458j2825j31446
2884B705956J09230Q0181n85590K60357R84801o386m02644j78790m0762q5994
2874B840359M38024M10633J20950N51122k90516n12435k52101O95471M35714J38270
2864D575491j30682p05999k69371N99758J73793L09770Q16016O6375l05665j93616
2854D935870N05215M52060j5246J14963K8424l758J95892J36780L68158R51399
2844G669757M46703j03320J09664J98356J11470K39893M61652M71019J71185L72180
2834A0148559M60989R55049J085076L61251J86705N67007O82893Q34331J616149
$$ plain form
2825 16898009 17756197 18123699 19332116 21460818 22990681 24419663 26429641 27800770
2817 27800770 29151587 31170779 32665190 33346575 34057451 34557898 34604100 34897875 34966847
2808 34966847 34815583 35264293 35812818 35899497 35874713 36524237 37204400 37323393 38565103 40005765
2798 40005765 40607533 41494552 43094140 44779221 47009864 49728692 52844854 56417307
2790 56417307 61348985 65474852 67150316 65776657 61749426 56458400 51460721 46884993
2782 46884993 43152658 40190218 37734120 35785277 34210891 33444101 32419498 31057271
2774 31057271 30035231 29389957 28959269 28800278 28457962 28370131 28515772 28470452 28741164 29783206
2764 29783206 30582703 30799581 31147953 30747622 29554644 29081639 27592759 25381001 23498679
$$ packed form
2825A6898009Q58188L67502J208417K128702J529863J428982K009978J371129
2817B7800770J350817K019192J494411O81385P10876N00447M6202K93775O8972
2808C4966847j51264M48710N48525Q6679k4784O49524O80163J18993J241710J440662
2798D0005765O01768Q87019J599588J685081K230643K718828L116162L572453
2790E6417307M931678M125867J675464j373659m027231n291026m997679m575728
2782D6884993l732335k962440k456098j948843j574386p66790j024603j362227
2774C1057271j022040o45274m30688j58991l42316q7831J45641m5320K70712J042042
2764B9783206P99497K16878L48372m00331j192978m73005j488880k211758j882322
$$ plain form
2755 23498679 22112967 20439494 19018732 18255261 16641991 15795362 15743940 14973898 13842943
2746 13842943 12978680 12218623 11329000 10600303 9929864 9298341 9065828 8917778 8574350
2737 8574350 7866619 7556838 7765894 7491090 7319597 7362056 7087804 6254760 5769587 5470360
2727 5470360 5157449 5516224 5717135 4758584 4666654 5000588 4823217 4560557 4740465 4800440
2717 4800440 4234246 4208253 4120344 3639651 3766785 3875383 3557505 3478694 3640573 3109216
2707 3109216 2777869 2799076 2847242 2941233 3050056 2964531 2563692 2473511 2727434 2660731 2261080
2696 2261080 2159158 2304180 2500331 2370518 2661867 1925528 1438641 1755093 2097245 1877246
2686 1877246 1950793 1923477 1662596 1448109 1632857 1722734 2203674 2395598 1986300 1264016
$$ packed form
2755B3498679j385712j673473j420762p63471j613270q46629n1422p70042j130955
2746A3842943q64263p60057q89623p28697o70439o31523k32513j48050l43428
2737H574350p07731l09781K09056k74804j71493M2459k74252q33044m85173k99227
2727E470360l12911L58775K00911r58551r1930L33934j77371k62660J79908N9975
2717D800440n66194k5993q7909m80693J27134J08598l17878p8811J61879n31357
2707C109216l31347K1207M8166R3991J08823q5525m00839r0181K53923o6703l99651
2696B261080j01922J45022J96151j29813K91349p36339m86887L16452L42152k19999
2686A877246P3547k7316k60881k14487J84748Q9877M80940J91924m09298p22284
$$ plain form
2676 1264016 1300700 1685574 1562709 1654152 2000063 1756593 1381549 1169482 855307 950699
2666 950699 884523 1098574 1110155 1328626 1322252 1399508 1121873 1063867 1212476 1501885 1208144
2655 1208144 779772 801875 920770 767369 779460 818994 682073 934280 1171207 1083480
2645 1083480 1013610 1125357 1420287 1466013 1064657 838618 788978 704419 703405 216082 507496
2634 507496 666430 834497 827555 904951 1270039 1190050 878212 524017 67938 232944
2624 232944 619291 802752 802660 689816 571695 475912 682067 776594 735669 638731 853086
2613 853086 565782 387359 687342 878252 772582 961486 811704 397797 417768 514797
2603 514797 515378 501763 405403 579879 470668 561720 800216 932605 1015706 1004564 877691
$$ packed form
2676A264016L6684L84874j22865R1443L45911k43470l75044k12067l14175R5392
2666I50699o6176K14051J1581K18471o374P7256k77635n8006J48609K89409k93741
2655A208144m28372K2103J18895j53401J2091L9534j36921K52207K36927q7727
2645A083480o9870J11747K94930M5726m01356k26039m9640q4559j014m87323K91414
2634E07496J58934J68067o942P7396L65088p9989l11838l54195m56079J65006
2624B32944L86347J83461r2j12844j18121r5783K06155R4527m0925r6938K14355
2613H53086k87304j78423K99983J90910j05670J88904j49782m13907J9971R7029
2603E14797N81j3615r6360J74476j09211R1052K38496J32389Q3101j1142j26873
$$ plain form
2592 877691 873114 960633 639381 140827 473340 588520 442544 399001 706620 916463
2582 916463 790846 928517 526195 45395 215913 837853 729477 655289 656457 580159
2572 580159 756487 647093 632649 772279 562538 -26274 -73988 177651 309283 462784
2562 462784 777508 795008 893669 770295 218156 58022 457572 771287 786195 968499
2552 968499 692903 591616 615355 725764 483041 588974 713909 675506 575063 580550
2542 580550 579097 883110 972332 467946 595998 731325 805689 532569 565928 522101 741753
2531 741753 959038 806929 606121 595338 889610 928586 321076 -76647 107813 514058
2521 514058 881251 1113299 1083649 801736 690138 757606 421605 817899 1144015 224884
$$ packed form
2592H77691m577Q7519l21252m98554L32513J15180j45976m3543L07619K09843
2582I16463j25617J37671m02322m80800J70518O21940j08376p4188J168p6298
2572E80159J76328j09394j4444J39630k09741n88812m7714K51639J31632J53501
2562D62784L14724J7500R8661j23374n52139j60134L99550L13715J4908J82304
2552I68499k75596j01287K3739J10409k42723J05933J24935l8403j00443N487
2542E80550j453L04013Q9222n04386J28052J35327P4364k73120L3359m3827K19652
2531G41753K17285j52109k00808j0783K94272L8976o07510l97723J84460M06245
2521E14058L67193K32048k9650k81913j11598O7468l36001L96294L26116r19131
$$ plain form
2511 224884 -229356 -213870 -106450 233429 51943 191618 787094 1101765 625785 472481
2501 472481 471118 470409 542065 656889 381547 205906 307416 134884 -8181 398553 916109
2490 916109 567485 713964 885468 455560 11722 -127906 157240 542893 931153 863005
2480 863005 297086 369657 173524 200805 800642 496107 210294 232363 79195 -100772
2470 -100772 -137527 401174 771280 344243 226036 288708 60462 255146 710924 1129390
2460 1129390 678132 502597 618134 179255 101321 354996 578021 623768 491518 298104
2450 298104 371754 647530 527004 421222 535501 -6122 -365629 -30763 119838 283568
2440 283568 282276 613480 237762 181915 537667 265746 388601 539653 224068 518226
$$ packed form
2511B24884m54240J5486J07420L39879j81486J39675N95476L14671m75980j53304
2501D72481j363p09P1656J14824k75342j75641J01510j72532j43065M06734N17556
2490I16109l48624J46479J71504m29908m43838j39628K85146L85653L88260o8148
2480H63005n65919P2571j96133K7281N99837l04535k85813K2069j53168j79967
2470a00772l6755N38701L70106m27037j18207O2672k28246J94684M55778M18466
2460A129390m51258j75535J15537m38879p7934K53675K23025M5747j32250j93414
2450B98104P3650K75776j20526j05782J14279n41623l59507L34866J50601J63730
2440B83568j292L31204l75718n5847L55752k71921J22855J51052l15585K94158
$$ plain form
2430 518226 199827 -86050 -95210 51152 12178 255041 453636 216096 126684 895769
2420 895769 835659 615787 723430 305326 340317 373681 -80427 -363518 70775 372195
2410 372195 299141 159944 245540 25227 67572 235210 297685 626522 499198 22936
2400 22936 -98711 68996 267730 -81341 -15498 89667 233337 743481 999240 842058
2390 842058 513345 323476 119049 -113361 -73984 144428 220455 343270 105661 174135
2380 174135 166233 200452 368763 451338 373122 76387 -23097 -239779 -88952 151129 725510
2369 725510 546930 -36152 -69410 -37042 75873 -36643 157296 335651 115057 88177
2359 88177 -204121 -41360 350791 425582 63062 294977 484731 415740 342829 618076
$$ packed form
2430E18226l18399k85877r160J46362l8974K42863J98595k37540q9412P69085
2420H95769o0110k19872J07643m18104L4991L3364m54108k83091M34293L01420
2410C72195p3054j39197Q5596k20313M2345J67638O2475L28837j27324m76262
2400B2936j21647J67707J98734l49071O5843J05165J43670N10144K55759j57182
2390H42058l28713j89869k04427k32410L9377K18412P6027J22815k37609O8474
2380A74135p902L4219J68311Q2575p8216k96735r9484k16682J50827K40081N74381
2369G25510j78580n83082l3258L2368J12915j12516J93939J78355k20594k6880
2359H8177k92298J62761L92151P4791l62520K31915J89754o8991p2911K75247
$$ plain form
2349 618076 237070 115488 219115 210159 41084 -52949 -222175 -232958 218997 466178
2339 466178 260163 524775 557311 410434 269891 35075 252259 390207 529590 382039
2329 382039 234058 89677 -181850 50921 666357 521728 672836 324358 -68720 517721
2319 517721 404489 151516 171161 467341 88925 -202664 223726 197391 454803 811648
2309 811648 979448 1131980 1086074 1269623 1144157 1009789 1101234 606694 355720 48423
2299 48423 -37954 447538 624444 622382 473722 475760 620509 331811 703122 723034 150463
2288 150463 -74806 -118411 318484 486506 401659 580874 415346 362376 193416 316395
2278 316395 383407 539411 511672 365379 339647 395195 80883 46160 37877 -77607 333722
$$ packed form
2349F18076l81006j21582J03627q956j69075r4033j69226j0783M51955K47181
2339D66178k06015K64612L2536j46877j40543k34816K17184J37948J39383j47551
2329C82039j47981j44381k71527K32771O15436j44629J51108l48478l93078N86441
2319E17721j13232k52973J9645K96180l78416k91589M26390k6335K57412L56845
2309H11648J67800J52532m5906J83549j25466j34368R1445m94540k50974l07297
2299D8423q6377M85492J76906k062j48660K038J44749k88698L71311J9912n72571
2288A50463k25269m3605M36895J68022q4847J79215j65528n2970j68960J22979
2278C16395O7012J56004k7739j46293k5732N5548l14312l4723q283j15484M11329
$$ plain form
2267 333722 439583 323511 385001 698082 662905 370484 166634 49833 276635 144491
2257 144491 -24796 226742 426250 436172 430610 410869 313078 -287947 -81087 -10948 10399
2246 10399 148040 382677 453232 391558 809709 801479 505474 473029 456045 94675 325546
2235 325546 278910 386032 370994 127552 134566 441754 935678 878242 634492 619106 413855
2224 413855 484903 330212 527886 421192 358145 180267 276496 639577 684674 750476 959340
2213 959340 626040 580071 482460 180256 84022 110111 693626 777747 830733 713029 1089825
2202 1089825 1343235 1267534 767751 525745 317186 354523 641539 496933 345634 365222
2192 365222 707492 947565 1098134 1145378 1156166 1256968 558183 646701 1056172 816800
$$ packed form
2267C33722J05861j16072O1490L13081l5177k92421k03850j16801K26802j32144
2257A44491j69287K51538J99508R922n562j9741r7791o01025K06860P0139K1347
2246A0399J37641K34637P0555o1674M18151q230k96005l2445j6984l61370K30871
2235C25546m6636J07122j5038k43442P014L07188M93924n7436k43750j5386k05251
2224D13855P1048j54691J97674j06694o3047j77878R6229L63081M5097O5802K08864
2213I59340l33300m5969r7611l02204r6234K6089N83515Q4121N2986j17704L76796
2202A089825K53410p5701m99783k42006k08559L7337K87016j44606j51299J9588
2192C65222L42270K40073J50569M7244J0788J00802o98785Q8518M09471k39372
$$ plain form
2182 816800 762447 710506 460431 321514 233673 263050 409564 1025827 1553404 1272953
2172 1272953 1052360 816259 961029 1281241 961494 653652 481140 402518 202340 192445
2162 192445 586322 1370289 1555554 1123091 919707 1265967 1520099 1302731 752878 935912
2152 935912 1108658 620731 614102 825878 1266585 1498253 1316687 1441322 1554692 1347369
2142 1347369 1543388 1717500 1472851 1499614 1811597 2271876 2458592 2471567 2481086 1807113
2132 1807113 1800033 2068754 2480244 2777554 2742912 2137432 1965176 2280905 3011200 3293123
2122 3293123 3793629 3936700 3608718 3475686 3430003 3705421 3772019 3893312 3952877 3671288
2112 3671288 3606985 3823372 4454500 4627960 4617773 4778938 4835708 5015394 5711333 5665376
$$ packed form
2182H16800n4353n1941k50075j38917q7841K9377J46514O16263N27577k80451
2172A272953k20593k36101J44770L20212l19747l07842j72512p8622k00178r895
2162A92445L93877P83967J85265m32463k03384L46260K54132k17368n49853J83034
2152I35912J72746m87927o629K11776M40707K31668j81566J24635J13370k07323
2142A347369J96019J74112k44649K6763L11983M60279J86716J2975R519o73973
2132A807113p080K68721M11490K97310l4642o05480j72256L15729P30295K81923
2122C293123N00506J43071l27982j33032m5683K75418O6598J21293N9565k81589
2112C671288o4303K16387O31128J73460j0187J61165N6770J79686O95939m5957
$$ plain form
2102 5665376 5524013 5532001 5657621 5999044 6693246 7105277 7585925 8031894 8385695 8890179
2092 8890179 9843139 10643572 11141481 11783457 12023866 12723766 13695871 14768040 15852394
2083 15852394 16933054 18590014 19878409 21434490 24016405 26598108 29320376 32199631
2075 32199631 35164785 37936607 42134035 47518632 53251017 60111698 68757122 80117003
2067 80117003 95630983 115942577 133067116 135083147 126126260 106918513 85678662
2060 85678662 69928175 58014024 49464614 42723238 37432540 33921000 31425592 28725582
2052 28725582 26483662 24623096 22736611 20946597 18972113 17132868 15544693 14843749
2044 14843749 14044769 12788733 12474404 12344711 11953734 11208440 10590326 10234378 9849292
$$ packed form
2102E665376j41363P988J25620L41423O94202M12031M80648M45969L53801N04484
2092H890179R52960Q00433M97909O41976K40409O99900R72105J072169J084354
2083A5852394J080660J656960J288395J556081K581915K581703K722268K879255
2075C2199631K965154K771822M197428N384597N732385O860681Q645424J1359881
2067H0117003J5513980K0311594J7124539K016031q956887j9207747k1239851
2060H5678662j5750487j1914151q549410o741376n290698l511540k495408k700010
2052B8725582k241920j860566j886485j790014j974484j839245j588175p00944
2044A4843749p98980j256036l14329j29693l90977p45294o18114l55948l85086
$$ plain form
2035 9849292 9190677 8562347 8135859 8107993 7907217 7620932 7249519 7131272 6722392 6495978
2025 6495978 6815049 6480491 6184906 6093577 5617560 5470224 5408947 5015826 4433790 3712771
2015 3712771 3899655 4038850 3739060 3888160 4098057 4122410 3944483 3932938 3448349 3279722
2005 3279722 3281413 3133665 3149374 3300513 3218644 2879501 3200231 3141324 2716859 2728767 2445118
1994 2445118 2400679 2572972 2333106 2230905 2520966 2168832 2309355 2576915 2396540 2306284
1984 2306284 2211640 2382392 2123497 1637801 1756671 1682880 1707810 1980701 2013420 1615206
1974 1615206 1270786 1184851 1374062 1471788 1486350 1622232 1691630 1468934 1392372 1239004
1964 1239004 1452519 1173364 1059517 1254412 935245 676774 618734 922140 1008979 803496
$$ packed form
2035I849292o58615o28330m26488k7866k00776k86285l71413j18247m08880k26414
2025F495978L19071l34558k95585r1329m76017j47336o1277l93121n82036p21019
2015C712771J86884J39195k99790J49100K09897K4353j77927j1545m84589j68627
2005C279722J691j47748J5709J51139q1869l39143L20730n8907m24465J1908k83649
1994B445118m4439J72293k39866j02201K90061l52134J40523K67560j80375r0256
1984B306284r4644J70752k58895m85696J18870p3791K4930K72891L2719l98214
1974A615206l44420q5935J89211R7726J4562J35882O9398k22696p6562j53368
1964A239004K13515k79155j13847J94895l19167k58471n8040L03406Q6839k05483
$$ plain form
1954 803496 726538 1021730 445439 952258 1119378 890035 1238881 1294805 1198370 1221144
1944 1221144 1248959 971839 736654 1203305 832388 408940 693237 591183 -51778 292686
1934 292686 882624 753474 595409 702686 597779 619133 640655 767433 697581 394918
1924 394918 580769 337315 407801 848771 194956 -5243 621816 537542 485319 410144
1914 410144 612312 600744 554358 898494 500776 255952 902605 416152 656827 827138
1904 827138 577171 450342 346930 657382 908502 609765 533016 445804 75997 371018
1894 371018 386813 337606 593255 442752 191857 301128 119145 288767 500170 410657
1884 410657 582871 364521 260948 510485 314675 776057 785681 357007 402367 109028
$$ packed form
1954H03496p6958K95192n76291N06819J67120k29343L48846N5924r6435K2774
1944A221144K7815k77120k35185M66651l70917m23448K84297j02054o42961L44464
1934B92686N89938j29150j58065J07277j04907K1354K1522J26778o9852l02663
1924C94918J85851k43454P0486M40970o53815k00199O27059q4274n2223p5175
1914D10144K02168j1568m6386L44136l97718k44824O46653m86453K40675J70311
1904H27138k49967j26829j03412L10452K51120k98737p6749q7212l69807K95021
1894C71018J5795m9207K55649j50503k50895J09271j81983J69622K11403q9513
1884D10657J72214k18350j03573K49537j95810M61382R624m28674M5360k93339
$$ plain form
1874 109028 5810 365997 544468 537821 320596 298576 131850 -49288 478669 248430
1864 248430 61716 315309 314606 65127 208852 255349 410661 766595 835373 260668 223434
1853 223434 290049 310013 140179 438210 587931 199457 157841 -90727 46492 669067
1843 669067 482285 437002 914644 820894 615953 187013 81103 511478 572103 416397
1833 416397 292689 74117 335458 283506 294010 558222 796264 705330 442905 297543
1823 297543 574052 657158 669993 839087 488023 327337 599018 120547 64161 198282
1813 198282 62506 273812 302149 197215 99300 330124 377602 166590 214893 533500
1803 533500 57266 -10006 312629 100685 137726 -97696 -112463 -92656 -211158 17860
$$ packed form
1874A09028j03218L60187J78471o647k17225k2020j66726j81138N27957k30239
1864B48430j86714K53593p03k49479J43725M6497J55312L55934O8778n74705l7234
1853B23434O6615J9964j69834K98031J49721l88474m1616k48568J37219O22575
1843F69067j86782m5283M77642r3750k04941m28940j05910M30375O0625j55706
1833D16397j23708k18572K61341n1952J0504K64212K38042r0934k62425j45362
1823B97543K76509Q3106J2835J69094l51064j60686K71681m78471n6386J34121
1813A98282j35776K11306K8337j04934r7915K30824M7478k11012M8303L18607
1803E33500m76234o7272L22635k11944L7041k35422j4767J9807j18502K29018
$$ plain form
1793 17860 201805 17278 65069 -86337 -97334 246891 347874 256043 378860 40956
1783 40956 350689 146424 -121507 69683 148033 215842 83931 -213425 -69248 -169014
1773 -169014 -127037 285522 18763 -105187 -472720 -637996 26686 37650 120195 310350
1763 310350 -176955 -297886 -238480 35979 249992 178937 341540 221251 160081 201214
1753 201214 -33563 -58296 393583 501058 -117030 -22101 76356 633040 750874 535120
1743 535120 619602 121107 5044 -17174 -67784 -26006 62889 -97775 -354917 107861 361988
1732 361988 568865 -100240 -157638 -102258 -92963 -85588 -446083 -516011 -231787 26131 411504
1721 411504 368985 416848 539307 187753 285960 473427 300202 -65043 -318637 -217727
$$ packed form
1793A7860J83945j84527M7791j51406j0997L44225J00983r1831J22817l37904
1783D0956L09733k04265k67931J91190P8350O7809j31911k97356J44177r9766
1773a69014M1977M12559k66759j23950l67533j65276O64682J0964Q2545J90155
1763C10350m87305j20931N9406K74459K14013p1055J62603j20289o1170M1133
1753B01214k34777k4733M51879J07475o18088R4929R8457N56684J17834k15754
1743E35120Q4482m98495j16063k2218n0610M1778Q8895j60664k57142M62778K54127
1732C61988K06877o69105n7398N5380R295P375l60495o9928K84224K57918L85373
1721D11504m2519M7863J22459l51554R8207J87467j73225l65245k53594J00910
$$ plain form
1711 -217727 95543 16747 8947 -29123 83030 393604 76619 -92198 -75498 117968 32250
1700 32250 2326 -357282 -403435 206379 306807 264637 243321 153297 -205232 -104758 335641
1689 335641 560263 311895 117101 -351063 -220118 304846 420617 244406 -110841 -447594
1679 -447594 -64860 -6042 -77192 -91593 396134 475387 -112470 -325639 -185772 -320972
1669 -320972 -187862 58985 31687 271831 156154 -193058 -324153 80017 272495 96087
1659 96087 333102 470642 232730 -8287 -315746 -550794 -343034 145325 -144625 -257264
1649 -257264 -195240 -170073 -116642 234549 494944 495064 501594 -19967 -393799 -165585 136877
1638 136877 330975 360499 351380 38758 -207478 -129762 -86053 -239508 -355190 -11286 50171
$$ packed form
1711b17727L13270p8796p800l8070J12153L10574l16985j68817J6700J93466q5718
1700C2250k9924l59608m6153O09814J00428m2170k1316r0024l58529J00474M40399
1689C35641K24622k48368j94794m68164J30945N24964J15771j76211l55247l36753
1679d47594L82734N8818p1150j4401M87727P9253n87857k13169J39867j35200
1669c20972J33110K46847k7298K40144j15677l49212j31095M04170J92478j76408
1659I6087K37015J37540k37912k41017l07459k35048K07760M88359k89950j12639
1649b57264O2024K5167N3431L51191K60395J20O530n21561l73832K28214L02462
1638A36877J94098K9524r119l12622k46236P7716M3709j53455j15682L43904O1457
$$ plain form
1627 50171 -67583 -29709 54764 288098 140120 -241674 -81642 132642 -158635 -49134
1617 -49134 34715 -153806 -77208 328150 319860 157867 335908 361266 227573 135707 475433
1606 475433 412667 -4707 -95465 -225698 -168977 349327 176187 -164536 179423 368768
1596 368768 135659 249282 361591 32049 -114801 -63559 -434270 -571143 128986 196500
1586 196500 -135133 -12966 -68311 -751295 -289929 141923 -77443 285983 433924 -80418
1576 -80418 -146046 360229 258550 229338 167487 -238453 -446309 -143711 -2162 309101
1566 309101 600556 389257 148661 164088 -195540 -219376 195054 442731 177743 -86988
1556 -86988 150228 99728 -162244 1708 -26437 -212709 -155734 -273091 -262760 125418 288169
$$ packed form
1627E0171j17754L7874Q4473K33334j47978l81794J60032K14284k91277J09501
1617d9134Q3849j88521P6598M05358q290j61993J78041K5358j33693r1866L39726
1606D75433o2766m17374r0758j30233N6721N18304j73140l40723L43959J89345
1596C68768k33109J13623J12309l29542j46850N1242l70711j36873P00129O7514
1586A96500l31633J22167n5345o82984M61366M31852k19366L63426J47941n14342
1576h0418o5628N06275j01679k9212o1851m05940k07856L02598J41549L11263
1566C09101K91455k11299k40596J5427l59628k3836M14430K47677k64988k64731
1556h6988K37216n0500k61972J63952k8145j86272N6975j17357J0331L88178J62751
$$ plain form
1545 288169 270038 -106784 -288802 46999 347127 85597 116864 42207 125415 501258
1535 501258 13882 -34756 200613 118601 -151335 33552 328361 261418 -223952 -193581
1525 -193581 -218909 83380 339677 -133399 -490501 -477036 -428865 -50455 47198 -36583 495880
1514 495880 337402 -128622 -185066 47195 96613 357400 452606 188513 -17029 -73182
1504 -73182 -244257 -263817 351178 292004 -268149 -559733 -567667 -220909 403277 716150 517126
1493 517126 103976 -34979 -278977 -418409 -85923 -25392 -198978 101132 3589 -418141
1483 -418141 -322275 -204571 46188 236807 246779 226846 220435 190159 -310109 -334321 113398
1472 113398 103414 -195398 -179208 211812 277981 -90273 -286800 -71267 354125 465164
$$ packed form
1545B88169j8131l76822j82018L35801L00128k61530L1267p4657Q3208L75843
1535E01258m87376m8638K35369q2012k69936J84887K94809o6943m85370L0371
1525a93581k5328L02289K56297m73076l57102J3465M8171L78410R7653q3781N32463
1514D95880j58478m66024n6444K32261M9418K60787R5206k64093k05542n6153
1504g3182j71075j9560O14995n9174n60153k91584p934L46758O24186L12873j99024
1493E17126m13150j38955k43998j39432L32486O0531j73586L00110r7543m21730
1483d18141R5866J17704K50759J90619R972j9933o411l0276n00268k4212M47719
1472A13398r984k98812J6190L91020O6169l68254j96527K15533M25392J11039
$$ plain form
1462 465164 221873 -163367 -207034 -373311 -508807 -19065 -98224 -16744 -160298 -466839
1452 -466839 -388170 -41040 -140466 -77325 -84113 -48203 -102478 -268445 -259025 -113373 263250
1441 263250 131202 154665 149062 42303 -71855 103657 81504 78362 159725 -114659 -143983
1430 -143983 -166896 -247241 125079 466032 467696 676391 773161 40411 -22567 -296372 -423261
1419 -423261 -356043 -273888 -185321 -475082 -462492 -261779 98162 469411 517509 394218 468617
1408 468617 -250889 -315054 -372167 -265209 -114728 141749 172128 106294 -121302 -296715
1398 -296715 -274887 178482 82564 -116078 -198025 -426013 -373950 -288389 -65518 101565 473693
1387 473693 542857 -74014 -215645 -101317 -126784 5191 -74587 -33989 -189691 -265173 -330307
$$ packed form
1462D65164k43291l85240m3667j66277j35496M89742p9159Q1480j43554l06541
1452d66839P8669L47130r9426O3141o788L5910n4275j65967R420J45652L76623
1441B63250j32048K3463n603j06759j14158J75512k2153l142Q1363k74384k9324
1430a43983k2913q0345L72320L40953J664K08695R6770p32750o2978k73805j26889
1419d23261O7218Q2155Q8567k89761J2590K00713L59941L71249M8098j23291P4399
1408D68617p19506o4165n7113J06958J50481K56477L0379o5834k27596j75413
1398b96715K1828M53369r5918j98642q1947k27988N2063Q5561K22871J67083L72128
1387D73693O9164o16871j41631J14328k5467J31975p9778M0598j55702p5482o5134
$$ plain form
1376 -330307 -422778 -148897 245271 31263 -71997 -61532 69239 -34339 118829 73119
1366 73119 -36971 -22714 190432 -93072 113256 233241 -33319 85610 79462 -40057
1356 -40057 -6400 207590 78348 -433076 -178640 166126 276763 20222 139668 128421
1346 128421 -329544 -322002 -428718 -505576 -349467 -346411 -319518 -469514 -236820 2445 -152412
1335 -152412 177042 251393 -41228 140752 -245043 -509588 -318922 50912 61949 -194762
1325 -194762 -103896 -8650 -197522 175561 304570 -2966 140285 116836 -183623 -223738
1315 -223738 313322 281426 325487 129248 -136761 -224574 -222452 -227711 -381931 -478225 -330252
1304 -330252 -688839 -516712 -164959 -191493 66291 259718 -200741 -295289 -46452 350811
$$ packed form
1376c30307r2471K73881L94168k14008j03260J0465J30771j03578J53168m5710
1366G3119j10090J4257K13146k83504K06328J19985k66560J18929o148j19519
1356d0057L3657K13990j29242n11424K54436L44766J10637k56541J19446j1247
1346A28421m57965P542j06716p6858J56109L056K6893j49996K32694K39265j54857
1335a52412L29454P4351k92621J81980l85795k64545J90666L69834J1037k56711
1325a94762R0866R5246j88872L73083J29009l07536J43251k3449l00459m0115
1315b23738N37060l1896M4061j96239k66009q7813K122n259j54220r6294J47973
1304c30252l58587J72127L51753k6534K57784J93427m60459r4548K48837L97263
$$ plain form
1294 350811 64520 -71485 -135879 -148116 69771 55721 -485803 -819409 -532793 -321969
1284 -321969 -448358 13599 490905 588547 262550 -23622 -235607 279543 170463 -284552
1274 -284552 -407562 -59156 -230435 -588041 -325546 -118304 370667 383461 -230274 -837260
1264 -837260 -338556 209610 137835 130370 149976 -248336 -467573 -455176 -473674 -291134 -48109
1253 -48109 -238086 -297745 -284194 -60957 12874 225720 -171379 -272855 304292 147299
1243 147299 -187193 82838 382677 314984 388854 55770 -767341 -359731 1985 -178598
1233 -178598 -62716 392798 355459 -68923 -253684 214446 249946 58385 80875 -328639
1223 -328639 -425710 -108590 -124267 -50710 138440 80252 -243126 -399781 -69240 -3709 641029
$$ packed form
1294C50811k86291j36005o4394j2237K17887j4050n41524l33606K86616K10824
1284c21969j26389M61957M77306R7642l25997k86172k11985N15150j09080m55015
1274b84552j23010L48406j71279l57606K62495K07242M88971J2794o13735o06986
1264h37260M98704N48166p1775p465J9606l98312k19237J2397j8498J82540K43025
1253d8109j89977n9659J3551K23237P3831K12846l97099j01476N77147j56993
1243A47299l34492K70031K99839o7693P3870l33084q23111M07610L61716j80583
1233a78598J15882M55514l7339m24382j84761M68130L5500j91561K2490m09514
1223c28639r7071L17120j5677P3557J89150n8188l23378j56655L30541O5531O44738
$$ plain form
1212 641029 999943 296655 -199430 -352718 -448837 -366895 -135037 -52309 106684 -34282
1202 -34282 -449088 -313843 306139 286525 19998 70590 -169438 -373033 -246800 -9918
1192 -9918 -74551 48996 390897 286260 20806 -233774 -372796 -416844 1591 472604
1182 472604 212852 -27103 -42406 -483068 -291071 43286 66978 310415 327240 -89540
1172 -89540 -331627 -121102 -96811 -77211 158771 91960 -183932 -426099 -339146 -331799 -100256
1161 -100256 469961 317289 154287 -312663 -491319 -331784 -38137 -124247 -329364 125020
1151 125020 305586 399361 109324 51532 -85093 -198976 13426 134206 313014 -23228
1141 -23228 -340425 -367477 -200523 8572 84427 -7395 -341673 -593666 -533550 -272316 -514581
$$ packed form
1212F41029L58914p03288m96085j53288r6119Q1942K31858Q2728J58993j40966
1202c4282m14806J35245O19982j9614k66527N0592k40028k03595J26233K36882
1192i918o4633J23547L41901j04637k65454k54580j39022m4048M18435M71013
1182D72604k59752k39955j5303m40662J91997L34357K3692K43437J6825m16780
1172h9540k42087K10525K4291J9600K35982o6811k75892k42167Q6953P347K31543
1161a00256N70217j52672j63002m66950j78656J59535K93647q6110k05117M54384
1151A25020J80566R3775k90037n7792j36625j13883K12402J20780J78808l36242
1141b3228l17197k7052J66954K09095P5855r1822l34278k51993O0116K61234k42265
$$ plain form
1130 -514581 85394 404761 177387 45252 -314109 -269835 -140632 506701 310997 16581
1120 16581 -177307 -454972 -633110 -431658 -106036 -62922 -103610 -153242 -308403 -262236 345906
1109 345906 351377 63740 -167006 -87257 -68554 -67251 -13589 -160776 60009 32323 -148804
1098 -148804 -446127 -193659 235364 291837 44747 122899 -46415 -22503 -8743 191670
1088 191670 529990 535659 178495 -386274 -263698 383945 435988 -195917 -603338 -643311
1078 -643311 -406751 -335952 -389 106029 11079 347897 145972 -248641 128772 560489
1068 560489 165153 -496145 -419220 -544350 -599407 -142812 -62006 -70825 544237 409254 4586
1057 4586 -113039 311878 512782 -178602 -236216 -206384 -238503 -89653 -360181 -769681 -713508
$$ packed form
1130e14581N99975L19367k27374j32135l59361M4274J29203O47333j95704k94416
1120A6581j93888k77665j78138K01452L25622M3114m0688m9632j55161M6167O08142
1109C45906N471k87637k30746P9749J8703J303N3662j47187K20785k7686j81127
1098a48804k97323K52468M29023N6473k47090P8152j69314K3912J3760K00413
1088A91670L38320N669l57164n64769J22576O47643N2043o31905m07421l9973
1078f43311K36560P0799L35563J06418r4950L36818k01925l94613L77413M31717
1068E60489l95336o61298P6925j25130n5057M56595Q0806q819O15062j34983m04668
1057D586j17625M24917K00904o91384n7614K9832l2119J48850k70528m09500N6173
$$ plain form
1046 -713508 -306063 -110098 -90679 36677 88889 -74864 -312492 -180568 120630 434547
1036 434547 515065 -72561 -401886 -149864 -153166 -192341 -256042 -446145 -296408 -320140 80007
1025 80007 138131 298611 616023 621171 469311 326322 -5397 69904 -94688 -488803 -219319
1014 -219319 -463834 -578275 -323313 -283644 34500 464335 276575 131002 -127537 60285
1004 60285 -303777 -667426 -261241 62036 -151671 -275987 -30985 -292062 -101781 359458
994 359458 359246 444146 90260 -65611 -56464 64951 216459 -107494 -296354 -397641 -155889
983 -155889 -55130 43183 154297 1007 -239294 -79446 20697 -17416 -195574 -405965
973 -405965 -592189 -159840 76763 -373988 -676874 -143363 176241 -401338 -517004 -310690
$$ packed form
1046g13508M07445J95965J9419J27356N2212j63753k37628J31924L01198L13917
1036D34547Q0518n87626l29325K52022l302l9175o3701j90103J49737k3732M00147
1025H0007N8124J60480L17412N148j51860j42989l31719P5301j64592l94115K69484
1014b19319k44515j14441K54962L9669L18144M29835j87760j45573k58539J87822
1004F0285l64062l63649M06185L23277k13707j24316K45002k61077J90281M61239
994C59458k12Q4900l53886j55871R147J21415J51508l23953j88860j01287K41752
983a55889J00759R8313J11114j53290k40301J59848J00143l8113j78158k10391
973d05965j86224M32349K36603m50751l02886N33511L19604n77579j15666K06314
$$ plain form
963 -310690 -144898 -122187 -19948 -175877 -272342 -274274 -392116 -637591 -261987 73861 -140060
952 -140060 -314106 91697 -72583 -280569 -25601 -295174 -618215 -49443 -18617 -188396
942 -188396 83203 548261 401911 -61742 236774 -128838 -296880 -262576 -264374 -432740
932 -432740 -34820 -96 35035 325737 297088 268867 -80075 -57745 -237654 -316638 244359
921 244359 424768 35183 -109978 -139328 -15716 345518 310380 108746 -326007 -246940
911 -246940 -188065 89756 -1050 -415229 -514596 -482023 -413153 -124465 150458 -232142 -26467
900 -26467 327115 -75347 -215617 -46220 53548 101800 -96967 -257452 -332888 -171021 27603
889 27603 -248761 -223001 95400 -116460 -313897 157839 410068 352718 159017 -240158
$$ packed form
963c10690J65792K2711J02239j55929r6465j932j17842k45475L75604L35848k13921
952a40060j74046M05803j64280k07986K54968k69573l23041N68772L0826j69779
942a88396K71599M65058j46350m63653K98516l65612j68042L4304j798j68366
932d32740L97920L4724L5131K90702k8649k8221l48942K2330j79909p8984N60997
921B44359J80409l89585j45161k9350J23612L61234l5138k01634m34753P9067
911b46940N8875K77821r0806m14179r9367L2573O8870K88688K74923l82600K05675
900b6467L53582m02462j40270J69397R9768M8252j98767j60485p5436J61867J98624
889B7603k76364K5760L18401k11860j97437M71736K52229n7350j93701l99175
$$ plain form
879 -240158 -455739 -97097 65877 -96058 -97733 -140562 -200288 -260028 36840 157934 -81395
868 -81395 280931 408434 18774 14503 -115780 -199474 40519 457356 265390 197682 -50860
857 -50860 -469833 -558571 -508840 -508828 -69455 -118608 -280442 -353171 -237515 -8086 14440 167505
845 167505 -16811 49513 113430 -132246 -273144 -6940 130334 -232195 -436034 -247704
835 -247704 -155140 -261942 -111857 85683 -98544 -48521 249498 246933 263240 220757 -48293
824 -48293 -315013 -87019 -401501 -217537 -69908 -89358 -149441 -86250 95270 148140 -30083
813 -30083 -186215 -237618 -88769 191657 -310977 -303375 -187487 131890 516935 689648 485150
802 485150 -30892 -188809 -303777 -295952 223647 68415 -303298 -475739 -736258 -392589
$$ packed form
879b40158k15581L58642J62974j61935j675m2829n9726n9740K96868J21094k39329
868h1395L62326J27503l89660m271j30283q3694K39993M16837j91966o7708k48542
857e0860m18973q8738M9731J2M39373m9153j61834p2729J15656K29429K2526J53065
845A67505j84316O6324O3917k45676j40898K66204J37274l62529k03839J88330
835b47704R2564j06802J50085J97540j84227N0023K98019k565J6307m2483k69050
824d8293k66720K27994l14482J83964J47629j9450o0083O3191J81520N2870j78223
813c0083j56132n1403J48849K80426n02634P602J15888L19377L85045J72713k04498
802D85150n16042j57917j14968P825N19599j55232l71713j72441k60519L43669
$$ plain form
792 -392589 144324 -75489 2054 285925 405734 -183864 -366346 -116859 77406 220789
782 220789 120804 -271555 -454510 -302365 -98346 29730 354895 436509 -42320 -330209
772 -330209 -314571 -3302 270509 200486 95574 -12687 51412 -23290 -307779 -78186 -15344
761 -15344 -185517 -294447 -235155 -175823 -153072 44187 188609 -11053 -23764 -161223 -500117
750 -500117 -644696 -225195 415175 339446 69437 -328792 -289259 41001 170161 210325
740 210325 197338 138376 231557 67089 -20254 23790 200495 263599 -401499 -533759 -460859
729 -460859 -257194 -82145 165522 420321 142309 -174697 -236591 -415921 -187527 98406
$$ packed form
792c92589N36913k19813P7543K83871J19809n89598j82482K49487J94265J43383
782B20789r9985l92359j82955J52145K04019J28076L25165Q1614m78829k87889
772c30209J5638L11269K73811p0023j04912j08261O4099p4702k84489K29593O2842
761a5344j70173j08930N9292N9332K2751J97259J44422j99662j2711j37459l38894
750e00117j44579M19501O40370p5729k70009l98229L9533L30260J29160M0164
740B10325j2987n8962R3181j64468q7343M4044J76705O3104o65098j32260P2900
729d60859K03665J75049K47667K54799k78012l17006o1894j79330K28394K85933
$$ [...]
##END NTUPLES=NMR SPECTRUM
##END=
