##TITLE=1H_CG-1151-4
 CDCl3, 8 sc, 
 23.08.2021
##JCAMPDX= 6.0         $$ Bruker NMR JCAMP-DX V2.0
##DATA TYPE= NMR SPECTRUM
##DATA CLASS= NTUPLES
##ORIGIN= UXNMR, Bruker Analytische Messtechnik GmbH
##OWNER= root
$$ XWIN-NMR		Version 3.5
$$ Mon Aug 23 09:23:32 2021 Russian Standard Time (UT+4h)  she@DPX200
##.OBSERVE FREQUENCY= 200.131506
##.OBSERVE NUCLEUS= ^1H
##.ACQUISITION MODE= SIMULTANEOUS
##.ACQUISITION SCHEME= undefined
##.AVERAGES= 8
##.DIGITISER RES= 18
##SPECTROMETER/DATA SYSTEM= spect
##.PULSE SEQUENCE= zg30
##.SOLVENT NAME= CDCl3
##.SHIFT REFERENCE= (INTERNAL, CDCl3, 0, 17.4995)
##AUDIT TRAIL= $$ (NUMBER, WHEN, WHO, WHERE, WHAT)
$$ ##TITLE= Audit trail, XWIN-NMR		Version 3.5
$$ ##JCAMPDX= 5.01
$$ ##ORIGIN= Bruker BioSpin GmbH
$$ ##OWNER= she
$$ F:/spectra/data/she/nmr/H-F/1/pdata/1/auditp.txt
$$ ##AUDIT TRAIL=  $$ (NUMBER, WHEN, WHO, WHERE, WHAT)
(   1,<2021-08-23 09:22:19.87 +0400>,<she>,<DPX200>,
      <created by zg, POWCHK disabled, PULCHK disabled
       configuration hash MD5:
       00 E9 B6 7A A2 85 ED C7 34 08 36 98 17 FE 4E 26
       data hash MD5: 16K
       D2 67 42 AA 83 A8 72 81 0A 7A 3D E1 62 80 8C 07>)
(   2,<2021-08-23 09:22:23.18 +0400>,<she>,<DPX200>,
      <Start of raw data processing
       efp BC_mod = 2 LB = 0.24 FT_mod = 6 PKNL = 1 PHC0 = -13357.95 PHC1 = 16.40099 SI = 16K 
       data hash MD5: 16K
       77 2F 5D 63 43 E5 48 22 1C 40 A3 55 3A B5 F3 32>)
(   3,<2021-08-23 09:22:43.64 +0400>,<she>,<DPX200>,
      <pk PHC0 = -0.07843432 PHC1 = -1.639128e-07 
       data hash MD5: 16K
       9E EA 91 CB 82 50 DB 9E BD 0C 85 3B 51 95 89 C8>)
(   4,<2021-08-23 09:22:46.79 +0400>,<she>,<DPX200>,
      <abs ABSG = 5 
       data hash MD5: 16K
       B9 03 B9 6C B4 B8 1B D6 CB EF B8 B4 3B 79 D2 F0>)
$$ ##END=
$$ 
$$ hash MD5
$$ C0 B6 ED BB 87 40 95 1B 2C 81 CE D6 E4 25 D1 2A
##$RELAX= 
##$RELAX= 
##$RELAX= 
##$RELAX= 
##$RELAX= 
##$RELAX= 
$$ Bruker specific parameters
$$ --------------------------
##$DU= <F:/spectra>
##$EXPNO= 1
##$NAME= <H-F>
##$PROCNO= 1
##$TYPE= <nmr>
##$USER= <she>
##$AMP= (0..31)
100 100 100 100 100 100 100 100 100 100 100 100 100 100 100 100 100 100 
100 100 100 100 100 100 100 100 100 100 100 100 100 100 
##$AQSEQ= 0
##$AQ_mod= 1
##$AUNM= <au_zg>
##$AUTOPOS= <>
##$BF1= 200.13
##$BF2= 200.13
##$BF3= 200.13
##$BF4= 200.13
##$BF5= 200.13
##$BF6= 200.13
##$BF7= 200.13
##$BF8= 200.13
##$BYTORDA= 1
##$CFDGTYP= 0
##$CFRGTYP= 5
##$CHEMSTR= <none>
##$CNST= (0..31)
1 1 145 1 1 1 1 1 1 1 1 1 1 1 1 1 1 1 1 1 1 1 1 1 1 1 1 1 1 1 1 1 
##$CPDPRG= <>
##$CPDPRG1= <>
##$CPDPRG2= <>
##$CPDPRG3= <>
##$CPDPRG4= <mlev>
##$CPDPRG5= <mlev>
##$CPDPRG6= <mlev>
##$CPDPRG7= <mlev>
##$CPDPRG8= <mlev>
##$CPDPRGB= <>
##$CPDPRGT= <>
##$D= (0..31)
0 1.2 0 0 0 0 0 0 0 0.06 0 0.03 0 0 0 0 0.0002 0 0 0 0 0 0 0 0 0 0 0 0 
0 0 0 
##$DATE= 1629696139
##$DBL= (0..7)
120 120 120 120 120 120 120 120 
##$DBP= (0..7)
150 150 150 150 150 150 150 150 
##$DBP07= 0
##$DBPNAM0= <>
##$DBPNAM1= <>
##$DBPNAM2= <>
##$DBPNAM3= <>
$$ [...]
##$SUBNAM3= <"">
##$SUBNAM4= <"">
##$SUBNAM5= <"">
##$SUBNAM6= <"">
##$SUBNAM7= <"">
##$SUBNAM8= <"">
##$SUBNAM9= <"">
##$SW= 20.0188882624521
##$SWIBOX= (0..15)
0 0 2 0 0 0 0 0 0 0 0 0 0 0 0 0 
##$SW_h= 4006.41025641026
##$TD= 16384
##$TD0= 1
##$TE= 0
##$TE2= 300
##$TE3= 300
##$TEG= 300
##$TL= (0..7)
0 120 120 120 120 120 120 120 
##$TP= (0..7)
150 150 150 150 150 150 150 150 
##$TP07= 0
##$TPNAME0= <>
##$TPNAME1= <>
##$TPNAME2= <>
##$TPNAME3= <>
##$TPNAME4= <>
##$TPNAME5= <>
##$TPNAME6= <>
##$TPNAME7= <>
##$TPOAL= (0..7)
0.5 0.5 0.5 0.5 0.5 0.5 0.5 0.5 
##$TPOFFS= (0..7)
0 0 0 0 0 0 0 0 
##$TUNHIN= 0
##$TUNHOUT= 0
##$TUNXOUT= 0
##$USERA1= <user>
##$USERA2= <user>
##$USERA3= <user>
##$USERA4= <user>
##$USERA5= <user>
##$V9= 5
##$VALIST= <valist>
##$VCLIST= <CCCCCCCCCCCCCCC>
##$VD= 0
##$VDLIST= <DDDDDDDDDDDDDDD>
##$VPLIST= <PPPPPPPPPPPPPPP>
##$VTLIST= <TTTTTTTTTTTTTTT>
##$WBST= 1024
##$WBSW= 4
##$XGAIN= (0..3)
0 0 0 0 
##$XL= 0
##$YL= 0
##$YMAX_a= 268686
##$YMIN_a= -275066
##$ZGOPTNS= <>
##$ZL1= 120
##$ZL2= 120
##$ZL3= 120
##$ZL4= 120
##$ABSF1= 17.49955
##$ABSF2= -2.519489
##$ABSG= 5
##$ABSL= 3
##$ALPHA= 0
##$AQORDER= 0
##$ASSFAC= 0
##$ASSFACI= 0
##$ASSFACX= 0
##$ASSWID= 0
##$AUNMP= <proc_1d>
##$AZFE= 0.1
##$AZFW= 0.1
##$BCFW= 0
##$BC_mod= 2
##$BYTORDP= 0
##$COROFFS= 0
##$CY= -3
##$DATMOD= 1
##$DC= 0
##$DFILT= <>
##$DTYPP= 0
##$F1P= 0
##$F2P= 0
##$FCOR= 1
##$FTSIZE= 16384
##$FT_mod= 6
##$GAMMA= 0
##$GB= 0
##$INTBC= 1
##$INTSCL= 1.334414e-10
##$ISEN= 128
##$LB= 0.24
##$LEV0= 0
##$LPBIN= 0
##$MAXI= 10000
##$MC2= 0
##$MEAN= 0
##$ME_mod= 0
##$MI= 1.114404
##$NCOEF= 0
##$NC_proc= -7
##$NLEV= 6
##$NOISF1= 3.799351
##$NOISF2= 2.8
##$NSP= 0
##$NTH_PI= 0
##$NZP= 0
##$OFFSET= 17.49955
##$PC= 1
##$PHC0= -13358.03
##$PHC1= 16.40099
##$PH_mod= 1
##$PKNL= yes
##$PPARMOD= 0
##$PSCAL= 0
##$PSIGN= 0
##$REVERSE= no
##$SF= 200.130007019701
##$SI= 16384
##$SIGF1= 3
##$SIGF2= 2
##$SINO= 5.538805
##$SIOLD= 16384
##$SREGLST= <1H.CDCl3>
##$SSB= 0
##$STSI= 16384
##$STSR= 0
##$SW_p= 4006.41025641026
##$SYMM= 0
##$S_DEV= 0
##$TDeff= 16384
##$TDoff= 0
##$TI= <>
##$TILT= no
##$TM1= 0
##$TM2= 0
##$TOPLEV= 0
##$USERP1= <user>
##$USERP2= <user>
##$USERP3= <user>
##$USERP4= <user>
##$USERP5= <user>
##$WDW= 1
##$XDIM= 16384
##$YMAX_p= 303827921
##$YMIN_p= -1165498
$$ End of Bruker specific parameters
$$ ---------------------------------
##NTUPLES= NMR SPECTRUM
##VAR_NAME=  FREQUENCY,     SPECTRUM/REAL,   SPECTRUM/IMAG
##SYMBOL=    X,             R,               I
##VAR_TYPE=  INDEPENDENT,   DEPENDENT,       DEPENDENT
##VAR_FORM=  AFFN,          ASDF,            ASDF
##VAR_DIM=   16384,         16384,           16384
##UNITS=     HZ,            ARBITRARY UNITS, ARBITRARY UNITS
##FACTOR=    0.24454680195387, 1,            1
##FIRST=     3502.18503746868, 0,            0
##LAST=      -504.225218941577, 0,           0
##MIN=       -504.225218941577, -1165498,    0
##MAX=       3502.18503746868, 303827921,    0
$$ Real data points
##PAGE= N=1
##DATA TABLE= (X++(R..R)), XYDATA
$$ [...]
8807 503361 420370 729752 504289 431539 301102 685907 613549 789165 444159 529564
8797 529564 772222 497176 562218 859181 747742 271082 477385 602743 407377 239291
8787 239291 503858 332309 233591 393065 417910 691955 389523 177328 -16197 488212
8777 488212 433548 580258 787773 706601 571433 632283 812466 640239 719576 383558
8767 383558 598902 469298 238446 514033 725233 730462 503450 407086 664253 802412
8757 802412 757430 930213 788903 1177981 918312 893701 844645 774194 821441 923169 708114
8746 708114 420788 1012191 843807 585983 529001 736134 818260 828285 903398 1217955
8736 1217955 896302 645706 843366 1297483 1274943 1034874 1279909 1094952 720384 882008
8726 882008 817572 928689 948616 1025181 1035454 1150004 875606 908424 1068792 1270442 1272464
8715 1272464 843481 762777 940890 857574 1063408 1018957 786848 1065826 865184 476142
8705 476142 1084623 1292585 906556 500476 634651 874937 907774 476003 929954 1465516
8695 1465516 1306899 914348 1094744 1079965 1299719 1330720 1224389 1098447 1052090 888826
8685 888826 1070943 1195253 1385605 1331059 933524 1163202 1408215 1769180 1750062 1220546
8675 1220546 1360583 1636792 1448875 1268861 1501623 1873673 1874449 1394405 1428818 1546166
8665 1546166 1411845 1175127 1496751 1633940 995460 1314546 1900426 1991953 1797566 1773610
8655 1773610 1630259 2126161 2095481 2025951 1762230 1782994 1942429 2040906 2002974 1914287 2268157
8644 2268157 2262644 1848234 1862314 1917298 1781948 1768873 1685222 2101215 2482835 1789125 1846303
8633 1846303 2419833 2654743 2267554 2577140 2639239 2473092 2597918 3043535 2720232 2523065
8623 2523065 2833092 2618954 2986124 3225966 2921689 3295079 3496757 3448053 3088446 3166755
8613 3166755 3538663 3647771 3649416 3606729 3832284 4191910 4302941 4678507 4844035 5126926
8603 5126926 4952110 4740980 4949035 5265700 5257121 5028699 5406639 5631862 5628380 5805294
8593 5805294 6308875 6330989 6159297 6383920 6486709 6290309 6162595 6287908 6400324 6641617
8583 6641617 6216038 6515442 6901261 6705889 6437211 6506122 6902321 6831402 6933992 6959664
8573 6959664 7392038 7334077 7330821 7756154 8472567 8560127 8696500 8950407 9071689 8948659
8563 8948659 9467759 9922575 10182610 10653976 11016244 11694215 12222675 12677850 12998929 13983102
8553 13983102 14420615 14653189 15367874 16002428 16665480 17347343 18885632 20380901 21569649
8544 21569649 23067390 25023445 27267358 29485177 32006012 34379792 37591938 41020987
8536 41020987 44242943 46561815 48084845 49705188 51046019 51743771 52294612 51982521 49649174
8527 49649174 46855845 43705738 40961422 38505905 37012068 35987448 35636206 34848000
8519 34848000 33872878 33532684 33812742 33818812 34301864 35478948 36824445 38530016 40720361
8510 40720361 43091823 46015263 48886019 52155463 55639355 59548361 62854905 65307405
8502 65307405 68072012 71041034 73723957 75747422 76348286 75611323 73716895 70599332
8494 70599332 66641511 61916437 56179657 50310324 45806106 41553456 38513918 36220147
8486 36220147 34283367 32811697 32051672 30951420 29836322 29196207 28880841 28424385 27994923
8477 27994923 28240256 28440717 28680094 28598977 29034910 29476735 29407504 29737448 30019407 29852307
8467 29852307 29504979 29509792 29292867 29314235 29294350 28936632 27876785 26395896 25492259 24233895
8457 24233895 22301002 20099114 18705826 17713783 16192945 14722223 14206346 14008049 13266073
8448 13266073 12434858 12266548 12157454 11950471 11570666 11368159 11445598 10938510 10801221 10456504
8438 10456504 10150065 10210771 10688458 10633480 10622831 11057392 10996070 10879380 10967384 10811374
8428 10811374 10479421 10333346 9980712 9537449 9529678 9289260 9130115 9203774 8890039 8583480
8418 8583480 8379019 8422836 8335794 7952161 7804454 7834647 7838679 7695509 7609405 7664297 7694753
8407 7694753 7430544 7871530 8080247 8035559 8113442 7963386 8002269 8672833 8980919 8617582
8397 8617582 8430332 8709011 8479897 8374478 7931828 7662002 7646186 7270643 6634196 6482610
8387 6482610 6560072 6360315 6004766 5445759 5336236 5007650 4760118 4859909 5282588 4936366
8377 4936366 4851275 4835118 4672535 4647417 4535329 4696898 4277197 4166712 4270196 4103659
8367 4103659 3747216 3988606 3950358 3805790 3891570 3628128 3840881 3959131 3372103 3265762
8357 3265762 3501824 3542948 3544864 3303656 3485725 3430841 3407506 3595076 3981495 3655302
8347 3655302 3338101 3022565 3151105 3230292 3022692 3099435 3113276 3057466 2769457 3019208
8337 3019208 3399159 2956998 2840207 2837875 2948768 2658379 2380811 2524385 2720277 2598246
8327 2598246 2668266 2744927 2415000 2323766 2451221 2826908 3143499 3025516 2863735 2624420
8317 2624420 2269162 2182745 2238317 2332426 2502706 2755700 2612477 2615776 2670363 2644605 2758147
8306 2758147 2594054 2657336 2635873 2295778 2057556 2292616 2575385 2812276 2740127 2648114
8296 2648114 3293395 3244253 2769458 2981252 2993674 2960217 2439805 2435150 2926218 2644488
8286 2644488 2280797 2966750 3019700 2460254 2394145 2530980 2854676 2916035 2905447 2820282
8276 2820282 3131734 2737704 2367209 2639846 2948166 2639686 2696266 2929595 3307224 3451155
8266 3451155 3184091 3137532 3389600 3437245 3135548 2884038 2780947 2838349 3170100 3017519
8256 3017519 2768798 3361566 3738643 3485849 3114048 3251530 3524999 3115931 2707489 2963423
8246 2963423 3443352 2970141 2883955 3587934 4166232 3773603 3681498 3662088 3293437 3383785
8236 3383785 3452625 3702369 3343305 3052826 3313470 3935487 3853538 3789046 4099656 4433154
8226 4433154 4663583 4335134 3867944 4525522 5081291 4379165 4353031 4756456 4609572 4190837
8216 4190837 4642306 5095219 4698911 4751399 4926019 5016459 4918357 5256804 5436173 5318991
8206 5318991 5200688 5888136 6003374 6227546 6321572 6930904 7023403 6749097 6598454 6911889
8196 6911889 7364276 7762070 7796571 9939662 10844199 7029361 7438676 8414183 9001114
8187 9001114 8834214 8608901 9065113 9395171 9468849 9704401 10059411 10803512 11216092 11366304
8177 11366304 12226211 12626527 12704935 13065023 13515119 13758643 14512176 15488958 16440652 17200731
8167 17200731 18400364 19761415 20942546 22330958 24204590 25816520 27190843 28933984
8159 28933984 30842539 32561903 34406147 35878778 36551970 36923206 36509013 35763567 34270886
8150 34270886 33265185 33037802 32917491 32738451 32817493 33114757 33112403 33515104 34207688 35168233
8140 35168233 35997260 37356119 39478100 42070069 44098732 45893054 47696417 49585353
8132 49585353 51380704 53457084 56128973 59120560 62250309 65219723 68073227 69878651
8124 69878651 70557436 69902864 68480764 66027849 63173980 60658052 58006372 55334895
8116 55334895 53224854 51482981 49794830 48113884 47172518 47457093 47575657 48061669 48908467
8107 48908467 50274820 51403154 52402280 53355373 54162012 54532016 54745241 55689351 56200908
8098 56200908 56826359 56902700 56918488 56800837 56708150 56550589 55833170 54929844 53587172 51365900
8088 51365900 47521135 43881513 41146186 38509937 36072228 34882111 33944842 33129467
8080 33129467 32195588 32036183 31934707 31327257 30864319 30365917 30695707 31304944 31264746 30958689
8070 30958689 30729888 29796022 28602695 27304004 25860551 25031045 24273869 23209551 22385554
8061 22385554 21389018 20309382 19458730 18642364 17919885 17345920 17038795 16233817 15636393
8052 15636393 15277999 14955838 14805330 14285373 13863258 13680810 13262164 12982410 12901000 12813180
8042 12813180 12670185 12617277 12447374 12672990 13040938 13234388 13262046 13393035 13316487 13382369
8032 13382369 13449041 13380595 13592733 13760855 14233393 14504620 14917016 15166136 15528379 16235079
8022 16235079 16757284 17367767 18359595 19481738 20845984 22454698 24154953 26574393 29398953
8013 29398953 32475069 36300184 40758542 43515731 42426616 37980981 32787074 29445962
8005 29445962 27367769 26102919 26129967 26380674 26451444 27431788 28648610 29296304 29753964
7996 29753964 30339768 30934301 30951773 30846069 30461564 29694547 28492218 27335584 26493833
7987 26493833 25972306 24832383 23876802 24030295 24311573 24584527 24818324 25392870 25928741
7978 25928741 26651174 27156696 28261320 29304460 29974363 30710765 31819928 32385676 33201417
7969 33201417 34218103 34792306 35596156 37250796 38465317 38509320 37795627 36271422 34567452
7960 34567452 32597627 30493990 29191103 28542772 27943662 27306390 27061550 27053179 26666883
7951 26666883 26719978 26791929 26972604 27200337 26617485 26322131 25972251 25635346 24964594 24338500
7941 24338500 23778586 23616844 23881943 24268320 24205402 23858930 23556524 23182032 22372600 21339525
7931 21339525 20497858 19826998 18841565 18085548 17579209 16924969 16446437 16190545 15828474
7922 15828474 15950040 15976854 15425570 15404267 15063994 14325078 13926854 13246108 12338375 12090345
7912 12090345 11880875 11272185 10843595 10295125 9644771 9685314 9255905 8962658 8589147 7861771
7902 7861771 7489091 7503662 7249440 7096642 6629419 6075650 6270992 6463678 6499311 6606007
7892 6606007 6526701 6667172 6414504 6300057 6197093 6165102 5593154 5554676 5345081 5031273
7882 5031273 4964835 4730198 4624124 5010562 4891545 4186027 3746297 3553326 3761094 3578593
7872 3578593 3203315 3159858 3178122 2922481 2778103 3079908 3127219 3070094 2789696 3037363
7862 3037363 2929369 2461394 2443940 2810765 2771757 2548549 2525049 2488486 2537768 2385384
7852 2385384 2513626 2886948 2622348 2345168 2681904 2327502 2001698 1950621 2103311 2084515
7842 2084515 1893101 1764491 1846756 2218111 2130805 1937578 1997518 1889176 1632803 1626587
7832 1626587 1431347 1287090 1238256 1180964 1540408 1911759 1657521 1602811 2027598 2092123
7822 2092123 1959491 2047989 1942614 1624098 1714149 1619183 1606525 1544309 1123662 1054280 1503926
7811 1503926 1316903 864754 1065547 1243002 1159659 1248740 898995 833676 1252213 1186915
7801 1186915 925123 1404324 1510104 1231789 1157700 1220729 1522916 1692677 1162113 1337168
7791 1337168 1547609 1129969 854067 1088080 1134162 1213777 1087049 1107819 1280665 1592072
7781 1592072 1219599 1079725 1433238 1170342 374692 523627 1073265 1070261 818543 998306
7771 998306 1142662 1189410 1223221 692562 902868 985377 689600 591085 440452 292930
7761 292930 575447 590568 641681 1154202 941788 537978 1030563 1005362 595156 509958
7751 509958 511878 506244 350932 302415 384109 623066 760192 962640 852107 133370 104019
7740 104019 253478 203786 47793 355941 453868 294134 131697 315030 393912 315079
7730 315079 443782 390879 407708 378500 366707 492686 670019 605374 487048 247972 136357
7719 136357 813546 582491 236501 243376 676094 582484 354874 317973 341355 452098 -2463
7708 -2463 16073 59450 -19050 179705 287136 548898 687142 629221 522998 477980 403138
7697 403138 452043 761744 808662 530067 542459 591477 514108 559461 622058 828311 304376
7686 304376 -24730 48980 390571 171024 -326433 -77055 450800 422228 134555 363696
7676 363696 416763 300051 292011 417998 360435 454770 710838 332762 128402 467651 298149
7665 298149 -270732 -210904 182764 456990 146171 412290 336871 377639 472093 239256
7655 239256 194712 -7201 -100364 -222942 -17289 128129 335244 370742 378699 379258 529711
7644 529711 189288 446318 219561 -6942 210897 172397 308569 176030 126420 669378
7634 669378 547161 -213390 42141 203261 33733 24803 206555 205720 486035 470982 240530
7623 240530 307613 588869 521950 -290888 -408246 308655 277200 -89312 -8415 234481
7613 234481 449717 200827 -117165 -111794 -269579 -264843 -106703 -80947 -67846 52383 151183
7602 151183 315299 451539 411800 414959 295317 56875 28852 152303 -126528 -96381 176317
7591 176317 40094 19881 68193 -113562 -181118 -280814 -177292 -166686 -235400 -276319 -144967
7580 -144967 430631 581908 419493 360830 8969 -34072 36873 14715 -154397 -411703
7570 -411703 -189494 -74323 40767 103088 -79821 88443 78686 129032 263854 -73121
7560 -73121 -46959 219874 204233 -178586 52522 229483 -218570 -182988 -246992 -1707 145626
7549 145626 -106739 -142422 -48745 -320170 -333242 -23208 -113064 -228123 -1772 139130
7539 139130 -258943 151647 97111 -13593 -28758 79081 4716 -93685 -24976 -20880 229607
7528 229607 165246 -100697 -113345 92147 83909 103770 -118663 -528536 -606905 -576908 -345228
7517 -345228 -56386 -40324 -387979 -263945 -188790 54389 284252 115773 -340579 -369674
7507 -369674 -74407 -201392 -303027 -452948 -113970 -26531 -91568 -642777 -485452 -388416
7497 -388416 -573299 -204662 -130689 -586804 -427733 -314702 -391589 -452711 -428627 -276627
7487 -276627 -343175 -62279 -26502 93913 -115693 -71017 213840 15461 -112190 -186775
7477 -186775 -219720 -286158 -222224 -183550 -257198 -286433 -43562 -37375 -284529 -201513 -169465
7466 -169465 -122898 -193310 -150871 -45529 50134 142135 174816 -125711 -284471 63294 -74219
7455 -74219 -485896 -421509 -399144 -440986 -266152 49571 188433 273801 -21477 -335615 -89144
7444 -89144 132660 -370133 -580986 -334929 -231394 53186 114391 138835 149324 201866 89099
7433 89099 -222442 -596944 -309145 -328478 -445191 -445657 -399274 -437318 -255415 -42854 110139
7422 110139 72541 -315602 -281391 -167164 -40587 -256060 -387687 -536285 -413561 -399972
7412 -399972 -214939 -165432 -733374 -677703 -422272 -445286 -665851 -419436 -324145 -259993 69305
7401 69305 188786 -195019 -276834 121021 251063 141498 -146647 -205077 -507466 -389221
7391 -389221 -309864 -193084 -549598 -805498 -497378 165036 360985 59654 -311497 -388582
7381 -388582 -3753 -317814 -577527 -452716 -119826 -75994 340748 391804 296136 -21263
7371 -21263 -87850 -132322 -136660 -413835 -496227 -269320 -206394 -248628 -467700 -75935 -89725
7360 -89725 -207463 -191023 -322186 -383584 -569817 -884344 -596791 -244614 -226524 -302083 286956
7349 286956 531563 374453 250635 85058 -83669 -224550 -595549 -367900 -51566 -279850
7339 -279850 -229415 130912 51557 -309885 207074 -79033 -446447 -382174 -538704 -526013
7329 -526013 -409678 -277614 -257268 -133007 -158731 -72596 77747 306940 -24221 -417865
7319 -417865 -298591 -124650 -420845 -733878 -507610 -295170 143022 184921 -26787 -275740
7309 -275740 -142964 68167 182549 -392904 -535392 -567458 -440710 -300399 28294 106466
7299 106466 -123748 -35887 -248125 14297 -603756 -464805 -507143 -512173 -414196 -498725 -506282
7288 -506282 -363055 -177302 37096 247586 -283623 -50714 201697 253656 -213978 -430956
7278 -430956 -428970 -116810 -22883 -299861 -43229 203338 -103778 -216444 -53462 -125809
7268 -125809 -277947 -401069 -239529 -115688 -168782 35076 312550 -29180 -95279 398969
7258 398969 209854 -176415 -103289 100418 -213747 -275159 -156998 -228698 27921 -203914
7248 -203914 -236324 -535955 -80038 -73092 -412962 -451036 -345572 -335202 -223639 -510746 -429687
7237 -429687 194013 239761 71000 -47210 -125275 -208569 -179266 -200924 -145212 119105 -485810
7226 -485810 -648745 -392928 -217698 -452989 -751325 -539782 -378263 -366235 -505623 -149
7216 -149 220825 289372 102262 23463 1261 -146789 -480801 -255521 -457479 -473173 -93109
7205 -93109 65644 129449 185074 132484 -74096 -237740 -433973 -17775 -64627 -303678 -48553
7194 -48553 -291522 -532516 -314677 -204836 60025 324611 41531 -186680 -261447 106675
7184 106675 106647 175781 87031 330489 368064 142374 80785 90682 429038 -31441 -448444
7173 -448444 -269709 -201845 -251775 -151945 -533002 -598155 -251480 -339154 -308740 -50681 97163
7162 97163 -136784 83193 -92803 -56048 -136188 -315418 -265066 -319151 -376309 -323738 135179
7151 135179 259462 107078 -434547 -418543 -100249 -160862 -549099 -465170 -316430 -369253
7141 -369253 -155580 106958 316457 173943 151322 121420 89574 -155582 -185537 -267842 -30712
7130 -30712 -191365 -618387 -376570 -223457 -162757 -55394 70745 -53963 92893 -26815
7120 -26815 130899 465615 247206 217246 540638 293084 364689 677845 650362 373715
7110 373715 434992 409001 529165 602605 213596 177205 98015 -723288 -600776 -238840 -371349
7099 -371349 -473959 -174940 70983 65993 -169914 -417995 -124675 98542 -89396 -362465
7089 -362465 -177647 -238988 -196275 42995 102862 213943 151588 8488 26846 113094 -305790
7078 -305790 -622416 -460173 -262967 -145632 -229699 -20367 319779 163956 182824 556963
7068 556963 407431 331177 322661 368981 -137184 -342229 -142429 99471 -122262 -195326 -293573
7057 -293573 -324240 -147976 -221963 -96638 -72300 -110095 -284072 -245315 -398521 -255995 49095
7046 49095 178078 -71750 -201814 -98300 -201023 -21973 -78528 -49798 -74029 89879
7036 89879 149446 164042 59422 -217766 -5472 -29810 -411464 -233021 333422 448078
7026 448078 404482 406647 619325 648495 568798 306858 353181 274608 -1137 -362650 -431856
7015 -431856 -339743 -322535 -209123 -437313 -10018 88071 -1043 51197 28206 -62865 -489557
7004 -489557 -384944 -78430 -84320 -211627 209101 177663 223026 166702 275651 249398 132739
6993 132739 -125808 62797 -284152 -443291 -198566 365302 249816 35845 491103 455990
6983 455990 415086 327269 175796 11310 263922 92519 -113237 -146469 196081 303657
6973 303657 -75591 -118250 233900 19115 -124526 -351275 -419542 -669088 -786563 -710260
6963 -710260 -395387 -80171 40991 -7997 164158 287859 343065 236662 194657 194782 175455
6952 175455 -27078 -6807 221703 329113 111213 73283 222977 -7140 -89384 -146966
6942 -146966 -218212 -148045 -244002 -710568 -669404 -143262 9792 -30284 -148438 -126207 195268
6931 195268 6342 102354 278342 -164630 -191628 -22880 10412 -152094 -76132 -162228 -27766
6920 -27766 98614 189512 3480 195470 206336 133197 -214750 -389331 -564065 -235805
6910 -235805 -95328 -212405 153775 81651 -349 299194 290048 -27065 -58677 -200480 -345853
6899 -345853 -186078 24025 -434611 -460272 -82622 -202289 -631225 -645726 -310619 175861
6889 175861 -125492 -414014 25283 184724 -19220 -168860 -290861 -66193 -94152 -230150
6879 -230150 26161 404361 -21962 -149768 53145 309089 147967 -16538 14802 133997
6869 133997 44789 -243505 -310024 -203427 -117158 -26957 101484 -84261 -256701 45802
6859 45802 78664 200488 377257 433194 156460 46185 143381 17805 -135168 -318461
6849 -318461 114388 247063 -338970 -2805 306758 36001 -334753 37018 157041 -130772
6839 -130772 -425150 -140891 123384 -44348 -273911 -269166 92337 131983 -152627 -156987 -232574
6828 -232574 -248090 -129072 -24198 29504 -81906 -124354 -412957 197567 399368 -20661
6818 -20661 -24596 -275068 -316056 -435026 -517974 -275220 -20796 -108514 10647 132692 208532
6807 208532 -154787 -40193 56167 -96794 -391544 -686899 -234144 -74367 -370991 -390563
6797 -390563 138909 157149 -212829 82673 483434 122646 -29634 -8816 326888 39904
6787 39904 -284386 -189639 84613 270687 -50717 -188530 41546 124058 330472 77538
6777 77538 9048 68790 19880 -338596 -305272 -236820 200207 354069 313818 232016 443425
6766 443425 206599 192281 113735 158195 97903 -242290 -258293 191151 404669 150580 87890
6755 87890 266709 336423 -6301 -92019 -18588 -63307 -300379 -80419 214659 55680 49715
6744 49715 66290 70283 446400 495513 97591 -234347 -146487 315946 314331 139119 172371
6733 172371 304766 1178 -101857 -100412 -545586 -296857 246399 345096 139683 -48672
6723 -48672 479454 654119 585287 478288 -27413 200719 600535 414125 239226 444223
6713 444223 450450 507875 740642 711239 482798 -44180 -139753 29566 334869 175281 -74689
6702 -74689 85111 210349 343094 99506 175768 218547 456414 433236 596208 390648
6692 390648 767237 876697 914063 818297 880878 1059756 569747 455104 881142 1281756
6682 1281756 587616 206239 392654 528095 683463 386302 535728 1124048 1247905 1013074
6672 1013074 1333950 1382868 1352731 1341056 1099933 820190 1126785 1104336 987934 713015
6662 713015 1096191 1602586 1399747 1034224 1076339 1510772 1236952 723397 757852 1106195
6652 1106195 1178306 1008169 1310486 1528578 1524343 1571737 1667250 1576347 1563878 1443081 1431318
6641 1431318 1286220 1059412 999288 1256636 1417062 1729186 2061630 1996224 1880763 1880736 2042997
6630 2042997 2190368 2122756 2158098 2259379 2727307 3082941 3241692 3360003 3565069 3565787
6620 3565787 3161314 3055246 3462332 3502154 3405950 3659285 3636196 4120506 4215639 4206794 4079437
6609 4079437 4427360 4154666 4182187 4315265 4428158 4155705 3492341 3485571 3942764 3864526
6599 3864526 3576821 3470831 3388255 3179835 2788253 2897585 2864215 2605754 2658425 2777746
6589 2777746 2673356 2257330 2332835 1915969 2129195 2147910 2145122 1976207 1909906 2207604
6579 2207604 2576982 2479710 2179480 1828530 1773994 1473415 1197982 1065224 1112925 1208154
6569 1208154 1069716 1109098 1213692 1340078 1360322 1526993 1575662 1368623 1260574 1115089
6559 1115089 1238510 1223777 1168838 1214690 1216736 1249528 1551704 1743976 1659166 1874652 2027818
6548 2027818 1839983 1349178 1389961 1636144 1491505 1119063 1363102 1674495 1735428 1879967
6538 1879967 2118469 2232021 1934610 2027695 2121814 1952620 1732818 1674280 1892369 1878944
6528 1878944 2070557 2164723 2422003 2701046 2494490 2493049 2785099 2620524 2592859 2424195
6518 2424195 2081091 2163002 2327613 2264378 2440413 2497448 2535995 2683696 2450688 2059358
6508 2059358 2278571 1930049 1921726 1726298 1578927 1249023 1357409 1399311 1882510 1797107
6498 1797107 1710788 1645377 1906952 1795216 1713101 1823650 1512285 1209217 962170 917916
6488 917916 1227287 1279780 1235632 1269171 1157810 1103936 853063 1150960 1695204 1590652
6478 1590652 971186 727422 1076495 1176929 1319302 934680 1183584 1147177 507041 581576
6468 581576 807645 942594 701755 424258 301160 776084 580422 423591 -17387 495152
6458 495152 857801 703604 665323 935155 1065596 850836 633676 580391 283846 35424
6448 35424 505244 660238 765652 625145 466891 710620 749972 820234 627427 725215
6438 725215 893257 813611 445870 630892 659102 533380 157597 357172 610685 596526
6428 596526 349002 459893 809794 335832 -22565 413038 359305 261879 259068 320787 514077
6417 514077 487574 711328 933189 901992 1063886 1166493 632921 475161 919091 702876
6407 702876 145817 196380 547844 424596 511591 523227 721707 707873 598588 615597 491639
6396 491639 339754 846934 693772 604013 973227 689326 720285 748029 820383 863786 555147
6385 555147 380406 847874 742778 351748 348703 600681 534918 566726 504170 569397 681137
6374 681137 876925 1093908 878416 922400 1079394 1144497 1127592 982211 947926 933493 1076563
6363 1076563 1156138 1398366 1217340 746291 869136 1362685 1313442 1161257 731522 610658
6353 610658 1051235 1192421 710633 823189 881645 883508 1304109 1356567 1054220 1437116
6343 1437116 1419951 1320211 850932 564538 602362 645430 435601 730212 1133424 799810
6333 799810 811626 1094732 1314938 1256585 1030163 826336 822677 687205 471211 517857 755384
6322 755384 1367852 1679000 1429720 1699186 1979080 1583634 1382078 1246091 939226 653142
6312 653142 588167 1048425 1263762 926443 1337476 1792463 1555248 1305899 958259 1089340
6302 1089340 1382761 1528808 1384671 1238445 914230 1506526 1852491 1636818 1719203 2024921
6292 2024921 1823930 1660803 1875774 1769754 1580834 1083521 1326656 1727387 1772974 1552848
6282 1552848 1670947 2263945 2590561 2259783 2247694 3047648 2842607 2283883 2487337 2820094
6272 2820094 2429070 2531796 2667238 3262220 3372879 2837845 2808301 3342241 3504990 3298385
6262 3298385 3194711 2950502 2963597 3185762 3688013 3702331 3855101 4491567 4762001 4571017
6252 4571017 4746482 5147733 5069533 5060832 5389124 5878581 6100751 6367917 6907883 7452831
6242 7452831 7269677 7627835 8316646 8490118 8883485 9479428 10218064 10982741 11543077 11703082
6232 11703082 12879685 13908563 14255514 14813702 15516333 15823441 15603333 15751545 15682809
6223 15682809 15574359 14908693 14247729 13841624 13541082 12869661 12412737 12440730 12719517 12811873
6213 12811873 12548776 12705059 12761552 12787105 13075774 13091325 13362755 14178953 14605446 15096380
6203 15096380 15915103 17288888 18372776 19173673 20279116 21698864 22982284 24135217
6195 24135217 25055857 26345768 27892461 29251957 30388730 32034876 33391156 33749555
6187 33749555 33879472 34238642 33441948 31821946 30257596 28791225 27232815 25494023 23974344
6178 23974344 22508583 20511049 18527948 17925819 17030030 15273435 13948030 13098597 12197496
6169 12197496 11284165 10763160 10121779 9584114 9290961 8912630 8612856 8393396 8141221
6160 8141221 7496600 7040764 6961644 6818410 6233607 5945197 5845172 5736950 5422626 5110699
6150 5110699 4696881 4459041 4060472 3724213 3555939 3688476 3802408 3834138 3944738 3996316
6140 3996316 3736392 3417327 3388851 2774319 2935925 2715325 2516025 2640018 2656490 2359999
6130 2359999 2303224 2723237 2548322 2122485 2094690 2153022 2073129 1858423 1896673 2232749
6120 2232749 1963474 2263501 2430937 2162507 2281797 2025573 2064378 2110604 1748783 1535324
6110 1535324 1748390 1663678 1609737 1118667 1015082 1462021 1248390 1092264 1515392 1581985
6100 1581985 1458582 1548004 1112823 883537 832561 500577 269283 372935 969709 1146784
6090 1146784 768386 914659 1660234 1404645 788470 906807 1034674 623687 527734 329189
6080 329189 280472 662128 747098 1008641 969003 904553 1040989 751040 291278 283868 281675
6069 281675 287058 179343 86358 536168 768575 313633 555851 632364 609942 577678 431086
6058 431086 318114 609133 270708 143183 549640 802595 460774 541217 262373 139262
6048 139262 539186 289945 372952 463817 338439 454839 703456 369231 365704 154810
6038 154810 222941 358718 578140 352902 33797 410800 521634 449572 -53117 -6862
6028 -6862 -331658 -275891 -265042 -595284 -316551 5105 -30458 3801 51198 163263 465266
6017 465266 139478 -81497 336624 24700 -454810 295600 580464 172450 133099 696300
6007 696300 719384 515339 311109 347019 377009 73203 -91242 -124037 -177424 -405001 21384
5996 21384 175123 -255405 -599536 -178080 -41555 -159933 63666 -175155 -426381 -250824
5986 -250824 -104514 19432 136883 137368 11862 104073 131062 95938 -2860 -153073 214393
5975 214393 134232 -317232 -377633 -157427 -172695 355501 320974 -77592 -155257 118281 57783
5964 57783 -291656 -373948 -542156 -320696 -248253 218153 359168 193684 81980 368245
5954 368245 398683 -73606 -211032 -257084 -105308 -240995 -171866 -165674 -15853 328285 449609
5943 449609 211054 144712 -176518 -418962 59710 -66090 -303145 -218441 -322000 -149250
5933 -149250 -110566 -370067 -445820 -205263 -460757 -584088 -327360 -84940 -391013 -350635
5923 -350635 -328559 87747 241197 141038 -264757 245263 383869 89372 -242377 113877
5913 113877 140670 -6492 -96010 -45459 32656 -176077 -124896 442771 459149 -109905 56094
5902 56094 99249 16461 -46282 -184705 -407059 117058 209891 83232 -15275 306410 292849
5891 292849 -44442 89318 201372 14802 38934 133967 242775 43681 119289 -161228
5881 -161228 282562 413615 542813 288130 96701 424704 548883 461356 311717 93167
5871 93167 195166 346230 426600 412671 272732 147416 220499 377619 284469 -120264 -10699
5860 -10699 218518 302212 29198 109148 -314423 119146 445783 -71039 -368635 174245
5850 174245 312881 -69581 -161594 21 152804 -261138 -427908 -81939 81191 -606837
5840 -606837 -702736 -68235 175995 66984 -474167 -348521 170278 -79992 -465094 -290376
5830 -290376 -450751 -558694 -719732 -657329 -277190 150274 337291 283246 340765 271325
5820 271325 238743 22391 -206481 -516816 -634515 -499419 -466425 -549891 -46496 22711
5810 22711 219024 392126 186486 123437 15882 -270859 -343265 -307751 -230565 -666858 -330332
5799 -330332 -89801 -47574 -228747 -218900 -75975 170875 -111473 -1551 31112 -147095
5789 -147095 -85148 -195844 -349363 -197939 -222038 -128363 -200562 -73302 140535 63849 20314
5778 20314 252722 -88117 -203404 -243104 -279553 -159546 19851 100471 201530 252764 14501
5767 14501 68941 -134972 -419812 -325700 -566868 -586210 -374314 -339912 -460685 -23202 -293804
5756 -293804 -86631 126697 -204620 -319305 -147053 -45724 -186812 -78923 16056 -100588
5746 -100588 -103388 -224536 -186024 -147643 -453989 -441697 -300620 -206766 -391736 -448220 24392
5735 24392 92830 -234529 -38967 52413 -136549 -540552 -298490 16784 99818 -196970
5725 -196970 228180 177924 -53735 -270525 -326482 -434870 -23014 -204414 -698671 -562803
5715 -562803 -72134 -211563 -457387 -158420 221325 298031 -65418 -241010 197959 201086
5705 201086 -178592 -392112 -121592 -428549 -653065 -471381 -162914 -192236 -492517 -569110
5695 -569110 3927 29318 67859 92119 247458 21566 97239 155738 -197443 -428370 -322271
5684 -322271 -261660 178977 -1808 -236602 92490 225456 -107893 -645983 -536954 -197993
5674 -197993 -432630 -611583 -348522 -261147 -519164 -361090 254100 295147 -227790 -155090
5664 -155090 -32397 -257275 113333 53291 -263879 -236153 -13138 -281048 -533790 -465219
5654 -465219 -278888 -67293 -181499 -273454 -13479 53899 -49178 -200512 101162 -168750
5644 -168750 -403456 -598772 106188 -30635 -544325 -444707 -236390 -419454 -105393 173606
5634 173606 137915 -385305 -381463 -267731 -281636 -455396 -398489 112529 303542 352735 82349
5623 82349 -82159 -41650 -253459 -205759 -240431 -497486 -658136 -391820 -321306 -286140 -539175
5612 -539175 -585017 -306583 -72849 -376775 -396116 -6722 -13608 -41141 -57000 -130297 -16442
5601 -16442 -324503 -408293 -277719 -165724 -449214 -493081 -239069 -22392 -3442 -168916
5591 -168916 -198994 -111139 -323347 -253746 -303917 -257932 -387427 -558994 -6190 205161 -300158
5580 -300158 -383841 -313474 -273280 -399993 -713535 -389555 -225000 -337265 -626889 -468455
5570 -468455 -470894 -210690 -36014 260401 -11469 297 -68068 -44254 88982 -74534 -291452
5559 -291452 -26695 96966 210890 18938 -33854 -6101 -6207 -393782 -355801 20134 -15426
5548 -15426 -643510 -528106 -104401 -274629 -531946 -201852 360505 72084 -228263 -346065
5538 -346065 113900 -42839 -558801 -566464 -466230 -292242 -535714 -544205 -154565 102483
5528 102483 -485249 -399721 10811 90554 -461218 -593323 -384077 -197336 -216412 -374912
5518 -374912 -107308 -35544 68049 50065 -134988 -262065 -389277 -406036 -463930 -244597
5508 -244597 -9507 -90363 -418135 -178138 -142395 -24247 43540 -56045 -291059 -164547
5498 -164547 -296586 -399647 -295224 -284066 2281 -22143 -342446 -369796 -70597 -237625
5488 -237625 -514921 -485514 -314107 -428030 -647004 -357007 -94633 -227436 -135975 58881
5478 58881 317820 196220 -217827 -141962 145166 -49213 45925 -84807 -159900 -534703
5468 -534703 -332619 -245898 -259248 -294304 -386030 -208218 17660 92638 151721 180321 25021
5457 25021 12345 36080 -134723 -26220 190127 238572 -242476 -194719 -282676 -387332 -731224
5446 -731224 -187097 -198206 -438652 -765406 -321324 -524855 -439051 -113893 221166 -12621
5436 -12621 -307891 30662 159333 -29053 -207575 -55160 -242486 -177500 -197787 -130999
5426 -130999 69736 60773 -288817 -442 -46536 -145877 -162403 -306400 -315759 -53042 -424813
5415 -424813 -692631 -293468 -105956 -274193 -321545 -184528 -215624 -258046 -227165 -409130
5405 -409130 -152859 16946 -481754 -473331 -45299 -23457 -370268 -384725 -36487 192927
5395 192927 81896 68795 475857 351582 -268168 134472 492569 133919 -67014 -300284
5385 -300284 -195908 -324260 -227765 -151427 186697 -237368 -103154 164337 -81458 -759122
5375 -759122 -302012 -60194 -94483 -79577 227467 333745 52631 333803 321941 97687
5365 97687 -220849 -484456 -333319 52703 -73951 -228185 45803 167570 373976 -392137
5355 -392137 -465766 13682 53887 -195297 -150318 50463 175180 131069 141440 -10629 -204852
5344 -204852 -401519 -497981 -266482 -99450 -319267 -440235 -155031 179279 123983 54035
5334 54035 -340769 -307806 23236 -165051 -324282 -218179 -184817 -237587 26281 -173764
5324 -173764 -159388 -191867 128195 -259354 -700371 -666801 -285283 -42699 92806 -73705
5314 -73705 -131284 -184453 -82623 -269755 -519926 -294647 -283652 -345886 -66484 12060 175701
5303 175701 -80143 53497 208615 -33530 -681791 -745088 -278764 -72824 -136858 -70697
5293 -70697 44910 139757 -112094 4270 256768 176383 -203177 -513368 -136438 35439
5283 35439 -197710 -520769 -400742 -274628 -215375 -358079 -557975 15507 317962 17317
5273 17317 -24178 39417 -88603 -19419 -313179 83225 120560 177263 267103 374978 432414
5262 432414 604571 346377 129499 39848 -123698 -498342 -752258 -735032 -443078 -511003
5252 -511003 -412365 -164838 49073 234805 115401 53797 -141388 34810 -166748 -176440
5242 -176440 -79453 -22783 -756 387985 240411 322582 258016 -535 -227307 -177933 -214537
5231 -214537 -553365 -487963 -169929 -40127 95089 7833 -31030 -75376 297133 667708
5221 667708 522383 -266813 -88182 145796 179550 164186 392836 353017 318785 46903
5211 46903 454378 912940 698852 -147992 114771 442092 -2965 -273490 150491 533023
5201 533023 474502 266676 228798 701753 856075 597870 590318 696910 252725 136774
5191 136774 311692 629911 542043 347441 509029 757069 688755 419476 488708 674186
5181 674186 634557 87966 98762 242575 313829 635957 487855 299727 420139 410875 46164
5170 46164 189652 539246 418441 -51264 177222 554578 897239 385037 193151 596541
5160 596541 500247 170336 327367 628590 803924 447587 346566 520220 293561 -172409
5150 -172409 -305464 -187219 -361167 -645150 -290939 -188488 -67499 83684 216958 77556
5140 77556 119959 376354 547917 338201 263244 -142384 -188137 141179 280217 116801
5130 116801 -222986 -289825 -106648 -187392 -508294 -447320 -308600 -39058 -218134 -76933
5120 -76933 105076 161791 215831 234663 274207 237006 164898 259262 195406 374565 405693
5109 405693 -156911 -567624 -205957 -48910 -436366 -566318 -366573 -310510 -205157 189678
5099 189678 643875 729566 738269 744869 714774 562981 259970 30182 265646 488524 411159
5088 411159 322544 385534 254895 -75597 -161952 -119167 -373613 -481302 -142868 -35350
5078 -35350 215351 234452 179412 -63562 160901 646000 744034 472183 255474 225360 398141
5067 398141 192084 127964 312775 453333 -122210 -633457 -399171 -250716 -557610 -416841
5057 -416841 -31544 182988 -13858 -43993 342310 652830 405498 92705 329437 184199
5047 184199 376301 507058 651930 629866 235953 135550 227709 70124 -167604 389
5037 389 37598 -359357 -474529 -276586 192040 61438 181977 150224 160285 110090 42664
5026 42664 22295 89251 -178575 -226207 58220 -37466 -298588 58165 -16872 -234881 73275
5015 73275 46230 -6648 -229748 -32622 548073 385063 62522 173582 530464 698176
5005 698176 379096 125924 574696 410246 51733 448093 582532 155856 -3906 262485
4995 262485 96558 142322 207203 -28653 25409 318034 263021 351290 763956 582871 403001
4984 403001 255288 50924 -242072 -85178 113893 101528 143943 84780 55608 267856
4974 267856 407639 363676 359436 218688 -28167 -147003 19157 45184 227327 6225
4964 6225 278281 667618 440654 484006 451891 399342 321686 197161 287443 491513 464530
4953 464530 221965 433815 331585 -61546 -110478 285538 106916 17180 103770 -1169
4943 -1169 267738 374421 198300 -16082 -125683 27985 -298579 -536425 70022 549103
4933 549103 413567 341881 669314 730754 537012 396930 535589 359606 46487 -331382
4923 -331382 -358935 87617 14936 -141611 -13635 420346 274051 257336 248153 468792 197714
4912 197714 198022 380553 557176 217529 416204 849432 804485 696735 393613 290522
4902 290522 341422 418513 602488 575700 22124 6037 113516 235921 79266 18975 78414
4891 78414 219520 311153 395964 484605 259729 219200 475539 484013 247637 132678 71406
4880 71406 -131809 182630 275397 157802 -25449 604800 578771 398571 266776 33056
4870 33056 -92914 -64402 91312 -171645 -117936 5014 297094 328089 445233 362664 450459
4859 450459 264959 125100 142523 -78314 179645 104511 45052 336605 307614 -9901
4849 -9901 186689 485615 422724 -110404 -121907 363516 60561 156740 331379 172149 312130
4838 312130 4181 -411862 -228781 -138251 163439 436677 511630 373162 475935 811884
4828 811884 675984 446943 280705 215460 292175 316737 396662 727543 556835 360528
4818 360528 693211 726508 278363 201002 190619 54998 201941 207415 173774 292594 295908
4807 295908 449636 644151 639879 314552 160444 468043 583867 464578 699810 792060
4797 792060 806039 1024144 1175059 1251816 963320 479671 517756 845054 777224 769894 562625
4786 562625 307937 546640 472263 425123 419961 552829 719274 801400 757023 956891 1283121
4775 1283121 1095640 887968 947947 829678 621784 408982 906883 1478204 1298292 871362
4765 871362 915896 1263984 1257126 1078233 1382859 1406818 809431 642341 1032700 1367942
4755 1367942 1503725 1323290 1526185 1624164 1609902 1335015 1342384 1636648 1327426 1528022
4745 1528022 1608961 1394282 1539480 1962087 2104021 1860957 1351884 1710702 1929715 1845048
4735 1845048 2153804 1914779 1885778 2064319 1887598 1615949 1545795 1444603 1184403 1389849
4725 1389849 1368515 1339619 1525400 1676230 1602413 1635197 1845126 1854511 1720637 1749716 1874448
4714 1874448 1959532 1306256 1453548 1819872 1464337 1031865 1155242 1414701 1388684 1230948
4704 1230948 1183792 950843 1272613 1528811 1499628 1579852 1259584 1673111 2215336 2179494
4694 2179494 1958871 2315066 2480150 2103068 2231888 2462630 2048702 1842478 1692320 1964936
4684 1964936 2249633 2065927 2077414 2283132 2598398 2408707 2277495 2114065 2300993 2188510
4674 2188510 2509632 2530533 2486440 2289713 2291858 2739747 2746962 2874585 2638482 2623383 2578920
4663 2578920 2349830 2302582 2639938 2495259 2246072 2471732 2579014 2166513 2294198 2485839
4653 2485839 2374837 2177008 2294934 2367315 2269695 2570056 2748510 2968121 2491693 2414248
4643 2414248 2642066 2497580 2215080 2258572 2301826 2040418 2079219 1963250 2601194 2579229
4633 2579229 2123852 2266137 2264757 1878478 2157474 2447407 2093389 2090521 2456673 2438352
4623 2438352 2655760 3138270 3260945 3321311 3225316 3359022 3705197 3658986 3643671 3842777
4613 3842777 4007070 3753642 3647436 3752097 3812651 3545023 3264147 3405425 3959938 3887245
4603 3887245 4164589 4317294 4286254 4298564 4635412 5157555 5303279 5375196 5732566 5815678
4593 5815678 5945953 6351424 6477103 6707072 6635380 6446264 6162697 6180824 5599658 5405940
4583 5405940 6081372 6467701 6203415 6397836 6808124 6796586 6740325 7108539 7609033 7741992
4573 7741992 7542584 7780661 8303436 8518218 8578197 9278900 9427746 9010958 8718422 8746415
4563 8746415 8595149 7946957 7969850 7992361 7579984 7319167 7829340 7990102 8008138 7969466
4553 7969466 8309171 8623051 8748454 9343276 9893115 10012385 9900300 10285378 10738480 10591184
4543 10591184 10497644 10826032 10833654 10720680 10947752 11674578 12338569 12489003 12835029 13394141
4533 13394141 13246406 13008245 12945768 12790081 12852723 12914351 12762361 12842544 13193438 13355095
4523 13355095 13217725 13251380 12814741 12204498 12032632 12093384 11822593 11843425 12122978 11981056
4513 11981056 12046361 12633993 12746008 12119658 11826738 11555460 11093274 10309886 9682108 9452702
4503 9452702 9851164 9925450 10030335 9883323 9893699 9905334 10207960 10183539 10069019 10430370
4493 10430370 10623204 10901146 10893931 10919628 11287949 11216503 11048521 11286145 11044704 11005130
4483 11005130 10514461 10279026 10512965 10602945 10243324 10033706 10361343 10682201 10571251 11311506
4473 11311506 12145004 12864430 13740203 14676583 14972653 14891687 13919657 12898564 11716817
4464 11716817 10751765 9719293 8698201 8075863 8045293 7872893 7477298 7266409 7030795
4455 7030795 6812834 6167945 5704217 5603247 5550575 5209837 5040602 5138450 5022302 4810096
4445 4810096 4792119 4760951 4709228 3804132 3846429 4178999 4339520 4442682 4463639 4429851 4634737
4434 4634737 4613594 4582198 5166572 5129732 4630147 4946687 5068147 4706675 4417088 4737924
4424 4737924 4905932 4680341 4407929 4723120 5013767 4700949 5162473 5747601 6199966 6362772
4414 6362772 6708073 7298121 8074880 8848161 9307480 9581440 9650739 9225578 8418025 7482996
4404 7482996 7074085 6696788 5900302 5661973 5421981 5418332 5453585 5039262 4847510 5049183
4394 5049183 5144197 5238078 5387121 5198291 5227642 5329429 5077234 5303327 5653169 5591581
4384 5591581 5278698 5352680 5465492 5617850 5395852 5559128 5583921 5493653 5428682 4985771
4374 4985771 4680026 4789028 4922281 5008113 5065139 5135924 5213171 5115922 5351121 5247494
4364 5247494 5100077 4952392 4942581 5080162 4926083 4968066 5187050 5552732 5368348 5103167
4354 5103167 4971669 5046661 4940640 4752501 4566005 4458266 4511294 3948817 3645704 3987072
4344 3987072 4268912 3905582 4007501 4486221 4513986 4160494 4070503 4438364 4669126 4599752
4334 4599752 4609831 4556412 4609440 4740265 4549114 4208232 3840069 3505874 3151928 3253048
4324 3253048 3423800 3334330 3397702 3450575 3302596 3447815 3671633 3313428 3394606 3735332
4314 3735332 3734484 3504449 3777040 4200150 3830139 3780380 4083971 3819214 3318978 3211487
4304 3211487 3274585 3122099 2538747 2004205 2431024 2630599 2449115 2118586 2309719 2404435
4294 2404435 2027050 1725421 2027247 1896700 1383764 1584407 1796407 2002989 2116911 1982194
4284 1982194 1829107 2277128 2121559 1478493 1577047 1830377 1751452 1882479 1799620 1494324
4274 1494324 1690418 1911099 2060234 1803832 1900099 1799576 1849289 1909036 2012320 1792284
4264 1792284 1669019 1696785 1781075 1875442 1648997 1682152 1997106 2094575 2098131 2232200 1973605
4253 1973605 1987679 1898134 1833296 1872005 1369110 1505803 2028728 1844147 1748502 2163487
4243 2163487 2097941 2202821 2091464 1932344 1858971 1915358 2125728 2139686 2258810 2657407
4233 2657407 2874783 2856441 2885962 2610912 2450064 2027632 1574703 1719500 2044680 1964093
4223 1964093 1966161 2365240 2619397 2613683 2807192 2564976 2490774 2631438 2622536 2432652 2787655
4212 2787655 2607019 2898073 3063998 3155150 3384239 3430756 3435450 3331541 3604093 3664368
4202 3664368 3632445 3535385 3701098 4156344 4280039 4421226 4779184 4862212 4953866 5382043
4192 5382043 5889327 6055619 6003900 6276247 6324418 6291781 6181228 6244226 6459277 6787256
4182 6787256 6380160 6167399 6265501 6327836 6370449 6352466 6429713 6489029 6771050 6702870 6703215
4171 6703215 6902220 6974897 6465031 6491072 6765037 6960934 7029486 6945210 7260908 7123174
4161 7123174 7154152 7044501 7428261 7626139 7689599 7515315 7396322 7532946 7886312 7990319
4151 7990319 7997919 8415985 8369400 8268316 8166558 8538740 8478081 7858159 7505711 7548554
4141 7548554 7470584 7330328 6735135 6870760 7105716 6630183 6604293 6841974 6569489 6275000
4131 6275000 6474296 6764658 6536682 6437251 6636673 7150575 7417266 7550325 7558021 8006978
4121 8006978 8092682 7840235 8088345 8542522 8454151 8508636 8993736 9345309 9613648 9662031
4111 9662031 10229196 11033802 11355820 11966978 12633711 13021147 13371845 13660622 13637847 13650899
4101 13650899 13683790 13788227 13736292 13509991 13159162 13478875 13886550 13622927 13788505 14135872
4091 14135872 14410462 14454358 15149015 15856416 16322663 16707248 17065208 17929747 18596155 18561324
4081 18561324 18747519 19086619 19199810 18651528 18262260 18421409 17947311 17907249 18033894 18222706
4071 18222706 18210500 18223801 18412097 19040435 19463815 19575216 19773580 20339817 21111816 21303098
4061 21303098 21523348 21839138 22127505 21940783 21989777 22088231 22205454 22314750 22304113 22493174
4051 22493174 22529494 22888292 23261472 23408985 23690267 23623530 23441098 23552232 23830120 23866574
4041 23866574 24298684 24157972 23902741 24259586 24419963 23775184 23612899 23869482 23076944
4032 23076944 22034408 21653558 21494515 21043020 20604224 20027255 19820355 19523274 18908282
4023 18908282 18173779 17933013 17497996 16701653 16111969 15742519 15587754 15326766 15510107
4014 15510107 15656032 16004241 16429757 16473145 16499569 16923914 17345611 17459017 17388516 17551321
4004 17551321 17627237 17559463 17098237 16979589 16725067 16476500 16292645 16323832 16375849 16516435
3994 16516435 16404617 16094898 16077422 16172248 16109198 16179608 16258592 16533476 16675937 16490431
3984 16490431 16920303 17067282 16801392 16588488 16493422 16088852 15646876 15349091 15274360 14919256
3974 14919256 14737232 14706710 14227554 14023688 14076339 14116821 13941153 13792399 13338696 13071318
3964 13071318 13051223 12575679 12357481 12320632 12108205 12082379 12245234 12184308 12273476 12323947
3954 12323947 12428017 12342564 12212233 12108519 12256269 12176373 12539143 13061023 13068602 13054699
3944 13054699 13494251 14087664 14229155 14208195 14464740 14394058 14336270 14548942 14682662 14939358
3934 14939358 15356829 15397655 15417124 15788505 16237737 16392152 16627359 16914083 17086719 17514242
3924 17514242 17543187 17626062 17984171 18066037 17974317 18301500 18767522 18908822 18750578 19259198
3914 19259198 19921121 20178042 20262397 20882162 21727436 21951147 22569483 23088064 23668525 24156967
3904 24156967 24981151 25883151 26932145 27813730 29082741 30446829 32096511 34182322 36299214
3895 36299214 38853708 41924763 45222856 49006159 53135326 57682090 62731465 66997314
3887 66997314 69855926 70515045 67610269 62273407 56720750 51373551 46856794 43258511
3879 43258511 40428433 38297691 36561073 34735486 33547502 32186905 31233212 30737068
3871 30737068 29945241 29072655 28527784 27928897 27527576 27531616 27446434 27547748 27743922 27624341
3861 27624341 28010267 28374194 28416746 29033984 29596760 30090892 30744502 31813131 32626287
3852 32626287 33499780 35102957 36831953 38464848 40239116 43107040 46184822 49206273
3844 49206273 53104441 57668790 61692270 65813787 69660749 73419629 77517301 81819909
3836 81819909 85737931 85850450 80193395 70166688 60522754 53536540 48161009 44218601
3828 44218601 41212166 39266600 37656713 36152608 34771459 33705919 32696374 32206962
3820 32206962 31216796 30177516 29953454 29483998 28856134 28788744 28945542 29291919 29254015 29207906
3810 29207906 29253794 29706469 30115297 30226858 30690680 31028056 31479241 31695748 32501354 32661576
3800 32661576 32452390 32608985 32756036 32661175 32336288 32622699 32843592 33221143 33591503 33963778
3790 33963778 34620590 35209695 35975330 37147316 38178748 38861671 39561459 40395606 41587056
3781 41587056 42495198 43614661 44274427 44615921 45642318 47183600 47984864 48904823 50566945
3772 50566945 51934193 52782857 53902519 55649549 57477064 58817832 60167773 61947624
3764 61947624 63964198 65606538 67168057 69523973 72204566 73768575 75513453 77636820
3756 77636820 80088525 82398220 84507767 86790263 89338918 91831491 94112543 96835910
3748 96835910 99599013 102493349 105461883 108717185 112011272 114895822 117731918 120857900
3740 120857900 124186624 126341306 128648964 131427176 133887011 136005444 138639686 141322886
3732 141322886 143564258 145838445 147475847 149143991 151268985 153064637 153799302 154431108
3724 154431108 155870564 157120058 157609870 158510901 160250342 161832947 163263575 164582929
3716 164582929 166755495 170002711 172873766 176140581 181244780 187037253 193404977 201641927
3708 201641927 211037374 221921669 233380406 244846940 255650650 263654653 264629612 257770630
3700 257770630 244050921 226424712 208467478 192702695 179535474 168215928 158623776
3693 158623776 150448295 143347076 136841365 131172241 125984576 121101557 116453421 112155457
3685 112155457 108272790 104750103 101793773 99416497 96968054 94693158 92686007 91069824
3677 91069824 89926199 89282063 88695874 88293329 88255767 88085158 88357811 88979132 89169850
3668 89169850 89350656 89934209 90139748 90312011 90373121 90487137 90444481 90278007 90386239 90254994
3658 90254994 90058998 90368729 90871620 91492797 92129523 92668903 93406293 94266166 95530028
3649 95530028 97508898 99505516 101113670 102976223 105916141 109424169 113296652 117646102
3641 117646102 123119494 129574032 136756169 144977640 154645435 165618736 177664777 191098144
3633 191098144 206054057 222325172 239453184 256345033 271958943 285807482 295827914
3626 295827914 301366065 303827921 303787403 301644668 298120415 294075475 289959210 286435822
3618 286435822 282236322 277728058 273169925 266848211 258193730 247333892 235232370 221334408
3610 221334408 206066679 190719177 176241193 163112550 151032672 140312872 131184980
3603 131184980 123314956 116048098 109549625 103831090 98531347 93720928 89332182 85430349
3595 85430349 81787255 78512556 75493735 72706085 70356849 68653198 67023383 65260352
3587 65260352 63680240 62589016 61869238 60849344 60004748 59562358 59130514 58338551 57234604
3578 57234604 56599260 56091304 55629761 54396831 53477231 53186120 52580831 51922848 52128982
3569 52128982 52227114 51984690 51755779 52206498 52430102 52559035 52236343 51528643 50870219 50139487
3559 50139487 49229694 48309172 47519041 46902711 45947053 45008604 44189712 43088624 42579022
3550 42579022 42097674 41688136 41185433 40986691 40895802 40689774 40688295 40922036 40900197 40583599
3540 40583599 39957747 39233232 38457100 37854458 36759129 35716721 35512983 35221511 34576203
3531 34576203 34275610 34476735 34196865 33744645 33675882 33808366 33760872 33494657 33809550 34205205
3521 34205205 34125532 33942696 34060213 33884076 33735638 33354660 33018379 32573377 31753063 31290030
3511 31290030 31401097 30978591 30984153 31044591 31053267 31136418 31347424 31733703 32037142 32138768
3501 32138768 32372041 33046717 32947585 32956822 32882174 32818591 32638452 32525465 32132183 32250522
3491 32250522 32700812 32360110 32200474 32281965 32282356 32216078 32331021 32513388 32886311 32808576
3481 32808576 32999059 33599901 34343458 34600183 34985443 35527916 36256057 36729691 37269500
3472 37269500 38139212 39106815 40260866 40907217 42047034 43611061 45274074 46193421 47440636
3463 47440636 48841017 50040666 50955621 51967092 53432850 54711156 55886742 57562955
3455 57562955 59425021 61263643 63169549 65795517 68216878 70732206 73516292 75822049
3447 75822049 78823503 81643063 84270345 87231749 90333627 93424955 96581631 100023229
3439 100023229 102938851 106068321 109064110 111797553 114456552 117240062 119778108 122607525
3431 122607525 125348713 129032382 133123887 137884039 143135011 149005777 156041053 163679252
3423 163679252 171905023 180829687 189848066 198833729 208700520 218793329 228333649 237174787
3415 237174787 245754406 253034151 259485671 264465136 269324682 274362736 279081957 283537517
3407 283537517 288405850 292648442 296358729 298447461 298853304 297420373 293595616 287292698
3399 287292698 279202842 270135276 260572786 250590263 240507918 231159874 222704825 213758990
3391 213758990 204821486 196034022 187190916 178040091 167651111 156930215 146959128 136976302
3383 136976302 128040730 120140265 112387746 105803097 99799720 94130848 89248060 85205047
3375 85205047 81398507 78012868 74870463 71888615 69250870 66888934 65108394 63384149
3367 63384149 61437514 59540587 57770254 56318928 55111436 53742036 52236228 51395596
3359 51395596 50309600 49321438 48237396 47182808 46299947 45112559 43033841 41910383
3351 41910383 40921021 39671279 38665786 37899242 37191352 36326339 35275608 34795230 34784069
3342 34784069 34088357 33152969 32825602 32292574 31241096 30859059 30384005 29876612 29412518
3333 29412518 29000091 28247861 27830642 27681806 26834391 25727039 25389690 24916859 24044212
3324 24044212 23522788 23013506 22729535 22297771 21571436 21303102 21220804 20803210 20150561 19763886
3314 19763886 19187311 18613514 18211826 17614217 17706708 17622939 17345313 17271193 16882801 16524272
3304 16524272 16427893 16213511 16159925 15572190 14732429 14546051 14660727 14365825 13961795 13628738
3294 13628738 13554373 13257366 13047860 12769860 12600431 12393846 11811897 11818808 11862523 11653251
3284 11653251 11532724 11512330 11557998 11552460 11168134 11354801 11229580 11244045 11108202 10534519
3274 10534519 10121720 10083486 10075132 9911173 9763332 9481307 9448482 9246358 9339880 9188776
3264 9188776 8751842 8820726 9303611 9144791 8929551 8909368 8970562 8904244 8904467 8512028 8102818
3253 8102818 7878183 8047960 8548382 8627867 8393901 8190981 8631872 8789164 8271647 8158357
3243 8158357 8579695 8662687 8276365 8413259 8912542 8668736 8997096 9465400 9333506 9556261
3233 9556261 9638085 10117227 10720655 10858528 11215587 11479304 10705493 9818833 9629934 9257443
3223 9257443 8510410 8112385 8299640 8247172 7679239 7605564 7806496 7327100 7480334 7530404
3213 7530404 7275837 7364365 7448765 7383377 7814216 7511879 7549697 7872528 7986719 7898682
3203 7898682 7797393 7510440 7471447 7714946 7734791 7910414 8461993 8484434 8509450 8739546
3193 8739546 9047547 9113286 8919554 9271234 9402968 8968600 8683774 8993747 9535224 9738589
3183 9738589 9620224 10007924 10597271 10544552 10644383 10973239 11037013 11414808 11521840 11857179
3173 11857179 12552850 13261291 13323699 13463191 13502886 13640054 14117863 14147489 14046941 14294623
3163 14294623 14657026 14993053 15147907 15280355 15820627 16189652 15937929 16315361 16968474
3154 16968474 17450233 17650995 17827910 18577526 18922120 19088180 19620517 20680497 21367345
3145 21367345 21961575 22683992 23276249 23800158 24389396 25202521 25889364 26280688 26626475
3136 26626475 27253650 27530925 28091521 29137440 29735672 30412938 30819605 31478910 32611319
3127 32611319 33357847 34360451 35766140 36760672 37962372 39129601 40546129 42143476
3119 42143476 43871364 45251175 46468820 47959407 49734915 51906082 53349880 55685636
3111 55685636 58882808 62072110 65252185 69544834 74009486 78500858 82731792 87208820
3103 87208820 91675325 95285872 97328460 98733669 98971129 97533995 94856460 91171977
3095 91171977 87022886 83001083 79168981 75530558 72605477 69614471 66623107 64195268
3087 64195268 61325911 58353607 55267632 52263323 49590885 46547904 43418064 40902423
3079 40902423 38645114 36233910 33915474 32059380 31007759 29549489 27908292 26379459
3071 26379459 24937599 23567175 22554616 21420067 20526691 19917303 19388650 18619387 18076154
3062 18076154 17594731 17177835 16593609 16187598 15499518 14943482 14497594 13966529 13396318
3053 13396318 12984640 12464314 11579674 11127765 11292337 11277551 10644608 10293481 10214951 10170420
3043 10170420 9895458 9862175 9486008 9246825 8583170 8478672 8462356 8485547 8480773 8205562
3033 8205562 7886732 7662732 7689344 7706765 7281699 6645990 6668560 6685284 6508536 6313072
3023 6313072 6194384 6344565 6486256 6028886 5881431 5846093 5874566 5762397 5600069 5324700
3013 5324700 4980917 4828589 4784178 4982797 5130881 4872379 4540899 4431438 4540578 4432565
3003 4432565 4293184 3842074 3715494 3649250 3734690 3578818 3626827 3736325 4028382 3684072
2993 3684072 3420353 3594295 3554432 3395777 3551304 3797879 3485989 3318155 3241907 3425898
2983 3425898 3482033 3619660 3302654 3110323 3203850 3287204 3106804 2919861 3217347 2980205
2973 2980205 2697019 2951385 3197639 2872873 2898067 3033552 2727558 2767559 3000401 3343652
2963 3343652 3109370 3009537 2947441 2843543 2433184 2430150 2785294 2777215 2414482 2367963 2494686
2952 2494686 2538421 2688112 2513200 2485264 2659719 2688215 2310779 2569919 2897190 2714352
2942 2714352 2634622 2703935 2575978 2496842 2445546 2398578 2629036 2174962 1877152 2365676
2932 2365676 2361814 2080790 2448225 2525826 2037040 1790666 2315500 2587830 2463601 2112848
2922 2112848 2202276 2389592 2026802 1980932 2312765 2360249 2274855 2310894 2314901 2230447 2281814
2911 2281814 2426042 2097146 1887775 2148655 2026079 2115713 2315461 2452856 2553970 2965485
2901 2965485 2729359 2659328 3034157 2753522 2642319 2840016 2627095 2300141 2345365 2629224
2891 2629224 3165697 2741623 2223868 2587829 2981893 2707057 2723647 2729696 3226663 3273051
2881 3273051 3317772 3544084 3857045 3932967 4003068 4217890 4348644 4097246 3682731 3810064
2871 3810064 4191575 4284081 4486323 4465526 4333402 4868450 5232163 5357841 5204271 5189192
2861 5189192 5185237 5115366 5261750 5304902 5434049 5298332 5307434 5753604 5740006 5649631 6028149
2850 6028149 6406756 6710472 6768946 6750785 7090691 7377272 7366026 7372994 7449823 7846481 7918586
2839 7918586 8126850 8739011 9250549 9873012 9716019 10295586 10963062 10909513 10979461 11472598
2829 11472598 12236081 12931107 13630195 14188398 15257129 16314708 17232914 18309590 19249293
2820 19249293 20276636 21818370 23300113 24927715 26594484 28256815 30496030 32245450
2812 32245450 33941982 34976854 35615279 35732886 36090449 35987369 36193315 36303498 36608557
2803 36608557 36974863 37253045 37323018 37607698 38188541 38725099 39380527 40242761 41618639
2794 41618639 43108923 44698150 46892080 49600102 52369459 55582566 59719768 64414232
2786 64414232 69135097 71947628 71105741 66697609 60368802 54091739 48768426 44481234
2778 44481234 41253775 38537362 36227492 34717802 33407746 32093469 31025706 30501677
2770 30501677 29791022 29356005 29057102 29400876 29719864 29823567 30014968 30563013 30927018
2761 30927018 31423830 31927233 32399249 32697849 31929589 30650208 29496558 27697590 25217381
2752 25217381 23348694 21516026 19770216 18490961 17322840 16261374 15193263 14456497
2744 14456497 13791212 13012917 12338917 11931864 11246728 10517852 10065134 9803421 9553805
2735 9553805 9032321 8430266 8219116 7756805 7430469 7432020 7483231 7260393 7213344 6849083
2725 6849083 6644969 6228636 6088102 6103261 6226480 5771103 5667568 5688123 5502919 5223522
2715 5223522 4999954 4963452 4474421 4239332 4167152 4310994 3621200 3498101 3888393 3756070
2705 3756070 3917138 3729336 3371033 3075013 2994099 2662210 3015008 2931235 3016381 3086838
2695 3086838 2829666 2813897 2920160 3021283 2793259 2641405 2464097 2719701 2627296 2612193
2685 2612193 2669813 2861507 2796810 2746859 2605480 2339629 1663348 1608530 1860174 1769675
2675 1769675 1529136 1382818 1498748 1499689 1616162 1596476 1464891 1473857 1502074 1750112 2126284
2664 2126284 1650104 1503795 1875658 1598015 1643362 1355290 1454710 1496398 1691677 1577846
2654 1577846 1774424 1522977 1563847 1481087 879298 1045650 1030910 971614 1062786 1301159
2644 1301159 1200211 1008402 1110429 1581576 1713303 1044525 933118 1069094 999850 622057
2634 622057 491412 1164739 1383923 1035915 1328121 1373499 864135 515030 723938 752291
2624 752291 365566 379526 363618 820445 1052272 1177246 1382204 1394247 1153215 989057
2614 989057 775773 551444 473919 540971 719618 671447 390189 445912 611089 791231
2604 791231 1052552 797203 689482 492347 456674 398938 856630 685370 557201 503240
2594 503240 509574 281166 284146 367273 684620 732568 606431 608389 384711 532106 642052
2583 642052 347851 220703 341836 747961 936036 687039 750539 676547 360348 498937
2573 498937 569809 -500 10597 202467 415055 492902 425437 296979 535636 591899 566002
2562 566002 900617 420009 -19130 339545 559544 647017 605555 923423 1221223 1179762
2552 1179762 524584 590313 608145 313398 118488 275127 208148 321243 55394 342129
2542 342129 707994 733017 562839 632184 487351 683872 657923 559793 740717 971175
2532 971175 800790 539613 358801 864724 787746 487927 559769 607588 415113 126247
2522 126247 105675 474144 575521 427715 122914 330067 303354 133785 511536 385187
2512 385187 545843 317371 94171 344604 657912 318939 58598 4331 520850 343524
2502 343524 42771 123266 144866 21380 -167039 9855 24513 -311002 -5202 -89630
2492 -89630 -161977 57132 627268 587647 95345 526987 701858 202056 52514 187280
2482 187280 286924 41877 -74522 119977 489404 191723 263395 337747 42145 -144079
2472 -144079 -152461 -253858 -305885 58674 425524 389727 120894 457218 474025 274150 412003
2461 412003 264725 16691 -211828 -153337 -23703 129213 152461 -82279 120078 425902
2451 425902 353574 304278 421070 557915 308079 144160 193245 403514 148982 262400
2441 262400 232643 28786 277285 349019 545610 379122 411420 233253 135380 -253282
2431 -253282 -516427 -107719 -25733 -354829 -391073 -364538 -372743 -60888 279958 388516 422514
2420 422514 218800 408390 565430 551447 439577 413133 37069 -118945 165430 -11121
2410 -11121 -261352 -100785 278417 69962 -158544 -348217 -152198 -346768 -446780 -249905
2400 -249905 -89166 -256278 -133788 60621 309690 -15779 -84975 278567 395245 535590
2390 535590 504953 311884 163340 184121 225002 420960 207493 -68020 -48363 29170 58180
2379 58180 -316905 -187627 201132 327783 -40633 -170081 203278 110178 250910 122744
2369 122744 -21238 -21376 -1534 22796 332867 314504 221432 -68648 -57555 18635 -11814
2358 -11814 -301453 -157691 27832 -179056 -111187 374995 811023 797752 682578 637968
2348 637968 564831 640880 398077 116137 14602 -56737 -140498 -128680 -82300 32033 197647
2337 197647 260657 141230 -201430 -141009 2527 -137816 -463323 -176901 -197825 -203859 -268436
2326 -268436 338477 822740 642187 325097 626304 791346 786246 442603 200125 620307
2316 620307 612380 -180148 -163803 181953 107563 231526 364701 464928 328620 512132
2306 512132 460784 509829 400391 721871 730196 525780 695145 1022185 699099 234574
2296 234574 175933 397793 554173 108409 219225 592602 404678 327916 337310 465595
2286 465595 572824 435842 434336 257085 25518 216685 509726 135038 132335 369370
2276 369370 620748 808781 723396 712771 381338 69492 -14613 15016 -142268 -196348 -210272
2265 -210272 -18464 120078 515127 135169 342144 532761 336063 358182 286050 180371
2255 180371 254867 495865 485573 371284 83236 158128 257897 170656 253175 91703 210433
2244 210433 291021 226286 126489 325303 -173753 8064 233953 350269 318323 231316 407722
2233 407722 718687 711571 293066 178462 40463 38078 242107 266330 188806 346314 651614
2222 651614 746736 473775 505550 769587 489757 100440 352495 750777 427441 257362
2212 257362 340743 344656 530016 352389 460566 561435 801800 335670 451813 558801
2202 558801 805665 469503 396399 170540 197667 309627 320848 318025 281478 415565 871867
2191 871867 830969 510242 797309 1067546 756882 637331 668547 662101 584445 773184 809017
2180 809017 786228 264867 295030 912198 1057609 659611 907195 902155 762394 1255567
2170 1255567 1511553 1135816 706256 470400 956224 931974 435246 519994 856631 1113186
2160 1113186 1192568 1195488 1345820 1392696 1397132 1348092 1169373 842130 745314 853594 1021611
2149 1021611 1161292 1218093 1351415 1351818 1635435 1692217 1815064 1666221 1650374 1751179 1943702
2138 1943702 1895867 2049454 2469911 2452349 2506252 2643867 2682433 2556662 2893976 2829731
2128 2829731 2600585 2389758 2449506 2748042 3054598 3280808 3408272 3547333 3337250 3341044
2118 3341044 3359887 3649476 3464162 3480982 3327167 3397795 3850576 3907230 4086259 4254155
2108 4254155 4570338 4688992 4393508 4461168 4522311 5053041 5094157 4974753 5031278 5767603
2098 5767603 6030162 6253481 6555554 7135045 7309257 7762694 8039632 8719125 9125855 9225238
2088 9225238 9725427 11052535 11779624 12447509 13796694 15288459 15912522 16842779 18311406
2079 18311406 20308546 21870225 23743854 26183501 28587892 30655888 33827526 37813790
2071 37813790 42814729 48510632 56027584 65077881 76234167 88650343 106005269 125901127
2063 125901127 144069565 150890512 137636253 110923262 83512700 65926136 54455388
2056 54455388 46560412 40155864 35947875 32789634 30220152 27565712 25505769 24235900
2048 24235900 22637312 20064508 18316296 17302520 16077496 14825330 14134089 13111237
2040 13111237 12474191 11670221 11086334 10191087 9539041 9510165 9475095 9054982 8765819 8504437
2030 8504437 8507963 8019044 7346315 7288253 7195492 6809100 6357066 6105946 5778750 5253969
2020 5253969 4937608 4909609 4869447 4426130 4199191 4005049 4439052 4652720 4701678 4420836
2010 4420836 4590849 4248135 3902540 3852394 3896917 3503353 3540767 3561818 3387704 3457103
2000 3457103 3873035 3735391 3172097 3110393 3171303 2667547 2194839 2148129 2140610 2108737 2287045
1989 2287045 2633312 2704834 2651791 2504097 2407153 2477132 2238339 2251348 2254005 2023319 1928871
1978 1928871 1833173 1710575 1707351 1635827 1679532 1900974 1946489 1743741 1371744 1576207 1706620
1967 1706620 1661886 1217282 1189153 1190999 1082707 1211290 1406734 1785206 1778323 1609036 1673882
1956 1673882 1576045 1564971 1411392 1388555 1165786 570826 355167 585844 547446 690862
1946 690862 953224 1263912 919531 844335 1043011 1378503 1171380 1066872 970923 1128727
1936 1128727 973772 969125 1092846 1228028 1030772 715337 1054736 965043 746955 725585
1926 725585 550349 366240 216552 694332 371985 211393 345771 577963 149453 263530
1916 263530 839137 949026 788695 456045 827743 702730 384503 436921 371848 342624
1906 342624 381491 596752 504483 416718 275035 545203 772189 330732 -225231 1203
1896 1203 278487 141701 54808 586859 618898 220551 549084 1376265 942790 -216748
1886 -216748 -229043 70466 372685 -56024 -74424 641336 494152 74076 365616 648446
1876 648446 598110 280145 480421 565443 140946 109843 553799 829265 608237 490321
1866 490321 697112 322025 163026 429568 447543 303641 141759 118627 149854 129379
1856 129379 471040 126293 -409710 -475856 133221 401588 249172 230186 360912 244558
1846 244558 266973 329903 293065 417117 585376 24255 -111838 115311 161340 -149541
1836 -149541 292555 435562 166649 141625 311070 473162 413617 358021 443657 673000
1826 673000 764569 463526 256331 448380 680270 470532 491063 280684 589092 582576
1816 582576 507640 382960 308078 242922 108866 230059 295365 167259 63 89573 155423
1805 155423 218256 406521 846728 494062 -166406 16319 -95395 -364401 -237025 -176537
1795 -176537 12074 28135 -103566 51500 480803 605728 513592 214122 -7852 -66558
1785 -66558 -34996 -19814 584106 432312 325678 336098 488355 211388 281067 278056 186278
1774 186278 144138 294436 113858 -443578 -381066 109268 66833 -26565 241488 375909
1764 375909 490930 631839 513780 504122 266048 -195664 -361517 -249186 -371838 -310678
1754 -310678 -412602 -462838 -117495 90625 60728 -19321 -350725 -77139 -125696 -77691 -156603
1743 -156603 -186441 -191007 187349 387222 456318 458241 267332 125302 265756 212797 -8989
1732 -8989 -212441 -272449 94306 73708 17520 -162996 -398328 -330390 -79482 -390764 -366228
1721 -366228 -631056 -300838 202206 480379 246164 -39525 25501 107670 271862 156855
1711 156855 234291 574429 159179 -33408 300318 136641 -228519 -170123 27253 -2271
1701 -2271 -458094 -160430 239714 411673 160313 331858 51596 5289 -188714 54310
1691 54310 296955 135250 -90063 97599 170195 22544 93287 -115661 -173777 117530
1681 117530 -207589 -466855 -98628 43185 228985 104735 -77033 302684 -55752 -436764
1671 -436764 -407530 -180384 -259983 -371514 -58065 365015 531679 273559 -26359 205594
1661 205594 122071 -343425 -839762 -881984 -62572 -191912 -357613 -225113 -1688 209289
1651 209289 61969 -160483 -50299 -188004 -760440 -541207 43378 -185818 -213403 176297
1641 176297 277249 374032 174045 -121993 6851 -1253 356480 456564 20493 -53542
1631 -53542 213220 272342 375744 31708 -353341 -222281 -33605 -45969 3461 -247106
1621 -247106 156430 281436 462382 213831 164256 -143160 -179250 -61300 33511 -166219
1611 -166219 -154541 -283432 52872 145899 -81769 -243296 -95164 61601 -57045 -61474
1601 -61474 82851 326362 397408 258724 186407 178194 93653 -248225 -208444 -172596 -41783
1590 -41783 952 83732 1920 -291487 -135912 -155537 -369056 -436125 -240276 -338908 -108819
1579 -108819 -253394 182724 128830 -90843 -8895 -106650 -195856 -204223 -479687 -474696 -133442
1568 -133442 -174976 -93612 127489 32112 -99378 -392208 -162027 -332434 -715820 -550791
1558 -550791 -151067 15317 4383 356744 236385 147642 106272 -177792 -75912 -206556
1548 -206556 -362906 -260854 -51012 95315 242194 61538 72875 33891 -309568 -473371
1538 -473371 -572023 -529503 -38272 66635 -106925 59305 264029 374859 478406 440667
1528 440667 511036 156392 59171 -5594 -172096 -308103 -249640 -117804 -60029 -178646 7881
1517 7881 -86161 -145681 -282227 -105601 -266258 -124752 -118593 -130614 31129 -331838 -482756
1506 -482756 146503 295466 162837 73734 183494 295058 -30050 176954 -191024 -388276
1496 -388276 -216582 -96452 -259876 -255205 -176184 43396 135942 193383 87440 -12023 -100610
1485 -100610 -167956 -74660 -245363 -294209 -544852 -275208 -410194 -135129 31908 -196738
1475 -196738 -162469 31811 -100893 -386608 -151862 -169827 130238 -20714 135675 8491
1465 8491 364768 283186 359316 451471 -72169 -303628 -201982 -431172 -353622 -19128 -291156
1454 -291156 -61804 37138 -85956 -224470 -170747 -75101 -109599 34327 -116821 -88119 -230834
1443 -230834 -89840 206809 336750 110709 532341 189369 8644 107824 -186941 -430625
1433 -430625 -49804 -54614 -130225 -507995 -673783 -386545 -162616 -151254 -95106 152058 -228915
1422 -228915 -383575 -521494 -142236 -78062 -467787 -517346 -423183 -216256 -279771 -265450 -199618
1411 -199618 -70272 -198831 -544141 -380008 -588299 -503267 -260256 -203701 -360880 -271644
1401 -271644 17170 141789 233077 201031 164971 -268122 -592373 -401292 -167053 -524711
1391 -524711 -547615 -53167 171800 418952 136180 157173 288369 218385 111859 105749 -144922
1380 -144922 -373478 -211316 235452 576496 522008 292526 554441 622295 587348 482923
1370 482923 -20245 -312389 -384414 -87601 -265361 -539300 -463544 -79693 166497 -95374
1360 -95374 238507 -205184 -500390 -375517 -73325 -193609 -440834 -388408 320246 226394
1350 226394 -170114 114278 29689 -124247 -661 215515 -325619 -336118 -282753 41925
1340 41925 190440 13603 -369106 -453591 -153933 -78373 -201601 -579695 -173660 157556
1330 157556 61264 32814 184529 274678 190074 188673 218013 25822 -294820 46575 228071
1319 228071 -34655 -122468 -211839 -74322 -31780 -252131 -189760 -186220 -327341 122645 43126
1308 43126 -196341 -144221 34037 235619 51405 -57383 -369145 -112579 260796 289870
1298 289870 365959 286417 225975 472438 483176 42426 -241433 -443900 -477309 -719457 -659643
1287 -659643 -272303 -21372 -77424 69772 457191 312970 -37718 -353944 -8284 124791
1277 124791 -241730 -312964 -46098 135209 386457 252202 -46609 69889 222289 160497
1267 160497 -65196 -383434 -263491 -215255 -558691 -467196 -367168 -239354 -107036 73013
1257 73013 -102400 -114455 -34566 -137440 -219339 -70589 148401 -523332 -585919 -132780 -188128
1246 -188128 -413071 -113473 72543 -215431 -238537 -202118 -186257 -376295 -373125 -296076 17491
1235 17491 -291386 -70739 99281 74589 -20910 -5374 199621 7725 -115518 -270895
1225 -270895 -12475 -584236 -613510 -159444 170979 -21370 -164593 -71414 299473 -167522
1215 -167522 -489517 -484873 -445740 -472961 -329182 -33655 235778 391373 531365 580447 121926
1204 121926 -48165 64565 -174418 -475062 -83806 -46215 -394790 -337880 334065 556943
1194 556943 121126 -48149 246279 104857 -317255 -349906 -25377 -195293 -172717 58475
1184 58475 -39639 90590 -21175 -46010 16953 -57260 -242628 -327094 -505986 -373980 -8942
1173 -8942 -98032 -12160 -7947 91299 24380 83397 90629 -181887 -251121 -286871 -710427 -584509
1161 -584509 -45328 -453592 -716643 -249464 380621 -84781 -199548 -140584 -204747 -458344
1151 -458344 -446241 -378984 -516107 -410012 -195921 182443 19848 245510 -178616 95943
1141 95943 126745 332275 166510 62932 88409 290750 400092 334549 -30516 -96037 218052
1130 218052 -151163 -246800 -39696 -20592 16671 257044 136839 174452 112409 -161595 -296997
1119 -296997 -23962 -612303 -764829 -125993 150195 31107 -273942 258088 676095 432933
1109 432933 79164 126479 132227 -255851 -111281 -53680 146537 -54160 206308 291422 215280
1098 215280 189059 76043 -400933 -554730 -153430 -389170 -402905 -494634 -280151 321460
1088 321460 183710 -136829 -142064 23960 69789 -219549 -420527 -138706 70146 -22287
1078 -22287 -208449 133520 -216577 -223053 -22011 -26104 14149 -120509 -572802 -681142 -354948
1067 -354948 107579 -392868 -1005953 -297727 -89286 -313607 -465897 3987 -82917 -246373
1057 -246373 -109050 275112 26938 -322749 -347492 226084 200668 130042 -262125 -254980 275899
1046 275899 64763 -527860 -476581 -220908 -242962 -242409 83737 357472 343744 103582 369760
1035 369760 838046 103425 -316921 -464032 -248181 48501 112778 -46919 164269 257710
1025 257710 514628 494411 -66790 82085 70066 -344847 -495568 -241503 -405532 -96854
1015 -96854 162240 113576 128126 36325 170283 422523 143270 -349839 -454561 -713275
1005 -713275 -299043 -202899 -249749 -362406 -232393 -98824 -384996 -671063 -454638 -338417
995 -338417 -264100 73930 -40410 -292668 -277494 278208 307935 67720 96503 -121906 -43289
984 -43289 12555 129973 34058 6978 -46705 -74094 71049 192640 109873 -339920 112860
973 112860 383293 -101702 -256174 -262114 98667 360832 452093 250858 -57820 -99812 67148
962 67148 40993 -121483 -14343 -267785 -486814 -366535 -241649 -295013 -39281 15912 494742
951 494742 547119 274908 8121 291924 153647 -4682 95738 -161147 40946 96482
941 96482 368309 126650 -64964 40487 202480 238656 164351 -65071 -608151 -283555
931 -283555 101210 13982 -186371 64517 106441 -232146 -430880 -99823 98665 -276881
921 -276881 -339482 -130509 -18740 -311900 -84600 128692 220146 -47836 -127841 -105838 -12278
910 -12278 -142500 69961 125664 17635 -79548 81713 269205 -52235 -60764 53942 -103250
899 -103250 -379439 -158395 29835 -59212 -212673 -332137 -126609 -201899 -90867 373779
889 373779 273005 -201335 -146016 9305 -128799 -172037 -66196 111568 154352 -332747
879 -332747 -241908 361555 149633 -70498 24404 134425 37366 166692 191214 255396 281464
868 281464 321350 69427 -107607 -198201 155414 257538 139655 -154216 -216673 -285050 -503045
857 -503045 -355775 -376390 -339937 -476196 -781120 -673620 -108353 -162987 -465636 -267820
847 -267820 -225489 -124874 35421 54817 78880 107370 73008 -439869 -325283 -228290 235835
836 235835 621200 195773 -107405 316296 341917 -55584 165664 -140028 -606660 -417444
826 -417444 -368031 -525733 74913 203706 -296578 -282630 -148734 171739 -18977 -300908
816 -300908 68571 267019 -149643 -286730 195796 322408 118489 -15061 235847 255555
806 255555 236106 -289952 -257361 -96124 85430 -39031 -188136 -282585 -305302 186144 -19868
795 -19868 -335419 -183378 252201 150725 354511 729355 517282 242548 -163217 77873
785 77873 140259 -110658 -149447 384241 302935 -2987 400750 490744 385824 433737 425023
774 425023 300907 185279 -380888 -113961 427999 281610 168786 297976 5633 92253
764 92253 173941 84156 -250549 -298929 47654 -7325 36900 330603 359299 46202 218294
753 218294 -32164 -335967 -399956 -502078 -347047 -542273 -487486 -315752 -47680 -54038 175303
742 175303 462049 350111 135009 67454 67758 185996 -45959 -464161 -145601 88074 72294
731 72294 30419 217247 347399 78758 -224419 -353215 -218691 -83524 -195368 -589242
721 -589242 -649240 -349312 -20860 215284 221074 48981 305376 361883 322630 223485 22081
710 22081 152139 -76145 -282845 -675490 -639430 -519553 -360977 286051 404345 505019
700 505019 348283 443162 196567 169675 196275 -64562 -148691 127144 456238 423829 -15884
689 -15884 -134139 255686 -25493 -267388 -305200 -243922 -425183 -552805 -744580 -428709
679 -428709 -166177 -189466 -153454 147454 350892 246980 41463 44492 178552 238332 333581
668 333581 61920 -108616 43952 7180 -60401 -89742 86068 750 -226739 -17441 75504
657 75504 90332 -71635 -231994 268184 227043 -57583 21330 137843 -143933 -404482 -422933
646 -422933 -227803 -439616 -906430 -516433 -285170 -455609 -392622 -58801 276321 147459
636 147459 213566 195246 49937 352107 523011 638187 625885 392738 310174 362883 430198
625 430198 426988 426889 49143 -293777 -108005 -241472 -419188 -482973 -511952 -241680 -46246
614 -46246 -121938 -30008 313729 228605 -198130 -175975 -34187 418528 618230 219095 287450
603 287450 523998 165651 -172163 -426459 -53553 -39180 -281740 -381440 -165570 -3407
593 -3407 1466 189670 371919 157049 -30204 -129341 -242770 30284 10465 62664 -18587
582 -18587 238902 125913 221571 29744 -127224 326990 -140102 -632859 -404732 -44837
572 -44837 -255959 -238005 -203037 -179585 -106 -150449 -12904 365298 121496 -375162 -248670
561 -248670 2545 67706 76218 160200 55047 147971 207016 -99933 -169403 140499 408128
550 408128 32921 437 -55207 81255 51862 -347691 -496243 -187052 -109904 -49790 99229
539 99229 42232 42876 90504 208012 207011 276139 295958 574757 445073 -131308 -54982 168189
527 168189 -50723 85053 187323 308856 12133 109091 117602 200896 -226420 -634267 -240817
516 -240817 10907 37793 -111752 103043 169241 256555 234136 234599 145565 -19731 40698
505 40698 -107319 104011 -216028 -318391 -309528 -225684 -192735 -417299 -392742 -378509 -224813
494 -224813 -294075 2711 289793 -117649 -395998 -394438 -235732 -306709 -212196 36723 -33860
483 -33860 -227354 -27609 319473 221502 -77689 -136257 -72170 -29784 95662 -135447 -21687
472 -21687 -11115 -99672 174835 235471 240553 -59547 -320645 -154759 -519248 -450161 -31740
461 -31740 412693 447708 333167 348346 230441 259748 374129 398220 132562 -194338 -254242
450 -254242 -443607 -250755 161697 198971 61084 97312 365007 402087 -218337 -389606
440 -389606 -216191 156580 -135864 -321198 -13394 56584 142049 -56528 67446 172498
430 172498 201297 273442 406172 104780 16019 211964 26546 248508 -97182 -50998 67132
419 67132 111735 -318294 -339927 43935 344239 -110715 -184432 160766 44463 -168320 -145506
408 -145506 94522 -130872 -473443 -298708 -73606 -207798 -262886 -190240 19603 23827 -33718
397 -33718 -65551 964 117588 59578 92626 88657 25872 -30686 295120 192876 -82077
386 -82077 -145847 -465592 -209534 -88460 -173531 -322281 -71211 -177981 -40469 -11018 295465
375 295465 -10562 199611 298335 60838 184039 190409 -16839 101429 167602 257849 12656
364 12656 -380228 -154363 111636 55957 -11778 142823 379011 343326 261512 -255270 -232282
353 -232282 -222305 -344249 -395655 -197919 -86395 -155972 48344 170346 64835 4375 -9349
342 -9349 63316 50957 -168283 3700 -106163 -379109 -352735 26570 72098 44239 344731
331 344731 617216 57300 9701 275832 -205425 -199335 -293602 -267375 -64191 -228555 -358115
320 -358115 -53753 -239502 -164709 53551 21911 -45511 7789 -144635 -179290 146591 -64779
309 -64779 -188896 -189253 -190576 -76694 -78047 -10882 90970 -28360 -367744 -89937 270251
298 270251 -110017 -387794 -384117 132808 76831 -86640 -233550 95682 -73867 128164
288 128164 50263 125213 16546 -457762 -19643 70718 -487905 -427313 -142436 -285444 -206474
277 -206474 -271424 -128164 96265 -155593 -53387 46695 3699 -181881 -12689 -79536
267 -79536 148623 141248 56666 3994 73514 467861 202721 -91425 -108310 248410 -12408
256 -12408 -473632 -107436 119664 -126387 48642 150333 115203 16399 -16992 184346 -170723
245 -170723 -171796 8217 -70165 -156832 -276222 -268867 122164 -141778 -132338 77780 83846 -128329
233 -128329 88378 48564 29290 -346030 -355873 34343 86224 -227862 -399671 -188478 -198188
222 -198188 -115926 -195496 -114562 -54229 -277328 -515997 -73641 67938 -32757 28723 418614
211 418614 368538 287019 34092 254618 64251 -26788 -59501 -408037 -299255 115177 -69856
200 -69856 -186874 17241 320384 317862 225387 118707 222794 128017 -79517 -124100 -111252
189 -111252 36018 129787 -304125 -57656 258563 69739 -140630 -162691 -109063 -91343 -322484
178 -322484 -467400 -275784 30546 338357 102234 -5400 216919 446213 133975 -1443
168 -1443 -186481 -260953 -340736 -15983 54999 62947 49877 -19429 168063 -24335 -187845
157 -187845 -220565 -9388 -338945 -156729 -229863 -20034 -20236 81599 327505 210620 -32093
146 -32093 -188518 -99994 -43889 -254686 -457894 -415087 -300648 -65022 -549298 -366118 -207084
135 -207084 -180842 -250766 -159807 31070 -25733 241290 65537 10715 77572 52182 -68270
124 -68270 81002 137746 -33956 -306986 -118536 43857 -231944 20661 15342 -60114 -188356
113 -188356 75993 115258 10702 85329 231476 233256 66248 -176493 -172957 -73985 -100446
102 -100446 -374444 -247109 6137 13223 104377 335569 240569 160084 -56407 -410229 -235158
91 -235158 -144306 -214648 -326688 -131913 255241 457303 430058 308164 253344 261173 234425
80 234425 642 -157613 -42211 -78360 -234765 -232673 -45360 -50264 -240085 -340919 -233044
69 -233044 -298259 -603314 -356225 -323713 -270545 -210487 -29493 58037 45019 22148 210083
58 210083 286876 -61646 -300589 1973 132968 -27894 -28342 54142 254991 25977 -209099
47 -209099 -161730 -264917 -331116 -268082 -156029 -363647 -564188 -152242 49885 -20333 -176809
36 -176809 113394 -11178 -159188 -147297 -49702 -56060 -143625 -131455 106282 47452 -177171
25 -177171 -29624 131052 -169811 -238518 -43865 -24959 -53189 -115063 -144903 118097 299504
14 299504 334730 516571 447306 306736 307830 239463 115847 45876 -201113 -246408 -387268
3 -387268 -666567 -553303 -258091
0 -258091
$$ Imaginary data points
##PAGE= N=2
##DATA TABLE= (X++(I..I)), XYDATA
16383 -1934598 -2116294 -2218328 -2243469 -2097433 -2193535 -2295993 -2374352 -2110258 -2014842 -2193590
16373 -2193590 -1784731 -1673015 -1740329 -1894731 -1902160 -1866404 -1903621 -2285423 -2005652 -1679006
16363 -1679006 -2063489 -1892004 -1456064 -1538062 -1390999 -1322825 -1233249 -1197885 -1276146 -1551849
16353 -1551849 -1388004 -1264725 -1472000 -1299236 -1305628 -1091868 -1086837 -1083073 -1032322 -1048460 -1045795
16342 -1045795 -1055617 -976934 -939013 -702357 -729886 -966352 -1034121 -1023489 -666196 -448925 -747618
16331 -747618 -619929 -554939 -300275 -207762 -458471 -408715 -338227 -583612 -360781 -80954
16321 -80954 -150039 -183866 -4015 -224720 -183390 -46443 -101347 -87542 -207005 -463263 -284900
16310 -284900 -197174 -429875 -477276 -232123 -83353 83447 31631 203178 322260 139498
16300 139498 63030 -19881 208626 359583 203775 102626 470919 534457 484158 177045
16290 177045 378115 911670 712466 564121 986739 1027143 201463 272960 716098 813508
16280 813508 654339 643355 827047 738598 532687 555906 843937 564154 499204 819928
16270 819928 847491 607650 768686 948822 1050166 845998 708688 862479 1047594 1143519
16260 1143519 1146798 1205384 1354363 1289749 1157436 1366065 1482200 1632798 1538298 1232514
16250 1232514 1434384 1561281 1457710 1286857 1463944 1448000 1319584 1320528 1065995 1000028
16240 1000028 1142949 1315522 1320268 1227683 1513003 1698823 1833678 1740876 1900057 1432421
16230 1432421 1448660 1451891 1632865 1649283 1829254 1933713 1778931 1887785 1879072 1730133
16220 1730133 1990619 2094026 1934840 1808067 1658647 1412562 1456734 1528753 1468285 1572305
16210 1572305 1835510 2017061 1883607 2085618 2205217 1814080 1847079 2043996 2170512 1795201
16200 1795201 1765785 2287521 2319867 1756026 1810525 2147351 1839355 1787278 2062198 2017907
16190 2017907 2023375 2144442 2182087 2377298 2221960 1992475 2206891 2551470 2700425 2599258
16180 2599258 2387534 2340230 2275019 2670667 2451442 2351350 2259247 2037098 1888929 2099605
16170 2099605 2075611 1872980 2129768 2494506 2080725 2501715 2418726 2195539 2355633 2731614
16160 2731614 2718934 2691381 2354164 2387260 2525140 2512348 2502649 2618346 2396465 2286066
16150 2286066 2440496 2591386 2493745 2622357 2680241 2785219 2449995 2728680 2783312 2622011
16140 2622011 2684227 2814376 2573531 2568276 2526825 2531864 2608676 2592973 2635857 2022534 2313867
16129 2313867 2630250 2600413 2158178 2713718 3058994 2634465 2503198 2958971 3108940 2868422
16119 2868422 2624338 2701841 2931533 3054025 2991288 2793058 2643762 2543442 2582766 3051739
16109 3051739 3029163 2519857 2378776 2608724 2742543 2944738 2625853 2735988 2673520 2749772
16099 2749772 2577689 2294434 2408437 2540790 2632498 2529066 2580883 2243305 2481260 2694341
16089 2694341 2443393 2141356 2426988 2473477 2398488 2593468 2874198 3021921 2859998 2962143
16079 2962143 2855216 3105334 2955473 2621701 2745142 2798317 2683496 2829056 2858486 2997092
16069 2997092 2947683 2507014 2384869 2548118 2440216 2285014 2433222 2581063 2350257 2750544
16059 2750544 2941090 2894003 2792204 2848549 2741936 2784290 2573001 2668714 2580668 2476872
16049 2476872 2674465 2482668 2275624 2302487 2820644 2973270 2783738 2604736 2587220 2578646
16039 2578646 2700534 2795091 2614486 2453121 2264251 2595073 2666496 2870211 2955221 2728762
16029 2728762 2706573 2853718 2657324 2473127 2733801 2692003 2554283 2470012 2610677 2501667
16019 2501667 2535287 2842979 2995735 2986173 2533853 2823244 2749084 2265749 2075425 2456071
16009 2456071 2269276 2156921 2166393 2391084 2636768 2747663 3078111 3323261 2957531 2809221
15999 2809221 3039738 2691000 2742036 2655394 2472564 2524068 2854884 2828122 3145175 3368895
15989 3368895 3348278 2842413 2748403 2804570 2601126 2452153 2729114 2293796 2249260 2527982
15979 2527982 2759670 2480800 2660624 2628986 2999507 2911021 3067208 3168998 2932908 2373304
15969 2373304 2627347 2714248 2756377 2767906 2769989 2743492 2465423 2752349 3122957 3037400 2633205
15958 2633205 2653314 2904291 2895268 2478195 2646829 2587959 2299922 2528265 2613866 2610894 2655362
15947 2655362 2728201 3017384 2913986 2871188 2914537 2776215 2683793 2524042 2689169 2790496
15937 2790496 2525544 2376292 2501738 2528665 2275666 2369429 2578105 2987137 2877748 2510126
15927 2510126 2523064 2751762 2730404 2612864 2500522 2573447 2891041 2714678 2540301 2961481
15917 2961481 3015185 2748583 2679678 2873798 2927533 2898760 2509692 2550805 2427161 2255584
15907 2255584 2252867 2470226 2910501 3130452 3117454 3109780 3156547 2994250 2786521 2757563 2781913
15896 2781913 2788133 2743888 2834957 2892107 2969556 2743288 2535217 2404251 2963378 2757006
15886 2757006 2411939 2458561 2750374 2310350 2395475 2498153 2422853 2533145 2738531 2804420
15876 2804420 2573651 2777441 2776269 2765190 2677479 2934598 2890688 2490519 2794479 3018767
15866 3018767 2690067 2278406 2644291 2820471 2769393 2536953 2822859 3095990 3106042 3105527
15856 3105527 3024548 2988443 2838704 2794068 2607072 2409860 2471814 2656147 2650518 2805314
15846 2805314 2709428 2693466 2549250 2528294 2519828 2473547 2459975 2656802 2562482 2682271 2834941
15835 2834941 3006684 3054039 2785551 2633960 2905482 2931860 2891433 2707047 2955874 3012967
15825 3012967 2765940 2445885 2752033 2975739 3169679 2855896 2808953 3131064 2745018 2603710
15815 2603710 2631012 2747080 2918293 3118046 3446973 3122007 2927574 2907155 2603603 2788204
15805 2788204 2810651 2661486 2814350 2789061 2847673 2823971 2584569 2624388 2578485 2574694 2485637
15794 2485637 2484124 2658062 2320478 2547946 2775195 2819535 2909867 2837989 2775161 2907781
15784 2907781 3195778 3087330 3058835 2983043 2981242 2986154 2772909 2493898 2776604 2982060
15774 2982060 2433263 2381454 2877704 2790286 2611534 2586152 2508215 2478747 2538729 2377897
15764 2377897 2364359 2515455 2507389 2618633 2771293 2791951 2971217 3063037 2886290 3101666
15754 3101666 3032274 2613905 2681835 2925667 2705322 2797433 3027168 2857192 2968243 2898142
15744 2898142 2740687 2809880 2905601 2626961 2559453 2725597 2648331 2740603 2800949 2663002
15734 2663002 2735010 2793390 2879297 2978144 3148896 2915157 2708847 3203471 3238422 2864560
15724 2864560 2766140 2886070 2753464 2626853 3007265 3061581 2838153 2540666 2687555 2403568
15714 2403568 2289492 2452054 2690199 2809649 2829071 3050367 3174710 3092987 3344244 3325718
15704 3325718 2924681 2693876 2421312 2844482 3222957 2981735 2782806 2765237 2837310 2789052
15694 2789052 2727561 2760561 2292249 2385203 2844503 2712728 2551559 2453446 2879463 2989299
15684 2989299 2957469 3165653 3207766 2839217 2525436 2966518 2861435 2513011 2435245 2679586
15674 2679586 2905209 2591599 2186182 2795734 2960999 2679793 2962927 3202338 2952423
15665 2952423 2869919 3140971 3192865 3018160 2655144 2903465 2957530 2777034 2960692 2755810
15655 2755810 2623940 3098008 3280715 3053999 2760587 2890465 3051740 2695675 2864566
15646 2864566 2947850 2720099 2717435 3249893 3387870 3204237 3139222 3410472 3174627 3139870
15636 3139870 2636758 2487797 2533062 2668920 2759367 2862954 2713544 2545640 2665709 2813664
15626 2813664 2905453 2732052 2551273 2833333 2904638 2662655 3006979 2811251 2822677 2660983
15616 2660983 2842432 2668805 2431956 2815668 3335458 2885021 2768222 2730599 2857829 2652616
15606 2652616 2591551 2744787 2990286 2527826 2197758 2428576 3072750 2870189 2657704 2904505
15596 2904505 3009793 2919604 2555342 2177944 2252899 2517749 2808528 2650245 2506220 2871503
15586 2871503 2972167 2820585 2775354 2944667 2831658 2717191 2413367 2784687 2860870 2902488
15576 2902488 2830006 2833527 2974319 3344985 2929461 2939864 3247558 3039650 2925478 3027796
15566 3027796 2810313 2727780 2641000 2790930 3019357 2849667 2639091 2953079 3141716 2709996
15556 2709996 2863480 3102772 2888273 2516864 2357218 2648001 2476452 2273296 2440563
15547 2440563 2892213 3207669 2888627 2775641 3168856 3272583 2883359 2768613 2958103
15538 2958103 2875400 2254652 2091224 2631316 3131061 2900116 2887292 3236059 3040326 2927839
15528 2927839 3165449 3012504 2365503 2507236 2755844 2838052 2898004 2938552 3100795 3073116
15518 3073116 2467028 2858871 3046752 2605108 2629315 2833278 2871572 2744847 2798385 2673524
15508 2673524 2812362 2768296 2633912 2761199 3075519 3090720 2939108 2842657 2999319 3020875
15498 3020875 2660381 2851367 2995514 2921600 2864356 2754870 2725486 3083626 3406381 3240895
15488 3240895 3103917 2982784 3163367 2711641 2481508 2789041 2972147 2755234 2703411 2852262
15478 2852262 2955762 2957340 2943901 2917316 2724691 2513077 2655637 2945474 2962105 2697115
15468 2697115 2683225 2844893 2919231 2621777 2761161 3306765 3038118 2808227 2954910 2819084
15458 2819084 2897072 3141366 3017533 2908658 2826314 2356963 2274717 2729342 2772347 3004626
15448 3004626 2888693 3065590 3011016 3033044 3298838 3425868 3024374 2742332 2758434 2500494
15438 2500494 2828125 2716762 2840446 3311694 3144884 2687816 3088748 3039226 2872743 2348758
15428 2348758 2354478 2486982 2652472 2582119 2776611 3411901 3605642 3279120 3152337 3572308
15418 3572308 3542733 2757288 2722631 3036267 2797767 2694377 2706421 2683213 3063419 3153908
15408 3153908 2956775 3040707 3196469 3051564 3116899 3237906 3100013 3032949 2910999 3195545
15398 3195545 3031326 2947918 2968555 3310705 2794727 2786953 3061824 3129855 2842799 2766786
15388 2766786 2453793 2327910 2657554 2512951 2710568 2986392 2974015 2742407 2765673 3019402
15378 3019402 3350775 3163072 3173081 2930260 2796651 2730574 2412031 2630200 2878890 2957693
15368 2957693 3020310 3116443 2965267 2996855 3055949 3019387 3052737 3215452 2659420 2798965
15358 2798965 2911822 2949134 2936224 3010709 2753923 2590618 2907951 3395695 3281247 2807004
15348 2807004 2728598 3001690 2967287 2526494 2261818 2553100 2634208 2468951 2956920 3176900
15338 3176900 3215084 2977575 3174910 3231901 2855568 2829568 3140387 3108826 2481097 2862756
15328 2862756 3154103 2996084 2777794 3135958 3446772 3257129 3036399 2822415 2877724 3114682
15318 3114682 3024994 2654855 3089992 3135013 3256371 3371015 3427038 3362626 3388878 2956212
15308 2956212 2928545 2952441 2716318 2627939 2214237 2436838 2684983 2381442 2474181 2989730
15298 2989730 3066123 2661936 2589334 2559041 2637606 2740732 2924962 2787571 2745983 2718570
15288 2718570 2839486 3138479 3343781 3208955 3122487 3259045 3027596 2816136 2883871 2763764
15278 2763764 2376377 2538094 2510973 2350553 2545735 3103889 3158085 3196784 3195614 2932558
15268 2932558 2821939 3039342 2983963 2643959 2631039 2622255 2888726 2791165 3118223 3327122
15258 3327122 3299580 2947977 2953485 2803690 2659883 2661575 2834366 2931317 2903800 2956590 2957835
15247 2957835 2837904 3218940 3381129 3231091 3347482 3348182 3085318 3168741 3259203 2966543
15237 2966543 2671138 2769168 3036357 2902961 2577873 2617063 3032263 2937410 2898068 3131538
15227 3131538 2806274 2795912 3083425 2934007 2645990 2699608 2666745 2693014 3058405 2863657
15217 2863657 2798454 3014129 3240250 3340803 3128693 2919681 2952072 2929189 2977724 2817391
15207 2817391 2863316 2678846 2683607 2783910 3038677 3056555 3037095 3452855 3423035 3196678
15197 3196678 3133182 2703209 2613900 2872751 3035231 2910202 2609880 2695850 3116372 2892996
15187 2892996 2881726 3227939 3060150 2740854 2816602 2755117 2554699 2330539 2898892 3205004
15177 3205004 3082780 2784800 3331244 3816669 3521002 3120870 3040265 2880242 2610616 2822939
15167 2822939 3141544 2899139 2607378 2768169 2842105 2626910 2477111 2722796 3107837 2981941
15157 2981941 2801550 3049878 3220722 3298229 3188197 2997484 2993136 2903088 3051775 3352692
15147 3352692 3525023 3236984 2850349 3082511 3058442 2899087 2812123 2321648 2073232 2449594
15137 2449594 2509357 2513056 2649340 2780627 2733025 2960758 2950076 3160711 2971749 2637653
15127 2637653 2703837 3162762 3140470 2732946 2987534 3275903 3385998 3096167 2884572 2837224
15117 2837224 2496179 2283693 2539601 2746357 2904103 3240897 2964068 3062037 3460098 3212552
15107 3212552 2942413 3266850 3230793 3003873 2906911 2902751 2917675 3057445 2983926 2581785
15097 2581785 2694781 2859440 2677229 2540702 2843369 3297022 3037129 3001853 3391525 3271668
15087 3271668 3064604 2917751 3031639 3260204 3171799 3245943 3835306 3915096 3424783 3339351
15077 3339351 3572601 3632156 2937687 2600427 2371366 2417356 2505981 2854670 2835145 2710764
15067 2710764 3143620 3020189 2896032 3097865 3172620 2941432 2848861 2929140 2907845 2904272
15057 2904272 2953366 3374007 3380223 3058593 2971525 2811521 2938307 3132118 3170943 3189559
15047 3189559 3067660 3011839 3092897 2913247 2774099 2543738 2701240 2862400 3025454 2864766
15037 2864766 3065802 3517415 3238861 3058428 3152187 3311943 2713100 2431796 2521967 2599487
15027 2599487 2588677 2305915 2831841 3116073 2832170 3093755 3357189 3355055 2929292 2860075
15017 2860075 3006007 2988616 3081239 3389103 3444297 3350766 3594947 3689333 3523441 3306330
15007 3306330 3196667 3092144 2916301 2670888 2971263 2904496 2882436 3202497 3205903 2898741
14997 2898741 2880043 2781651 2935100 3071434 3187626 3119800 3088097 2829653 2927201 2888529
14987 2888529 2962965 3059220 2884338 2962480 3464923 3517614 3143297 3351399 3414520 3148400
14977 3148400 3069439 3168250 2820811 2625237 2697987 2655768 3013420 3110769 3183056 3073231
14967 3073231 2847184 3121323 3108188 3043934 2979062 2773939 3023335 3015163 2671176 2959986
14957 2959986 3327697 2961389 2985397 2951908 2759475 3149860 3029125 2743125 2960724 3060324
14947 3060324 2505377 2840841 3167749 3197956 3254202 3198456 3193765 3045431 2894647 3346424
14937 3346424 3227259 3004636 3382176 3210296 2919621 2709202 2747872 2919972 2968052 2854628
14927 2854628 3111215 3558244 3150838 3226812 3139482 3044270 3309274 2950225 2734990 2762478
14917 2762478 2863341 3017025 3182063 3010026 3218227 3572121 3480043 3283625 3084434 2980427
14907 2980427 2792686 2821744 2597252 2908320 3195017 2948307 2808825 3319414 3458994 3382844
14897 3382844 3133513 3029981 3420486 3053325 2786707 2834875 3045760 3045685 2986108 3118060
14887 3118060 3223160 3245223 3243630 3101316 3285413 3365688 2879119 2753206 2978383 2892046
14877 2892046 2548224 2490695 2580152 2875009 3282577 3335411 3238148 3488232 3219661 2813275
14867 2813275 2887563 2807155 2784169 3024628 2901560 3221540 3438406 3286055 3193176 3300501
14857 3300501 3495726 3395233 3067525 2872262 2815103 2797064 2918684 3065870 3345679 3189412
14847 3189412 3133546 2912479 2795870 2757197 2752124 2614009 2647145 2685342 2841476 2803149 3222511
14836 3222511 3478474 3135246 2974392 3082336 3151340 3063656 3240372 3220252 3398380 3285282
$$ [...]
##END NTUPLES=NMR SPECTRUM
##END=
