##TITLE=1H_CG-1150IVe
 CDCl3
 8 sc, 
 28.8.2023
##JCAMPDX= 6.0         $$ Bruker NMR JCAMP-DX V2.0
##DATA TYPE= NMR SPECTRUM
##DATA CLASS= NTUPLES
##ORIGIN= UXNMR, Bruker Analytische Messtechnik GmbH
##OWNER= root
$$ XWIN-NMR		Version 3.5
$$ Mon Aug 28 14:36:25 2023 Russian Standard Time (UT+4h)  she@DPX200
##.OBSERVE FREQUENCY= 200.13135
##.OBSERVE NUCLEUS= ^1H
##.ACQUISITION MODE= SIMULTANEOUS
##.ACQUISITION SCHEME= undefined
##.AVERAGES= 8
##.DIGITISER RES= 18
##SPECTROMETER/DATA SYSTEM= spect
##.PULSE SEQUENCE= zg30
##.SOLVENT NAME= CDCl3
##.SHIFT REFERENCE= (INTERNAL, CDCl3, 0, 15.7315)
##AUDIT TRAIL= $$ (NUMBER, WHEN, WHO, WHERE, WHAT)
$$ ##TITLE= Audit trail, XWIN-NMR		Version 3.5
$$ ##JCAMPDX= 5.01
$$ ##ORIGIN= Bruker BioSpin GmbH
$$ ##OWNER= she
$$ F:/spectra/data/she/nmr/H-F/1/pdata/1/auditp.txt
$$ ##AUDIT TRAIL=  $$ (NUMBER, WHEN, WHO, WHERE, WHAT)
(   1,<2023-08-28 14:35:14.73 +0400>,<she>,<DPX200>,
      <created by zg, POWCHK disabled, PULCHK disabled
       configuration hash MD5:
       00 E9 B6 7A A2 85 ED C7 34 08 36 98 17 FE 4E 26
       data hash MD5: 16K
       42 AB 65 33 C6 72 C8 15 A3 C6 60 2A F4 80 E4 4D>)
(   2,<2023-08-28 14:35:16.96 +0400>,<she>,<DPX200>,
      <Start of raw data processing
       efp BC_mod = 2 LB = 0.24 FT_mod = 6 PKNL = 1 PHC0 = -21044.32 PHC1 = 6.65272 SI = 16K 
       data hash MD5: 16K
       EC 6E 54 3E 8D E6 30 52 7A 67 CD 9C 2B B7 41 24>)
(   3,<2023-08-28 14:35:31.45 +0400>,<she>,<DPX200>,
      <pk PHC0 = -16.50969 PHC1 = 22.4 
       data hash MD5: 16K
       E0 6A D8 9B C3 D4 57 E6 3F AA DD 30 BA 25 75 B1>)
(   4,<2023-08-28 14:35:35.25 +0400>,<she>,<DPX200>,
      <abs ABSG = 5 
       data hash MD5: 16K
       45 1C EE DB 86 5A 77 D5 6F DC 9A 6F 0C B1 E8 C1>)
$$ ##END=
$$ 
$$ hash MD5
$$ 10 C6 98 0F 82 0D C9 87 99 54 12 45 94 6B 31 82
##$RELAX= 
##$RELAX= 
##$RELAX= 
##$RELAX= 
##$RELAX= 
##$RELAX= 
$$ Bruker specific parameters
$$ --------------------------
##$DU= <F:/spectra>
##$EXPNO= 1
##$NAME= <H-F>
##$PROCNO= 1
##$TYPE= <nmr>
##$USER= <she>
##$AMP= (0..31)
100 100 100 100 100 100 100 100 100 100 100 100 100 100 100 100 100 100 
100 100 100 100 100 100 100 100 100 100 100 100 100 100 
##$AQSEQ= 0
##$AQ_mod= 1
##$AUNM= <au_zg>
##$AUTOPOS= <>
##$BF1= 200.13
##$BF2= 200.13
##$BF3= 200.13
##$BF4= 200.13
##$BF5= 200.13
##$BF6= 200.13
##$BF7= 200.13
##$BF8= 200.13
##$BYTORDA= 1
##$CFDGTYP= 0
##$CFRGTYP= 5
##$CHEMSTR= <none>
##$CNST= (0..31)
1 1 145 1 1 1 1 1 1 1 1 1 1 1 1 1 1 1 1 1 1 1 1 1 1 1 1 1 1 1 1 1 
##$CPDPRG= <>
##$CPDPRG1= <>
##$CPDPRG2= <>
##$CPDPRG3= <>
##$CPDPRG4= <mlev>
##$CPDPRG5= <mlev>
##$CPDPRG6= <mlev>
##$CPDPRG7= <mlev>
##$CPDPRG8= <mlev>
##$CPDPRGB= <>
##$CPDPRGT= <>
##$D= (0..31)
0 1.2 0 0 0 0 0 0 0 0.06 0 0.03 0 0 0 0 0.0002 0 0 0 0 0 0 0 0 0 0 0 0 
0 0 0 
##$DATE= 1693218914
##$DBL= (0..7)
120 120 120 120 120 120 120 120 
##$DBP= (0..7)
150 150 150 150 150 150 150 150 
##$DBP07= 0
##$DBPNAM0= <>
##$DBPNAM1= <>
##$DBPNAM2= <>
##$DBPNAM3= <>
##$DBPNAM4= <>
$$ [...]
##$SUBNAM3= <"">
##$SUBNAM4= <"">
##$SUBNAM5= <"">
##$SUBNAM6= <"">
##$SUBNAM7= <"">
##$SUBNAM8= <"">
##$SUBNAM9= <"">
##$SW= 18.05172834244
##$SWIBOX= (0..15)
0 0 2 0 0 0 0 0 0 0 0 0 0 0 0 0 
##$SW_h= 3612.71676300578
##$TD= 16384
##$TD0= 1
##$TE= 0
##$TE2= 300
##$TE3= 300
##$TEG= 300
##$TL= (0..7)
0 120 120 120 120 120 120 120 
##$TP= (0..7)
150 150 150 150 150 150 150 150 
##$TP07= 0
##$TPNAME0= <>
##$TPNAME1= <>
##$TPNAME2= <>
##$TPNAME3= <>
##$TPNAME4= <>
##$TPNAME5= <>
##$TPNAME6= <>
##$TPNAME7= <>
##$TPOAL= (0..7)
0.5 0.5 0.5 0.5 0.5 0.5 0.5 0.5 
##$TPOFFS= (0..7)
0 0 0 0 0 0 0 0 
##$TUNHIN= 0
##$TUNHOUT= 0
##$TUNXOUT= 0
##$USERA1= <user>
##$USERA2= <user>
##$USERA3= <user>
##$USERA4= <user>
##$USERA5= <user>
##$V9= 5
##$VALIST= <valist>
##$VCLIST= <CCCCCCCCCCCCCCC>
##$VD= 0
##$VDLIST= <DDDDDDDDDDDDDDD>
##$VPLIST= <PPPPPPPPPPPPPPP>
##$VTLIST= <TTTTTTTTTTTTTTT>
##$WBST= 1024
##$WBSW= 4
##$XGAIN= (0..3)
0 0 0 0 
##$XL= 0
##$YL= 0
##$YMAX_a= 30213
##$YMIN_a= -42972
##$ZGOPTNS= <>
##$ZL1= 120
##$ZL2= 120
##$ZL3= 120
##$ZL4= 120
##$ABSF1= 15.80198
##$ABSF2= -2.249871
##$ABSG= 5
##$ABSL= 3
##$ALPHA= 0
##$AQORDER= 0
##$ASSFAC= 0
##$ASSFACI= 0
##$ASSFACX= 0
##$ASSWID= 0
##$AUNMP= <proc_1d>
##$AZFE= 0.1
##$AZFW= 0.1
##$BCFW= 0
##$BC_mod= 2
##$BYTORDP= 0
##$COROFFS= 0
##$CY= -3
##$DATMOD= 1
##$DC= 0
##$DFILT= <>
##$DTYPP= 0
##$F1P= 0
##$F2P= 0
##$FCOR= 1
##$FTSIZE= 16384
##$FT_mod= 6
##$GAMMA= 0
##$GB= 0
##$INTBC= 1
##$INTSCL= 3.70164e-10
##$ISEN= 128
##$LB= 0.24
##$LEV0= 0
##$LPBIN= 0
##$MAXI= 10000
##$MC2= 0
##$MEAN= 0
##$ME_mod= 0
##$MI= 1.114404
##$NCOEF= 0
##$NC_proc= -9
##$NLEV= 6
##$NOISF1= 3.799351
##$NOISF2= 2.8
##$NSP= 0
##$NTH_PI= 0
##$NZP= 0
##$OFFSET= 15.73146
##$PC= 1
##$PHC0= -21060.83
##$PHC1= 29.05272
##$PH_mod= 1
##$PKNL= yes
##$PPARMOD= 0
##$PSCAL= 0
##$PSIGN= 0
##$REVERSE= no
##$SF= 200.130008019805
##$SI= 16384
##$SIGF1= 3
##$SIGF2= 2
##$SINO= 5.538805
##$SIOLD= 16384
##$SREGLST= <1H.CDCl3>
##$SSB= 0
##$STSI= 16384
##$STSR= 0
##$SW_p= 3612.71676300578
##$SYMM= 0
##$S_DEV= 0
##$TDeff= 16384
##$TDoff= 0
##$TI= <>
##$TILT= no
##$TM1= 0
##$TM2= 0
##$TOPLEV= 0
##$USERP1= <user>
##$USERP2= <user>
##$USERP3= <user>
##$USERP4= <user>
##$USERP5= <user>
##$WDW= 1
##$XDIM= 16384
##$YMAX_p= 308534936
##$YMIN_p= -8774146
$$ End of Bruker specific parameters
$$ ---------------------------------
##NTUPLES= NMR SPECTRUM
##VAR_NAME=  FREQUENCY,     SPECTRUM/REAL,   SPECTRUM/IMAG
##SYMBOL=    X,             R,               I
##VAR_TYPE=  INDEPENDENT,   DEPENDENT,       DEPENDENT
##VAR_FORM=  AFFN,          ASDF,            ASDF
##VAR_DIM=   16384,         16384,           16384
##UNITS=     HZ,            ARBITRARY UNITS, ARBITRARY UNITS
##FACTOR=    0.220516191357247, 1,           1
##FIRST=     3148.33713943648, 0,            0
##LAST=      -464.379623569303, 0,           0
##MIN=       -464.379623569303, -8774146,    0
##MAX=       3148.33713943648, 308534936,    0
$$ Real data points
##PAGE= N=1
##DATA TABLE= (X++(R..R)), XYDATA
$$ [...]
4924C357072j32205K8608O35927o75297l53134p84872J20597K62835n17291R96767
$$ 3357072 3224867 3253475 3889402 3214105 2860971 2076099 2196696 2459531 1942240 2939007
4914B939007Q8318P10562p37735k04881J83212J70530m29635k06618P82231P37623
$$ 2939007 3027325 3737887 3000152 2795271 2978483 3149013 2719378 2512760 3294991 4032614
4904D032614R6940K2694M4162n60250J56958N51513j96299l8143m48659o38377
$$ 4032614 4129554 4152248 4196410 3636160 3793118 4344631 4148332 4110189 3661530 3023153
4894C023153K0067M36201N45998m94470N7010q1690k18932Q18668J07701n7421
$$ 3023153 3043220 3479421 4025419 3530949 3587959 3506269 3287337 4106005 4213706 4156285
4884D156285m34011k75194O1024M53107K74748L00501J02797k60766L69212j18887
$$ 4156285 3722274 3447080 3508104 3961211 4235959 4536460 4639257 4378491 4747703 4628816
4874D628816m35637l21478j28160N84351R35677n68513q93991L50315J436276
$$ 4628816 4193179 3871701 3743541 4327892 5263569 4695056 3801065 4151380 5587656
4865E587656k4451J27538M71942p40096L2061L07919L53707J002018k11931K33174
$$ 5587656 5563205 5690743 6162685 5422589 5454650 5762569 6116276 7118294 6906363 7139537
4855G139537L16624k29558L14417m3839L4020K7252k61970K75357l13460k71459
$$ 7139537 7456161 7226603 7541020 7497181 7531201 7558453 7296483 7571840 7258380 6986921
4845F986921L18110P24983M20405O8168M47322N24126Q69670l70093j80384J193942
$$ 6986921 7305031 8030014 8450419 8518587 8965909 9490035 10359705 9989612 9809228 11003170
4835A1003170O54020M63658O9197R81881L17553M64941J066927J276184R96110
$$ 11003170 11657190 12120848 12190045 13171926 13489479 13954420 15021347 16297531 17293641
4826A7293641J006872J179141q8310P95295J060772L95148J302153J270657m26750
$$ 17293641 18300513 19479654 19391344 20186639 21247411 21642559 22944712 24215369 23788619
4817B3788619O2738N31514L30282l43743j67101m30561q94249j363457n53102
$$ 23788619 23851357 24382871 24713153 24369410 24202309 23771748 22877499 21514042 20960940
4808B0960940n56749j91917n0064r71832L2104O63609k40152P83699Q84305r61041
$$ 20960940 20404191 20212274 20162210 19190378 19222482 19886091 19645939 20429638 21313943 20352902
4798B0352902J64950R71393q5662k35068k27213P77411K72663j338515K23283
$$ 20352902 20517852 21489245 21403583 21168515 20941302 21718713 21991376 20652861 20876144
4789B0876144O3660o5217j056359j125456o43885m23629r17213n16520r15353
$$ 20876144 20939804 20874587 19818228 18692772 18048887 17625258 16708045 16191525 15276172
4780A5276172n51213j45260p86157m96034M0939k38407q62112j24907l51420k13018
$$ 15276172 14724959 14579699 13793542 13297508 13338447 13100040 12237928 12113021 11761601 11548583
4770A1548583p44778q64088j31208k63499j0208r16580k94442O14457J47420K25791
$$ 11548583 10803805 9939717 9808509 9545010 9534802 8618222 8323780 8938237 9085657 9311448
4760I311448n5796p95634m25666r5119L43920m4535J9185Q5276o55742j03361
$$ 9311448 9255652 8460018 8034352 7939233 8283153 8238618 8257803 8343079 7687337 7583976
4750G583976o57014n84610p2456K80253M02393q63357l94586J87146K27527K6236
$$ 7583976 6926962 6342352 6269896 6550149 6952542 6089185 5694599 5881745 6109272 6135508
4740F135508n42839P68633k44362l8001p79189K37813M06410l6421n42293m85637
$$ 6135508 5592669 6361302 6116940 6078939 5299750 5537563 5943973 5907552 5365259 4879622
4730D879622O00184L85485j94255k84667K94821M17252n05088K32801N45932l46396
$$ 4879622 5479806 5865291 5671036 5386369 5681190 6098442 5593354 5826155 6372087 6025691
4720F025691o78839m81052k67421K69521L24145j55503N64080m58687m8204M4001
$$ 6025691 5346852 4865800 4598379 4867900 5192045 5036542 5600622 5141935 5093731 5137732
4710E137732n3738J74496l91213j48534L99236r741m46540j02680R8988M92970
$$ 5137732 5083994 5258490 4867277 4718743 5117979 5108238 4661698 4559018 4658006 5150976
4700E150976K94670k73280l32963j89652q039j74448L44623M79436P69352j537341
$$ 5150976 5445646 5172366 4839403 4649751 4641712 4467264 4811887 5291323 6060675 4523334
4690D523334j204262M13021J025140N43409L96283l44508m94254P0502k89191
$$ 4523334 3319072 3732093 4757233 5300642 5696925 5352417 4858163 4928665 4639474
4681D639474K43218j181974k13226N30555J05009J95529Q80854J13490M20522
$$ 4639474 4882692 3700718 3487492 4018047 4123056 4318585 5199439 5312929 5733451
4672E733451o26431o83804K73915J65871M05329p22730k40470O9112J038622k52049
$$ 5733451 5107020 4423216 4697131 4863002 5268331 4545601 4305131 4374243 5412865 5160816
4662E160816q31873n48577O3849P6526p09097K76763M4658J42040q2846K20705
$$ 5160816 4328943 3780366 3844215 3920741 3211644 3488407 3533065 3675105 3592259 3812964
4652C812964K8673P17285n28301k72839l71779M60200O42112j007179O12101N03095
$$ 3812964 3841637 4558922 4030621 3757782 3386003 3846203 4488315 3481136 4093237 4596332
4642D596332n1388p118K9578p65024o26608P75432Q89284J2327j37160l90818
$$ 4596332 4544944 4537826 4567404 3802380 3175772 3951204 4840488 4852815 4715655 4324837
4632D324837l31978j75577M14580R447K83861l55524j22104L50062N2241O31031
$$ 4324837 3992859 3817282 4231862 4241309 4525170 4169646 4047542 4397604 4449845 5080876
4622E080876J53333n8438l90503k56780j02748l25505k36231K971j869N40214
$$ 5080876 5234209 5175771 4785268 4528488 4425740 4100235 3864004 3866975 3865106 4405320
4612D405320r26424L52443j22959N0349J100555O25874j46964K04173p70291N772
$$ 4405320 3478896 3831339 3708380 3758729 4859284 5485158 5338194 5542367 4772076 4777848
4602D777848J85701r17620M76689P78308J96245p64582O2133N2675j19561l34679
$$ 4777848 4963549 4045929 4522618 5300926 5497171 4732589 4794722 4847397 4727836 4393157
4592D393157j213Q67760P85428m98464J11013l8944J95605j180605M14793J35972
$$ 4393157 4391944 5259704 6045132 5546668 5657681 5618737 5814342 4633737 5048530 5184502
4582E184502K26731r2125k86076p23820K16416K81956N82232k52401j106910J209913
$$ 5184502 5411233 5319108 5033032 4309212 4525628 4807584 5389816 5137415 4030505 5240418
4572E240418l98132m07448J42926N0139l94385j000854O59122J249079k70831
$$ 5240418 4842286 4434838 4577764 4627903 4233518 3232664 3891786 5140865 4870034
4563D870034l03888P01606m66290N86615J99388J02646o68331L6532L99367j01900
$$ 4870034 4566146 5267752 4801462 5388077 5587465 5690111 5021780 5058312 5457679 5355779
4553E355779Q880J72940O5911O43572p95032j034906Q85448M38490J216632n38324
$$ 5355779 5364659 5537599 5603510 6247082 5452050 4417144 5302592 5741082 6957714 6419390
4543F419390q64423j18204R05777o0686o35376j71895J17676n02574L57397J060830
$$ 6419390 5554967 5436763 6342540 6281854 5646478 5474583 5592259 5089685 5447082 6507912
4533F507912k42380N868J38918L22036J534884j253486p3004N06863R83682n64746
$$ 6507912 6265532 6271400 6410318 6732354 8267238 7013752 6940748 7447611 8431293 7866547
4523G866547m38422M91394j84339J51555J21787m02690J64538N6729N4852r0659
$$ 7866547 7428125 7919519 7735180 7886735 8008522 7605832 7770370 7827099 7881951 7791292
4513G791292P03419K60269j76387R28308l03374r55938P18223o11324N68035J46659
$$ 7791292 8494711 8754980 8578593 9506901 9203527 8247589 8965812 8354488 8922523 9069182
4503I069182P2738R3535k77992O98866M4456P99365m68268J068133j22523k14424
$$ 9069182 9141920 9235455 8957463 9656329 9700785 10500150 10031882 11100015 10977492 10763068
4493A0763068J043713o8289L16107j166567l05975J07815q747L58097J4303M9087
$$ 10763068 11806781 11738492 12054599 10888032 10582057 10689872 10681125 11039222 11053525 11102612
4483A1102612m3626J97270j26114R4785k84734o61376j30429j74349J42011P11774
$$ 11102612 11058986 11256256 11130142 11224927 10940193 10278817 10148388 9974039 10116050 10827824
4473A0827824j43136j362800j110108N22185J54639O05910J09136M6455K34661
$$ 10827824 10684688 9321888 8211780 8733965 8888604 9494514 9603650 9650105 9884766
4464I884766J20226q17239P1070m43441K44394K55747L44213L42156M83181q7633
$$ 9884766 10004992 9187753 9258823 8815382 9059776 9315523 9659736 10001892 10485073 10397440
4454A0397440n44338K3787q7745J112788Q60904j65145N0576J35666M64811K34261
$$ 10397440 9853102 9876889 9789144 10901932 11762836 11597691 11648267 11783933 12248744 12483005
4444A2483005L10227m81869o6616L60174P6353m43948K83612Q64137l26528L53755
$$ 12483005 12793232 12311363 12244747 12604921 12681274 12237326 12520938 13385075 13058547 13412302
4434A3412302O41751l3422k6175M42051L6277L06964p9741P0690q7076j034236
$$ 13412302 14054053 14020631 13994456 14436507 14472784 14779748 14700007 14770697 14683621 13649385
4424A3649385L64806j49999q82567L23603J13310N9556P37600L4800o35188m5756
$$ 13649385 14014191 13864192 12981625 13305228 13418538 13478094 14215694 14250494 13615306 13569550
4414A3569550l5847N31203k19902m07853N0511K12566r8800o02383m30923P59819
$$ 13569550 13533703 14064906 13845004 13437151 13487662 13700228 13601428 12999045 12568122 13327941
4404A3327941m64050q3989l47433N00081n8046J83573O32432l96363o81615k26788
$$ 13327941 12863891 12779902 12432469 12932550 12874504 13058077 13690509 13294146 12612531 12385743
4394A2385743N00535K90161J27235m07457l11402n92373q44204k33527l05854
$$ 12385743 12886278 13176439 13303674 12896217 12584815 11992442 11148238 10914711 10608857
4385A0608857m97538n9917K2736K97752m54748M98397j82302m61860l43707j10050
$$ 10608857 10111319 10051402 10074138 10371890 9917142 10415539 10233237 9771377 9427670 9317620
4375I317620k48L45292r38299l35071j18539q7796n74722l46999O42876L85038
$$ 9317620 9317372 9662664 8724365 8389294 8270755 8182959 7608237 7261238 7904114 8289152
4365H289152N93380j69766j076123j56669J18180p0634p03483j76766O90662L87496
$$ 8289152 8882532 8712766 7636643 7479974 7598154 7527520 6824037 6647271 7337933 7725429
4355G725429k50370M62332j13364j62823K91373K91814n51825n18914J84565M16354
$$ 7725429 7475059 7937391 7824027 7661204 7952577 8244391 7692566 7173652 7358217 7774571
4345G774571N63377K04195K26072M17720n59965j358925K12532O16567L93293
$$ 7774571 8337948 8542143 8768215 9185935 8625970 7267045 7479577 8096144 8489437
4336H489437n33915O25843o94494l47812N70583J24306m66065K99085L86915J10084
$$ 8489437 7955522 8581365 7886871 7539059 8109642 8233948 7767883 8066968 8453883 8563967
4326H563967J61441K76343N11829L77529j55219n89931j3614J400333R19205m41579
$$ 8563967 8725408 9001751 9513580 9891109 9735890 9145959 9132345 10532678 11451883 11010304
4316A1010304l07477o71953P38692n2714K62204P73581r76805N37451J76320P91141
$$ 11010304 10702827 10030874 10769566 10716852 10979056 11752637 10775832 11313283 11489603 12280744
4306A2280744N10771o65015j44582J123036j07806n51395n03733l0027O82831
$$ 12280744 12791515 12126500 11981918 13104954 12997148 12445753 11942020 11911993 12594824
4297A2594824m71135j80593j00647K1814o43991j46687M58081k89159k44954Q62604
$$ 12594824 12123689 11943096 11842449 11864263 11220272 11073585 11531666 11242507 10997553 11860157
4287A1860157N8095j236809K53511j53708Q80238K09479K11997r2123J00193p30372
$$ 11860157 11918252 10681443 10934954 10781246 11661484 11870963 12082960 11990837 12091030 11360658
4277A1360658K78035M2757j3606J256540m53927q44833K22429K69192k48478j25804
$$ 11360658 11638693 11681450 11667844 12924384 12470457 11625624 11848053 12117245 11868767 11742963
4267A1742963j65883j84781J69171n89814K97003R82293k92605M69112O8516j11711
$$ 11742963 11577080 11392299 11561470 10971656 11268659 12250952 11958347 12427459 12495975 12384264
4257A2384264j26850K37181k47480n8541m69091n77007P24535Q3677p97984J13165
$$ 12384264 12257414 12494595 12247115 12188574 11719483 11142476 11867011 11950688 11152704 11265869
4247A1265869l78891J28280K01392k04554k79075P00508j31540l09804P6497J145382
$$ 11265869 10886978 11015258 11216650 11012096 10733021 11433529 11301989 10992185 11068682 12214064
4237A2214064j35068p52967J23327O6662J44713K40650K52314O46614j69389k05744
$$ 12214064 12078996 11326029 11449356 11516018 11660731 11901381 12153695 12800309 12630920 12425176
4227A2425176Q15565O21391q01886k39699l69188K16337n1905p8870K2816J19127
$$ 12425176 13240741 13862132 13060246 12820547 12451359 12667696 12615791 12536921 12559737 12678864
4217A2678864l68873J38055n38942m81712J127540o84070J5725P2331O6477L09394
$$ 12678864 12309991 12448046 11909104 11427392 12554932 11870862 11886587 11958918 12025395 12334789
4207A2334789M22513o48385m20923m76440N93676L12362J20548J7217n76003J160946
$$ 12334789 12757302 12108917 11687994 11211554 11805230 12117592 12238140 12255357 11679354 12840300
4197A2840300J45097j55679l6973N2818P04766L73560j174535m25202m63594J50663
$$ 12840300 12985397 12829718 12792745 12845563 13550329 13923889 12749354 12324152 11860558 12011221
4187A2011221k05106O89225J92788p37775p30651O27126Q23394j083O01732l09502
$$ 12011221 11806115 12495340 12688128 11950353 11219702 11846828 12670222 12669139 13270871 12961369
4177A2961369k31873j75929r5744l0267N57756P16463k32366j17911K86123K55221
$$ 12961369 12729496 12553567 12457823 12427556 12985312 13701775 13469409 13351498 13637621 13892842
4167A3892842J292950j91289m6633j73624m4013Q32149N02794P5437P6923L25605
$$ 13892842 15185792 14994503 14947870 14774246 14730233 15562382 16065176 16140613 16217536 16543141
4157A6543141N3894q58867R92176n4745M17172Q62613l96990p99600J36918J043481
$$ 16543141 16597035 15738168 16730344 16675599 17092771 17955384 17558394 16758794 16895712 17939193
4147A7939193L56636N25112p54065K13971n5875L4295J125662k80735N65961J007070
$$ 17939193 18295829 18820941 18066876 18280847 18224972 18259267 19384929 19104194 19670155 20677225
4137B0677225K68381Q17725m85836L29301M96513K98521N63282p41031P65570
$$ 20677225 20945606 21763331 21277495 21606796 22103309 22401830 22965112 22224081 22989651
4128B2989651n7546l6969p09915N87679j42769k19324k41784Q80540J40242l72525
$$ 22989651 22932105 22895136 22185221 22772900 22630131 22410807 22169023 23049563 23189805 22817280
4118B2817280p945k87248L55496o33426K2928K61369N62762L88488M70352q431
$$ 22817280 22809335 22522087 22877583 22244157 22267085 22528454 23091216 23479704 23950056 23941625
4108B3941625m19996J76159N46136q4918P43762J59454r45489N07246M91324O83687
$$ 23941625 23521629 23697788 24243924 24159006 24902768 25062222 24116733 24623979 25115303 25798990
4098B5798990J583791N85567k62986k52855J115686N87303N50730R34649Q30715
$$ 25798990 27382781 27968348 27705362 27452507 28568193 29155496 29706226 30640875 31471590
4089C1471590J028688P13579J304904J250527J110152K049734J971893K177294
$$ 31471590 32500278 33213857 34518761 35769288 36879440 38929174 40901067 43078361
4081D3078361J818397J960340J596443J884215J065144j17525M16558j772635
$$ 43078361 44896758 46857098 48453541 50337756 51402900 51285375 51701933 49929298
4073D9929298q64829L93359K7037k17118l88198j251085j161305j082510j305091
$$ 49929298 49064469 49457828 49484865 49267747 48879549 47628464 46467159 45384649 44079558
4064D4079558P4455o01736n56779j072615k93779m82000L86268N69160J12120
$$ 44079558 44154013 43552277 42995498 41922883 41629104 41147104 41533372 42102532 42214652
4055D2214652N79672N97466L15057K6143J050112N97318M30392j47378R18700
$$ 42214652 42794324 43391790 43706847 43732990 44783102 45380420 45810812 45663434 46582134
4046D6582134P32852J67176n59228n18285l29457m37269M09439p87783q73199
$$ 46582134 47314986 47482162 46922934 46404649 46075192 45637923 46047362 45259579 44386380
4037D4386380r7089j157559j295500j41327j68980k13645o88529p50170r02956
$$ 44386380 44289291 43131732 41836232 41694905 41525925 41312280 40623751 39873581 38970625
4028C8970625j25832r4670l13582P04596j71143j075474k08673j019353p55236
$$ 38970625 38844793 38750123 38436541 39141137 38969994 37894520 37685847 36666494 35911258
4019C5911258o47700N33362M49562l27466L18253l89119j555995o35096N11020
$$ 35911258 35263558 35796920 36246482 35919016 36237269 35848150 34292155 33657059 34168079
4010C4168079J42843m62141j003790m51604N20022m36529J76133o36698K62152
$$ 34168079 34310922 33848781 32844991 32393387 32913409 32476880 32653013 32016315 32278467
4001C2278467l2060n11814L66073m91058n39843J06285K68398m81355m70382p8559
$$ 32278467 32246407 31734593 32100666 31609608 31069765 31176050 31444448 30963093 30492711 30414152
3991C0414152q0543n24839J09254j88815m42083n941K76113J36353k73016O7204
$$ 30414152 30333609 29808770 29918024 29729209 29287126 29281185 29557298 29693651 29420635 29487839
3981B9487839M05428K25006M81862J26909O94657K52936N30J176128R41323J811829
$$ 29487839 29893267 30118273 30600135 30727044 31421701 31674637 31675167 32851295 33792618 35604447
3971C5604447K069151K688376L273346M403941O976551J0135389J2472280J3021249
$$ 35604447 37673598 40361974 43635320 48039261 55015812 65151201 77623481 90644730
3963I0644730N307062p882642j4416515j2875890r705746p516852m457079l634170
$$ 90644730 95951792 88069150 73652635 60776745 51070999 43554147 39097068 35462898
3955C5462898j985824j923389j132330p76586j747025j369540m29490m77549p03660
$$ 35462898 33477074 31553685 30421355 29644769 27897744 26528204 26098714 25621165 24917505
3946B4917505n93943J37194j319785n24690J87334n74046J36267L64393n58004
$$ 24917505 24323562 24460756 23140971 22616281 22803615 22229569 22365836 22730229 22172225
3937B2172225j7928n33876K64621L28267J8281n88275k77189J99171L14829j4696
$$ 22172225 22154297 21620421 21885042 22213309 22231590 21643315 21366126 21565297 21880126 21865430
3927B1865430j115542m14176J38509l65328J1024L86768N88574p26794o27189
$$ 21865430 20749888 20335712 20474221 20108893 20119917 20506685 21095259 20368465 19741276
3918A9741276j48013M73485l29949l62645j59785Q28122K88760j004899M18770
$$ 19741276 19593263 20066748 19736799 19374154 19214369 20042491 20331251 19326352 19745122
3909A9745122r98425k49358N44244l53509r17275m07094L65698o5804O7705k78717
$$ 19745122 18746697 18497339 19041583 18688074 17770799 17363705 17729403 17663599 17731304 17452587
3899A7452587J55576n0223j70774J26091p55608R8840k28023J5388n85309P1991
$$ 17452587 17608163 17557940 17387166 17513257 16757649 16856489 16628466 16643854 16058545 16130536
3889A6130536j76068j65010M73117J46883M31775j14736n07565k27024q2485P71403
$$ 16130536 15954468 15789458 16262575 16409458 16841233 16726497 16218932 15991908 15909423 16680826
3879A6680826M37909Q9327j002730m51681l23599m63902k42043J13534l4969P9543
$$ 16680826 17118735 17208062 16205332 15753651 15430052 14966150 14724107 14837641 14802672 14882215
3869A4882215M12922K84653l17590J17125K70951N19858r06543j403Q0491m06346
$$ 14882215 15295137 15579790 15262200 15379325 15650276 16170134 15263591 15262188 15342679 14936333
3859A4936333O4039K81537k80176j11784l24230O16319n9089m25510l9930L66792
$$ 14936333 15000372 15281909 15001733 14889949 14565719 15182038 15122949 14697439 14657509 15024301
3849A5024301M36841n26372K11699J92279p2754r65050l55526l75099K40136o33551
$$ 15024301 15461142 14934770 15146469 15338748 15265994 14300944 13945418 13570319 13810455 13176904
3839A3176904N7849J05680P08492j5548o63801Q15273j17093N6600j047242M98191
$$ 13176904 13234753 13340433 14048925 14033377 13369576 14184849 14067756 14124356 13077114 13575305
3829A3575305n9517k79512L10069M31227K61320k51483j4126o10947Q91108O5871
$$ 13575305 13515788 13236276 13546345 13977572 14238892 13987409 13973283 13362336 14253444 14319315
3819A4319315j259867l7496J93673r0305O9342N4564M22713K65176q4763p34441
$$ 14319315 13059448 13021952 13215625 13125320 13194662 13249226 13671939 13937115 13852352 13117911
3809A3117911l05863l94865P20374l9056J7743k73602K49144l49947M71539P85234
$$ 13117911 12812048 12417183 13137557 13098501 13116244 12842642 13091786 12741839 13213378 13998612
3799A3998612K12932n68284k21777L18473M08613p157J25280l49164K65842p023
$$ 13998612 14211544 13643260 13421483 13739956 14148569 14141412 14266692 13917528 14183370 14176347
3789A4176347L3973j63247j20376K06585n28168M55842M31368j8004k75714q3675
$$ 14176347 14210320 14047073 13926697 14133282 13605114 14060956 14492324 14474320 14198606 14114931
3779A4114931p85711N23849O48984J25651M45779m812j70139K73755J51859k86445
$$ 14114931 13329220 13853069 14502053 14627704 15073483 15068671 14898532 15172287 15324146 15037701
3769A5037701j92126M0177q8310o31565N26489L84133n11008M22803l28693N73500
$$ 15037701 14845575 14885752 14797442 14165877 14692366 15076499 14565491 14988294 14659601 15233101
3759A5233101l15897P36511K52998j66924l27552r01127j68214J054251K16581
$$ 15233101 14917204 15653715 15906713 15739789 15412237 14511110 14342896 15397147 15613728
3750A5613728l3056R31699R67183l99492j226501l82136Q47304P95774L26850
$$ 15613728 15580672 16512371 17479554 17080062 15853561 15471425 16318729 17114503 17441353
3741A7441353O75687p18602J09686L40199P56028l92916J022281J37291n8173
$$ 17441353 18117040 17398438 17508124 17848323 18604351 18211435 19233716 19371007 19312834
3732A9312834K64416N49853R7428n52127l656O69853L56946k93325j42270J63846
$$ 19312834 19577250 20127103 20224531 19672404 19668748 20338601 20695547 20402222 20259952 20423798
3722B0423798J65580l81341j89292p86792M92709M27618L07363l25276n99532
$$ 20423798 20589378 20208037 20018745 19231953 19724662 20152280 20459643 20134367 19534835
3713A9534835j8118n40571j215253O7861M70366l79584r15756k20224r68253O69267
$$ 19534835 19516717 18976146 17760893 17828754 18299120 17919536 17003780 16783556 15815303 16484570
3703A6484570n74383n71625L17023l60775k53000q32770j85121M16024o06933
$$ 16484570 15910187 15338562 15655585 15294810 15041810 14209040 14023919 14439943 13833010
3694A3833010j50467L32690m87142l57824l78421l23252J292182k94093j98130
$$ 13833010 13682543 14015233 13528091 13170267 12791846 12468594 13760776 13466683 13268553
3685A3268553J5598j133836J18519O29670O78388n26563R7636l10153L38869J68658
$$ 13268553 13284151 12150315 12268834 12898504 13576892 13050329 13147965 12837812 13176681 13345339
3675A3345339k87055j34209Q7202R39686J44564L57716O09326m40129M16723j60817
$$ 13345339 13058284 12924075 13011277 13950963 14095527 14453243 15062569 14622440 15039163 14878346
3665A4878346l15483l62838j37492P35275J99963j26699n037m24430m69648k19357
$$ 14878346 14562863 14200025 14062533 14797808 14997771 14871072 14866035 14441605 13971957 13752600
3655A3752600R61965o91690j96836k7286N74894O85698j479589M84126k57525
$$ 13752600 14714565 14022875 13826039 13798753 14373647 15059345 13579756 14063882 13806357
3646A3806357p19288L36752K39575N57467m53568k90210L0525p15344k37658O46599
$$ 13806357 13087069 13423821 13663396 14220863 13767295 13477085 13507610 12792266 12554608 13201207
3636A3201207j66811M87243J10142j092866L72277M12579J81974r44473k55662
$$ 13201207 13034396 13521639 13631781 12538915 12911192 13323771 13505745 12561272 12305610
3627A2305610O30520k7847L53513m47077O1309m86082K23237L31510O5016k72651
$$ 12305610 12936130 12908283 13261796 12814719 12876028 12389946 12613183 12944693 13009709 12737058
3617A2737058L02653Q40973j3701k62615l576K93213M36180n7035l83579Q37868
$$ 12737058 13039711 13880684 13866983 13604368 13600792 13894005 14330185 14273150 13889571 14727439
3607A4727439j63726l47956J44445Q84261o56154J39806l52265N90014K19930
$$ 14727439 14563713 14215757 14360202 15244463 14588309 14728115 14375850 14965864 15185794
3598A5185794l53735j12449J01694L78843J92504K99569j50661O539L32151j38832
$$ 15185794 14832059 14719610 14821304 15200147 15392651 15692220 15541559 15548098 15880249 15741417
3588A5741417j55652Q8334j65784K83105J99341L75680j21459K81286P58311J223568
$$ 15741417 15585765 15674099 15508315 15791420 15990761 16366441 16244982 16526268 17284579 18508147
3578A8508147J83546m59186K54965P05933K15470K12829P92075j08088M00218
$$ 18508147 18691693 18232507 18487472 19193405 19408875 19621704 20413779 20305691 20705909
3569B0705909N47733k92975J75567k85728J15272L29947K20019R49293j7889p21625
$$ 20705909 21253642 20960667 21136234 20850506 20965778 21295725 21515744 22465037 22447148 21725523
3559B1725523J19087M13899L35379j50653J93755N05620o00620O48340O05761
$$ 21725523 21844610 22258509 22593888 22443235 22636990 23142610 22541990 23190330 23796091
3550B3796091o9291J499809M88448J29282r4379K80331J005748o2255L84605O9588
$$ 23796091 23726800 25226609 25715057 25844339 25749960 26030291 27036039 26973784 27358389 27427977
3540B7427977o01081j01682m76774M95375o76775n04971M80111p92113o96199
$$ 27427977 26826896 26725214 26248440 26743815 26067040 25562069 26042180 25250067 24553868
3531B4553868k31877l8841K35213j061081j171345n30398o66716o52129l41821
$$ 24553868 24321991 24283150 24518363 23457282 22285937 21755539 21088823 20436694 20094873
3522B0094873N66474j077201j530723O8993j90066m91276J42058m61351j27780
$$ 20094873 20661347 19584146 18053423 18122416 17932350 17441074 17583132 17121781 16994001
3513A6994001j0038L56159p12452q36808J34787R26628K07433O53565N2571N5916
$$ 16994001 16983963 17340122 16627670 15790862 15925649 16852277 17059710 17713275 17765846 17821762
3503A7821762Q6155k52086q12011K03816L10998K95859L81800n28876J084582
$$ 17821762 17907917 17655831 16843820 17047636 17358634 17654493 18036293 17507417 18591999
3494A8591999K22444K62241P15221j11240l91274N69153q56084j91761L20393
$$ 18591999 18814443 19076684 19791905 19680665 19289391 19858544 19002460 18810699 19131092
3485A9131092n82414j80913K55091q61715m7432m31844q69529q31975k80198k27605
$$ 19131092 18548678 18367765 18622856 17761141 17713709 17281865 16412336 15580361 15300163 15072558
3475A5072558k34169l41627p89340j77229k99086K15791N53779j193783m48489
$$ 15072558 14838389 14496762 13707422 13530193 13231107 13446898 14000677 12806894 12358405
3466A2358405N00725j77474l16338n73342j34646o42908L54926k93976p56350
$$ 12358405 12859130 12681656 12365318 11791976 11657330 11014422 11369348 11075372 10319022
3457A0319022M95558K75447O32897p25241l03776K86648n05443n5136k48155j58268
$$ 10319022 10814580 11090027 11722924 10997683 10693907 10980555 10475112 10419976 10171821 10013553
3447A0013553J57769j17759O21792L45368l49097q6891J88518n2708l38987J7116
$$ 10013553 10171322 10053563 10675355 11020723 10671626 10584735 10773253 10720545 10381558 10398674
3437A0398674k71863Q71563J72547n41804k99720L19491l2914n45919k46410n4242
$$ 10398674 10126811 10998374 11170921 10629117 10329397 10648888 10615974 10070055 9823645 9769403
3427I769403M97564K17622n26135L01899J122166m47305m23804J80114k42836
$$ 9769403 10266967 10484589 9958454 10260353 11382519 10935214 10511410 10691524 10448688
3418A0448688j83531N46431K35591O4139j133700K79428O36656J5324j94724j86181
$$ 10448688 10265157 10811588 11047179 11111318 9977618 10257046 10893702 10909026 10714302 10528121
3408A0528121M54099m20678l85428K31504o8529L31356L97779K44489L94187m18310
$$ 10528121 10982220 10561542 10176114 10407618 10339089 10670445 11068224 11312713 11706900 11288590
3398A1288590N1815j0957P26323p34084P43131o71925K00451N07084p73440P64647
$$ 11288590 11340405 11329448 12055771 11321687 12064818 11392893 11593344 12100428 11326988 12091635
3388A2091635M18732o35370l28583J078705q3907J22176K79774m31723l91678
$$ 12091635 12510367 11874997 11546414 12625119 12541212 12663388 12943162 12511439 12119761
3379A2119761O26007N86092j27301O30227M07703k69002L51166k15949J63631
$$ 12119761 12745768 13331860 13204559 13834786 14242489 13973487 14324653 14108704 14272335
3370A4272335o2998J60574R41437L4917n26635n1832N92930L20144N1266L441
$$ 14272335 14209337 14369911 15311348 15346265 14819630 14767798 15360728 15680872 15732138 15735579
3360A5735579J029463j71584l42856L51766N71103l62435L30698l18322R04788
$$ 15735579 16765042 16593458 16250602 16602368 17173471 16811036 17141734 16823412 17728200
3351A7728200k39409m55218J7423L37551Q35217N8743p50736Q25566M19004K16288
$$ 17728200 17488791 17033573 17050996 17388547 18223764 18282507 17531771 18357337 18776341 18992629
3341A8992629p4297K65575M84491j8452r08876O91789K38343n20132R43026J202173
$$ 18992629 18918332 19183907 19668398 19649946 18741070 19432859 19671202 19151070 20094096 21296269
3331B1296269R79195n34259R38728J32517J017607l15972N12919M90583R01906
$$ 21296269 22275464 21741205 22679933 22812450 23830057 23514085 24027004 24517587 25419493
3322B5419493j98189O1251m27371N44893Q87471k94784M60230J035121J58634
$$ 25419493 25221304 25282555 24855184 25400077 26287548 25992764 26452994 27488115 27646749
3313B7646749J139902m25597Q53818J041499N00926j86289M20912L23426l61814
$$ 27646749 28786651 28361054 29214872 30256371 30757297 30571008 30991920 31315346 30953532
3304C0953532N6960P78667N00795J095769j63176O64295P17114l91301M30615
$$ 30953532 31010492 31789159 32289954 33385723 33222547 33886842 34603956 34212655 34643270
3295C4643270J303053P67997j9334R63310N85418P13571Q81609N13086J200685
$$ 34643270 35946323 36714320 36694986 37658296 38243714 38957285 39838894 40351980 41552665
3286D1552665J653164J503016K860551K861427L437967J122530j825440l154177
$$ 41552665 43205829 44708845 47569396 50430823 53868790 54991320 53165880 50011703
3278E0011703k964356k844811j545240k021988m65571j42231p49330j431356r76600
$$ 50011703 47047347 44202536 42657296 40635308 40169737 40027506 39278176 37846820 36870220
3269C6870220j55346k45563q13863m92727j069496l03538P49881m95447o62754
$$ 36870220 36714874 36469311 35655448 35162721 34093225 33789687 34539568 34044121 33381367
3260C3381367J68737O6838l0706J129861P20936J231585J636895K586998L566875
$$ 33381367 33550104 33616942 33586236 34716097 35437033 36668618 38305513 40892511 44459386
3251D4459386N615490Q135475M874636k235968o647799o387074n192217m106778
$$ 44459386 50074876 58210351 63084987 60849019 54201220 47814146 42621929 38515151
3243C8515151j571677n67333q78657j478900k374003r26521j161812j220904n65076
$$ 38515151 36943474 36376141 35497484 34018584 31644581 30718060 29556248 28335344 27770268
3234B7770268k82719j206500j253061O70417m67296l66659M0564j45926j52312
$$ 27770268 27487549 26281049 25027988 25698405 25231109 24864450 24905014 24759088 24606776
3225B4606776j98136P86251P61104O17051M21565J378968J793345L655619K635132
$$ 24606776 24408640 25194891 25955995 26573046 26994611 28373579 30166924 33822543 36457675
3216C6457675M97652l253384l938890l244558k379529n26551j007690n98185r12615
$$ 36457675 36955327 33701943 29763053 26518495 24138966 23612415 22604725 22006540 21093925
3207B1093925o35370k73202j86369N2479j12247j144092q70760O1369j94753J30404
$$ 21093925 20458555 20185353 19998984 20051463 19939216 18795124 17924364 17985733 17790980 17921384
3197A7921384K4782O35536O13638r87439p47380L38690J57182k15163j23672K09129
$$ 17921384 17946166 18581702 19195340 18207901 17460521 17799211 17956393 17741230 17617558 17826687
3187A7826687m21300Q1821J98575j5851O17283j63747l62697O13886M00308p97924
$$ 17826687 17405387 17487208 17685783 17669932 18287215 18123468 17760771 18374657 18774965 17977041
3177A7977041n24082j4472l8960j19625P5684o2318R75016j67846J80012O46186
$$ 17977041 17452959 17438487 17399527 17279902 17355586 17293268 18268284 18100438 18280450 18926636
3167A8926636q96306O6414L30690P67653L7721k39964K51462l1194J40607R23597
$$ 18926636 18030330 18096744 18427434 19195087 19232808 18992844 19244306 19213112 19353719 20277316
3157B0277316M74083k85240m35052j1127J001841K72262q0106P25686j75899R63618
$$ 20277316 20751399 20466159 20031107 20019980 21021821 21294083 21213977 21939663 21763764 22727382
3147B2727382Q45544m8805q3529m86923R11036R21944J379338N58819L08582J21469
$$ 22727382 23572926 23524121 23440592 22953669 23864705 24786649 26165987 26724806 27033388 27154857
3137B7154857L95860j4474O05294N06219J73650Q32680r4170k65579j57764r256
$$ 27154857 27550717 27536243 28141537 28647756 28821406 29654086 29559916 29294337 29136573 29127317
3127B9127317M66716m55188J01093J50840j070733n80186q01373p63993l82823
$$ 29127317 29594033 29138845 29239938 29390778 28320045 27739859 26938486 26174493 25791670
3118B5791670k73882j017966J60414j91631r05208N92347n3921l73700q09104
$$ 25791670 25517788 24499822 24660236 24468605 23563397 24155744 24101823 23728123 22919019
3109B2919019j072169m50917k81514p89229m15848j286373J82058n44960r54024
$$ 22919019 21846850 21395933 21114419 20325190 19909342 18622969 18805027 18260067 17306043
3100A7306043j73875m57382k98275l32829K86975m84354n96996M77443j020186
$$ 17306043 17132168 16674786 16376511 16043682 16330657 15846303 15249307 15726750 14706564
3091A4706564r7017n49411K26831n06424q5019J55408o37697Q9669k41179k04774
$$ 14706564 14609547 14060136 14286967 13780543 13695524 13850932 13213235 13302904 13061725 12856951
3081A2856951l98663K3488j1M59485p55367q79900Q68987j65454m20322J197440
$$ 12856951 12458288 12481776 12481765 12941250 12185883 11305983 12174970 12009516 11589194 12786634
3071A2786634n81746n78522k10546j5744J2228k25345m0300n0118m92144K17623
$$ 12786634 12204888 11626366 11415820 11400076 11412304 11186959 11146659 11096541 10604397 10822020
3061A0822020J83430J28396m18267o8546j65594K98098m51559l68404K78983L2523
$$ 10822020 11005450 11133846 10715579 10647033 10481439 10779537 10327978 9959574 10238557 10271080
3051A0271080L6828L55688q12072n41030J55017M13295q42858j80234P39531n4782
$$ 10271080 10307908 10663596 9851524 9310494 9465511 9878806 9035948 8855714 9595245 9540463
3041I540463j06570j17969M81767K335k85405K65896J09741r66296k11664L34067
$$ 9540463 9433893 9315924 9797691 9800026 9514621 9780517 9890258 8923962 8712298 9046365
3031I046365L84601m37774k34660Q07315L61736O60214k77431q33974M07802L03984
$$ 9046365 9430966 8993192 8758532 9565847 9927583 10587797 10310366 9476392 9884194 10188178
3021A0188178p51128l3950P89220p81151m30215L60589k60874M8288j11750j63683
$$ 10188178 9437050 9403100 10192320 9411169 8980954 9341543 9080669 9128957 9017207 8853524
3011H853524L95591l11802K04249M71355j55107q64455l11728r7459J399676k87449
$$ 8853524 9249115 8937313 9141562 9612917 9457810 8593355 8281627 8184168 9583844 9296395
3001I296395n90522L54960q5916N9318J80359L57434n37847J43731r07221M14277
$$ 9296395 8705873 9060833 8974917 9034235 9214594 9572028 9034181 9177912 8270691 8684968
2991H684968L29045l6028K17979m44414k6938l49303N41432n3105p0217o2757
$$ 8684968 9014013 8977985 9195964 8751550 8724612 8375309 8916741 8863636 8793419 8730662
2981H730662J26159n2978n2958K39586J20788j27520n0565k4720n75249L77718
$$ 8730662 8856821 8803843 8750885 8990471 9111259 8983739 8933174 8908454 8333205 8710923
2971H710923L21326K92650O111m51998O04459Q03757J18p68491K91033K87546
$$ 8710923 9032249 9324899 9331010 8879012 9483471 10287228 10287346 9518855 9809888 10097434
2961A0097434j98001P47661k62672l44744r30934L87916K02553o3688O97987l76836
$$ 10097434 9899433 10647094 10384422 10039678 9108744 9496660 9699213 9635525 10333512 9956676
2951I956676p1743m3241J6171J073748r83516O125M9691L68036J96042Q8753R8423
$$ 9956676 9884933 9841692 9857863 10931611 9948095 9954220 10003911 10371947 10567989 10656742 10755165
2940A0755165L28163l30726K97765L03666K55189J36534m14036p0609M85874J85397
$$ 10755165 11083328 10752602 11050367 11354033 11609222 11745756 11331720 11261111 11746985 11932382
2930A1932382Q07368P86803l52322M03034j92324R0946J033981L10257o38828
$$ 11932382 12739750 13526553 13174231 13577265 13384941 13475887 14509868 14820125 14181297
2921A4181297O36497R9455J27506K6246P31071R9204K71871N65800Q09629l27261
$$ 14181297 14817794 14917249 15044755 15071001 15802072 15901276 16173147 16738947 17548576 17221315
2911A7221315O01008O0899m75527J015531J291504M83427J111884M05901l62937
$$ 17221315 17822323 17883222 17407695 18423226 19714730 20198157 21310041 21715942 21353005
2902B1353005p7321N42083K42325P21624P86442J072566J117455M40118J668996
$$ 21353005 21275684 21817767 22060092 22781716 23568158 24640724 25758179 26198297 27867293
2893B7867293M69617R12813J137175P75147P65453O37758J447819O97480J446388
$$ 27867293 28336910 29249723 30386898 31162045 31927498 32565256 34013075 34710555 36156943
2884C6156943J256677J141135k7775R86035J202084J026097J201682P48461j16187
$$ 36156943 37413620 38554755 38526980 39513015 40715099 41741196 42942878 43691339 43575152
2875D3575152N81634J173275Q98930R23350J071899R09843N24029J340031J443007
$$ 43575152 44156786 45330061 46228991 47152341 48224240 49134083 49658112 50998143 52441150
2866E2441150J098773K142914J420676K691767K387658K262509L321940K091103
$$ 52441150 53539923 55682837 57103513 59795280 62182938 64445447 67767387 69858490
2858F9858490K281442J273841J670205J013927R66063k4091k322428k780843k571737
$$ 69858490 72139932 73413773 75083978 76097905 77063968 77039877 74717449 71936606 69364869
2849F9364869l033266l073727j348103k301785j721214j406187k408845k515228
$$ 69364869 66331603 63257876 61909773 59607988 57886774 56480587 54071742 51556514
2841E1556514k029823l184901k915393j659740k228416j959159k228413q74759
$$ 51556514 49526691 46341790 43426397 41766657 39538241 37579082 35350669 34475910
2833C4475910j918147r18110j543269q34627j563850j808981j662032j17966l15051
$$ 34475910 32557763 31639653 30096384 29261757 27697907 25888926 24226894 24108928 23793877
2824B3793877l30952m31114o92577n58856o46930j47769L79488l34079j045465
$$ 23793877 23462925 23031811 22339234 21780378 21133448 20985679 21365167 21031088 19985623
2815A9985623q39228o97971j120899l07318K9022k79170p0113o47286n55572R682
$$ 19985623 19146395 18448424 17327525 17020207 17049229 16770059 16699946 16052660 15497088 15506770
2805A5506770p00770q48745l67949l93066l02837K64697K82235j01144m3623m76090
$$ 15506770 14806000 13957255 13589306 13196240 12893403 13158100 13440335 13339191 13295568 12819478
2795A2819478l31483k38377L63848q5087p55869o25457p22459O98680j00809o43549
$$ 12819478 12487995 12249618 12613466 12528379 11772510 11147053 10424594 11123274 11022465 10378916
2785A0378916q6434O810K48932p90886K72897Q03138n26737P4351k54798J82069
$$ 10378916 10292482 10299292 10548224 9757338 10030235 10833373 10306636 10380987 10126189 10308258
2775A0308258L50209j01684O4022k98606Q6613l43050M39862P66396K07898J36573
$$ 10308258 10658467 10556783 10620805 10322199 10408812 10065762 10505624 11272020 11479918 11616491
2765A1616491K97009K35522M26844j53496r2109J68965m73908j174519n96726
$$ 11616491 11913500 12149022 12575866 12422370 12330261 12499226 12025318 10850799 10254073
2756A0254073m42049R3448J20977p42614J61727q63004r02684N39706L28235m79765
$$ 10254073 9812024 9905472 10026449 9283835 9445562 8582558 7679874 8219580 8547815 8068050
2746H068050K20665K68678n63807L40937j023198K48460n82005P99704J70390
$$ 8068050 8288715 8557393 7993586 8334523 7311325 7559785 6977780 7777484 7947874
2737G947874k42952J42229J62910K27376o72335m61290K63520P15828N06892o56540
$$ 7947874 7704922 7847151 8010061 8237437 7565102 7103812 7367332 8083160 8590052 7933512
2727G933512J30271K21718j000763r34374O18107K69480k03705J78414M78796
$$ 7933512 8063783 8285501 7284738 6350364 6968471 7237951 7034246 7212660 7691456
2718G691456J56201J97619J56348j13501O00094o62090l04745L68266j57136K38997
$$ 7691456 7847657 8045276 8201624 8088123 8688217 8026127 7721382 8089648 7932512 8171509
2708H171509J31457j02801R3753K27114K09270M7819J62507L64122J015329o33590
$$ 8171509 8302966 8200165 8293918 8521032 8730302 8778121 8940628 9304750 10320079 9686489
2698I686489k5373J081753l47479p96547M6041k04481L80956J69167M6421R42703
$$ 9686489 9661116 10742869 10395390 9598843 9644884 9440403 9821359 9990526 10036947 10979650
2688A0979650p0731l02241J74983L51127M85316K5687l39947o6081L00150k95292
$$ 10979650 10908919 10606678 10781661 11132788 11618104 11643791 11303844 11237763 11537913 11242621
2678A1242621P3287n01015J450478m14897q17664k24237O04787m76964J48271
$$ 11242621 11315908 10814893 12265371 11850474 11032810 10808573 11413360 10936396 11084667
2669A1084667j002933l37465N89683m34565O37308m31201o56861k71397j35882
$$ 11084667 10081734 9744269 10333952 9899387 10536695 10105494 9448633 9177236 9041354
2660I041354j11337m76641K46476l98614n77991J34377N53615m56368m67793L35856
$$ 9041354 8930017 8453376 8699852 8301238 7723247 7857624 8411239 7954871 7487078 7822934
2650G822934l18257m33933n75253N61696n8335p18532q87057m1904m62209L57749
$$ 7822934 7504677 7070744 6495491 7057187 6998852 6280320 5393263 5351359 4889150 5246899
2640E246899l3973K94012N94333k85302m10516k08787M73663l54000l06782O06439
$$ 5246899 5212926 5506938 6101271 5815969 5405453 5196666 5670329 5316329 5009547 5615986
2630E615986k82517j71523M572j70822k24293N11844j58711L06655m23341K94403
$$ 5615986 5333469 5161946 5166518 4995696 4771403 5283247 5124536 5431191 5007850 5302253
2620E302253j13067n30786n92544l23903Q5060o9813j48059j55277L41374j65424
$$ 5302253 5189186 4658400 4065856 3741953 3827013 3757200 3609141 3453864 3795238 3629814
2610C629814J313J009886K31412n92429l15918j96010l22458L67594K26355l57418
$$ 3629814 3631127 4641013 4872425 4279996 3964078 3768068 3445610 3813204 4039559 3682141
2600C682141k89807J08607o10503L28601O78909j91994O46764o32078l93975J020622
$$ 3682141 3392334 3500941 2890438 3219039 3897948 3705954 4352718 3720640 3326665 4347287
2590D347287l26890j147903N3970K12697N32321j017649O25765N41313j183440
$$ 4347287 4020397 2872494 2926464 3139161 3671482 2653833 3279598 3820911 2637471
2581B637471N6974O1950n02386j8387N85450J97140L90723P80648q80649p33375
$$ 2637471 2694445 2756395 2254009 2235622 2821072 3018212 3408935 4189583 3308934 2575559
2571B575559L4800J6587m11875j061l145k75637N79637o49210P05887j2074l57354
$$ 2575559 2610359 2626946 2215071 2214010 2210865 1935228 2514865 1865655 2571542 2559468 2202114
2560B202114J53110Q87129n2713p30312P1436K72707L06115p66499L1982J3627
$$ 2202114 2355224 3242353 3189640 2459328 2530764 2803471 3109586 2343087 2375069 2388696
2550B388696K11024L96415o40013m3168Q080m28354J51955r6926R79645o30036
$$ 2388696 2599720 2996135 2356122 2312954 2321034 1892680 2044635 1947709 2927354 2297318
2540B297318p00108M23630n8371l9649p6212o10487R7541k7414Q95006Q927o26655
$$ 2297318 1597210 2020840 1962469 1922820 1846608 1236121 1333662 1306248 2201254 2210181 1583526
2529A583526J77484K87015K51113K49586J33239n63541L46547m2170j140488R2424
$$ 1583526 1761010 2048025 2299138 2548724 2681963 2118422 2464969 2422799 1282311 1374735
2519A374735O77010j13534l49750m98197L22929L00516o0557N04629O51107q48943
$$ 1374735 2051745 1938211 1588461 1090264 1413193 1713709 1653152 2157781 2808888 1959945
2509A959945R9191M60545N27040p69713r46176N14090j058775M91200l65540k75977
$$ 1959945 2059136 2519681 3046721 2277008 1330832 1844922 786147 1277347 911807 635830
2499F35830M48146j79828L30417M71113q01415L6907Q74367K143o95136m27888
$$ 635830 1083976 904148 1234565 1705678 904263 941170 1815537 1817680 1122544 694656
2489F94656R52389l8702N2467o20609M83123J92969J29410J50708o78613Q02816
$$ 694656 1647045 1608343 1660810 1040201 1523324 1716293 1845703 1996411 1317798 2120614
2479B120614J91570j91395q08779r5804K92302k48855r85044J05504O87074M80726
$$ 2120614 2312184 2120789 1312010 1216206 1508508 1259653 274609 380113 1067187 1547913
2469A547913q5830m54737k68381M9374N16280K05208j78458K27262l019L37406
$$ 1547913 1462083 1007346 738965 788339 1304619 1509827 1331369 1558631 1555612 1893018
2459A893018J43167n59927j78560Q8265P54831J57339k36262J56257l33037O22909
$$ 1893018 2036185 1476258 1297698 1385963 2140794 2298133 2061871 2218128 1885091 2508000
2449B508000K15542r77904R6265m12237L44807K41240n04927l55642J329778L49367
$$ 2508000 2723542 1745638 1841903 1429666 1774473 2015713 1510786 1155144 2484922 2834289
2439B834289j590387n9550N4281R0003J81630n76632M55263J71669M1782O03618
$$ 2834289 1243902 1184352 1238633 1328636 1510266 933634 1388897 1560566 1602348 2205966
2429B205966N84788P26743n73479m41257n27839m34166M48398L99832o05532m59399
$$ 2205966 2790754 3517497 2944018 2502761 1974922 1540756 1989154 2388986 1783454 1324055
2419A324055Q50964m62834p3317k31815N1367p27550j03039O22226k49177o84242
$$ 1324055 2175019 1712185 1638868 1407053 1458420 730870 627831 1250057 1000880 316638
2409C16638K71738J7295O75021K73977p22706J002271o09185m83134O4393k0231
$$ 316638 588376 605671 1280692 1554669 831963 1834234 1225049 741915 806308 786077
2399G86077M40811n4830o28331l89385P78386N77459O1669L10015O17331p27664
$$ 786077 1226888 1172058 543727 154342 932728 1510187 1571856 1881871 2499202 1771538
2389A771538o80543q77321J56585M88229O52106K2058K51615m0825N9723N12192
$$ 1771538 1090995 213674 370259 858488 1510594 1532652 1784267 1743442 1803165 2315357
2379B315357L3862k9845p72149O49990L23080K35652q14q8763k46139n16215l69534
$$ 2315357 2349219 2319374 1547225 2197215 2520295 2755947 2755133 2666370 2420231 1904016 1534482
2368A534482j02940j32373L38108K45827j118483k99610K4229M94145j33498O25319
$$ 1534482 1431542 1299169 1637277 1883104 764621 465011 489240 983385 849887 1475206
2358A475206K3231o30993q08361L81168N50335J67731j37577l44799M97989p89001
$$ 1475206 1498437 867444 59083 440251 990586 1158317 1020740 675941 1173930 384929
2348C84929L74393k95991M82314M99534L37600n40755J72115p34693o47924O05084
$$ 384929 759322 463331 945645 1445179 1782779 1242024 1414139 679446 31522 636606
2338F36606l4385M99853m28888Q07666k65238r05972L74334L77021l00076M61513
$$ 636606 602221 1102074 673186 1480852 1215614 309642 683976 1060997 760921 1222434
2328A222434K41999j65j5780r13292k37097R62957L46686j370143O25649K52387
$$ 1222434 1464433 1464268 1448488 535196 298099 1261056 1607742 237599 863248 1115635
2318A115635n05699n59268P84932J50934L73602L66579J41565j08348l26513j38457
$$ 1115635 609936 50668 835600 986534 1360136 1726715 1868280 1759932 1433419 1294962
2308A294962J75311o61222k17238l22404P15656L34430n06512J41724l47051n44443
$$ 1294962 1470273 809051 591813 269409 985065 1319495 812983 954707 607656 63213
2298F3213L59911K5548k96372L46170j3252J75922L65021L42965K33391m34831
$$ 63213 423124 448672 152300 498470 485218 661140 1026161 1369126 1602517 1167686
2288A167686l21773j03344M72486n45775q4908K93527j75265n2537j64073j74413
$$ 1167686 845913 742569 1215055 669280 584372 877899 702634 650097 486024 311611
2278C11611M02881n52122q2150N04219l70683O46779Q5961k7430O19222M5770
$$ 311611 714492 162370 80220 584439 213756 860535 946496 919066 1538288 1584058
2268A584058j245894N59918J53852l62924O1534L59457q41067L84218K94685L61612
$$ 1584058 338164 898082 1051934 689010 750544 1110001 268934 653152 947837 1309449
2258A309449K5245q17570k15264L35147L73098N24266k73621p15163m98822l6257
$$ 1309449 1334694 517124 301860 637007 1010105 1534371 1260750 545587 46765 10508
2248A0508L77627P11644p04253K18647K42722o58671L25579k23590M73825K26186
$$ 10508 388135 1099779 395526 614173 856895 198224 523803 300213 774038 1000224
2238A000224j36972l20818L75942q3926M16515L55238n10605n1806j26677R22979
$$ 1000224 863252 542434 918376 834450 1250965 1606203 1095598 1043792 917115 1840094
2228A840094K68151k50473j78688j17950J92066j83935p29512N38848M00123m68491
$$ 1840094 2108245 1857772 1679084 1561134 1753200 1569265 839753 1378601 1778724 1310233
2218A310233k70840N38271M1438l84767M52825L09700p57251J20649M68426M02332
$$ 1310233 1039393 1577664 1619102 1234335 1687160 1996860 1239609 1360258 1828684 2231016
2208B231016m40653p51124P45956J11734l73224j32164m30832l93545L88079K14760
$$ 2231016 1790363 1039239 1785195 1896929 1523705 1391541 960709 567164 955243 1170003
2198A170003M02761P0119K27284l84484L98301j7284M51091Q31252J07351p6413
$$ 1170003 1572764 1642883 1870167 1485683 1883984 1866700 2317791 3149043 3256394 3179981
2188C179981q43460o08460O35907P80644J55348j89173l94772M90524r06399j71005
$$ 3179981 2336521 1728061 2363968 3144612 3299960 3110787 2716015 3206539 2300140 2129135
2178B129135M63717P3778r0661L53125P15820m1327O56821J34520l43909Q73756
$$ 2129135 2592852 2666630 2575969 2929094 3644914 3603587 4260408 4394928 4051019 4924775
2168D924775M56635l08703n22016K83705M23392k98457l47220J36311R75755R4777
$$ 4924775 5381410 5072707 4550691 4834396 5257788 4959331 4612111 4748422 5724177 5818954
2158E818954j98767J90913J47277J299378J39802k4234O4898J90035r4055L2495
$$ 5818954 5620187 5811100 5958377 7257755 7397557 7373323 7438221 7628256 7534201 7566696
2148G566696Q35818o901N81477O38324O64331N87473N60568O8342l10544K43685
$$ 7566696 8402514 8395613 8977090 9615414 10279745 10867218 11427786 11496128 11185584 11429269
2138A1429269J047930O09567N19044J270161N31541L16559P78017Q59115Q35912
$$ 11429269 12477199 13086766 13605810 14875971 15407512 15724071 16502088 17361203 18197115
2129A8197115J107412J035555J202771J671043J840127J028153K033423L117440
$$ 18197115 19304527 20340082 21542853 23213896 25054023 26082176 28115599 31233039
2121C1233039K136500J210017J504875Q55608L246344M829611N953529P843512
$$ 31233039 33369539 34579556 36084431 36940039 40186383 45015994 50969523 58813035
2113E8813035J0299590J2560819J6814686K4917485L7353175N5995232P1045017
$$ 58813035 69112625 81673444 98488130 123405615 160758790 216754022 287799039
2106B87799039K0735897m3417600n7884875n3980482l6838688k3989018j7261044
$$ 287799039 308534936 265117336 207232461 153251979 116413291 92424273 75163229
2099G5163229j4059965q851974o710297m721045m059640j921906j020623N60345
$$ 75163229 61103264 52251290 45540993 40819948 36760308 34838402 33817779 34378124
2091C4378124j910654k253955l000980k991537j759676j160609j931141j088619
$$ 34378124 32467470 30213515 27212535 24220998 22461322 21300713 19369572 18280953
2083A8280953j066210j815051j221980l47271r03189k08979n89817j214672m55362
$$ 18280953 17214743 15399692 14177712 13830441 12927252 12718273 12128456 10913784 10458422
2074A0458422k81551j05177j157362k25004k50414r45522p47224k00327M03249
$$ 10458422 10176871 10071694 8914332 8689328 8438914 7493392 6746168 6545841 6949090
2065F949090r19267j69183K27407L12019L26755j172573L45361k9161k50122q00977
$$ 6949090 6029823 5860640 6088047 6400066 6726821 5554248 5899609 5870448 5620326 4819349
2055D819349J86300K52282p36701l56687L9790q83582k11875K71133N65244J09572
$$ 4819349 5005649 5257931 4521230 4164543 4204333 3320751 3108876 3380009 3945253 4054825
2045D054825n20838J73211k84758J1197J06548N71941l54341p46936O1048k28256
$$ 4054825 3533987 3707198 3422440 3433637 3540185 4112126 3757785 3010849 3071897 2843641
2035B843641Q48226j75925m17848n74597l46586k63472M30444N87131m64233m45454
$$ 2843641 3691867 3515942 3098094 2523497 2176911 1913439 2343883 2931014 2466781 2021327
2025B021327k85292R87914j28546l49475j22740n62781K28948l3488J002656k94471
$$ 2021327 1736035 2723949 2595403 2245928 2123188 1560407 1789355 1755867 2758523 2464052
2015B464052q98016n21445m84216L48819L19101L4502M40081j77267k29330l4950
$$ 2464052 1566036 1044591 560375 909194 1228295 1262797 1702878 1525611 1296281 1261331
2005A261331M06026r1197l177o11170Q47297o22970O8325j75792J42853n82540
$$ 1261331 1667357 1576160 1572983 961813 1809110 1186140 1254465 1078673 1221526 638986
1995F38986J29478P28455q28801N16192l63585M01499n23192k931p0057L35616
$$ 638986 768464 1496919 668118 1184310 820725 1222224 699032 696101 626044 961660
1985I61660K20755J31353K97825J56827j09248m78561j111900K12535J63887K01764
$$ 961660 1182415 1313768 1611593 1768420 1659172 1180611 68711 281246 445133 646897
1975F46897K28787n9548J63522Q96461m32826q94101n0073P8844R67589l05024
$$ 646897 875684 816136 979658 1876119 1443293 549192 499119 577963 1545552 1240528
1965A240528R3923m53774j47855l79534L20828M1428r7005J87287k48087n57738
$$ 1240528 1334451 880677 732822 353288 674116 715544 618539 805826 557739 1
1955Ak09205K49283N51349l22357p68178o9565O91842L95613R77715o74843J07931
$$ 1 -209204 40079 591428 269071 -499107 -568672 123170 518783 1496498 821655 929586
1944I29586j37330o66475K07898k17772N9669R10922L16552q40195k01593J61349
$$ 929586 792256 125781 333679 115907 175576 1086498 1403050 562855 361262 522611
1934E22611n02915K58333P04418p84885M87288l06597J16709K72884l08752m80605
$$ 522611 19696 278029 982447 197562 684850 378253 494962 767846 459094 -21511
1924b1511q10823P27149J33226j16078Q6836J83719n27841m0714J49795O6837
$$ -21511 -832334 -105185 28041 -88037 -1201 182518 -345323 -386037 -236242 -169405
1914a69405J92131R2329k01914k63002P41131K8154l13239m99889N89908k05023
$$ -169405 22726 115055 -86859 -349861 391270 419424 106185 -393704 196204 -8819
1904h819p37912l3876Q69894J43356l2826k44020M90768k59066l92008l38889
$$ -8819 -746731 -780607 89287 232643 199817 -44203 446565 187499 -204509 -543398
1894e43398Q2664o999K08260l34261L62189K12324M27637j84837k17976O16182
$$ -543398 -460734 -467733 -259473 -593734 -231545 -19221 408416 223579 5603 621785
1884F21785N17937p78999O87591L96232p89255r54159K13780O98494M46536o04869
$$ 621785 1139722 360723 1048314 1444546 655291 -298868 -85088 613406 1059942 455073
1874D55073l99087j5198O21651k74418l99147l44251l04225L51872n236Q44702
$$ 455073 55986 40788 662439 388021 -11126 -355377 -659602 -307730 -312966 531736
1864E31736M01926l57465j56141n93213K71375J064312n61811k6173m01111N43928
$$ 531736 933662 576197 420056 -173157 98218 1162530 600719 574546 173435 717363
1854G17363L15033m38860k48329M1748j045522K84916Q3096P29967p37354l4109
$$ 717363 1032396 593536 345207 386955 -658567 -373651 -290555 439412 -297942 -332051
1844c32051j85784O05698L37382M9529J83300N2050k53389l74681N57111n32155
$$ -332051 -517835 87863 425245 474774 658074 710124 456735 82054 639165 107010
1834A07010N46492k06533k48021K40909m62498m68136M44487M35199j07115Q7340
$$ 107010 653502 446969 198948 439857 -22641 -490777 -46290 388909 281794 369134
1824C69134j96849k75023L46080k77570L04658Q41668m68345q55089L63546N11391
$$ 369134 172285 -102738 243342 -34228 270430 1112098 643753 -211336 152210 663601
1814F63601j93519o71633J49395N80549K97379o29008q5749k13721L28230l81078
$$ 663601 470082 -201551 -52156 528393 825772 196764 111015 -102706 225524 -155554
1804a55554J9173p624N35733l9042k35310j58496o16479k8830m83956L79614O01105
$$ -155554 -136381 -144005 391728 352686 117376 -41120 -657599 -686429 -1170385 -790771 -189666
1793a89666l04885j39932P2346K28301O43342r45769l81116P96335N16070l18243
$$ -189666 -494551 -634483 -562137 -333836 309506 -636263 -1017379 -221044 295026 -23217
1783b3217Q1999P37608j81907j85416m24898o066J70192p9156j06309O3122L64189
$$ -23217 58782 796390 614483 429067 4169 -1897 168295 89139 -17170 45952 410141
1772D10141J73182L0890K86587k81055j125759J45924j19199J97183J41777N41456
$$ 410141 583323 614213 900800 619745 -506014 -360090 -479289 -282106 -140329 401127
1762D01127l58686m67502o04287Q13822j97729O09024J76009J56146l48033L3614
$$ 401127 42441 -425061 -1029348 -215526 -413255 195769 371778 527924 179891 213505
1752B13505l18983j33051J55759P2437L71423M28908m14955k38383J85779m34097
$$ 213505 -105478 -238529 -82770 -10333 361090 789998 375043 136660 322439 -111658
1742a11658L19596L23430k69492n7015l45529N45815r09000o06452O81748J091642
$$ -111658 207938 531368 261876 204861 -140668 405147 -503853 -1110305 -428557 663085
1732F63085N3863n8547m31490J06406k65034k86685L39759m03071L65836L48963
$$ 663085 716948 658401 226911 333317 68283 -218402 121357 -281714 84122 433085
1722D33085p91977P3995O19129q5371j40185m25505N06458J51817j84393p1192
$$ 433085 -358892 -284897 334232 248861 108676 -316829 189629 341446 157053 85861
1712H5861M40496l89127m43305j37532k15820k16251Q95664j95073L94287K97025
$$ 85861 526357 137230 -306075 -443607 -659427 -875678 19986 -175087 219200 516225
1702E16225J085141m78085k65259n56617l41738O64614m5341o14473P2114n5782
$$ 516225 1601366 1123281 858022 301405 -40333 624281 578940 -35533 36581 -19201
1692a9201k48877n12815M48426j62962K77872K50876l85880J58666l8844N46889
$$ -19201 -268078 -780893 -332467 -495429 -217557 33319 -352561 -193895 -232739 314150
1682C14150l67435q69415R17975N6670M94550j11560o9993n22451K07728j30260
$$ 314150 -53285 -922700 -4725 51945 546495 434935 364942 -157509 50219 -80041
1672h0041J71377L76784j47624r6071m78116m16252K52758N55593o05405R39p3721
$$ -80041 91336 468120 320496 224425 -253691 -669943 -417185 138408 -466997 -466058 -539779
1661e39779n69550N80205K52340m09281l27366O75170k27846P5473l99714j81559
$$ -539779 -1109329 -529124 -276784 -686065 -1013431 -338261 -566107 -490634 -890348 -1071907
1651a071907R67779K3670M47031m24269k59792K9425K68480p7510J61036k82654
$$ -1071907 -104128 -80458 366573 -57696 -317488 -288063 -19583 -97093 63943 -218711
1641b18711K56666J36819J82522j34859m42188k77315j91425R38667q3593l52773
$$ -218711 37955 174774 357296 222437 -219751 -497066 -688491 250176 166583 -186190
1631a86190p34254K22314M43348M20188K38523p07660K52532L60390J33452K45339
$$ -186190 -920444 -698130 -254782 165406 403929 -303731 -51199 309191 442643 687982
1621F87982p37422J14254l43118j46865L29576L86739m37373n2106k86615J397657
$$ 687982 -49440 64814 -278304 -425169 -95593 291146 -146227 -198333 -484948 912709
1611I12709M37461j370085k5672L58296J82366j546176N99044L9622q956j59055
$$ 912709 1350170 -19915 -45587 312709 495075 -1051101 -452057 -412435 -421391 -580446
1601e80446N35950L79059J45686j99878l80973q17873J178466o68658R47312j20205
$$ -580446 -44496 334563 480249 280371 -100602 -918475 259991 -408667 538645 418440
1591D18440l74548l39524N43247n88734j93714L22918r5789L91365q34600m27062
$$ 418440 43892 -295632 247615 -341119 -534833 -211915 -307704 83661 -750939 -1178001
1581a178001j87205P81542k83205l92727O15128K58369M68257N41980J92974q79367
$$ -1178001 -1365206 -583664 -866869 -1259596 -644468 -386099 82158 624138 817112 -62255
1571f2255p3884l43648l12400M08057m59892O63375k35917L72382o92010Q3125
$$ -62255 -136139 -479787 -792187 -384130 -844022 -180647 -416564 -44182 -736192 -653067
1561f53067k43552J93J027475q2946p12394N16051J74462n50859k10410M14903
$$ -653067 -896619 -896426 131049 48103 -664291 -148240 26222 -524637 -735047 -320144
1551c20144J61767L64148j89038p38178N36956o6680J28169q4779l93382p26044
$$ -320144 -158377 205771 16733 -721445 -184489 -251169 -123000 -207779 -601161 -1327205
1541a327205P9586K63007k77085K56457J60407r89393N16423N43173L76560O88418
$$ -1327205 -1247619 -984612 -1261697 -1005240 -844833 -1834226 -1317803 -774630 -398070 290348
1531B90348M27341J41069o79989L30195l91774K5487J50029O63230p49981k69940
$$ 290348 717689 858758 178769 508964 117190 142677 292706 955936 205955 -63985
1521f3985O24380o78965K29195m66653k4749N62145m6241l60789J64725n94772
$$ -63985 560395 -118570 110625 -356028 -380777 181368 135127 -225662 -60937 -655709
1511f55709P42811j44421L14642n45104j76359L69772k84747O92044l28694j2967
$$ -655709 87102 -57319 257323 -287781 -464140 -94368 -379115 312929 -15765 -28732
1501b8732o3226P40761k40140n77621l22612N46572l51002M34036n8416J3248
$$ -28732 -91958 648803 408663 -168958 -491570 55002 -296000 138036 79620 92868
1491I2868J27233m12904K36943L67254k68805k95698j49058K22891k32835m83592
$$ 92868 220101 -192803 44140 411394 142589 -153109 -302167 -79276 -312111 -795703
1481g95703P44524Q65540N80109l40954o96148K2815o43115l63977J63199P22389
$$ -795703 -51179 814361 1394470 1053516 357368 380183 -262932 -626909 -463710 258679
1471B58679L81903l56254M7739M82700j96483j160499l32321J148551K11205m6529
$$ 258679 640582 284328 332067 814767 618284 -542215 -874536 274015 485220 438691
1461D38691q39460j91700J048679j67544r57962K19982J34711N75792j47094m04154
$$ 438691 -400769 -592469 456210 288666 -669296 -449314 -314603 261189 114095 -290059
1451b90059m33769Q01421L46878l72371j36803o0818L72556k20653k01683o67683
$$ -290059 -723828 77593 424471 52100 -84703 -145521 227035 6382 -195301 -862984
1441h62984O76353J62355q4429l28725L77585k3214M108l61979J75563K05848
$$ -862984 -186631 -24276 -108705 -437430 -59845 -83059 -78951 -440930 -265367 -59519
1431e9519J16844K11530j20291P8873K21074j366182J89434j56790J64483Q7664
$$ -59519 57325 268855 148564 227437 448511 -917671 -728237 -885027 -720544 -632880
1421f32880n05088J085097q54664O66606k63665q75161k89779N15606O09011l79883
$$ -632880 -1137968 -52871 -907535 -240929 -504594 -1379755 -1669534 -1153928 -544917 -924800
1411i24800L98565j12017j45722P42002M86386l20930P2451M16030p17464l09172
$$ -924800 -526235 -638252 -783974 -41972 444414 123484 195935 611965 -105499 -414671
1401d14671K90602O65728o51423l21693J78342M87976L42458m09643k32577J61294
$$ -414671 -124069 541659 -109764 -431457 -253115 234861 577319 167676 -64901 96393
1391I6393k99015O8529L98169m7506n98893N0833N48018j012414M37144M65175
$$ 96393 -202622 -134093 264076 216570 -382323 -331490 216528 -795886 -358742 106433
1381A06433q5824q8456m51920J87376O29336J54217n78010K87891J019177k61722
$$ 106433 20609 -67847 -519767 -332391 296945 451162 -126848 161043 1180220 918498
1371I18498k97961m0226l9378p76302O97196m38745K404k88574M82541n95049
$$ 918498 620537 580311 540933 -235369 461827 23082 25486 -263088 219453 -375596
1361c75596n13709J87978j2590k89952L32910O19198L54554j7629j79226Q7486
$$ -375596 -889305 -701327 -713917 -1003869 -670959 -51761 302793 285164 105938 193424
1351A93424l44963N04601l33579m84677K98452O94451j17260N97611J76773n07115
$$ 193424 -151539 353062 19483 -465194 -166742 527709 410449 1008060 1184833 677718
1341F77718n93980P32615L57769o51966p44148j68323r52621N71114Q24882L1452
$$ 677718 83738 816353 1174122 522156 -221992 -390315 -1342936 -771822 53060 84512
1331H4512r73357j30330O55278K3669k33672O01427O44136L32483k3137o01522
$$ 84512 -888845 -1019175 -363897 -340228 -573900 27527 671663 1004146 981009 379487
1321C79487l28527P8630L62689n91971L35902j74372M78489n94720M34884o3823
$$ 379487 50960 129590 492279 -99692 236210 61838 540327 -54393 380491 316668
1311C16668j59731K84826o66678J89339p07950k08684L08162J66913m16465j76883
$$ 316668 156937 441763 -224915 -35576 -743526 -952210 -644048 -477135 -893600 -1070483
1301a070483O14354L84328L16434q28012O4198L41254k06576J158313n49163n95921
$$ -1070483 -456129 -71801 244633 -583379 -519181 -177927 -384503 773810 224647 -371274
1291c71274M75056J28919o72184L77360J83078n27475N75007L30419n36457q35621
$$ -371274 103782 232701 -439483 -62123 120955 -406520 168487 498906 -37551 -873172
1281h73172N47926M62228j86574k84356O44332m08514K55580j21465j112626n8065
$$ -873172 -325246 136982 -49592 -333948 310384 -98130 157450 35985 -1076641 -1134706
1271a134706j87231M08565J220184m59474m83110N50067L66859K25199r3165M3682
$$ -1134706 -1321937 -913372 306812 -152662 -635772 -85705 281154 506353 413188 456870
1261D56870O15009o16348p40256o0352m62787J53231k01658l6394P64749R48240
$$ 456870 1071879 455531 -284725 -345077 -807864 -654633 -856291 -892685 -127936 820304
1251H20304J08176m71641n95507N63548P5967N0939m26723M07513k76473k13263
$$ 820304 928480 456839 -138668 424880 500847 551786 125063 532576 256103 42840
1241D2840n07080K29893J51506N47496O0389j083913J97968j35945L47466k58986
$$ 42840 -464240 -234347 -82841 464655 525044 -558869 -360901 -496846 -149380 -408366
1231d08366o44212k5075N21050Q23330j33036K29954n07052m94942L38596l46579
$$ -408366 -1052578 -1077653 -556603 266727 133691 363645 -143407 -638349 -299753 -646332
1221f46332K56110L3020J26073k14896P04948o18688m68210M82947R2826k8797
$$ -646332 -390222 -357202 -231129 -446025 258923 -359765 -827975 -345028 -252202 -280999
1211b80999o1606J181150p07368m83031L67688m65902J38456l09941J061340L41854
$$ -280999 -342605 838545 131177 -351854 15834 -450068 -311612 -621553 439787 781641
1201G81641k90752M97585j361178L5605O13365k81462O18545j4337r33636P1344
$$ 781641 490889 988474 -372704 -337099 276266 -5196 613349 599012 -334624 -263280
1191b63280K96527K77509r79009M99444j8367l01619J372859M60626j025112j29063
$$ -263280 33247 310756 -668253 -168809 -187176 -488795 884064 1344690 319578 190515
1181A90515p48110k38834P24383l1768k68781o526L03876j2037M70492n5587r41783
$$ 190515 -557595 -796429 -72046 -103814 -372595 -379121 -75245 -87282 383210 327623 -614160
1170f14160O52333o45360L77686Q73981j92857M9736q61298M93298J37082J82549
$$ -614160 38173 -607187 -229501 644480 451623 501359 -359939 133359 270441 452990
1160D52990l1418N8888J28830K67702o96761J75290J08474L20814o76155L48602
$$ 452990 421572 480460 609290 876992 180231 355521 463995 784809 108654 457256
1150D57256l51622l07713N61909j72773j36416L84095p61338J39399M08330Q6542
$$ 457256 105634 -202079 359830 187057 50641 434736 -326602 -187203 221127 307669
1140C07669o11859j73763M58600O36381K90962j011811n66058J67962k5996q9621
$$ 307669 -304190 -477953 -19353 617028 907990 -103821 -669879 -501917 -527913 -617534
1130f17534P09034m19617N39008M05910K464l71613J22976L53198q24585o0402
$$ -617534 91500 -328117 210891 616801 619265 247652 370628 723826 -100759 -161161
1120a61161O06107r5008q15956R0593N14361n53207j57864K92162m4323J04809
$$ -161161 444946 349938 -466018 -375425 138936 -414271 -572135 -279973 -324296 -219487
1110b19487N85555m6966k6850l55360n71620M08095K0321k25926K82024J91172
$$ -219487 366068 319102 292252 -63108 -634728 -226633 -206312 -432238 -150214 40958
1100D0958M87685q2950l75718k86578l87999N77009r983m32512L87907R53261
$$ 40958 528643 445693 69975 -216603 -604602 -27593 -37576 -470088 -82181 871080
1090H71080j117679j76854L51802J36187r845J89339M73931L08443l21263p18926
$$ 871080 -246599 -423453 -71651 64536 54691 244030 717961 1026404 705141 -13785
1080a3785o55968m93476N03858j3726N01360k31015R9499P63966M76926n12008
$$ -13785 -669753 -1163229 -659371 -673097 -171737 -402752 -303253 460713 937639 425631
1070D25631k41483p19179j57406K8004K62817K45287L15549j92822O20403m71861
$$ 425631 184148 -535031 -692437 -664433 -401616 -156329 159220 -33602 586801 114940
1060A14940l65012r1495n11747M96388L08829q07897j05457N38757Q5235J41198
$$ 114940 -250072 -341567 -853314 -356926 -48097 -855994 -961451 -422694 -337459 -196261
1050a96261N52613j80354k56893j02880j37093Q91228J60354m06604J5869j94254
$$ -196261 356352 175998 -80895 -183775 -320868 570360 730714 324110 339979 145725
1040A45725o37486p2083P75726J201273P5180M27728r74159r58969L18665M33189
$$ 145725 -491761 -563844 211882 1413155 1488335 1916063 941904 -17065 301600 734789
1030G34789n3045J45320l0709l83842K46818n10182o89633K4403J202075M69909
$$ 734789 681744 827064 796355 412513 659331 149149 -540484 -516081 685994 1155903
1020A155903p63052p63933K80774J276837l34277j144469p23643R14072j51082
$$ 1155903 392851 -371082 -90308 1186529 852252 -292217 -1015860 -101788 -252870
1011b52870j3014K52923O6448l32966k50003o09840K45094N96819q5486J88409
$$ -252870 -265884 -12961 53487 -279479 -529482 -1139322 -894228 -297409 -382895 -194486
1001a94486J06495J71336n67536j17802N59226J84960J26948M34844o98733l53377
$$ -194486 -87991 83345 -484191 -601993 -42767 142193 269141 703985 5252 -348125
991c48125N93184J07928l08470P17518k88744k05051R5880M17204K48590j220263
$$ -348125 245059 352987 44517 762035 473291 268240 364120 781324 1029914 -190349
981a90349o34178M50715M9260K9170j37441N1668M79370N83489k18988q28960
$$ -190349 -824527 -373812 -324552 -295382 -432823 -381155 98215 681704 462716 -366244
971c66244N7889j49183k83454K44097N95344L56494j43581M98138l40804q06713
$$ -366244 -308355 -457538 -740992 -496895 98449 454943 311362 809500 468696 -338017
961c38017N60559L77896l17938L84185p51845l47337J17322J55751K63718l44930
$$ -338017 222542 600438 282500 666685 -85160 -432497 -315175 -159424 104294 -240636
951b40636p10525n4816M13993K07251M1594l43832n3587j99424Q82434J103538
$$ -240636 -951161 -1005977 -591984 -384733 -343139 -686971 -740558 -939982 -57548 1045990
941A045990n19446p8904J08743l87782O38437q54827J66971J01895m6646j81960
$$ 1045990 526544 447640 556383 168601 807038 -47789 119182 221077 174431 -7529
931g529j79643p96890O76200l4184j59342K93653M1073K12378q03011l2965r2541
$$ -7529 -187172 -984062 -307862 -342046 -501388 -207735 -166662 45716 -757295 -790260 -882801
920h82801P05954P23005k64480q14383L44770k35195K06675K09155J31476l4292
$$ -882801 -176847 546158 281678 -532705 -187935 -423130 -216455 -7300 124176 89884
910H9884l06040n28327M76737N61800K15970k07807M39827k56065o8521q70m70252
$$ 89884 -216156 -744483 -267746 294054 510024 302217 742044 485979 417458 416588 -53664
899e3664m15307M283L10960n99772r114J75400j95156K38422m87306M25409J47891
$$ -53664 -468971 -464688 -153728 -753500 -762614 -587214 -782370 -543948 -1031254 -605845 -457954
888d57954j64170Q08215p3060n22161p1354J012605j32820k42170n02979L28177
$$ -457954 -622124 186091 113031 -409130 -480484 532121 399301 157131 -345848 -17671
878a7671J15219l85776L44890K1892k54537k39289q16963J319627M5415N20390
$$ -17671 97548 -288228 56662 78554 -175983 -415272 -1232235 87392 132807 653197
868F53197k82204k12276n93612k3813J026884J41885L77761r77135m46680k24685
$$ 653197 370993 158717 -434895 -458708 568176 710061 1087822 110687 -335993 -560678
858e60678l63633O64431R1841l83750M74289o56421k27339L79545K24158O91377
$$ -560678 -924311 -259880 -168039 -551789 -77500 -733921 -961260 -581715 -357557 333820
848C33820n72385L01247Q74855l36663K9902p07551o89055r2039j74700K22031
$$ 333820 -238565 62682 937537 600874 630776 -76775 -765830 -857869 -1032569 -810538
838h10538M62744J7639j60l91804N58408P87594k91643l48739J02479J67313m39551
$$ -810538 -347794 -330155 -330315 -722119 -163711 623883 332240 -16499 85980 253293 -186258
827a86258p29452N74891K14621n20698M64045M97295l72540L5415K96866m13933
$$ -186258 -915710 -340819 -126198 -646896 -182851 314444 -58096 -22681 274185 -139748
817a39748K88277k73704n94368N01453n03116N80750L41218m36905K7555j527
$$ -139748 148529 -125175 -719543 -218090 -721206 -140456 200762 -236143 -208588 -210115
807b10115k94400j68755J0234k19353Q6910K93956J38383R2346p07665k03370
$$ -210115 -504515 -673270 -663036 -882389 -795479 -501523 -363140 -270794 -978459 -1181829
797a181829O88260O43254M28896o48018n17155J308848j61158K42946q08540q19255
$$ -1181829 -493569 149685 578581 -69437 -586592 722256 561098 804044 -4496 -823751
787h23751M26380M9435k34246P49202J19081j69559J56015r82065J043961j89490
$$ -823751 -397371 -347936 -582182 167020 286101 116542 272557 -709508 334453 144963
777A44963l18144J90468n06040R03619l66548l04070O19557q53531K5437L04735
$$ 144963 -173181 17287 -488753 414866 48318 -255752 363805 -489726 -464289 -159554
767a59554L78116j47284l72527j27897j21948J85929P96528L1292k26770J19950
$$ -159554 218562 71278 -301249 -429146 -551094 -365165 431363 462655 235885 355835
757C55835l11568K88766M95028P479k35771l48388J8782K75835L13897m47436
$$ 355835 44267 333033 828061 835540 599769 251381 270163 545998 859895 412459
747D12459M126m23278l73130o16792M35939k72937R90214R8269P1423P51731r59488
$$ 412459 416585 -6693 -379823 -996615 -560676 -833613 156601 254870 326293 1078024 118536
736A18536m41966n21954M09401J81702K68056l32158n288J09536k04589L38013
$$ 118536 -323430 -845384 -435983 -254281 13775 -318383 -323671 -214135 -418724 -80711
726h0711K01732n96469K9013o62915m5921P7281N66755M461n18412N48404l26967
$$ -80711 121021 -475448 -446435 -1109350 -1155271 -1077990 -511235 -506774 -1025186 -476782 -803749
715h03749M53025m43907k15068P83250P16017j80818o40969j98975P72112M04723
$$ -803749 -350724 -794631 -1009699 -226449 489568 308750 -332219 -531194 240918 645641
705F45641p51515O2464M23910L7340k7082o52862m05650J35067k46613O5828N07386
$$ 645641 -105874 -43410 380500 417840 390758 -262104 -667754 -532687 -779300 -713472 -206086
694b06086L20388l1564m29518l28348p9412N53742l7514l24699J96979P95229
$$ -206086 114302 82738 -346780 -675128 -754540 -200798 -238312 -563011 -366032 429197
684D29197M0399n92816L75934J44049K75554k72473l62309L43064N33j15379k94086
$$ 429197 469596 -123220 252714 396763 672317 399844 37535 380599 381132 265753 -28333
673b8333l55539n74776N96532Q05320o22315N50590k94350k50978N58648P66538
$$ -28333 -383872 -958648 -362116 443204 -179111 371479 77129 -173849 384799 1151337
663A151337p68640M92120q5878j011452O55976L18887o89316N65416l4257k37284
$$ 1151337 382697 874817 788939 -222513 433463 752350 63034 628450 594193 356909
653C56909R955L29443j165288P55095J69701q95891j38182L7881K06583K93685
$$ 356909 366864 696307 -468981 286114 455815 -440076 -578258 -540377 -333794 -40109
643d0109J2037o34875N05120L77541O10514j56574o0956L75149l00263n82330
$$ -40109 -28072 -662947 -157827 219714 830228 673654 612698 987847 687584 105254
633A05254l43072q05841N23466K19404j47790m92185K90063j029632R20749L83626
$$ 105254 -237818 -1043659 -520193 -300789 -448579 -940764 -650701 -1680333 -759584 -375958
623c75958N83961P76471n60662l73805o43639O16575p53584p10302r0104R04891
$$ -375958 208003 984474 423812 50007 -593632 22943 -730641 -1440943 -1531047 -626156
613f26156R37793o06416M02006K5558j55982j0079j13834L92664J88081k66436
$$ -626156 311637 -294779 107227 132785 -23197 -33276 -147110 245554 433635 167199
603A67199L79292M32259j86335l76424J96323Q475p55794p9773O36859k22876
$$ 167199 546491 978750 792415 415991 612314 620789 -135005 -214778 422081 199205
593A99205Q35053o83509o2472J56403o41541L67976n04203l1629n17263Q80571
$$ 199205 1034258 350749 288277 444680 -196861 171115 -333088 -364717 -881980 -1409
583a409N87646R0343M80884r81506n21410k54721O63036J37963n25291J117816
$$ -1409 586237 676580 1157464 175958 -345452 -600173 62863 200826 -324465 793351
573G93351m51450j628716n93537J121357J471017L96909o33870o97819N48336
$$ 793351 341901 -1286815 -1880352 -758995 712022 1108931 475061 -222758 325578
564C25578n29944L43456J48593J19317J36843R0175m15857r98392L91436R71362
$$ 325578 -204366 139090 287683 407000 543843 634018 218161 -780231 -388795 582567
554E82567l32365m49605L94265R36428k48622M03597J62914j598564K94225J28326
$$ 582567 250202 -199403 194862 1131290 882668 1286265 1449179 -149385 144840 273166
544B73166o0471J15862j21705m41N14059n27675n93072m23973O13054L68399N06587
$$ 273166 212695 328557 206852 206411 720470 192795 -400277 -824250 -211196 157203 663790
533F63790p56989M39909k82922j26405L52810K95303j89265O9939q5590l86967
$$ 663790 -93199 346710 63788 -62617 290193 585496 396231 466170 380580 -6387
523f387j6992n84630K18792P83407j68743K98832l63462r54172K5528K44802L71894
$$ -6387 -23379 -608009 -389217 394190 225447 524279 160817 -793355 -767827 -523025 -151131
512a51131M68403j16809R575o33931m28234N92465J20871L62415N20941l77187
$$ -151131 317272 200463 210038 -423893 -852127 -259662 -138791 223624 744565 367378
502C67378q81880R8539m6819L46812q90460O09781M24271j67187r6912l30255
$$ 367378 -514502 -415963 -462782 -115970 -1006430 -396649 27622 -139565 -236477 -566732
492e66732l61716L16074J098636j54592m2625P53041p55994p56881o50760M62855
$$ -566732 -928448 -612374 486262 331670 289045 1042086 286092 -470789 -1121549 -658694
482f58694P85478P1107m84297k73999P85639l14215L85623L8131R0402M6014p5850
$$ -658694 126784 197891 -286406 -560405 225234 -88981 296642 334773 425175 471189 395339
471C95339O64511l30730r32386l30243N17778L06578q6159l80890j53699l67754
$$ 395339 1059850 729120 -203266 -533509 -15731 290847 204688 -176202 -329901 -697655
461f97655L84131J107442J36211k27137l04865o59078R755k29140k1627O50656
$$ -697655 -313524 793918 930129 702992 398127 -260951 -251196 -480336 -501963 148693
451A48693N24704o65858q01523j13894p7452L79632k55790N37415p3336L20048
$$ 148693 673397 7539 -793984 -907878 -985330 -605698 -861488 -324073 -397409 -77361
441g7361M3065k79825J76464o5088O30806P6483r36983q39819Q80307J002537
$$ -77361 -34296 -314121 -137657 -202745 428061 504544 -432439 -1272258 -391951 610586
431F10586m85283r32687k11440K28273O24607N35390j91855l48226L94224J67257
$$ 610586 125303 -807384 -1018824 -790551 -165944 369446 177591 -170635 223589 390846
421C90846O63343j20231q75862n03235J43331L18867J67685J25688l38176m51008
$$ 390846 1054189 933958 58096 -445139 -301808 17059 184744 310432 -27744 -478752
411d78752l50416J024982Q4280N43597m16709n9208Q31316l77254n87360p74795
$$ -478752 -829168 195814 280094 823691 406982 347774 1179090 801836 214476 -560319
401e60319L96433J82343l80059l90392J92454J81650O56653m37290r2739l05398
$$ -560319 -163886 18457 -361602 -751994 -559540 -377890 278763 -158527 -251266 -556664
391e56664k32278O32371N00971j00181M99820r0385k24606m09311R4104M90454
$$ -556664 -788942 -156571 344400 244219 744039 653654 429048 19737 113841 604295
381F04295m65434J9962m78186J83797N74172q4025l60603L88420l43195j01816
$$ 604295 138861 158823 -319363 -135566 438606 354581 -6022 382398 39203 -62613
371f2613M9295O68957l22460l23317K05951K98849R7351l54190l76312L1772M25306
$$ -62613 -13318 655639 333179 9862 215813 514662 612013 257823 -118489 -86717 338589
360C38589k9036q4779L48544p96436l52478Q51252J04984L59720n36535n77986
$$ 338589 309553 224774 573318 -223118 -575596 275656 380640 740360 203825 -374161
350c74161P35137l75051o48866O43010L74490L94102m65563m70187K83021j0585
$$ -374161 360976 -14075 -662941 -19931 354559 748661 283098 -187089 95932 85347
340H5347n53988J08924K70615P18066l39817n40821K02808o28114K74016L45381
$$ 85347 -468641 -359717 -89102 628964 289147 -251674 -48866 -676980 -402964 -57583
330e7583Q09562o67210k75736J60099K46678j54514k6982M73606J88957k22982
$$ -57583 751979 84769 -190967 -30868 215810 61296 34314 507920 696877 473895
320D73895n90234J67472m62734L63473J57677n85720J24538O34572K61460l19749
$$ 473895 -116339 51133 -411601 -48128 109549 -476171 -351633 282939 544399 224650
310B24650k15673q8730L52325M30708o99987k05219K63070K75251j54988K16033
$$ 224650 8977 -79753 272572 703280 3293 -201926 61144 336395 181407 397440
300C97440K46793M09614j76781m30747o74376j00812J06961N76482m93848L01906
$$ 397440 644233 1053847 877066 446319 -228057 -328869 -221908 354574 -139274 162632
290A62632q6969L51541k09001l62799Q87341q96040L95600K19005j66351K0777
$$ 162632 75663 427204 218203 -144596 742745 -153295 242305 461310 294959 315736
280C15736p891m95046M80247k37637K39818J29988L11910p8913m64397m86992
$$ 315736 307845 -187201 293046 55409 295227 425215 737125 658212 193815 -293177
270b93177r4253O09312J47745j53019J61506k3538L9701K39039M3127l02086p8203
$$ -293177 -387430 221882 369627 216608 378114 354576 394277 633316 676443 374357 296154
259B96154m30145M16947l28663n37237O77481O24482l64967m31683M74305M0532
$$ 296154 -133991 282956 -45707 -582944 94537 719019 354052 -77631 396674 437206
249D37206m74309m8448N2217Q803L17839k60992k69345L15967M66634m3363J32989
$$ 437206 -37103 -85551 -33334 -24531 293308 32316 -237029 78938 545572 502209 635198
238F35198o04090Q0305m83102L23875J16179l99557L77551N59521p00554k55625
$$ 635198 31108 111413 -371689 -47814 68365 -331192 46359 605880 -94674 -350299
228c50299N81108L7502o26262p1681O27978L78440K58505J9227n97672k83064
$$ -350299 230809 268311 -357951 -429632 198346 576786 835291 854518 256846 -26218
218b6218K39115l01820K62301j40398q8656Q40493o91209j035497L52228J073624
$$ -26218 212897 -88923 173378 32980 -55676 784817 93608 -941889 -589661 483963
208D83963n22747K00138j36752p3202n51202N50865M06319o76303J99340k86984
$$ 483963 -38784 161354 24602 -48600 -599802 -48937 357382 -318921 -119581 -406565
198d06565P53598m2250N5926J01943p97039M32747L59556j48149j62323m25366
$$ -406565 347033 304783 360709 462652 -334387 98360 457916 309767 147444 -277922
188b77922N56704L162j72242l28841L55824o81j1683m1882M29296j42188N03594
$$ -277922 278782 281944 109702 -219139 136685 136004 124321 82439 511735 369547 873141
177H73141n08799j41611l04651k72632o003P64904j69433K00813l13936j6451
$$ 873141 364342 222731 -81920 -354552 -360555 404349 234916 435729 121793 105342
167A05342N38309K67732J07274N469j34335n89661k71298K19549r5217m37428
$$ 105342 643651 911383 1018657 1024126 889791 300130 28832 248381 153164 -284264
157b84264l42758l5346L13289J31456L39090l23376o8700J78170O13125J44177
$$ -284264 -627022 -662368 -349079 -217623 121467 -201909 -270609 -92439 520686 664863
147F64863O20456j62895n82110k81037L65313k62783L0204q09172L10023O90655
$$ 664863 1285319 1122424 540314 259277 624590 361807 392011 -417161 -107138 583517
137E83517j45042l90491j6127J92215k82490j41474o99698M62442P68329K52381
$$ 583517 438475 47984 31857 224072 -58418 -199892 -899590 -437148 331181 583562
127E83562p76595N74086K69689k84818K93001m33643k70083J75184L60324o86093
$$ 583562 -193033 381053 650742 365924 658925 225282 -44801 130383 490707 -195386
117a95386m57880p8258Q45805J33169L47372l38359l23272K0288K36392L31213
$$ -195386 -653266 -731524 114281 247450 594822 256463 -66809 -46521 189871 521084
107E21084J94980o13068l54668Q9620O10036p67516M31315j53382l32532J59011
$$ 521084 716064 102996 -251672 -162052 447984 -319532 111783 -41599 -374131 -215120
97b15120j20408J077154k10626j91132N36574K03437m96403o1048m88870M03255
$$ -215120 -335528 741626 531000 339868 876442 1079879 583476 522428 33558 436813
87D36813M33418p24285J15217L17727J34527r8236m79870k62640M78956Q62920
$$ 436813 870231 145946 261163 578890 713417 615181 135311 -127329 351627 1214547
77A214547k96606p9606k91749L05294J91162p77838p82939K14700j03671m6138
$$ 1214547 917941 838335 546586 851880 1043042 265204 -517735 -303035 -406706 -452844
67d52844j25489j48817M83227m4042L35014M65516k51546M10293L14044j07726
$$ -452844 -578333 -727150 -243923 -287965 47049 512565 261019 671312 985356 877630
57H77630j92694l46094J65250k4929O58304k50989r97924J69494K3389m32381
$$ 877630 684936 338842 504092 479163 1137467 886478 -111446 58048 81437 -350944
47c50944O69861M00979m27894k50373L14262k61829K3067K58660r7636q96113
$$ -350944 318917 719896 292002 41629 355891 94062 117129 375789 278153 -617960
37f17960P0215L75330L00086m37156j1091J57322M77850k78513k92214j9959k07622
$$ -617960 -547745 -172415 127671 -309485 -320576 -163254 314596 36083 -256131 -276090 -483712
26d83712K6062P9502J077287l95266L58810l34648m7739k41450J01255J54130
$$ -483712 -457650 -378148 699139 303873 662683 328035 280296 38846 140101 294231
16B94231k15685j75133L94369k93873p9029J32605K81551k0489K9273J62414N10059
$$ 294231 78546 -96587 297782 3909 -75120 57485 339036 318547 347820 510234 1020293
5A020293o96803k28945K86282N80507k30614
$$ 1020293 323490 94545 380827 961334 730720
0G30720
$$ 730720
$$ Imaginary data points
##PAGE= N=2
##DATA TABLE= (X++(I..I)), XYDATA
16383b279552O68114k10214m6782O45568p2574J6588m8236m1247j47931n7473
$$ -2279552 -1611438 -1821652 -1868434 -1222866 -1295440 -1278852 -1327088 -1368335 -1516266 -1573739
16373a573739j90507N72926J75802j12234J35368L36179j051144k62685p8497
$$ -1573739 -1764246 -1191320 -1015518 -1127752 -992384 -656205 -1707349 -1970034 -2048531
16364b048531P27635j11760J45264K21424L5785m47966m15204Q06327J062030
$$ -2048531 -1320896 -1432656 -1287392 -1065968 -1030183 -1478149 -1893353 -1087026 -24996
16355b4996q44665j16875k34124l61111M33644K93629N2545J05806K34899O61089
$$ -24996 -869661 -986536 -1220660 -1581771 -1148127 -854498 -801953 -696147 -461248 199841
16345A99841m78554j09793K80174p36123k84259J12867l82519N90669M64862Q9046
$$ 199841 -278713 -388506 -108332 -844455 -1128714 -1015847 -1398366 -807697 -342835 -253789
16335b53789j46550K43175J93428p26257K79701k6935k9251o52969K61820L92543
$$ -253789 -400339 -157164 36264 -689993 -410292 -437227 -466478 -1119447 -857627 -465084
16325d65084M98512J76483m53512J04807K81461p8555o08934k2321o6845M72644
$$ -465084 33428 209911 -243601 -138794 142667 64112 -544822 -567143 -633988 -161344
16315a61344J74497K24850l6410k95654K76938k24650n4974K94496L35018j30197
$$ -161344 13153 238003 201593 -94061 182877 -41773 -96747 197749 532767 402570
16305D02570m04272k954K0798L86698l9216J213547M40364o46225k58089P8061
$$ 402570 -1702 -4656 16142 402840 363624 1577171 2017535 1371310 1113221 1191282
16295A191282o64713O1896K81883Q2213m97679m80073Q13218r1106o53273K7015
$$ 1191282 526569 588465 870348 952561 454882 -25191 788027 696921 43648 70663
16285G0663l6695M30708M81074l49399k62963k84624J76437P69956m71421L97506
$$ 70663 33968 464676 945750 596351 333388 48764 225201 995157 523736 921242
16275I21242l75613n21169R32684m5006k90671j71863M54245L87664j208066L12363
$$ 921242 545629 24460 957144 912138 621467 449604 903849 1291513 83447 395810
16265C95810J77315K32319J109968p40803m94243J69094Q44356l45784K84043
$$ 395810 573125 805444 1915412 1174609 680366 849460 1693816 1348032 1632075
16256A632075K44620n51186m07739N49694j055940J36770N01794N02974j474J52217
$$ 1632075 1876695 1325509 917770 1467464 411524 548294 1050088 1553062 1551588 1703805
16246A703805l23767l46521k83666k01225K52446Q57419r09854O80630J61127
$$ 1703805 1380038 1033517 749851 548626 801072 1658491 748637 1429267 1590394
16237A590394K7613L92172n72105n29820L0481n14068N53263N56742K32890M00600
$$ 1590394 1618007 2010179 1438074 908254 938735 424667 977930 1534672 1767562 2168162
16227B168162j40012n05108M20939p38330K23806L72667M2582K6299L34182R364
$$ 2168162 2028150 1523042 1943981 1205651 1429457 1802124 1844706 1871005 2205187 2214551
16217B214551j608150O87477P78100K54057l80772O13562p51939K15888o721m12714
$$ 2214551 606401 1293878 2071978 2326035 1945263 2558825 1806886 2022774 2016053 1603339
16207A603339J19338J93133l21583L31592K94739p4647p77727J07641N12007p6102
$$ 1603339 1722677 1915810 1594227 1925819 2220558 2145911 1368184 1475825 1987832 1911730
16197A911730L82476q2922p27865j54018k43438P5277k84657L59942K72677K78831
$$ 1911730 2294206 2211284 1483419 1329401 1085963 1161240 876583 1236525 1509202 1788033
16187A788033K84473K49738k03562o09222P58122q2973q72638o01690J077987
$$ 1788033 2072506 2322244 2118682 1509460 2267582 2184609 1311971 710281 1788268
16178A788268L60672K33168j08770r05387O2357l7517M03288k99919J88286n78424
$$ 1788268 2148940 2382108 2273338 1367951 1430308 1392791 1796079 1496160 1684446 1106022
16168A106022J59621j64329K38062R88966R1058o45153J13009K92899P81471m18350
$$ 1106022 1265643 1101314 1339376 2328342 2419400 1774247 1887256 2180155 2961626 2543276
16158B543276k09567k14703Q7091k84185q71026J610202p75216J3983R18168r32991
$$ 2543276 2333709 2119006 2206097 1921912 1050886 2661088 1885872 1899855 2818023 1885032
16148A885032L92874R0843J55660K70677m59345P1326m29734o1263L84958N57300
$$ 1885032 2277906 2368749 2524409 2795086 2335741 2407067 1977333 1916070 2301028 2858328
16138B858328n19886J66429L1077J79154O27947n1305n87477m67793J75427K65017
$$ 2858328 2338442 2504871 2535948 2715102 3343049 3291744 2704267 2236474 2411901 2676918
16128B676918P17069K57502o827J32545N0094j076484n05608k02859Q914O53413
$$ 2676918 3393987 3651489 3644662 3777207 3827301 2750817 2245209 2042350 2051264 2704677
16118B704677l82624l8627q17101L13029J93355q63126J055532O71142J87254
$$ 2704677 2322053 2283426 1466325 1779354 1972709 1109583 2165115 2836257 3023511
16109C023511m02391l37633J46557l45444j07163K31981M80010L80388o19014
$$ 3023511 2621120 2283487 2430044 2084600 1977437 2209418 2689428 3069816 2450802
16100B450802j260899Q28L97835P27325K39926j63386m58760J01558L97494K35870
$$ 2450802 1189903 1190731 1588566 2315891 2555817 2392431 1933671 2035229 2432723 2668593
16090B668593r42313j03157J98398N76314Q98158k58648r39003j90636L01284
$$ 2668593 1726280 1623123 1821521 2397835 3295993 3037345 2098342 1907706 2208990
16081B208990N05706j77375q92358K65656L75621J129603o47083K90963m5254
$$ 2208990 2714696 2537321 1644963 1910619 2286240 3415843 2768760 3059723 3014469
16072C014469p30622O25277M81367m44987K61833k47086k29651J70464l34012
$$ 3014469 2283847 2909124 3390491 2945504 3207337 2960251 2730600 2901064 2567052
16063B567052p10030M27817L47054q16147K26400j85552N17807j43513q7578m17173
$$ 2567052 1857022 2284839 2631893 1815746 2042146 1856594 2374401 2230888 2143310 1726137
16053A726137K00175K01637k55615K69789L05652J36720m16875R33573k34985
$$ 1726137 1926312 2127949 1872334 2142123 2447775 2584495 2167620 3101193 2866208
16044B866208o53515m5834k04621l73189M4054M39841Q83616q49167R9611O9616
$$ 2866208 2212693 2166859 1962238 1589049 1633103 2072944 2956560 2107393 2207004 2276620
16034B276620j99782K6332m16393J21773M2971R24493l36031J080606K60918n80460
$$ 2276620 2076838 2103170 1686777 1808550 1851521 2776014 2439983 3520589 3781507 3201047
16024C201047j221076N11971L24651q7811p44472n22078N80821O07210m03060
$$ 3201047 1979971 2491942 2816593 2728782 1984310 1462232 2043053 2650263 2247203
16015B247203j41003J159294r72260L85624Q84418j96533j211546L43302q9008
$$ 2247203 2106200 3265494 2293234 2678858 3563276 3366743 2155197 2498499 2409491
16006B409491J97626j34556Q2958K12476K15577j12509j022384R60981L64449
$$ 2409491 2607117 2472561 2555519 2767995 2983572 2871063 1848679 2809660 3174109
15997C174109r43535m12167l0973q88166k13411J125178k77652R33635R81114
$$ 3174109 2230574 1818407 1787434 899268 685857 1811035 1533383 2467018 3448132
15988C448132k99839m43112r84618r4976L75949p66141M49073J116639m65254
$$ 3448132 3148293 2705181 1720563 1625587 2001536 1235395 1684468 2801107 2335853
15979B335853M7488k33336l3783M75975m10679l8725J057754n35725J95200j39687
$$ 2335853 2383341 2150005 2116222 2592197 2181518 2142793 3200547 2664822 2860022 2720335
15969B720335o10999Q376j03500L23400N70496j08381J3678K30901O33397p30139
$$ 2720335 2109336 2117712 2014212 2337612 2908108 2799727 2813405 3044306 3677703 2947564
15959B947564k20675J98979p88485L19466R3023l59285l35789M8633k88053J30404
$$ 2947564 2726889 2925868 2137383 2456849 2549872 2190587 1854798 1903431 1615378 1745782
15949A745782N08010O07104q6495O8861J33178k77673K17690L96959O48156j51741
$$ 1745782 2253792 2860896 2774401 2843262 2976440 2698767 2916457 3313416 3961572 3809831
15939C809831r36390p53367m2346k71719L83017l70411J15831j67293N11992r5761
$$ 3809831 2873441 2120074 2077728 1806009 2189026 1818615 1934446 1767153 2279145 2183384
15929B183384j36040k57390O50008Q8553j27526k20078m13565O44067K18428Q01835
$$ 2183384 2047344 1789954 2439962 2528515 2400989 2180911 1767346 2411413 2629841 3431676
15919C431676J28708J05321j270171L10266o1295n47117j38973k31756J005173
$$ 3431676 3560384 3665705 2395534 2705800 2644505 2097388 1958415 1726659 2731832
15910B731832K50372l42268J76934L2283k66821l08663l25275K15273O56158J76084
$$ 2731832 2982204 2639936 2816870 2849153 2582332 2273669 1948394 2163667 2819825 2995909
15900B995909L88729q1830p28498M8154r5196p78607M69902J013M41707l1178
$$ 2995909 3384638 3302808 2574310 2622464 2527268 1748661 2218563 2219576 2661283 2630105
15890B630105K27631M4431l67578R5732O60945j34402q02052L74581J28184k01436
$$ 2630105 2857736 2902167 2534589 2630321 3291266 3156864 2354812 2729393 2857577 2656141
15880B656141n52540m27466N30162N90058M13797J84612j258188K07794R49394
$$ 2656141 2103601 1676135 2206297 2796355 3210152 3394764 2136576 2344370 3293764
15871C293764j048188J84022J212264O3295p95542k66279K47553p03139m2449
$$ 3293764 2245576 2429598 3641862 3705157 2909615 2643336 2890889 2187750 2145301
15862B145301L07522n6825Q15476l85451p55983n64453R98798O98650k26198K65365
$$ 2145301 2452823 2395998 3211474 2826023 2070040 1505587 2504385 3203035 2976837 3242202
15852C242202o79784k41685Q36306k91245K66914l35471n78417l7945n20869O07334
$$ 3242202 2562418 2320733 3157039 2865794 3132708 2797237 2218820 2180875 1660006 2267340
15842B267340N71147k16562K5472Q3938o1253l00530j55457o49606p8855N29288
$$ 2267340 2838487 2621925 2647397 2731335 2670082 2369552 2214095 1564489 1485634 2014922
15832B014922L74844J8612o7238K88298p31768J11166N57485M78452N0617l69319
$$ 2014922 2389766 2408378 2341140 2629438 1897670 2008836 2566321 3044773 3095390 2726071
15822B726071k25324p8509o17771N02608j79894K7615l08041o4522M06400k10126
$$ 2726071 2500747 2422238 1804467 2307075 2127181 2154796 1846755 1782233 2188633 1978507
15812A978507J510721l64885K68523j120079o24488J248006J30429K12406k27549
$$ 1978507 3489228 3124343 3392866 2272787 1648299 2896305 3026734 3239140 3011591
15803C011591p84484K54267L58749M18237q1099j50153o87487j23470L60809j22920
$$ 3011591 2227107 2481374 2840123 3258360 3177261 3027108 2339621 2216151 2576960 2454040
15793B454040o4361R8929Q42792Q5382m54334k29478L24708q89949l20154J027825
$$ 2454040 2389679 2488608 3331400 3416782 2962448 2732970 3057678 2167729 1847575 2875400
15783B875400M57741p69621j21608k46534Q89408k95387K50459q4578o89453j81715
$$ 2875400 3333141 2563520 2441912 2195378 3084786 2789399 3039858 2955280 2265827 2084112
15773B084112q41m79190J511k69951J03048J018879q43268J04343k6165M46535
$$ 2084112 2083271 1604081 1605592 1335641 1438689 2457568 1614300 1718643 1692478 2139013
15763B139013J47108n8273p6886K47302M66246k15139L19942m90140J22485k96606
$$ 2139013 2286121 2227848 2150962 2398264 2864510 2649371 2969313 2479173 2601658 2305052
15753B305052k84928j51733L99067M02232J088783k85448j15819n91036k63863
$$ 2305052 2020124 1868391 2267458 2669690 3758473 3473025 3357206 2766170 2502307
15744B502307O44701L28428j048312N68892q10865n83767L99909P88796j27085
$$ 2502307 3147008 3475436 2427124 2996016 2185151 1601384 2001293 2790089 2663004
15735B663004n27611K61065K19001k04122r60357O56549k73886O78602l49343
$$ 2663004 2135393 2396458 2615459 2411337 1450980 2107529 1833643 2512245 2162902
15726B162902j3456O81939j97529m2561m34173N35688N42362p76283K90469K79147
$$ 2162902 2149446 2831385 2633856 2591295 2157122 2692810 3235172 2458889 2749358 3028505
15716C028505n94326k42879m64466P6357N10774m36040j8929k33389N25050K54740
$$ 3028505 2434179 2191300 1726834 1803191 2313965 1877925 1858996 1625607 2150657 2405397
15706B405397J59412l78058j13046j95296N84388k40146J63503K04687O77802
$$ 2405397 2564809 2186751 2073705 1878409 2462797 2222651 2386154 2590841 3268643
15697C268643M07282j338393j6272p41366N01142M58298n87852L66783O08737
$$ 3268643 3675925 2337532 2321260 1579894 2081036 2539334 1951482 2318265 2927002
15688B927002k89969k80040M20326r84737K89362P12632n70756n63389P69657
$$ 2927002 2637033 2356993 2777319 1792582 2081944 2794576 2223820 1660431 2430088
15679B430088l31802P17394k27500p22383R4129M30075k22867J71175M23413M20900
$$ 2430088 2098286 2815680 2588180 1865797 1959926 2390001 2167134 2338309 2761722 3182622
15669C182622l46203J7863J31403L79010k3176j09478p60293q356l10568L78907
$$ 3182622 2836419 2854282 2985685 3364695 3341519 3232041 2471748 2463392 2152824 2531731
15659B531731K54855n2098m41166J65860M38615O0183J43431o72899l13368K32024
$$ 2531731 2786586 2734488 2293322 2459182 2897797 2957980 3101411 2428512 2115144 2347168
15649B347168O64092J01367l82424k86610N44095l90898J58400K73733k30712
$$ 2347168 3011260 3112627 2730203 2443593 2987688 2596790 2755190 3028923 2798211
15640B798211o35522L08338n58960N37948K29052K45777p73635k07557M10863
$$ 2798211 2162689 2471027 1912067 2450015 2679067 2924844 2151209 1943652 2354515
15631B354515J219643o44988n54192j91729K21160O5880k95828O27315l13370
$$ 2354515 3574158 2929170 2374978 2183249 2404409 2470289 2174461 2801776 2488406
15622B488406P1681P01170K86792m04035q09532q8312p898M33970l76512L14603
$$ 2488406 2560087 3261257 3548049 3144014 2334482 2246170 2238272 2672242 2295730 2610333
$$ [...]
##END NTUPLES=NMR SPECTRUM
##END=
