##TITLE=1H_CG-1150-X2
 CDCl3, 8 sc, 
 6.08.2021
##JCAMPDX= 6.0         $$ Bruker NMR JCAMP-DX V2.0
##DATA TYPE= NMR SPECTRUM
##DATA CLASS= NTUPLES
##ORIGIN= UXNMR, Bruker Analytische Messtechnik GmbH
##OWNER= root
$$ XWIN-NMR		Version 3.5
$$ Fri Aug  6 08:44:07 2021 Russian Standard Time (UT+4h)  she@DPX200
##.OBSERVE FREQUENCY= 200.131506
##.OBSERVE NUCLEUS= ^1H
##.ACQUISITION MODE= SIMULTANEOUS
##.ACQUISITION SCHEME= undefined
##.AVERAGES= 8
##.DIGITISER RES= 18
##SPECTROMETER/DATA SYSTEM= spect
##.PULSE SEQUENCE= zg30
##.SOLVENT NAME= CDCl3
##.SHIFT REFERENCE= (INTERNAL, CDCl3, 0, 17.4995)
##AUDIT TRAIL= $$ (NUMBER, WHEN, WHO, WHERE, WHAT)
$$ ##TITLE= Audit trail, XWIN-NMR		Version 3.5
$$ ##JCAMPDX= 5.01
$$ ##ORIGIN= Bruker BioSpin GmbH
$$ ##OWNER= she
$$ F:/spectra/data/she/nmr/H-F/1/pdata/1/auditp.txt
$$ ##AUDIT TRAIL=  $$ (NUMBER, WHEN, WHO, WHERE, WHAT)
(   1,<2021-08-06 08:42:52.45 +0400>,<she>,<DPX200>,
      <created by zg, POWCHK disabled, PULCHK disabled
       configuration hash MD5:
       00 E9 B6 7A A2 85 ED C7 34 08 36 98 17 FE 4E 26
       data hash MD5: 16K
       2B C6 5C 7C F1 E3 59 42 B4 00 F9 05 BB 76 3F 38>)
(   2,<2021-08-06 08:42:54.84 +0400>,<she>,<DPX200>,
      <Start of raw data processing
       efp BC_mod = 2 LB = 0.24 FT_mod = 6 PKNL = 1 PHC0 = -13355.24 PHC1 = 13.40099 SI = 16K 
       data hash MD5: 16K
       C2 CA F0 AD 3D 8F EB D8 95 9E F3 E9 63 1C 4B 5C>)
(   3,<2021-08-06 08:43:16.34 +0400>,<she>,<DPX200>,
      <pk PHC0 = -1.253384 PHC1 = 1.341105e-07 
       data hash MD5: 16K
       8C 8E 2C 08 F4 0E 6B 93 72 DE BF 89 61 22 77 A0>)
(   4,<2021-08-06 08:43:19.84 +0400>,<she>,<DPX200>,
      <abs ABSG = 5 
       data hash MD5: 16K
       52 9F 3C 29 AC B8 B6 9B 20 AF 30 5E B0 6B 9E 76>)
$$ ##END=
$$ 
$$ hash MD5
$$ 78 80 6E 24 55 03 F9 F0 3D 72 16 AF 5A E2 76 4B
##$RELAX= 
##$RELAX= 
##$RELAX= 
##$RELAX= 
##$RELAX= 
##$RELAX= 
$$ Bruker specific parameters
$$ --------------------------
##$DU= <F:/spectra>
##$EXPNO= 1
##$NAME= <H-F>
##$PROCNO= 1
##$TYPE= <nmr>
##$USER= <she>
##$AMP= (0..31)
100 100 100 100 100 100 100 100 100 100 100 100 100 100 100 100 100 100 
100 100 100 100 100 100 100 100 100 100 100 100 100 100 
##$AQSEQ= 0
##$AQ_mod= 1
##$AUNM= <au_zg>
##$AUTOPOS= <>
##$BF1= 200.13
##$BF2= 200.13
##$BF3= 200.13
##$BF4= 200.13
##$BF5= 200.13
##$BF6= 200.13
##$BF7= 200.13
##$BF8= 200.13
##$BYTORDA= 1
##$CFDGTYP= 0
##$CFRGTYP= 5
##$CHEMSTR= <none>
##$CNST= (0..31)
1 1 145 1 1 1 1 1 1 1 1 1 1 1 1 1 1 1 1 1 1 1 1 1 1 1 1 1 1 1 1 1 
##$CPDPRG= <>
##$CPDPRG1= <>
##$CPDPRG2= <>
##$CPDPRG3= <>
##$CPDPRG4= <mlev>
##$CPDPRG5= <mlev>
##$CPDPRG6= <mlev>
##$CPDPRG7= <mlev>
##$CPDPRG8= <mlev>
##$CPDPRGB= <>
##$CPDPRGT= <>
##$D= (0..31)
0 1.2 0 0 0 0 0 0 0 0.06 0 0.03 0 0 0 0 0.0002 0 0 0 0 0 0 0 0 0 0 0 0 
0 0 0 
##$DATE= 1628224971
##$DBL= (0..7)
120 120 120 120 120 120 120 120 
##$DBP= (0..7)
150 150 150 150 150 150 150 150 
##$DBP07= 0
##$DBPNAM0= <>
##$DBPNAM1= <>
##$DBPNAM2= <>
##$DBPNAM3= <>
##$DBPNAM4= <>
$$ [...]
##$SUBNAM3= <"">
##$SUBNAM4= <"">
##$SUBNAM5= <"">
##$SUBNAM6= <"">
##$SUBNAM7= <"">
##$SUBNAM8= <"">
##$SUBNAM9= <"">
##$SW= 20.0188882624521
##$SWIBOX= (0..15)
0 0 2 0 0 0 0 0 0 0 0 0 0 0 0 0 
##$SW_h= 4006.41025641026
##$TD= 16384
##$TD0= 1
##$TE= 0
##$TE2= 300
##$TE3= 300
##$TEG= 300
##$TL= (0..7)
0 120 120 120 120 120 120 120 
##$TP= (0..7)
150 150 150 150 150 150 150 150 
##$TP07= 0
##$TPNAME0= <>
##$TPNAME1= <>
##$TPNAME2= <>
##$TPNAME3= <>
##$TPNAME4= <>
##$TPNAME5= <>
##$TPNAME6= <>
##$TPNAME7= <>
##$TPOAL= (0..7)
0.5 0.5 0.5 0.5 0.5 0.5 0.5 0.5 
##$TPOFFS= (0..7)
0 0 0 0 0 0 0 0 
##$TUNHIN= 0
##$TUNHOUT= 0
##$TUNXOUT= 0
##$USERA1= <user>
##$USERA2= <user>
##$USERA3= <user>
##$USERA4= <user>
##$USERA5= <user>
##$V9= 5
##$VALIST= <valist>
##$VCLIST= <CCCCCCCCCCCCCCC>
##$VD= 0
##$VDLIST= <DDDDDDDDDDDDDDD>
##$VPLIST= <PPPPPPPPPPPPPPP>
##$VTLIST= <TTTTTTTTTTTTTTT>
##$WBST= 1024
##$WBSW= 4
##$XGAIN= (0..3)
0 0 0 0 
##$XL= 0
##$YL= 0
##$YMAX_a= 70755
##$YMIN_a= -79589
##$ZGOPTNS= <>
##$ZL1= 120
##$ZL2= 120
##$ZL3= 120
##$ZL4= 120
##$ABSF1= 17.50199
##$ABSF2= -2.51705
##$ABSG= 5
##$ABSL= 3
##$ALPHA= 0
##$AQORDER= 0
##$ASSFAC= 0
##$ASSFACI= 0
##$ASSFACX= 0
##$ASSWID= 0
##$AUNMP= <proc_1d>
##$AZFE= 0.1
##$AZFW= 0.1
##$BCFW= 0
##$BC_mod= 2
##$BYTORDP= 0
##$COROFFS= 0
##$CY= -3
##$DATMOD= 1
##$DC= 0
##$DFILT= <>
##$DTYPP= 0
##$F1P= 0
##$F2P= 0
##$FCOR= 1
##$FTSIZE= 16384
##$FT_mod= 6
##$GAMMA= 0
##$GB= 0
##$INTBC= 1
##$INTSCL= 1.334414e-10
##$ISEN= 128
##$LB= 0.24
##$LEV0= 0
##$LPBIN= 0
##$MAXI= 10000
##$MC2= 0
##$MEAN= 0
##$ME_mod= 0
##$MI= 1.114404
##$NCOEF= 0
##$NC_proc= -9
##$NLEV= 6
##$NOISF1= 3.799351
##$NOISF2= 2.8
##$NSP= 0
##$NTH_PI= 0
##$NZP= 0
##$OFFSET= 17.49955
##$PC= 1
##$PHC0= -13356.49
##$PHC1= 13.40099
##$PH_mod= 1
##$PKNL= yes
##$PPARMOD= 0
##$PSCAL= 0
##$PSIGN= 0
##$REVERSE= no
##$SF= 200.13000701907
##$SI= 16384
##$SIGF1= 3
##$SIGF2= 2
##$SINO= 5.538805
##$SIOLD= 16384
##$SREGLST= <1H.CDCl3>
##$SSB= 0
##$STSI= 16384
##$STSR= 0
##$SW_p= 4006.41025641026
##$SYMM= 0
##$S_DEV= 0
##$TDeff= 16384
##$TDoff= 0
##$TI= <>
##$TILT= no
##$TM1= 0
##$TM2= 0
##$TOPLEV= 0
##$USERP1= <user>
##$USERP2= <user>
##$USERP3= <user>
##$USERP4= <user>
##$USERP5= <user>
##$WDW= 1
##$XDIM= 16384
##$YMAX_p= 509425645
##$YMIN_p= -2404766
$$ End of Bruker specific parameters
$$ ---------------------------------
##NTUPLES= NMR SPECTRUM
##VAR_NAME=  FREQUENCY,     SPECTRUM/REAL,   SPECTRUM/IMAG
##SYMBOL=    X,             R,               I
##VAR_TYPE=  INDEPENDENT,   DEPENDENT,       DEPENDENT
##VAR_FORM=  AFFN,          ASDF,            ASDF
##VAR_DIM=   16384,         16384,           16384
##UNITS=     HZ,            ARBITRARY UNITS, ARBITRARY UNITS
##FACTOR=    0.24454680195387, 1,            1
##FIRST=     3502.18503745764, 0,            0
##LAST=      -504.225218952619, 0,           0
##MIN=       -504.225218952619, -2404766,    0
##MAX=       3502.18503745764, 509425645,    0
$$ Real data points
##PAGE= N=1
##DATA TABLE= (X++(R..R)), XYDATA
$$ [...]
$$ plain form
4791 505429 247020 255331 -632461 344831 485305 547752 869943 1056265 1086764 508605
4781 508605 524906 877975 1866124 1171979 808729 216723 1010105 799312 628274 934076
4771 934076 455113 1406358 1971771 1218525 233453 965173 1686045 828878 1478737 2078961
4761 2078961 1439517 1370202 900018 491498 1641044 1773939 1205171 1261418 1871235 2864217
4751 2864217 2627615 1939748 896004 936632 140904 152441 108630 500165 1434681 1701769
4741 1701769 1395783 1324114 845060 437439 857422 94277 -750713 123763 312371 649518
4731 649518 182947 -34804 673200 254890 -20006 28438 324506 439125 620370 554695
4721 554695 380676 643400 245500 677209 863885 508563 82204 529771 207318 561424
$$ packed form
4791E05429k58409Q311q87792R77292J40474O2447L22191J86322L0499n78159
4781E08605J6301L53069R88149o94145l63250n92006P93382k10793j71038L05802
4771I34076m78963R51245N65413p53246r85072P31720P20872q57167O49859O00224
4761B078961o39444o9315m70184m08520J149546J32895n68768N6247O09817R92982
4751B864217k36602o87867j043744M0628p95728J1537m3811L91535R34516K67088
4741A701769l05986p1669m79054m07621M19983p63145q44990Q74476J88608L37147
4731F49518m66571k17751P08004m18310k74896M8444K96068J14619J81245o5675
4721E54695j74019K62724l97900M31709J86676l55322m26359M47567l22453L54106
$$ plain form
4711 561424 578189 138261 -148897 -836448 587957 587695 1472856 626860 -339748 642804
4701 642804 -69461 -585515 -520442 312815 98959 -443892 -114148 752055 1314698 345303
4691 345303 163342 1173486 706523 521208 809026 -4902 618527 1151684 586944 -65220
4681 -65220 -721227 -645384 -396116 251266 -298846 -468379 548826 150811 -840082 -76385
4671 -76385 700697 -463355 -216968 476803 438282 382710 -1004542 -464219 371499 899697
4661 899697 477474 -52092 621922 119879 780355 777639 -286308 75751 152241 -667918
4651 -667918 652634 1223060 -245758 -315617 -742851 -1353295 60969 497187 -196995
4642 -196995 -443362 -1482645 -947162 130972 480379 -246408 -673490 -852199 -1158262
$$ packed form
4711E61424J6765m39928k87158o87551J424405k62Q85161q45996r66608R82552
4701F42804p12265n16054O5073Q33257k13856n42851L29744Q66203N62643r69395
4691C45303j81961J010144m66963j85315K87818q13928O23429N33157n64740o52164
4681f5220o56007P5843K49268O47382n50112j69533J017205l98015r90893P63697
4671g6385P77082j164052K46387O93771l8521n5572j387252N40323Q35718N28198
4661H99697m22223n29566O74014n02043O60476k716j063947L62059P6490q20159
4651f67918J320552N70426j468818o9859m27234o10444J414264M36218o94182
4642a96995k46367j039283N35483J078134L49407p26787m27082j78709l06063
$$ plain form
4633 -1158262 -465993 -763091 -1204751 -582949 -134508 -342444 -760486 -432698 -1025971 -669049
4623 -669049 -292191 -893577 -286348 173435 390338 -113488 15993 -59315 -755503 -418892
4613 -418892 -211071 -250114 -173457 66408 246807 -893689 -1008783 -795285 -1916008 -1214310
4603 -1214310 85480 123944 112297 -548991 369779 -147590 208248 702199 451190 -163628
4593 -163628 256009 -462725 -835907 -288294 -53705 -243856 779550 724121 -599369 -457735
4583 -457735 -825250 -784631 -132322 715477 872029 124258 159256 115572 432737 634518
4573 634518 -351668 -28351 706870 639226 564406 751469 623297 619924 708907 1084863 1375890
4562 1375890 494447 898752 766142 554189 412013 406812 -108481 691078 778538 182997
$$ packed form
4633a158262O92269k97098m41660O21802M48441k07936m18042L27788n93273L56922
4623f69049L76858o01386O07229M59783K16903n03826J29481p5308o96188L36611
4613d18892K07821l9043P6657K39865J80399j140496j15094K13498j120723P01698
4603a214310J299790L8464j1647o61288R18770n17369L55838M93951k51009o14818
4593a63628M19637p18734l73182N47613K34589j90151J023406n5429j323490J41634
4583d57735l67515M0619O52309Q47799J56552p47771L4998m3684L17165K01781
4573F34518r86186L23317P35221o7644p4820J87063j28172l373Q8983L75956K91027
4562A375890q81443M04305j32610k11953j42176n201n15293P99559Q7460n95541
$$ plain form
4552 182997 329221 359816 418261 -111294 -647802 -309680 758253 1377606 1423293 1197711
4542 1197711 614978 550899 1528398 1191877 677606 1137830 66814 448315 1797763
4533 1797763 1240967 1951232 1571268 809454 958019 -70584 -772278 237953 268442
4524 268442 995542 1541954 1913968 905899 986453 1404368 2077281 1335325 1473389 1594731
4514 1594731 1226057 821156 1097693 1547788 2315304 2598665 2271913 2003447 2236735 2346009
4504 2346009 1405692 2231799 3647568 2915612 2454881 1737943 1917595 1993403 2129608 1814889
4494 1814889 1515978 1821781 1369457 2076162 2919771 3105135 3160709 2466782 2256022 2316739
4484 2316739 1811330 2562722 2623606 2584653 3305132 2033759 2786540 1881008 2055809 3091961
$$ packed form
4552A82997J46224L0595N8445n29555n36508L38122J067933O19353M5687k25582
4542A197711n82733o4079R77499l36521n14271M60224j071016L81501J349448
4533A797763n56796P10265l79964p61814J48565j028603p01694J010231L0489
4524B68442P27100N46412L72014j008069Q0554M17915O72913p41956J38064J21342
4514A594731l68674m04901K76537M50095P67516K83361l26752k68466K33288J09274
4504B346009r40317Q26107J415769p31956m60731p16938J79652P5808J36205l14719
4494A814889k98911L05803m52324P06705Q43609J85364N5574o93927k10760O0717
4484B316739n05409P51392O0884l8953P20479j271373P52781r05532J74801J036152
$$ plain form
4474 3091961 2264425 1339685 1398608 2102648 2253396 2500109 2056950 1313533 1302388 1351764
4464 1351764 889253 721910 528157 1020970 1965700 2108792 1734732 1786639 1682360 459403
4454 459403 157641 1904640 1435793 1401278 1717621 1582488 1283504 861569 689423 1734327
4444 1734327 1066148 1303236 1315023 1281464 1307583 1139490 1760873 2530232 1780427 1251395
4434 1251395 1556258 2600278 2352990 1818729 1187586 1730940 2627196 3644264 3730271
4425 3730271 4308366 4659998 4177324 3628740 3140291 4017451 3345628 2722398 3723956
4416 3723956 3712524 2976593 3328594 2988755 3017870 3420183 3381769 3149018 3667404 3949580
4406 3949580 2828359 2699931 2809339 3448922 3195609 2613929 2786969 2756009 2559874 3337202
$$ packed form
4474C091961q27536r24740N8923P04040J50748K46713m43159p43417j1145M9376
4464A351764m62511j67343j93753M92813R44730J43092l74060N1907j04279j222957
4454D59403l01762J746999m68847l4515L16343j35133k98984m21935j72146J044904
4444A734327o68179K37088J1787l3559K6119j68093O21383P69359p49805n29032
4434A251395L04863J044020k47288n34261o31143N43354Q96256J017068Q6007
4425C730271N78095L51632m82674n48584m88449Q77160o71823o23230J001558
4416C723956j1432p35931L52001l39839K9115M02313l8414k32751N18386K82176
4406C949580j121221j28428J09408O39583k53313n81680J73040l0960j96135P77328
$$ plain form
4396 3337202 3575311 3639284 2801107 2805976 2974829 2777068 2327245 2339070 3027703 3749178
4386 3749178 2639706 1563829 2315607 2157601 3264797 3362598 3100552 2694852 2588516
4377 2588516 3317083 3883787 3623791 4221786 3971529 3849461 3353082 2715602 3212189 3352146
4367 3352146 3525040 2927693 3203158 3317062 3553957 4083168 3685616 3769908 3574591 4446694
4357 4446694 5117950 5468474 4783678 5263721 6118442 6962241 6018740 4667832 4432759
4348 4432759 5586873 5686099 6063965 6608780 7186105 7035472 6184277 7100630 8162255
4339 8162255 8215873 8726028 8718047 9297948 9049290 9136248 9953535 9426123 10363369 10406149
4329 10406149 10536133 10205976 10260084 9868778 9814430 9138561 9299264 10215226 10582346 9731700
$$ packed form
4396C337202K38109O3973q38177M869J68853j97761m49823J1825O88633P21475
4386C749178j109472j075877P51778j58006J107196R7801k62046m05700j06336
4377B588516P28567N66704k59996N97995k50257j22068m96379o37480M96587J39957
4367C352146J72894n97347K75465J13904K36895N29211l97552Q4292j95317Q72103
4357D446694O71256L50524o84796M80043Q54721Q43799r43501j350908k35073
4348D432759J154114R9226L77866N44815N77325j50633q51195R16353J061625
4339H162255N3618N10155p981N79901k48658Q6958Q17287n27412R37246M2780
4329A0406149J29984l30157N4108l91306n4348o75869J60703R15962L67120q50646
$$ plain form
4319 9731700 9752839 10670346 11202247 10919136 9630060 9905718 10455083 10571975 10245655 11577948
4309 11577948 11024276 10754647 11357095 11073911 11838336 12223649 12225088 12517939 12719272 12313078
4299 12313078 11554656 11231023 12000356 12267105 12611623 12016233 11658384 11619698 11383807 10733986
4289 10733986 10879077 11505737 11278630 10411991 10496364 9398186 10128402 9888744 9498342
4280 9498342 9859209 9657953 9779885 10026771 8434659 8959258 10235861 9586577 9667261
4271 9667261 9526023 9988080 10065608 9943595 9986563 10553544 10250033 10329345 9937826 10521498
4261 10521498 10505812 11140627 10726555 10015853 11092670 11798449 12100682 11701202 11974220
4252 11974220 13646104 13242579 12588357 12566758 13127677 12729495 12859212 13550964 14433397
$$ packed form
4319I731700K1139R17507N31901k83111j289076K75658N49365J16892l26320J332293
4309A1577948n53672k69629O02448k83184P64425L85313J439K92851K01333m06194
4299A2313078p58422l23633P69333K66749L44518n95390l57849l8686k35891o49821
4289A0733986J45091O26660k27107q66639Q4373j098178P30216k39658l90402
4280I498342L60867k01256J21932K46886j592112N24599J276603o49284Q0684
4271I667261j41238M62057P7528j22013M2968N66981l03511P9312l91519N83672
4261A0521498j5686O34815m14072p10702J076817P05779L02233l99480K73018
4252A1974220J671884m03525o54222k1599N60919l98182J29717O91752Q82433
$$ plain form
4243 14433397 14861875 15014812 14299873 13916567 14238652 15111962 16277306 16835659 17154096
4234 17154096 17531874 17525908 18819606 19204040 17791787 16808176 18082201 19106243 19481920
4225 19481920 19925279 20417155 21299648 21803679 21936307 22617149 23780202 24582234 24842806
4216 24842806 24333577 24691658 25364210 25567453 25939635 27115787 28030665 28217487 28366201
4207 28366201 29339522 30617164 31467765 32590559 33897526 33774785 34648787 35908365 37183350
4198 37183350 38221234 38934696 39286405 40223814 40870817 42567749 44484451 45342225 46196967
4189 46196967 47129179 47386627 48694716 49548353 50191922 52018628 53209689 54150264 54283424
4180 54283424 54949829 56545149 56691467 58010166 58995957 59690462 59266044 59432010 60585484
$$ packed form
4243A4433397M28478J52937p14939l83306L22085Q73310J165344N58353L18437
4234A7154096L77778n966J293698L84434j412253r83611J274025J024042L75677
4225A9481920M43359M91876Q82493N04031J32628O80842J163053Q02032K60572
4216B4842806n09229L58081O72552K03243L72182J176152R14878J86822J48714
4207B8366201R73321J277642Q50601J122794J306967j22741Q74002J259578J274985
4198C7183350J037884P13462L51709R37409O47003J696932J916702Q57774Q54742
4189D6196967R32212K57448J308089Q53637O43569J826706J191061R40575J33160
4180E4283424O66405J595320J46318J318699R85791O94505m24418J65966J153474
$$ plain form
4171 60585484 60198339 60204618 59964609 59384232 59586759 59037578 58054410 58391589 57275143 56134378
4161 56134378 56325457 55180802 54069593 53276161 53672382 51413371 49776518 48228583 47878944
4152 47878944 46884690 45703323 45287538 44190259 42348896 41585175 40964874 39815118 38723771
4143 38723771 38742275 38167362 36013645 35826259 34751225 34533555 33565036 32829610 31312691
4134 31312691 30567737 30471253 29846341 29199404 28256722 27116442 27171134 25486291 25052582
4125 25052582 24601673 23776911 23429358 23630726 23597893 22999287 22961701 21829610 21869605 21373481
4115 21373481 20883673 21008245 21116409 20350918 20654470 20075188 19754014 19599990 19978696
4106 19978696 20417441 20017303 19259591 19912105 20163628 19786922 20629971 20382381 20026749
$$ packed form
4171F0585484l87145O279k40009n80377K02527n49181r83168L37179j116446j140765
4161E6134378J91079j144655j111209p93432L96221k259011j636853j547935l49639
4152D7878944r94254j181367m15785j097279j841363p63721o20301j149756j091347
4143C8723771J8504n74913k153717j87386j075034k17670r68519p35426j516919
4134C1312691p44954r6484o24912o46937r42682j140280N4692j684843m33709
4125B5052582m50909q24762l47553K01368l2833n98606l7586j132091L9995m96124
4115B1373481m89808J24572J08164p65491L03552n79282l21174j54024L78706
4106A9978696M38745m00138p57712O52514K51523l76706Q43049k47590l55632
$$ plain form
4097 20026749 19443978 18772381 19188345 18726670 17925910 18483999 18663090 18551189 18634633 18657667
4087 18657667 18306365 18594282 17963239 18332661 18784052 19441095 19736434 19567082 19442740
4078 19442740 20410928 20613322 20959053 20698979 20844751 21123862 21559823 21222662 21522281
4069 21522281 21649624 21188582 21866310 21825735 22710915 23406176 24146252 23985606 24675482 25674981
4059 25674981 25964369 27341860 27138273 27278426 27394037 28629252 29511079 29249934 28335378
4050 28335378 29660866 30881872 31766157 31707196 32001068 32458304 33304010 34074460 34815031
4041 34815031 35713700 36667638 37411325 38198022 38120293 38228482 38881830 38434565 38391583 38791548
4031 38791548 38862823 37306011 37191873 37324063 36733851 35915273 36640923 35283272 34260843
$$ packed form
4097B0026749n82771o71597M15964m61675q00760N58089J79091j11901Q3444K3034
4087A8657667l51302K87917o31043L69422M51391O57043K95339j69352j24342
4078A9442740R68188K02394L45731k60074J45772K79111M35961l37161K99619
4069B1522281J27343m61042O77728m0575Q85180O95261P40076j60646O89876R99499
4059B5674981K89388J377491k03587J40153J15611J235215Q81827k61145r14556
4050B8335378J325488J221006Q84285n8961K93872M57236Q45706P70450P40571
4041C4815031Q98669R53938P43687P86697p7729J08189O53348m47265m2982L99965
4031C8791548P1275j556812j14138J32190n90212q18578P25650j357651j022429
$$ plain form
4022 34260843 33578809 33217233 32130130 30860494 31453190 31625993 31497881 30712571 30569729
4013 30569729 30236076 29752263 29459357 30295798 31092952 30813257 30483768 30480491 29858294 29475655
4003 29475655 29280108 29771024 30297991 30089423 29934900 29607908 30683148 30962089 31209948
3994 31209948 31730571 32244930 32239516 31934024 32055181 33605568 33475271 34388820 35537098
3985 35537098 36284155 36265566 37166359 38099202 39560694 39766352 41025801 40301244 41647385
3976 41647385 42494660 42333517 42829773 44383110 45682108 47179277 47494758 49257605 50577055
3967 50577055 50928367 52646091 53099837 53902988 55662813 58019554 58996990 60833962 61813946
3958 61813946 63688031 64608028 65929446 66493722 66535919 67750494 68077817 67946514 68546016
$$ packed form
4022C4260843o82034l61576j087103j269636N92696J72803j28112p85310j42842
4013C0569729l33653m83813k92906Q36441P97154k79695l29489l277o22197l82639
4003B9475655j95547M90916N26967k08568j54523l26992J075240K78941K47859
3994C1209948N20623N14359n414l05492J21157J550387j30297R13549J148278
3985C5537098P47057j8589R00793R32843J461492K05658J259449p24557J346141
3976D1647385Q47275j61143M96256J553337J298998J497169L15481J762847J319450
3967E0577055L51312J717724M53746Q03151J759825K356741R77436J836972R79984
3958F1813946J874085R19997J321418N64276M2197J214575L27323j31303N99502
$$ plain form
3949 68546016 68477557 67764408 67222023 66996178 66831009 66105700 64036340 63020553 62497267
3940 62497267 60770495 58547199 57398294 56032954 54459354 52130738 51741421 49897401
3932 49897401 48418118 47735155 45325158 43757325 43037214 42229264 40653210 39963348 39283647
3923 39283647 37982879 37441631 36266057 35218147 35197301 34596323 33254709 32906951 33422083
3914 33422083 33224435 31965719 32431017 30968339 30629860 30215735 29675324 28820833 27306735
3905 27306735 26490756 26422322 26021033 25006722 26099524 25712403 25046121 24942641 24737418
3896 24737418 25432967 25421299 25050102 25705611 26289958 26027080 26181712 24981490 25649819
3887 25649819 25944510 25308896 26521851 25929745 26192585 25459055 25550780 24528347 24327346
$$ packed form
3949F8546016o8459p13149n42385k25845j65169p25309k069360j015787n23286
3940F2497267j726772k223296j148905j365340j573600k328616l89317j844020
3932D9897401j479283o82963k409997j567833p20111q07950j576054o89862o79701
3923C9283647j300768n41248j175574j047910k0846o00978j341614l47758N15132
3914C3422083j97648j258716M65298j462678l38479m14125n40411q54491j514098
3905B7306735q15979o8434m01289j014311J092802l87121o66282j03480k05223
3896B4737418O95549j1668l71197O55509N84347k62878J54632j200222O68329
3887B5649819K94691o35614J212955n92106K62840p33530R1725j022433k01001
$$ plain form
3878 24327346 24578499 24743334 24972896 25302173 25312300 25470736 25470791 26346932 27053241 27337947
3868 27337947 27685329 27583659 29758099 30299366 31227276 32395855 33087659 33611817 35518810
3859 35518810 36852204 39419915 41717615 43758126 46916965 50942594 55046206 59785206
3851 59785206 65451762 72991935 79646668 88749775 102486193 118134983 134036080 150166315
3843 150166315 163990626 161593257 136538104 110673535 94930769 83573154 75854901
3836 75854901 69088637 63436355 58997214 55477178 51473349 49510671 47242341 45509435
3828 45509435 44386115 43701181 42861815 40747212 40188175 41010880 40721537 39737261 39980793
3819 39980793 40689223 40396726 41927530 42213596 42132363 43827020 43608603 43739199 43305809
$$ packed form
3878B4327346K51153J64835K29562L29277J0127J58436N5Q76141P06309K84706
3868B7337947L47382j01670K174440N41267R27910J168579O91804N24158J906993
3859C5518810J333394K567711K297700K040511L158839M025629M103612M739000
3851E9785206N666556P540173O654733R103107J3736418J5648790J5901097J6130235
3843A50166315J3824311k397369k5055153k5864569j5742766j1357615p718253
3836G5854901o766264n652282m439141l520036m003829j962678k268330j732906
3828D5509435j123320o84934q39366k114603n59037Q22705k89343r84276K43532
3819C9980793P08430k92497J530804K86066q1233J694657k18417J30596m33390
$$ plain form
3810 43305809 43123442 43659791 44598440 44384258 43534796 44259762 45179595 45147825 44566308 43848100
3800 43848100 42000668 42007785 41839081 41213302 40378536 40755057 39711457 38228975 37839507
3791 37839507 37324655 37382367 36551311 35333198 35215840 34344063 32551480 30140445 30846487
3782 30846487 29648577 28657381 27129888 26463170 25520718 26125060 25134016 24176612 23450381
3773 23450381 22857887 22456027 20791275 20334325 19663820 19715279 19384196 18612014 18026164
3764 18026164 18710509 17824664 16895092 16277905 16044651 14879133 14602193 14805778 14516449
3755 14516449 14436431 15430841 15030348 14610017 13916088 14407851 14414557 14014620 14171109 13902294
3745 13902294 13633953 14614222 14640454 14560169 14920466 14806543 13856929 14344835 14387786 13165838
$$ packed form
3810D3305809j82367N36349R38649k14182q49462P24966R19833l1770n81517p18208
3800D3848100j847432P117j68704o25779q34766L76521j043600j482482l89468
3791C7839507n14852N7712q31056j218113j17358q71777j792583k411035P06042
3782C0846487j197910r91196j527493o66718r42452O04342r91044r57404p26231
3773B3450381n92494m01860j664752m56950o70505N1459l31083p72182n85850
3764A8026164O84345q85845r29572o17187k33254j165518k76940K03585k89329
3755A4516449q0018R94410m00493m20331o93929M91763O706l99937J56489k68815
3745A3902294k68341R80269K6232q0285L60297j13923r49614M87906M2951j221948
$$ plain form
3735 13165838 12970155 12997993 12515742 12176288 12609489 12575460 11612901 12133635 11827634 11468366
3725 11468366 11918495 11900191 11743177 12112197 11431253 10924172 10692301 10100319 9415785 11291912
3715 11291912 11354984 9526682 10799390 10934920 10688195 9904313 9927420 9475955 10251192
3706 10251192 10973920 10865201 10777748 10989604 11965112 11975208 11946828 12901671 13922034 13643289
3696 13643289 14020883 14504561 13447495 13161760 13043676 13525967 13258294 11666996 10717039
3687 10717039 10222410 10393627 10258831 9835625 8938458 7619610 7418777 8153841 8033714
3678 8033714 8559936 7621074 7647152 7297741 8173388 8670872 8874896 9225606 8526178 8578261
3668 8578261 7419087 7822605 7394764 7785441 7834781 7047593 7060383 6889519 7093501 8229631
$$ packed form
3735A3165838j95683K7838m82251l39454M33201l4029r62559N20734l06001l59268
3725A1468366M50129j8304j57014L69020o80944n07081k31871n91982o84534J876127
3715A1291912O3072j828302J272708J35530k46725p83882K3107m51465P75237
3706A0251192P22728j08719q7453K11856R75508J0096k8380R54843J020363k78745
3696A3643289L77594M83678j057066k85735j18084M82291k67673j591298r49957
3687A0717039m94629J71217j34796m23206q97167j318848k00833P35064j20127
3678H033714N26222r38862K6078l49411Q75647M97484K04024L50710o99428N2083
3668H578261j159174M03518m27841L90677M9340p87188J2790j70864K03982J136130
$$ plain form
3658 8229631 7982108 7450665 7265478 7795317 8163209 8118528 7895816 8185487 8060791 7279160
3648 7279160 7083173 7724738 8687438 8775233 8316812 7700932 7471612 7576165 6705207 6668875
3638 6668875 8032455 8001888 7741612 7073597 7333621 8146489 8146313 8806195 9040405 9284645
3628 9284645 8243788 8391150 8969035 9092220 8997868 9740669 9300982 9752376 9806451 8731746
3618 8731746 10509831 10914761 11717842 11687285 12112859 11939700 11801329 12122290 11832391 12546441
3608 12546441 14008085 15027463 14390084 13811073 14034330 13770415 14289885 14767536 15932155
3599 15932155 16878762 16516250 16587553 16744166 16361284 17123595 17069736 16907459 18444053 18984502
3589 18984502 19144419 19050960 20349202 21774989 22012135 22809779 23978205 25840875 26691083
$$ packed form
3658H229631k47523n31443j85187N29839L67892m4681k22712K89671j24696p81631
3648G279160j95987O41565R62700Q7795m58421o15880k29320J04553q70958l6332
3638F668875J363580l0567k60276o68015K60024Q12868j76O59882K34210K44240
3628I284645j040857J47362N77885J23185r4352P42801m39687M51394N4075j074705
3618H731746J778085M04930Q03081l0557M25574j73159j38371L20961k89899P14050
3608A2546441J461644J019378o37379n79011K23257k63915N19470M77651J164619
3599A5932155R46607l62512P1303J56613l82882P62311n3859j62277J536594N40449
3589A8984502J59917r3459J298242J425787K37146P97644J168426J862670Q50208
$$ plain form
3580 26691083 28445937 29768935 31190140 32800782 33116074 34197113 35896949 37508285
3572 37508285 39925972 41478425 42765425 44931811 47206845 50159677 52598815 55373703
3564 55373703 56886223 58152593 59986862 61933384 63359088 64236018 65130885 66380503
3556 66380503 67561376 67771056 66785120 67511748 67506418 66518986 66617471 66294510 65997285 65601912
3546 65601912 62576994 61160650 59506909 57480982 55209883 53820137 51004502 48200195
3538 48200195 46831161 44741578 43238220 42538685 40340753 37945127 36959224 35471582
3530 35471582 34475764 32617810 31440713 30942185 29352060 27542968 27057611 26824492 25499439
3521 25499439 24105656 22947782 22688314 21813214 22115333 21988947 21131370 20580985 18743490
$$ packed form
3580B6691083J754854J322998J421205J610642L15292J081039J699836J611336
3572C7508285K417687J552453J287000K166386K275034K952832K439138K774888
3564E5373703J512520J266370J834269J946522J425704Q76930Q94867J249618
3556F6380503J180873K09680r85936P26628n330r87432R8485l22961k97225l95373
3546F5601912l024918j416344j653741k025927k271099j389746k815635k804307
3538D8200195j369034k089583j503358o99535k197932k395626r85903j487642
3530C5471582r95818j857954j177097m98528j590125j809092m85357k33119j325053
3521B5499439j393783j157874k59468q75100L02119j26386q57577n50385j837495
$$ plain form
3512 18743490 18424020 19017230 19073282 18896974 18469523 18125880 18309768 18576970 18983108 18205898
3502 18205898 18966070 18555982 18222811 18452933 18824225 17517827 17262765 16979121 18081033
3493 18081033 18367655 18287900 19055093 19428408 19160770 19891357 19556170 19505726 20083310 19803321
3483 19803321 19448503 20231741 20097913 19548890 18749083 18742595 18841299 19089318 19301682 19085324
3473 19085324 18725790 18024807 18381689 18566673 17871318 17867256 19288986 19236450 19383289 19235531
3463 19235531 19604176 19947184 20231715 20510356 21301774 21300082 21754269 22806389 23107224 23172549
3453 23172549 23233995 23057723 23813031 24012400 24537436 25306990 26313319 26895456 27074753
3444 27074753 26571830 27311978 28492692 29204538 29392458 29939736 31155579 31807781 32055925
$$ packed form
3512A8743490l19470N93210N6052j76308m27451l43643J83888K67202M06138p77210
3502A8205898P60172m10088l33171K30122L71292j306398k55062k83644J101912
3493A8081033K86622p9755P67193L73315k67638P30587l35187n0444N77584k79989
3483A9803321l54818P83238j33828n49023p99807o488R8704K48019K12364k16358
3473A9085324l59534p00983L56882J84984o95355m062J421730n2536J46839j47758
3463A9235531L68645L43008K84531K78641P91418j692M54187J052120L00835O5325
3453B3172549O1446j76272P55308J99369N25036P69554J006329N82137J79297
3444B7074753n02923P40148J180714P11846J87920N47278J215843O52202K48144
$$ plain form
3435 32055925 33387561 34335027 35864221 36841512 38364798 38950721 40303110 43299706 44794880
3426 44794880 46346789 48283081 50472104 52113958 54434347 57788290 60955349 64825653
3418 64825653 68106007 71880447 75216368 79337587 84617759 89821141 94303310 100537045
3410 100537045 105291754 110962009 117274960 122192732 127677441 132677330 137071115 140463103
3402 140463103 142448650 145651874 148743010 149345542 148898257 147672212 147347978 146242241
3394 146242241 143221506 139370685 134342973 129185807 125150801 119687723 115338218 110799192
3386 110799192 106562624 101343878 97389886 93339721 89385722 85829448 82267750 78552190
3378 78552190 74374881 71217898 69125381 66655345 63503209 60962257 58713259 57069365
$$ packed form
3435C2055925J331636R47466J529194R77291J523286N85923J352389K996596J495174
3426D4794880J551909J936292K189023J641854K320389L353943L167059L870304
3418F4825653L280354L774440L335921M121219N280172N203382M482169O233735
3410A00537045M754709N670255O312951M917772N484709M999889M393785L391988
3402A40463103J985547L203224L091136O02532m47285j226045l24234j105737
3394A46242241l020735l850821n027712n157166m035006n463078m349505m539026
3386A10799192m236568n218746l953992m050165l953999l556274l561698l715560
3378G8552190m177309l156983k092517k470036l152136k540952k248998j643894
$$ plain form
3370 57069365 55912009 53695616 52253500 50837392 50204426 48922940 47726776 46171746
3362 46171746 46070439 45702078 43631529 42400401 41383079 39945127 39668957 38599744 37962490
3353 37962490 37165439 35862884 35154448 34442380 32974627 31881862 32141336 30803933 30314777
3344 30314777 29960275 29830328 29498855 28198309 28121487 27893669 27895203 27926451 28568436 28633197
3334 28633197 28345526 27795943 27844305 27203845 27060556 27190036 26164549 26198315 24545777
3325 24545777 22674896 21598690 21854834 21063292 20071404 18580170 18700434 18939792 17449767
3316 17449767 15981505 15673242 15275025 14873745 14470912 14447709 14486161 13994674 13790934 12794884
3306 12794884 12815104 12988741 12674919 12786459 13375141 13228380 12437929 12067397 12262545 12782447
$$ packed form
3370E7069365j157356k216393j442116j416108o32966j281486j196164j555030
3362D6171746j01307l68361k070549j231128j017322j437952k76170j069213o37254
3353C7962490p97051j302555p08436p12068j467753j092765K59474j337403m89156
3344C0314777l54502j29947l31473j300546p6822k27818J534L1248O41985O4761
3334B8633197k87671n49583M8362o40460j43289J29480j025487L3766j652538
3325B4545777j870881j076206K56144p91542r91888j491234J20264K39358j490025
3316A7449767j468262l08263l98217m01280m02833k3203L8452m91487k03740r96050
3306A2794884K0220J73637l13822J11540N88682j46761p90451l70532J95148N19902
$$ plain form
3296 12782447 12323464 12011165 11828398 11118914 11890087 11938390 11634679 11859385 11214321 11189390
3286 11189390 11769319 11960538 11848413 11532038 11946435 11584562 11182916 11948646 12226929
3277 12226929 12214358 11086099 12480194 13277097 13888617 13128960 13238735 13696711 13610385
3268 13610385 14221832 14880120 14765163 14933819 14372049 14899810 14741114 13896652 13685642
3259 13685642 13450021 13033392 13426215 13699549 13732912 13686595 13898654 13819188 13094650 14055152
3249 14055152 13532208 13498481 14117189 14555181 14055112 13708872 14476424 15702184 16466587
3240 16466587 16427800 16046440 16373084 16970013 17912305 17975290 18111734 18543370 18382628 19737376
3230 19737376 20963197 22590751 23277277 22074694 22627736 23838872 25012160 25575645 26254649
$$ packed form
3296A2782447m58983l12299j82767p09484P71173M8303l03711K24706o45064k4931
3286A1189390N79929J91219j12125l16375M14397l61873m01646P65730K78283
3277A2226929j2571j128259J394095P96903O11520p59657J09775M57976q6326
3268A3610385O11447O58288j14957J68656n61770N27761j58696q44462k11010
3259A3685642k35621m16629L92823K73334L3363m6317K12059p9466p24538R60502
3249A4055152n22944l3727O18708M37992n00069l46240P67552J225760P64403
3240A6466587l8787l81360L26644N96929R42292O2985J36444M31636j60742J354748
3230A9737376J225821J627554O86526j202583N53042J211136J173288N63485O79004
$$ plain form
3221 26254649 26826781 27173745 27051353 27523231 28143754 29272083 28836884 29002837 29936866
3212 29936866 29678916 29459946 29159184 29234230 30011232 30152264 30152175 30255992 31192716 30891468
3202 30891468 31387395 32490619 32532437 32827679 33142857 32982066 32703958 32737884 33811662
3193 33811662 33594935 33991448 34701623 35237690 36270769 37370520 37362694 36733194 38830139
3184 38830139 38935006 39387162 41602307 42519724 42736982 43881223 44906850 46236033 47453506
3175 47453506 48726504 49870925 50912526 52712003 54334555 55666749 56771959 59000849
3167 59000849 60332506 61679167 63616053 64558161 65677192 67920177 70018242 72050870
3159 72050870 74539066 75883634 77749107 81028338 83806901 86004186 89170804 92036139
$$ packed form
3221B6254649N72132L46964j22392M71878O20523J128329m35199J65953R34029
3212B9936866k57950k18970l00762P5046P77002J41032q9J03817R36724l01248
3202C0891468M95927J103224M1818K95242L15178j60791k78108L3926J073778
3193C3811662k16727L96513P10175N36067J033079J099751p826o29500K096945
3184C8830139J04867M52156K215145R17417K17258J144241J025627J329183J217473
3175D7453506J272998J144421J041601J799477J622552J332194J105210K228890
3167E9000849J331657J346661J936886R42108J119031K242985K098065K032628
3159G2050870K488196J344568J865473L279231K778563K197285L166618K865335
$$ plain form
3151 92036139 94066264 96571512 98477178 99753454 100803526 103885551 106087833 106849941
3143 106849941 107867237 109233695 110753658 112196093 112846137 112674751 113306169 115164564
3135 115164564 116187109 116178980 116123304 115885016 114613072 114703462 114994844 112936529 111490099
3126 111490099 110954886 108834050 106013114 105509833 103769827 102191411 100385197 98261399
3118 98261399 95568452 93272819 90285770 88175264 84569251 80531744 76595197 73664155
3110 73664155 70961260 68012523 66053534 63256446 60008189 57987455 55975698 54893458
3102 54893458 53266650 51710261 50215838 49631195 48919488 48675254 49467826 49400985 49073973
3093 49073973 49197649 48056292 47775842 47859909 48424056 49322582 49015595 48025047 46850082
$$ packed form
3151I2036139K030125K505248J905666J276276J050072L082025K202282P62108
3143A06849941J017296J366458J519963J442435O50044j71386O31418J858395
3135A15164564J022545q129n5676k38288j271944R0390K91382k058315j446430
3126A11490099n35213k120836k820936n03281j740006j578416j806214k123798
3118I8261399k692947k295633k987049k110506l606013m037507l936547k931042
3110G3664155k702895k948737j958989k797088l248257k020734k011757j082240
3102E4893458j626808j556389j494423n84643p11707k44234P92572o6841l27012
3093D9073973J23676j141357k80450Q4067N64147Q98526l06987r90548j174965
$$ plain form
3084 46850082 47124710 46782384 46322255 46586892 48022244 48574164 49170825 48782193 49424940
3075 49424940 49864230 49833619 49776765 51472274 51701525 52018263 51902543 51664381 51844238 52162178
3065 52162178 51595588 51168558 51324243 50037394 49640939 48863049 48655624 47861925 46873466
3056 46873466 45590923 43517878 42328753 41084196 39627890 39478683 38650774 37583395
3048 37583395 36390083 35265907 34571832 33145693 32243649 31039131 30962270 30351908 28703097
3039 28703097 28188427 27323989 27406665 28858829 28351563 27373809 26289751 25917634 26727005
3030 26727005 26404565 26784451 27340714 27576979 28374075 28209597 29124405 29194909 30640067
3021 30640067 31764944 32411578 33877234 34933805 35319902 37205099 38417728 40031287
$$ packed form
3084D6850082K74628l42326m60129K64637J435352N51920N96661l88632O42747
3075D9424940M39290l0611n6854J695509K29251L16738j15720k38162J79857L17940
3065E2162178n66590m27030J55685j286849l96455p77890k07425p93699r88459
3056D6873466j282543k073045j189125j244557j456306j49207q27909j067379
3048C7583395j193312j124176o94075j426139r02044j204518p6861o10362j648811
3039B8703097n14670q64438Q2676J452164n07266r77754j084058l72117Q09371
3030B6727005l22440L79886N56263K36265P97096j64478R14808P0504J445158
3021C0640067J124877O46634J465656J056571L86097J885197J212629J613559
$$ plain form
3013 40031287 42012132 42180737 43756960 45366122 47230426 49145889 50648217 52720880
3005 52720880 54687942 56634129 59174104 61015787 64903817 67389408 69874917 73469078
2997 73469078 78350830 82091646 86169421 90033470 94032054 97736903 99751280 101735503
2989 101735503 101956307 101033893 100068044 96548855 92279619 87725364 83401296 77685105
2981 77685105 71751960 67139199 62941588 58166157 53429344 50358893 47639583 44477593
2973 44477593 41326333 39460961 37431122 34945961 33187873 32145154 30337156 28970010
2965 28970010 27800014 26887235 25400898 24254653 23342238 22035207 21324827 21393383 21087794
2956 21087794 20950564 19669495 19314003 19153296 19296204 17361160 17346682 17343909 17035178 16260211
$$ packed form
3013D0031287J980845J68605J576223J609162J864304J915463J502328K072663
3005E2720880J967062J946187K539975J841683L888030K485591K485509L594161
2997G3469078M881752L740816M077775L864049L998584L704849K014377J984223
2989A01735503K20804r22414r65849l519189m269236m554255m324068n716191
2981G7685105n933145m612761m197611m775431m736813l070451k719310l161990
2973D4477593l151260j865372k029839k485161j758088j042719j807998j367146
2965B8970010j169996r12779j486337j146245r12415j307031p10380O8556l05589
2956B1087794j37230j281069l55492j60707J42908j935044j4478k773l08731p74967
$$ plain form
2946 16260211 16188524 16286092 16398241 16059700 15566915 16046796 16530021 17031096 16243785 16042154
2936 16042154 15202543 16396354 16482350 16907078 16239874 16772117 17451545 17041474 17291286
2927 17291286 18134481 18896140 19665458 20410386 20602868 20608701 20900028 22423900 22189696 22815744
2917 22815744 22942490 22249142 22812918 22777077 22334376 21008449 20537043 19849447 19160439
2908 19160439 18470216 17462678 16791076 15916838 15730578 14993115 14256813 13938483 12640394
2899 12640394 11569634 11467662 11298567 11545196 10767727 10516442 10865211 10004487 10389356
2890 10389356 9865549 10440693 9914501 9225045 8938051 9101762 9017563 9846220 9255695 8830276
2880 8830276 9893759 8975544 8401701 8618256 8446173 7704647 8510140 8627129 8406210
$$ packed form
2946A6260211p1687R7568J12149l38541m92785M79881M83225N01075p87311k01631
2936A6042154q39611J193811Q5996M24728o67204N32243O79428m10071K49812
2927A7291286Q43195P61659P69318P44928J92482N833K91327J523872k34204O26048
2917B2815744J26746o93348N63776l5841m42701j325927m71406o87596o89008
2908A9160439o90223j007538o71602q74238j86260p37463p36302l18330j298089
2899A2640394j070760j01972j69095K46629p77469k51285L48769q60724L84869
2890A0389356n23807N75144n26192o89456k86994J63711q4199Q28657n90525m25419
2880H830276J063483r18215n73843K16555j72083p41526Q05493J16989k20919
$$ plain form
2871 8406210 7921707 7663797 8830753 8219496 7964003 9077804 9703313 9618628 9490457
2862 9490457 9350587 8117635 8553706 9172771 8693390 8270576 8981473 8484410 8895301
2853 8895301 9241350 9608111 10245954 9563865 9217101 9172874 8838287 9695910 9735693 9108349
2843 9108349 10293197 10425667 10839983 9832566 10060521 10370982 10076492 10367772 10461840
2834 10461840 10671988 11369322 11410077 11204520 11782234 12332770 12656902 12594235 12848104 12423561
2824 12423561 12961490 12928872 14247826 14793325 15236679 15093458 15253486 15267398 15639688 15481858
2814 15481858 15936047 17723935 17266585 17773950 18405358 19346008 19917125 19305920 20001495
2805 20001495 19791375 20874926 22424003 22516920 22179268 22813999 23602836 24870669 25756703
$$ packed form
2871H406210m84503k57910J166956o11257k55493J113801O25509q4685j28171
2862I490457j39870j232952M36071O19065m79381m22814P10897m97063M10891
2853H895301L46049L66761O37843o82089l46764m4227l34587Q57623L9783o27344
2843I108349J184848J32470M14316j007417K27955L10461k94490K91280R4068
2834A0461840K10148O97334M0755k05557N77714N50536L24132o2667K53869m24543
2824A2423561N37929l2618J318954N45499M43354j43221J60028J3912L72290j57830
2814A5481858M54189J787888m57350N07365O31408R40650N71117o11205O95575
2805B0001495k10120J083551J549077R2917l37652O34731P88837J267833Q86034
$$ plain form
2796 25756703 26222035 27396159 27985231 28545796 28895577 30779152 31969378 32429434 33310696
2787 33310696 34289612 36082439 37513833 38337324 38957541 40726589 41413499 42435650 45809853
2778 45809853 48529157 51461969 53197293 56461172 60197509 62574675 65545343 69996815
2770 69996815 75555154 81359183 86582321 92214397 98976831 104494441 108989745 113519232
2762 113519232 118491467 124765421 131834910 140002793 147701432 154107787 160777353 167159701
2754 167159701 173851185 183656841 195213895 207975551 223120888 241860211 261805839
2747 261805839 283243346 304855269 325114938 342415695 351766171 354796728 347518211
2740 347518211 329286167 305766926 278914708 253311309 230655006 210527847 192950891
$$ packed form
2796B5756703M65332J174124N89072N60565L49781J883575J190226M60056Q81262
2787C3310696R78916J792827J431394Q23491O20217J769048O86910J022151L374203
2778D5809853K719304K932812J735324L263879L736337K377166K970668M451472
2770F9996815N558339N804029N223138N632076O762434N517610M495304M529487
2762A13519232M972235O273954P069489Q167883P698639O406355O669566O382348
2754A67159701O691484R805656J1557054J2761656J5145337J8739323J9945628
2747B61805839K1437507K1611923K0259669J7300757R350476L030557p278517
2740C47518211j8232044k3519241k6852218k5603399k2656303k0127159j7576956
$$ plain form
2733 192950891 177584705 163723637 151418396 139308726 129312221 119644743 110141100
2726 110141100 100671701 93930498 88186581 82665351 78822108 75112109 72207726 68311223
2718 68311223 65266051 63046126 61402920 60090114 57349480 55504478 55093180 53507660
2710 53507660 52204935 52640158 51783800 49834660 48227964 48560118 48334422 46815867 47779310
2701 47779310 48783919 48401436 47972828 48652252 50058956 51790639 53575891 56304507 59196791
2692 59196791 61925934 65053932 67542891 70343422 73978863 76687459 78399909 77482796
2684 77482796 75617501 71874720 67872168 61847920 56507909 51905096 48280531 43997271
2676 43997271 41062125 39253936 36505433 34221884 32086877 29591016 27693802 26266556
$$ packed form
2733A92950891j5366186j3861068j2305241j2109670r996505r667478r503643
2726A10141100r469399o741203n743917n521230l843243l709999k904383l896503
2718F8311223l045172k219925j643206j312806k740634j845002m11298j585520
2710E3507660j302725M35223q56358j949140j606696L32154k25696j518555R63443
2701D7779310J004609l82483m28608O79424J406704J731683J785252K728616K892284
2692E9196791K729143L127998K488959K800531L635441K708596J712450r17113
2684G7482796j865295l742781m002552o024248n340011m602813l624565m283260
2676D3997271k935146j808189k748503k283549k135007k495861j897214j427246
$$ plain form
2668 26266556 24940676 24724478 23204075 23499860 22091229 21822195 20894699 19563668 19777606
2659 19777606 18086695 16965339 16527441 16755357 15696668 15150704 14067339 13608713 13683141
2650 13683141 13399769 13399510 12354563 11896035 11397955 11223953 10702900 10568569 10603457 10323507
2640 10323507 9496644 9355300 9338994 9095585 9271611 9118627 8568939 8173972 7999634 7712134
2630 7712134 7380287 7207599 8282242 7168294 6640793 6880019 7405366 7127652 6461882
2621 6461882 6165539 6364737 6155358 6036858 5688261 5132517 6150778 5334673 4585767
2612 4585767 4842795 5184452 5144153 5289193 4917348 4833972 4440290 4738828 3877478 4208096
2602 4208096 4717471 3901331 3972476 4399963 4536597 4031159 3619779 4515289 4268107 3976823
$$ packed form
2668B6266556j325880k16198j520403K95785j408631k69034r27496j331031K13938
2659A9777606j690911j121356m37898K27916j058689n45964j083365m58626P4428
2650A3683141k83372k59j044947m58528m98080j74002n21053j34331L4888k79950
2640A0323507q26863j41344j6306k43409J76026j52984n49688l94967j74338k87500
2630G712134l31847j72688J074643j113948n27501K39226N25347k77714o65770
2621F461882k96343J99198k09379j18500l48597n55744J018261q16105p48906
2612D585767K57028L41657m0299J45040l71845q3376l93682K98538q61350L30618
2602D208096N09375q16140P1145M27487J36634n05438m11380Q95510k47182k91284
$$ plain form
2592 3976823 3977354 2817257 2794654 2576128 3006104 2896797 3438911 3543259 3604476 3448346
2582 3448346 2776305 3848055 3707172 3250492 1690987 1284685 1052179 1779618 2385092
2573 2385092 3479978 3015033 3515765 3199108 1856988 1810700 1497163 1654639 1803477
2564 1803477 1314131 1217209 758971 410362 1520484 1425909 1826081 1879174 2704908 2448309
2554 2448309 2511917 1590203 1590841 2225841 2585997 1373509 918636 1896611 1485062 1434618
2544 1434618 1454278 1504912 2029352 1608811 1220523 1629368 1765218 1402573 1314596 1228818
2534 1228818 965848 832257 107465 825992 1641358 502873 950148 1646432 1031487
2525 1031487 1189222 1567458 2542730 1568575 1403831 1186946 1309324 1452936 1192299 1575718
$$ packed form
2592C976823N31j160097k2603k18526M29976j09307N42114J04348O1217j56130
2582C448346o72041J071750j40883m56680j559505m06302k32506P27439O05474
2573B385092J094886m64945N00732l16657j342120m6288l13537J57476J48838
2564A803477m89346r6922m58238l48609J110122r4575M00172N3093Q25734k56599
2554B448309O3608r21714O38O35000L60156j212488m54873R77975m11549n0444
2544A434618J9660N0634N24440m20541l88288M08845J35850l62645q7977q5778
2534A228818k62970j33591p24792P18527Q15366j138485M47275O96284o14945
2525A031487J57735L78236R75272r74155j64744k16885J22378J43612k60637L83419
$$ plain form
2515 1575718 1149373 342420 272636 2198761 1637803 1391186 1221724 1690654 986254 247747
2505 247747 840701 1122667 1448244 992994 1123603 729270 1031809 1066657 1192735 2114979
2495 2114979 2084395 1912186 2167101 2495135 2346635 1786284 2337184 2557291 2325071 2010833
2485 2010833 2091676 2831610 1823958 1182804 782478 735168 854582 923636 712627 690496
2475 690496 1479650 1733554 943206 -290808 445214 1002254 388936 -408006 -687799 -357854
2465 -357854 491220 392203 162848 -357041 -1279463 -224226 636727 183650 -223625 610502
2455 610502 995138 -575836 -268957 589863 1029804 582247 78375 -534949 -1106702 -394457
2445 -394457 -351431 917388 695626 -200664 -309 -409568 -851739 -221032 -134023 344275
$$ packed form
2515A575718m26345q06953o9784J926125n60958k46617j69462M68930p04400p38507
2505B47747N92954K81966L25577m55250J30609l94333L02539L4848J26078R22244
2495B114979l0584j72209K54915L28034j48500n60351N50900K20107k32220l14238
2485B010833Q0843P39934j007652o41154m00326m7310J19414O9054k11009k2131
2475F90496P89154K53904p90348j234014P36022N57040o13318p96942k79793L29945
2465c57854Q49074r9017k29355n19889r22422J055237Q60953m53077m07275Q34127
2455F10502L84636j570974L06879Q58820M39941m47557n03872o13324n71753P12245
2445c94457M3026J268819k21762q96290K00355m09259m42171O30707Q7009M78298
$$ plain form
2435 344275 495081 579561 -339430 -383480 -232061 -367170 87445 -182010 303536 1123461
2425 1123461 755811 407216 992170 55338 -622612 -646773 215126 511607 514222 -164404
2415 -164404 -881097 -802032 -201107 719783 -570382 132188 765311 110038 412143 -203604
2405 -203604 -214889 319971 40812 645343 -365885 -1349297 -1219872 -956788 689034 -90626
2395 -90626 -958343 -618636 -1052397 -1230775 -1377641 -1177633 -1024620 -359139 -163857 -884415
2385 -884415 -392114 -929922 -1151080 -728231 -516854 -608237 -693506 -1624683 -1132008 -992957
2375 -992957 -235177 210849 -187546 -981756 -616662 360985 -230322 -752129 -283357 237259
2365 237259 177880 364497 -703224 -1220402 -1004754 -460526 433318 9954 346017 326736
$$ packed form
2435C44275J50806Q4480r18991m4050J51419j35109M54615k69455M85546Q19925
2425A123461l67650l48595N84954r36832o77950k4161Q61899K96481K615o78626
2415a64404p16693P9065O00925R20890j290165P02570O33123o55273L02105o15747
2405b03604j1285N34860k79159O04531j011228r83412J29425K63084J645822p79660
2395i0626q67717L39707m33761j78378j46866K00008J53013O65481J95282p20558
2385h84415M92301n37808k21158M22849K11377r1383q5269r31177M92675J39051
2375i92957P57780M46026l98395p94210L65094R77647n91307n21807M68772N20616
2365B37259n9379J86617j067721n17178K15648N44228Q93844m23364L36063j9281
$$ plain form
2355 326736 -721493 -651236 -420185 -326919 -858374 -1423747 -1465682 -764667 -701178 -1257578
2345 -1257578 -577727 -149200 -448132 -1091454 -133218 7983 475019 126458 -246493 -553265
2335 -553265 -1579688 -1523098 -856609 65850 -598432 -1085084 -352471 102916 723018 611880
2325 611880 275525 -368504 508222 639127 -16555 910964 1927467 515536 131417
2316 131417 297252 -318831 866825 618356 -88024 29315 221770 197336 954172 1150819
2306 1150819 457778 1446564 2490768 1750261 2173654 763444 95521 621297 1230889
2297 1230889 -195608 -113045 529571 832027 122075 306698 445467 156098 321944 137135
2287 137135 -472428 746237 1092776 668001 933597 1046888 584187 1571410 1133188 1216675
$$ packed form
2355C26736j048229P0257K31051R3266n31455n65373m1935P01015O3489n56400
2345a257578O79851M28527k98932o43322R58236J41201M67036l48561l72951l06772
2335e53265j026423N6590O66489R22459o64282m86652P32613M55387O20102j11138
2325F11880l36355o44029Q76726J30905o55682R27519J016503j411931l84119
2316A31417J65835o16083J185656k48469p06380J17339J92455k4434P56836J96647
2306A150819o93041R88786J044204p40507M23393j410210o67923N25776O09592
2297A230889j426497Q2563O42616L02456p09952J84623J38769k89369J65846j84809
2287A37135o09563J218665L46539m24775K65596J13291m62701R87223m38222Q3487
$$ plain form
2277 1216675 897994 805117 961631 1112446 164384 -645779 -583702 -51808 575983 338003
2267 338003 62669 1023510 247540 63396 1111590 786686 1479115 1206921 726630 -690093
2257 -690093 -71429 163077 934534 165291 688785 1005232 435209 1154247 367280 -519993
2247 -519993 -238647 -954386 -427618 -698662 -513164 -117589 931393 948551 590922 -280887
2237 -280887 308057 5148 1045392 763329 933783 1710259 571848 59298 -539796
2228 -539796 212942 -122886 -25227 126284 505664 423067 820752 875518 1185739 522053
2218 522053 -251359 437323 558078 71652 1140351 933945 -20359 422247 1170638 1090691
2208 1090691 813141 425124 -100169 26110 645302 210496 -227605 930980 981007 1154406
$$ packed form
2277A216675l18681r2877J56514J50815r48062q10163O2077N31894O27791k37980
2267C38003k75334R60841p75970j84144J048194l24904O92429k72194m80291j416723
2257f90093O18664K34506P71457p69243N23494L16447n70023P19038p86967q87273
2247e19993K81346p15739N26768k71044J85498L95575J048982J7158l57629q71809
2237b80887N88944l02909J040244k82063J70454P76476j138411n12550n99094
2228e39796P52738l35828R7659J51511L79380q2597L97685N4766L10221o63686
2218E22053p73412O88682J20755m86426J068699k06406r54304M42606P48391p9947
2208A090691k77550l88017n25293J26279O19192m34806m38101J158585N0027J73399
$$ plain form
2198 1154406 1725430 1570947 1671950 2136649 1802758 2026831 2461729 3035221 3244589 3284043
2188 3284043 3195166 2802028 2735017 2875269 2450507 3253901 2844554 2300485 2342435 3307601
2178 3307601 2810012 1835193 2386703 2457984 2191118 2541951 3217277 3950010 3717352 3465853
2168 3465853 3890757 3927048 3685706 2967480 3152738 3892676 4077471 3882696 4586637 4511671
2158 4511671 3682350 2975555 4438670 3853128 2898993 4200329 4266415 4196840 4064498 3736998
2148 3736998 4099124 5324011 5653407 5592118 5365424 5140250 5350832 5555897 6490618 6748410
2138 6748410 6700762 5966593 6171450 6503973 6799420 6863253 7622226 8033957 8091196 8047242
2128 8047242 8726092 9468110 9807273 9737087 10428224 11253961 11682593 11901099 13089646 12916218
$$ packed form
2198A154406N71024j54483J01003M64699l33891K24073M34898N73492K09368L9454
2188C284043q8877l93138o7011J40252m24762Q03394m09347n44069M1950R65166
2178C307601m97589r74819N51510P1281k66866L50833O75326P32733k32658k51499
2168C465853M24904L6291k41342p18226J85258P39938J84795j94775P03941p4966
2158D511671q29321p06795J463115n85542r54135J301336O6086o9575j32342l27500
2148C736998L62126J224887L29396o1289k26694k25174K10582K05065R34721K57792
2138F748410m7648p34169K04857L32523K95447O3833P58973M11731N7239m3954
2128H047242O78850P42018L39163p0186O91137Q25737M28632K18506J188547j73428
$$ plain form
2118 12916218 13304754 13104294 13594808 14156566 15040563 16115800 15875936 15869626 15659131 16732718
2108 16732718 17937086 18852237 18441397 19132285 20261611 21098974 21260197 21913185 22114046
2099 22114046 21933104 23264132 24969623 25222481 26960525 28559493 30515290 32461050
2091 32461050 35464353 37960412 40588367 42594224 44457194 47570335 50174015 52079064
2083 52079064 54681035 58833347 62854050 67582795 72484759 78463631 85355616 93812964
2075 93812964 103314853 111643332 121951378 134475168 151416204 170670751 192258063
2068 192258063 221086862 259859307 308809604 362833867 421871545 477060028 509425645
2061 509425645 456414614 347638504 267818805 216390493 181070656 154090460 133295671
$$ packed form
2118A2916218L88536k00460M90514N61758Q83997J075237k39864o310k10495J073587
2108A6732718J204368R15151m10840O90888J129326Q37363J61223O52988K00861
2099B2114046j80942J331028J705491K52858J738044J598968J955797J945760
2091C2461050L003303K496059K627955K005857J862970L113141K603680J905049
2083E2079064K601971M152312M020703M728745M901964N978872O891985Q457348
2075I3812964R501889Q328479J0308046J2523790J6941036J9254547K1587312
2068A92258063K8828799L8772445M8950297N4024263N9037678N5188483L2365617
2061E09425645n3011031j08776110p9819699n1428312l5319837k6980196k0794789
$$ plain form
2054 133295671 117253497 104938458 96772862 90425798 84402280 79690595 74519801 67617984
2046 67617984 60065407 53533449 48841071 45538690 42562309 40223717 37993472 35931284
2038 35931284 33476937 31492631 30344078 28943447 27860695 28340450 27137330 26067360
2030 26067360 24160851 22554277 22517234 20856128 19403076 19028594 18350234 17351084 17512297
2021 17512297 16702366 15544928 14469295 14790732 14249737 13365509 12580857 12321098 13131263
2012 13131263 11881885 10499793 10802654 11102802 10471438 10164331 9809229 9059651 9547412
2003 9547412 9677428 9495920 9700905 10426359 10680524 9688172 9502130 9243875 9049576 8611397
1993 8611397 8490119 7933105 7348070 8024501 8186158 6591191 6364469 5719137 5275755
$$ packed form
2054A33295671j6042174j2315039q165596o347064o023518m711685n170794o901817
2046F7617984p552577o531958m692378l302381k976381k338592k230245k062188
2038C5931284k454347j984306j148553j400631j082752M79755j203120j069970
2030B6067360j906509j606574l7043j661106j453052l74482o78360r99150J61213
2021A7512297q09931j157438j075633L21437n40995q84228p84652k59759Q10165
2012A3131263j249378j382092L02861L00148o31364l07107l55102p49578M87761
2003I547412J30016j81508K04985P25454K54165r92352j86042k58255j94299m38179
1993H611397j21278n57014n85035O76431J61657j594967k26722o45332m43382
$$ plain form
1984 5275755 5857312 5840001 5132726 4460589 4868037 5085939 4291201 4624456 4642705 4136489
1974 4136489 3966828 3804615 3039391 2448933 2780642 2806895 3426993 3614219 3622751 4088232
1964 4088232 3443130 2418046 1874187 2054283 2312250 2334020 1946292 2684607 2766154 1915964
1954 1915964 2817063 1256192 855171 1763672 1684129 2193493 1248033 2292053 2264483 1981421
1944 1981421 2007023 1627327 1421375 1462376 1624023 1579974 2869113 1249317 1786614 1280107
1934 1280107 1589372 2362627 1856789 1750413 1529053 765682 1008778 688525 1360157 2383519
1924 2383519 1725794 636833 924785 454036 1968405 1803239 1184913 1390488 1121372
1915 1121372 1235981 1662476 1632533 992527 1540064 1286299 1495523 1870586 1114483 990924
$$ packed form
1984E275755N81557j7311p07275o72137M07448K17902p94738L33255J8249n06216
1974D136489j69661j62213p65224n90458L31709K6253O20098J87226Q532M65481
1964D088232o45102j025084n43859J80096K57967K1770l87728P38315Q1547q50190
1954A915964R01099j560871m01021R08501p9543N09364r45460J044020k7570k83062
1944A981421K5602l79696k05952M1001J61647m4049J289139j619796N37297n06507
1934A280107L09265P73255n05838j06376k21360p63371K43096l20253O71632J023362
1924B383519o57725j088961K87952m70749J514369j65166o18326K05575k69116
1915A121372J14609M26495k9943o40006N47537k53765K09224L75063p56103j23559
$$ plain form
1905 990924 855844 1351830 1127743 820690 1743807 1275430 914056 919360 483239 -197151
1895 -197151 448293 445135 1743508 1616338 177753 -107292 296157 107303 239551 282478
1885 282478 554000 1953401 1231337 183869 137812 225087 469455 246392 810794 -307083
1875 -307083 -249447 -1132691 -50694 -91230 257775 -461479 -505751 -1305726 -633570 -512925
1865 -512925 -1010110 -34860 153612 -186096 1091172 250145 -54978 475156 -238988 -385849
1855 -385849 162926 1033385 248336 -262546 -5196 441833 548949 226055 264261 477459
1845 477459 136141 -13662 -302130 -191632 241481 1016726 545564 460928 -296818 616557
1835 616557 933896 1194321 862758 1300349 1384267 1476049 1543234 1053942 593796 101387
$$ packed form
1905I90924j35080M95986k24087l07053R23117m68377l61374N304m36121o80390
1895a97151O45444l158J298373j27170j438585k85045M03449j88854J32248M2927
1885B82478K71522J399401p22064j047468m6057Q7275K44368k23063N64402j117877
1875c07083N7636q83244J081997m0536L49005p19254m4272p99975O72156J20645
1865e12925m97185R75250J88472l39708J277268q41027l05123N30134p14144j46861
1855c85849N48775Q70459p85049n10882K57350M47029J07116l22894L8206K13198
1845D77459l41318j49803k88468J10498M33113P75245m71162q4636p57746R13375
1835F16557L17339K60425l31563M37591Q3918R1782O7185m89292m60146m92409
$$ plain form
1825 101387 307986 96023 26094 1489291 1575444 2449935 2198098 1470084 371091 510639
1815 510639 300571 661794 929443 483254 197827 -333857 230911 756238 230782 458267
1805 458267 882003 1063351 449156 227594 -194110 81830 -886825 -351919 -949434 -1203041
1795 -1203041 -524007 -851749 -248378 361967 384039 -1336644 -667523 -485730 101671 344231
1785 344231 520301 291504 -199340 -415980 65728 40927 228402 -382696 -825431 -48740
1775 -48740 719462 1082779 494982 1227309 911146 -30745 -658302 -658852 -890931 -334299
1765 -334299 60940 -130757 319705 171338 348803 471343 85180 -638892 -420874 16912
1755 16912 -448250 -383917 528644 450896 14665 -441730 -446583 -887192 -959892 -675500 -411468
$$ packed form
1825A01387K06599k11963o9929J463197Q6153Q74491k51837p28014j098993J39548
1815E10639k10068L61223K67649m46189k85427n31684N64768N25327n25456K27485
1805D58267M23736J81348o14195k21562m21704K75940r68655N34906n97515k53607
1795a203041O79034l27742O03371O10345K2072j720683O69121J81793N87401K42560
1785C44231J76070k28797m90844k16640M81708k4801J87475o11098m42735P76691
1775d8740P68202L63317n87797P32327l16163r41891o27557n50k32079N56632
1765c34299L95239j91697M50462j48367J77465J22540l86163p24072K18018M37786
1755A6912m65162O4333R12561p7748m36231m56395m853m40609p2700K84392K64032
$$ plain form
1744 -411468 -376024 -550053 -832337 -96089 -91142 -189001 -867014 -928429 -271565 -493934 -1134193
1733 -1134193 -495904 -999960 -682629 -260518 -557983 -308195 -792097 -221141 -672990 -554184
1723 -554184 -735418 -386187 -479531 -469442 134013 19966 -856646 -588078 -120940 -765013
1713 -765013 -1027444 -609324 -426488 427355 -82239 -538844 -1035588 -1068645 4386 -435306
1703 -435306 58522 -1077938 -566325 132552 846081 -33057 -156626 333309 176786 -603275
1693 -603275 -1106579 -1298704 -823115 -558055 310105 -255658 -1086691 -889221 -149934 -368136
1683 -368136 -851708 -604025 -464166 -1279515 -521462 -68586 -650614 399244 -504510 -431807
1673 -431807 -788238 -981986 -389447 9678 458792 376092 -477641 -899015 -193562 -421948
$$ packed form
1744d11468L5444j74029k82284P36248M947r7859o78013o1415O56864k22369o40259
1733a134193O38289n04056L17331M22111k97465K49788m83902N70956m51849J18806
1723e54184j81234L49231r3344J0089O03455j14047q76612K68568M67138o44073
1713g65013k62431M18120J82836Q53843n09594m56605m96744l3057J073031m39692
1703d35306M93828j136460N11613O98877P13529q79138j23569M89935j56523p80061
1693f03275n03304j92125M75589K65060Q68160n65763q31033J97470P39287k18202
1683c68136m83572K47683J39859q15349P58053M52876n82028J049858r03754P2703
1673d31807l56431j93748N92539L99125M49114q2700q53733m21374P05453k28386
$$ plain form
1663 -421948 60219 225821 -231776 -267983 -324171 -260179 -255888 -452419 -1204051 -441045 223770
1652 223770 94789 155130 -15593 -720410 -678651 -626133 -302516 -843568 -68161 90713
1642 90713 -147871 -923304 -439658 -746206 -1072481 47543 -143086 866266 195094 -1266998
1632 -1266998 -752789 -705054 -646327 -995031 -275257 -133126 -329526 388661 370492 481987
1622 481987 106136 -387572 -290461 -554754 255836 552209 -1003723 -1210751 -890729 -248183
1612 -248183 -288988 -659479 -642475 -687456 11656 -239918 86185 -428311 -398730 -821609
1602 -821609 -916201 -252702 -336952 -816141 -1209788 -1478694 -631003 -314635 -311013 -531332
1592 -531332 -708299 -483218 -659077 -410553 -722836 -1253924 -696403 -341571 391259 -864638
$$ packed form
1663d21948M82167J65602m57597l6207n6188O3992M291j96531p51632P63006O64815
1652B23770j28981O0341j70723p04817M1759N2518L23617n41052P75407J58874
1642I0713k38584p75433M83646l06548l26275J120024j90629J009352o71172j462092
1632a266998N14209M7735N8727l48704P19774J42131j96400P18187j8169J11495
1622D81987l75851m93708R7111k64293Q10590K96373j555932k07028L20022O42546
1612b48183m0805l70491J7004m4981O99112k51574L26103n14496K9581m22879
1602h21609r4592O63499q4250m79189l93647k68906Q47691L16368L622k20319
1592e31332j76967K25081j75859K48524l12283n31088N57521L54832P32830j255897
$$ plain form
1582 -864638 -2010322 -1404418 -1002399 -409512 -17651 -17704 -774165 -884410 -1131852 -782278
1572 -782278 -583780 -356421 -707258 -441165 189202 -436841 -531491 -307954 134541 -640765
1562 -640765 50261 15942 -95911 187641 -174311 -362628 -967186 -517360 -407878 -1029974
1552 -1029974 -693899 -220517 58067 -344796 -269639 -370680 -10377 242079 253855 7891
1542 7891 120704 754683 36795 813951 -238097 348522 -337760 -312089 114151 -193523
1532 -193523 -444425 -247080 497977 152793 445033 -252072 -1385157 -969391 -351930 -77818
1522 -77818 -781647 -155584 -406210 -416894 -673643 -38667 -850553 -1350404 -1035428 -1162035
1512 -1162035 -1261810 -334887 83920 160520 -1299652 -541719 663561 517703 281937 -1112376
$$ packed form
1582h64638j145684O05904M02019N92887L91861n3p56461j10245k47442L49574
1572g82278J98498K27359l50837K66093O30367o26043r4650K23537M42495p75306
1562f40765O91026l4319j11853K83552l61952j88317o04558M49826J09482o22096
1552a029974L36075M73382K78584m02863P5157j01041L60303K52456J1776k45964
1542G891J12813O33979p17888P77156j052048N86619o86282K5671M26240l07674
1532a93523k50902J97345P45057l45184K92240o97105j133085M15766O17461K74112
1522g7818p03829O26063k50626j0684k56749O34976q11886m99851L14976j26607
1512a162035r9775R26923M18807P6600j460172P57933J205280j45858k35766j394313
$$ plain form
1502 -1112376 -2119573 -1285568 -369983 -619297 -149044 -680595 -1052805 -496946 -685474
1493 -685474 -278125 -324835 -480488 -796758 -565997 -65114 79809 -366663 -702846 -1542014
1483 -1542014 -1793609 -598584 -678082 -159730 204794 247422 -132708 15272 -992938 -1612298
1473 -1612298 -405026 -21997 59060 -95659 -1367805 -533525 579498 -517280 -528083
1464 -528083 -93926 -359939 211247 -511635 245308 591850 32258 -831402 -236091 -161892
1454 -161892 -501241 -183228 -697597 -962360 -625695 -1347925 -345466 9915 -380747 -583849
1444 -583849 119592 176327 78220 539921 -140813 -557844 -57559 -303693 -3140 -1178515
1434 -1178515 -688001 -84546 -410607 -969821 -1194696 -207664 488559 321824 187453 107164
$$ packed form
1502a112376j007197Q34005R15585k49314M70253n31551l72210N55859j88528
1493f85474M07349m6710j55653l16270K30761N00883J44923m46472l36183q39168
1483a542014k51595J195025p9498N18352L64524M2628l80130J47980j008210o19360
1473a612298J207272L83029Q1057j54719j272146Q34280J113023j096778j0803
1464e28083M34157k66013N71186p22882P56943L46542n59592q63660N95311P4199
1454a61892l39349L18013n14369k64763L36665p22230J002459L55381l90662k03102
1444e83849P03441N6735r8107M61701o80734m17031N00285k46134L00553j175375
1434a178515M90514O03455l26061n59214k24875R87032O96223j66735j34371q0289
$$ plain form
1424 107164 143627 -141472 -995583 -1324947 -893038 -437182 -1204138 -498841 -573300 -837890
1414 -837890 275988 250239 201685 -283675 -455208 -521441 570651 231241 -176669 249133
1404 249133 -337323 49017 75881 -48605 92303 -254075 -671497 471370 -441546 -198676
1394 -198676 571384 -863736 -849145 -741565 -405405 -584205 -598617 490434 78936 -105788
1384 -105788 -905511 -1378341 -628704 -54460 -302783 22871 760046 483778 -726417 -231057
1374 -231057 -309022 -1049105 -629663 -319617 82573 732312 1050443 331126 222523 16250
1364 16250 -501943 -588037 -764366 -652932 -796997 -56137 666909 341278 -635955 -420401
1354 -420401 -290720 200511 -303636 -666566 -523396 -736840 -311047 -18362 -492262 226273
$$ packed form
1424A07164L6463k85099q54111l29364M31909M55856p66956P05297p4459k64590
1414h37890J113878k5749m8554m85360j71533o6233J092092l39410m07910M25802
1404B49133n86456L86340K6864j24486J40908l46378m17422J142867r12916K42870
1394a98676P70060j435120J4591J07580L36160j78800j4412J089051m11498j84724
1384a05788p99723m72830P49637N74244k48323L25654P37175k76268j210195M95360
1374b31057p7965p40083M19442L10046M02190O49739L18131p19317j08603k06273
1364A6250n18193q6094j76329J11434j44065P40860P23046l25631r77233K15554
1354d20401J29681M91231n04147l62930J43170k13444M25793K92685m73900P18535
$$ plain form
1344 226273 244747 -255759 165832 358441 -173790 -107173 52262 657708 237544 -358618
1334 -358618 551168 342182 -377223 -266260 -961577 -802436 -1009559 36644 -984707
1325 -984707 -1535669 -750053 -483644 -804667 -2012567 -1059395 -689072 -203602 -18673 487587
1315 487587 -290594 -337631 -368408 -55026 701050 112084 -1359884 -1516517 -409297 -14900
1305 -14900 -883592 105667 469879 -702174 -1078526 -767427 -24110 85798 -104981 -746385
1295 -746385 28344 -89358 -353095 329953 1300507 695233 125024 188290 -392405 86211
1285 86211 896418 1203657 415695 1484504 1197892 -131494 131689 757482 686488 832427
1275 832427 480557 826121 806659 499030 1111441 1381229 421799 -328735 131401 -46442
$$ packed form
1344B26273J8474n00506M21591J92609n32231O6617J59435O05446m20164n96162
1334c58618R09786k08986p19405J10963o95317J59141k07123J046203j021351
1325i84707n50962P85616K66409l21023j207900R53172L70323M85470J84929N06260
1315D87587p78181m7037l0777L13382P56076n88966j471968j56633J107220L94397
1305a4900q68692R89259L64212j172053l76352L11099P43317J09908j90779o41404
1295g46385P74729j17702k63737O83048R70554o05274n70209O3266n80695M78616
1285H6211Q10207L07239p87962J068809k86612j329386K63183O25793p0994J45939
1275H32427l51870L45564j9462l07629O12411K69788r59430p50534M60136j77843
$$ plain form
1265 -46442 -14390 571142 12666 731371 270819 -259425 185575 62880 -394774 -599927
1255 -599927 -432181 -411216 -640309 -1244827 -841914 -1328941 -1889253 -1415724 185439 -895935
1245 -895935 19630 175706 -533300 44896 -726361 -1316825 -447617 330554 -211753 -1257693
1235 -1257693 -871529 -207453 45960 -842161 -1574062 -333154 -1000975 -846508 -841789 -1699447
1225 -1699447 -1031890 -436427 -190830 -809447 -1121462 -412308 -790028 -835705 -1534461 -1045979
1215 -1045979 -917994 -91195 -416203 97364 -11305 -567024 -815288 -847956 -422634 -818907
1205 -818907 12574 -379188 -934840 -775619 -498867 -594394 -952050 -233592 337207 -182129
1195 -182129 -1039935 -403122 -432711 -793730 241833 -115614 -842537 -1058113 477947 604977
$$ packed form
1265d6442L2052N85532n58476P18705m60552n30244M45000j22695m57654k05153
1255e99927J67746K0965k29093o04518M02913m87027n60312M73529J601163j081374
1245h95935R15565J56076p09006N78196p71257n90464Q69208P78171n42307j045940
1235a257693L86164O64076K53413q88121p31901J240908o67821J54467M719q57658
1225a699447O67557N95463K45597o18617l12015P09154l77720m5677o98756M88482
1215a045979J27985Q26799l25008N13567j08669n55719k48264l2668M25322l96273
1205h18907Q31481l91762n55652J59221K76752r5527l57656P18458N70799n19336
1195a82129q57806O36813k9589l61019J035563l57447p26923k15576J536060J27030
$$ plain form
1185 604977 -789287 -1364803 -1330177 -1090482 -1204548 -950026 -465553 301227 -829462 -572180
1175 -572180 -1287917 -1848160 -870101 -852442 -304728 -634311 -55867 -161111 -473859 -929722
1165 -929722 -394037 -268120 -531544 -1184791 -1111823 -712336 100976 312417 -305896 -312950
1155 -312950 -183493 -264877 -1170418 -950995 -183529 -511793 -799112 -366947 243320 -303552
1145 -303552 -480003 326000 728786 183126 -13928 275309 1531605 1190292 396456 654399
1135 654399 91107 -24292 383285 617190 265782 523627 360922 -157432 -866566 -1060843
1125 -1060843 -83593 -808250 -985969 -71204 350010 313951 325800 -303357 -534532 -409601
1115 -409601 -643202 -1037758 -634399 -225308 -496207 -1015510 -681779 28598 -224030 179345
$$ packed form
1185F04977j394264n75516L4626K39695j14066K54522M84473P66780j130689K57282
1175e72180p15737n60243R78059J7659N47714l29583N78444j05244l12748m55863
1165i29722N35685J25917k63424o53247P2968L99487Q13312K11441o18313p054
1155c12950J29457q1384r05541K19423P67466l28264k87319M32165O10267n46872
1145c03552j76451Q06003M02786n45660j97054K89237J256296l41313p93836K57943
1135F54399n63292j15399M07577K33905l51408K57845j62705n18354p09134j94277
1125a060843R77250p24657j77719R14765M21214l6059J1849o29157k31175J24931
1115d09601k33601l94556M03359M09091k70899n19303L33731P10377k52628M03375
$$ plain form
1105 179345 -481038 -222222 -974347 85534 971100 434130 -332543 -285776 856476 494604
1095 494604 -163209 -166443 -644056 -445549 -102205 -1133961 -615183 -659738 -857260 -416621
1085 -416621 44793 309379 -216206 232473 233936 653902 -166297 -381031 1134291 -434342
1075 -434342 -920813 -698118 -13128 -317937 -170817 633147 1183818 485401 -949758 -961978
1065 -961978 -1286002 -912181 -698281 -152436 -588631 870978 672705 -149963 287203 -88944
1055 -88944 -568327 131852 -1191042 -2100793 -1443783 -724161 -300586 -176188 -497497 166746
1045 166746 650965 429019 133511 375045 651090 -162854 -119201 22867 -79720 -617897
1035 -617897 572887 -453352 -335241 217196 669817 253996 349908 -244679 40652 724832
$$ packed form
1105A79345o60383K58816p52125J059881Q85566n36970p66673M6767J142252l61872
1095D94604o57813l234m77613J98507L43344j031756N18778m4555j97522M40639
1085d16621M61414K64586n25585M48679J463M19966q20199k14734J515322j568633
1075d34342m86471K22695O84990l04809J47120Q03964N50671o98417j435159j2220
1065i61978l24024L73821K13900N45845m36195J459609j98273q22668M37166l76147
1055h8944m79383P00179j322894r09751O57010P19622M23575J24398l21309O64243
1045A66746M84219k21946k95508K41534K76045q13944M3653J42068j02587n38177
1035f17897J190784j026239J18111N52437M52621m15821R5912n94587K85331O84180
$$ plain form
1025 724832 31757 -874296 209618 571294 70674 42300 -1150699 -1052654 -250329 272118
1015 272118 358615 1172378 410821 -559511 224875 -468533 -63929 101629 156202 765599
1005 765599 676899 568479 365215 880819 -23453 -72135 -146006 -665764 66211 -458348
995 -458348 -56599 467589 208231 782570 511757 105833 293612 253859 646749 1481428
985 1481428 1559911 783918 -220319 -57933 -467645 492808 1467584 253945 106704 293366
975 293366 645195 1006039 -697538 -758446 -119268 746160 1158614 -362877 -430383 241841
965 241841 511519 567606 209556 286312 -767831 -1067688 -418588 -907678 -814690 478457
955 478457 111405 73441 267643 411865 671615 422772 -406442 -526030 -501172 600033
$$ packed form
1025G24832o93075r06053J083914L61676n00620k8374j192999R8045Q02325N22447
1015B72118Q6497Q13763p61557r70332P84386o93408M04604J65558N4573O09397
1005G65599q8700j08420k03264N15604r04272m8682p3871n19758P31975n24559
995d58348M01749N24188k59358N74339k70813m05924J87779l9753L92890Q34679
985A481428P8483p75993j004237J62386m09712R60453R74776j213639j47241J86662
975B93366L51829L60844j703577o0908O39178Q65428M12454j521491o7506O72224
965B41841K69678N6087l58050P6756j054143k99857O49100m89090R2988J293147
955D78457l67052l7964J94202J44222K59750k48843q29214j19588K4858J101205
$$ plain form
945 600033 -411324 -483005 -534362 -1455025 -716325 -746808 -589010 76981 894320 942076
935 942076 399283 213316 576222 358790 525372 1117361 1428345 541253 544698 826516
925 826516 662929 223504 51542 -468615 344474 1156235 121096 -1136752 -1835971 -1505194
915 -1505194 -957482 -458606 -369741 204917 425146 250958 470757 -151354 110292 197366
905 197366 299162 1060199 988857 434116 136246 -114218 -770123 -1065952 -643573 -368810
895 -368810 232003 -8028 -680324 -580739 -369265 -114494 765501 1189751 1590011 1274150
885 1274150 1552899 761058 244382 400154 19820 558932 762959 -174721 337792 -140125
875 -140125 375351 1297508 825988 506219 631412 1086559 131281 -710432 -1000674 -619582
$$ packed form
945F00033j011357p1681n1357r20663P38700l0483J57798O65991Q17339M7756
935I42076n42793j85967L62906k17432J66582N91989L10984q87092L445K81818
925H26516j63587m39425j71962n20157Q13089Q11761j035139j257848o99219L30777
915a505194N47712M98876Q8865N74658K20229j74188K19799o22111K61646Q7074
905A97366J01796P61037p1342n54741k97870k50464o55905k95829M22379K74763
895c68810O00813k40031o72296R9585K11474K54771Q79995M24250M00260l15861
885A274150K78749p91841n16676J55772l80334N39112K04027r37680N12513m77917
875a40125N15476R22157m71520l19769J25193M55147r55278q41713k90242L81092
$$ plain form
865 -619582 397045 721425 -146770 -471494 38748 480851 598598 567031 -131854 -213674
855 -213674 -273747 -289792 -704259 -253459 -350843 -575137 1081675 874738 728453 204911
845 204911 -356666 204971 200915 176833 186990 150898 -409100 672950 521956 415577 210109
834 210109 472094 348045 -52209 90892 552337 457107 -409607 -239955 409723 -44826
824 -44826 -292395 -427944 -1029664 -55112 -133410 -418316 30502 223548 -88427 663012
814 663012 698006 6821 504305 462916 729290 1556669 335770 456344 1238102 1177605
804 1177605 55187 550846 -157274 -867303 -167030 -332562 734900 -488227 -242468
795 -242468 -215980 193783 499025 775080 605406 202801 568869 1181633 1115735 209820
$$ packed form
865f19582J016627L24380q68195l24724N10242M42103J17747l1567o98885q1820
855b13674o0073j6045m14467M50800r7384k24294J656812k06937j46285n23542
845B04911n61577N61637m056k4082J0157l6092n59998J082050j50994j06379k05468
834B10109K61985j24049m00254J43101M61445r5230q66714J69652O49678m54549
824d4826k47569j35549o01720R74552p8298k84906M48818J93046l11975P51439
814F63012L4994o91185M97484m1389K66374Q27379j220899J20574P81758o0497
804A177605j122418M95659p08120p10029P00273j65532J067462j223127K45759
795b42468K6488M09763L05242K76055j69674m02605L66068O12764o5898r05915
$$ plain form
785 209820 388516 787291 238023 -420481 -64651 707800 -57839 -298508 -244683 -732432
775 -732432 -372442 1016422 439064 159254 363718 -74355 648745 110730 -125925 -241136
765 -241136 157499 -180256 152494 1051436 1147617 245722 27648 -60269 735204 108645
755 108645 127691 746922 493979 1252868 1317546 1256045 488916 36441 288410 667121
745 667121 564452 -630897 -1342517 -193395 456910 -95254 371209 327535 271265 -160194
735 -160194 -353978 765600 32967 238252 547378 655420 424416 -40540 -154115 36856
725 36856 515557 170902 -42485 -47046 181643 315213 667589 456425 222994 535498
715 535498 238257 -433832 902533 740871 216304 -64959 70368 -189992 -15890 -212039
$$ packed form
785B09820J78696L98775n49268o58504L55830P72451p65639k40669N3825m87749
775g32432L59990J388864n77358k79810K04464m38073P23100n38015k36655j15211
765b41136L98635l37755L32750Q98942R6181r01895k18074q7917P95473o26559
755A08645J9046O19231k52943P58889O4678o1501p67129m52475K51969L78711
745F67121j02669j195349p11620J149122O50305n52164M66463m3674n6270m31459
735a60194j93784J119578p32633K05285L09126J08042k31004m64956j13575J90971
725C6856M78701l44655k13387m561K28689J33570L52376k11164k33431L12504
715E35498k97241o72089J336365j61662n24567k81263J35327k60360J74102j96149
$$ plain form
705 -212039 67828 91674 -420872 195442 -448257 -765305 -419748 -561884 -79173 -117753
695 -117753 76879 511716 392821 411562 -1145560 -962824 -52445 452361 523112 138676
685 138676 495516 305995 -179766 586102 832666 820109 1318110 1026753 792535 -90579
675 -90579 -398334 599145 -439779 -190160 -18171 601707 355108 464362 859970 828010
665 828010 1295876 325871 -466294 703320 920963 2339444 1955242 500278 697153
656 697153 295542 493081 -86227 -356525 -595927 -716498 85719 728275 667025 90536
646 90536 65655 -165546 -570557 -1135688 -1026268 143725 557167 1380444 446146 681195
636 681195 186624 -115200 733887 -57045 -226133 -144187 -326782 1227107 1341055 832564
$$ packed form
705b12039K79867K3846n12546O16314o43699l17048L45557j42136M82711l8580
695a17753J94632M34837j18895J8741j557122J82736R10379N04806P0751l84436
685A38676L56840j89521m85761P65868K46564j2557M98001k91357k34218q83114
675i0579l07755R97479j038924K49619J71989O19878k46599J09254L95608l1960
665H28010M67866r70005p92165J169614K17643J418481l84202j454964J96875
656F97153m01611J97539n79308k70298k39402j20571Q02217O42556o1250n76489
646I0536k4881k31201m05011n65131J09420J169993M13442Q23277r34298K35049
636F81195m94571l01824Q49087p90932j69088Q1946j82595J553889J13948n08491
$$ plain form
626 832564 646027 230331 649193 885428 1334056 454175 243806 387515 911413 1941413
616 1941413 1937287 1277608 1380444 839600 261271 1103610 -309693 -796735 -655188 -467224
606 -467224 -253430 -207287 -643356 -866481 -472650 310910 565164 1325513 1113698 385730
596 385730 120651 -591838 1023188 1044905 1848502 1988603 1457276 504744 522067 640813
586 640813 126736 610692 132277 586446 1194557 1392273 -915223 -634906 -601731 18382
576 18382 934028 -182220 139836 -84752 608034 -45786 795932 1019826 148942 19574
566 19574 -341866 491781 131945 -1174367 -129255 751242 191758 -365073 909694 1615757
556 1615757 576186 400633 661032 2058527 2275437 300973 -93077 -629378 -683669
$$ packed form
626H32564j86537m15696M18862K36235M48628q79881k10369J43709N23898J030000
616A941413m126o59679J02836n40844n78329Q42339j413303m87042J41547J87964
606d67224K13794M6143m36069k23125L93831P83560K54254P60349k11815p27968
596C85730k65079p12489J615026K1717Q03597J40101n31327r52532J7323J18746
586F40813n14077M83956m78415M54169O08111J97716k307496K80317L3175O20113
576A8382R15646j116248L22056k24588O92786o53820Q41718K23894q70884j29368
566A9574l61440Q33647l59836j306312J045112Q80497n59484n56831J274767P06063
556A615757j039571j75553K60399J397495K16910j974464l94050n36301n4291
$$ plain form
547 -683669 -142819 352264 282149 -98063 -401949 120927 307472 -662569 -1090698 -1253109
537 -1253109 -297980 241905 -10650 712244 783519 1080405 1436089 191780 143395 -364152
527 -364152 -32358 446739 583687 -206886 -341554 258591 644327 24660 -128918 394653
517 394653 185828 164235 606204 162429 321654 253587 279223 137432 -254251 -101211
507 -101211 65882 127416 34592 696672 1061940 422245 113503 -491548 41706 167129
497 167129 177999 431775 373028 1004297 578940 -59422 -288095 -128705 1561222 2554054
487 2554054 2288019 1673388 -29832 -779735 696461 411619 -251115 369438 -626063
478 -626063 -292254 -315172 -108079 507935 404216 -933897 -486161 -1175698 -1111205 -293866
$$ packed form
547f83669N40850M95083p0115l80212l03886N22876J86545r70041m28129j62411
537a253109R55129N39885k52555P22894P1275K96886L55684j244309m8385n07547
527c64152L31794M79097J36948p90573j34668O00145L85736o19667j53578N23571
517C94653k08825k1593M41969m43775J59225o8067K5636j41791l91683J53040
507a01211J67093O1534r2824O62080L65268o39695l08742o05051N33254J25423
497A67129J0870K53776n8747O31269m25357o38362k28673J59390J689927R92832
487B554054k66035o14631j703220p49903J476196k84842o62734O20553r95501
478f26063L33809k2918K07093O16014j03719j338113M47736o89537O4493Q17339
$$ plain form
468 -293866 -55116 -385577 -368514 -189740 491139 278231 338602 351081 524774 1058355
458 1058355 202622 1343131 1790691 1236079 1353472 909903 614337 1129590 1336406 795377
448 795377 589125 672691 264030 29031 233978 -304374 323039 348926 1026142 671674
438 671674 -281118 313470 197094 97775 -155938 -103750 -714757 -690174 236788 877299
428 877299 -111819 593030 724654 493413 1282918 1370623 767298 885483 1369569 944556
418 944556 890410 1662686 450751 -106862 -782318 -610948 406292 60081 140693 1507984
408 1507984 1547310 1328076 1189527 917811 429796 -54831 251010 247514 608541 -363776
398 -363776 393454 577021 681849 640312 423217 383740 505579 1046516 1304952 1501380
$$ packed form
468b93866K38750l30461J7063J78774O80879k12908O0371J2479J73693N33581
458A058355q55733J140509M47560n54612J17393m43569k95566N15253K06816n41029
448G95377k06252Q3566m08661k34999K04947n38352O27413K5887O77216l54468
438F71674r52792N94588j16376r9319k53713N2188o11007K4583R26962O40511
428H77299r89118P04849J31624k31241P89505Q7705o03325J18185M84086m25013
418I44556n4146P72276j211935n57613o75456J71370J017240l46211Q0612J367291
408A507984L9326k19234j38549k71716m88015m84627L05841l496L61027r72317
398c63776P57230J83567J04828m1537k17095l9477J21839N40937K58436J96428
$$ plain form
388 1501380 835323 831748 61624 345235 -109087 340176 694946 532412 805830 201469
378 201469 -210337 1049968 1773705 1717622 1586697 1410246 1297280 979411 1026227 908999
368 908999 876626 449587 932351 1006099 1694930 540099 336188 261921 13977 264574
358 264574 87436 475530 358988 1228579 1143493 1123113 1213544 674883 337154 761798
348 761798 1153089 423881 436217 906833 300887 200884 1181003 552184 972794 1117933
338 1117933 978936 1264589 996156 1102446 405149 180069 578326 938575 1130096 1712220
328 1712220 1799090 1115006 1017470 795477 -235489 -452025 543234 384947 548144 1164999
318 1164999 704027 -519406 821271 1685591 806456 1047370 1814976 915887 562520
$$ packed form
388A501380o66057l575p70124K83611m54322M49263L54770j62534K73418o04361
378B01469m11806J260305P23737n6083j30925j76451j12966l17869M6816j17228
368I08999l2373m27039M82764P3748O88831j154831k03911p4267k47944K50597
358B64574j77138L88094j16542Q69591q5086k0380R0431n38661l37729M24644
348G61798L91291p29208J2336M70616o05946j00003R80119o28819M20610J45139
338A117933j38997K85653k68433J06290o97297k25080L98257L60249J91521N82124
328A712220Q6870o84084r7536k21993j030966k16536R95259j58287J63197O16855
318A164999m60972j223433J340677Q64320q79135K40914P67606q99089l53367
$$ plain form
309 562520 291637 181193 988817 198724 -13422 638818 657548 997228 1204704 978776
299 978776 651863 807464 1069981 52088 179134 487682 670797 -136183 404188 414508
289 414508 198588 327699 14485 206257 831555 1359992 825484 399410 571747 -335172
279 -335172 82112 662816 -497497 256603 -243662 162521 91701 51560 1124896 1126260
269 1126260 1355208 640637 176907 -70007 374071 787312 476486 540699 1747836 2174653
259 2174653 1307440 578672 1734078 1202968 -395383 -419587 1693872 1311239 1675509
250 1675509 1148909 515383 1320164 900508 1328364 527723 -356892 302349 1053755 1635149
240 1635149 1338437 1532187 1901670 1743312 964116 610160 1251461 -89763 -87258 1122532
$$ packed form
309E62520k70883j10444Q07624p90093k12146O52240J8730L39680K07476k25928
299I78776l26913J55601K62517j017893J27046L08548J83115q06980N40371J0320
289D14508k15920J29111l13214J91772O25298N28437n34508m26074J72337r06919
279c35172M17284N80704j160313P54100n00265M06183p0820m0141J073336J364
269A126260K28948p14571m63730k46914M44078M13241l10826O4213J207137M26817
259B174653q67213p28768J155406n31110j598351k4204K113459l82633L64270
250A675509n26600o33526Q04781m19656M27856q00641q84615O59241P51406N81394
240A635149k96712J93750L69483j58358p79196l53956O41301j341224K505J209790
$$ plain form
230 1122532 1124806 877236 1651003 1979018 2279950 1455499 1694453 1167643 988044 1061341
220 1061341 563945 520906 808591 992630 663021 735717 1072189 1026805 557428 -258196
210 -258196 22597 337686 1176949 863713 510604 972694 623421 881551 713907 793067
200 793067 577716 682377 676783 106557 1041757 619128 176592 -1375 323228 902458
190 902458 824576 605741 119897 -6824 305283 65205 95137 676679 -485461 277713
180 277713 300242 499130 989453 625683 896347 1317794 1203271 1097422 1456851 863158
170 863158 944577 479792 329634 191897 -25946 11408 -259474 16720 -102059 577444
160 577444 813370 601210 452624 681281 1094162 56316 631578 1046082 523003 472586
$$ packed form
230A122532K274k47570P73767L28015L00932q24451K38954n26810j79599P3297
220A061341m97396m3039K87685J84039l29609P2696L36472m5384m69377q15624
210b58196K80793L15089Q39263l13236l53109M62090l49273K58130j67644P9160
200G93067k15351J04661n594n70226R35200m22629m42536j77967L24603N79230
190I02458p7882k18835m85844j26721L12107k40078K9932N81542j162140P63174
180B77713K2529J98888M90323l63770K70664M21447j14523j05849L59429n93693
170H63158Q1419m64785j50158j37737k17843L7354k70882K76194j18779O79503
160E77444K35926k12160j48586K28657M12881j037846N75262M14504n23079n0417
$$ plain form
150 472586 1154266 1332489 878965 386880 599555 1319205 973746 845149 507183 776084
140 776084 1286170 1082694 859470 793225 927324 1051216 1326052 866223 575913 -79101
130 -79101 612400 977512 971646 990852 1459990 1026745 1612272 656754 811552 191814 -105485
119 -105485 514246 -427324 -617954 -991724 825405 387114 756109 1067839 335251 255622
109 255622 680037 704080 550884 608481 1333333 1242718 1007416 675040 318798 358377 913256
98 913256 216954 67888 323926 1493649 1534192 1176897 461666 704132 502758 773605
88 773605 969316 506950 970210 922430 773172 792153 247940 51872 1327225 1603711
78 1603711 1105397 859747 518494 973633 539365 219380 591312 1465604 1070084 364325
$$ packed form
150D72586O81680J78223m53524m92085K12675P19650l45459j28597l37966K68901
140G76084N10086k03476k23224o6245J34099J23892K74836m59829k90310o55014
130g9101O91501L65112n866J9206M69138m33245N85527r55518J54798o19738k97299
119a05485O19731r41570j90630l73770J817129m38291L68995L11730p32588p9629
109B55622M24415K4043j53196N7597P24852r0615k35302l32376l56242L9579N54879
98I13256o96302j49066K56038J169723M0543l57295p15231K42466k01374K70847
88G73605J95711m62366M63260m7780j49258J8981n44213j96068J275353K76486
78A603711m98314k45650l41253M55139m34268l19985L71932Q74292l95520p05759
$$ plain form
68 364325 794246 493077 893331 433291 1852 206224 479596 965941 269053 -219569
58 -219569 317637 838836 737838 445594 322231 561595 1170372 1104224 1127475 1088006 483964
47 483964 1012951 860906 903556 1080237 698546 376784 32615 661325 1161841 1049188
37 1049188 1075682 637967 296393 422930 695963 641298 583582 785223 869478 1114635 422393
26 422393 645433 719469 -75219 -507340 104574 620389 938796 1014638 963983 829445 1420774
15 1420774 1367428 1037921 1066069 1128406 702433 826614 796125 954840 464975 662929 630082
4 630082 340887 -39914 -90568 423691
0 423691
$$ packed form
68C64325M29921l01169M00254m60040m31439K04372K73372M86345o96888m88622
58b19569N37206N21199j00998k92244j23363K39364O08777o6148K3251l9469o04042
47D83964N28987j52045M2650J76681l81691l21762l44169O28710N00516j12653
37A049188K6494m37715l41574J26537K73033n4665n7716K01641Q4255K45157o92242
26D22393K23040P4036p94688m32121O11914N15815L18407P5842n0655j34538N91329
15A420774n3346l29507K8148O2337m25973J24181l0489J58715m89865J97954l2847
4F30082k89195l80801n0654N14259
0D23691
$$ Imaginary data points
##PAGE= N=2
##DATA TABLE= (X++(I..I)), XYDATA
$$ plain form
16383 -2889562 -2704113 -2406803 -3089931 -2916255 -3049330 -3448887 -3545319 -3271435 -3173525 -2888336
16373 -2888336 -2318541 -2605775 -2833879 -2591993 -2476534 -2792042 -2590444 -2692999 -2440378
16364 -2440378 -2513334 -2186854 -2495816 -2802577 -2593010 -2569512 -2534567 -2877130 -2289360 -1777496
16354 -1777496 -2114310 -2613245 -2653225 -2673744 -2342491 -2288986 -1993340 -2358963 -1743047 -1481863
16344 -1481863 -1701994 -2493646 -2319831 -1946269 -1551380 -1900240 -2523605 -2014324 -1288372
16335 -1288372 -1498790 -1438706 -1320124 -1399296 -1515003 -1191323 -1457776 -489607 -316437 -652889
16325 -652889 -1315025 -1086297 -634727 -1057001 -1326338 -1210809 -1424739 -1296300 -766300 -557666
16315 -557666 -780556 -675281 -817211 -699954 -467667 -832428 -916110 -1039723 -297004 726234
$$ packed form
16383b889562J85449K97310o83128J73676j33075l99557r6432K73884R7910K85189
16373b888336N69795k87234k28104K41886J15459l15508K01598j02555K52621
16364b440378p2956L26480l08962l06761K09567K3498L4945l42563N87770N11864
16354a777496l36814m98935l9980k0519L31253N3505K95646l65623O15916K61184
16344a481863k20131p91652J73815L73562L94889l48860o23365N09281P25952
16335a288372k10418O0084J18582p9172j15707L23680k66453R68169J73170l36452
16325f52889o62136K28728M51570m22274k69337J15529k13930J28439N30000K08634
16315e57666k22890J05275j41930J17257K32287l64761q3682j23613P42719J023238
$$ plain form
16305 726234 139239 -278897 -504023 -458059 -430681 -554015 -342470 -278800 -698491 -814771
16295 -814771 181226 169331 -200425 580338 370756 187824 715427 275156 547659 944084
16285 944084 505365 -541126 598765 513265 450925 256066 -116243 -276145 341914 454017
16275 454017 436030 1003577 488632 1275314 1010686 870616 827763 518381 447490 564636
16265 564636 954547 681071 683393 1018944 807078 687663 270659 109926 792423 1029852
16255 1029852 1111573 508991 85275 396197 1535807 1805273 1569617 1197241 1033061
16246 1033061 816417 747323 1364198 1985640 2103003 2656159 2997276 3080731 1594144 1307767
16236 1307767 1835761 2137212 2432558 1978346 1629432 1501865 1348264 1620054 1654505 2569063
$$ packed form
16305G26234n86995m18136k25126M5964K7378j23334K11545O3670m19691j16280
16295h14771R95997j1895l69756P80763k09582j82932N27603m40271K72503L96425
16285I44084m38719j046491J139891q5500o2340j94859l72309j59902O18059J12103
16275D54017j7987N67547n14945P86682k64628j40070m2853l09382p0891J17146
16265E64636L89911k73476K322L35551k11866j19415m17004j60733O82497K37429
16255A029852Q1721o02582m23716L10922J139610K69466k35656l72376j64180
16246A033061k16644o9094O16875O21442J17363N53156L41117Q3455j486587k86377
16236A307767N27994L01451K95346m54212l48914j27567j53601K71790L4451R14558
$$ plain form
16226 2569063 1291573 784813 1486101 1964234 1233212 1104385 1668531 1313890 1759585
16217 1759585 1659362 2429588 2313422 1594451 1167309 1432731 1960198 2200223 1928124
16208 1928124 2452549 2047647 2326399 2136020 2554718 2745290 2220053 1817473 1682052
16199 1682052 2546764 2604064 1738754 1996214 1772758 1557603 2143469 2921675 3000306 2567470
16189 2567470 2285728 1292592 1899095 2256350 2836536 3358435 3284454 2810405 1520643
16180 1520643 1992214 2088097 1271481 2769398 2933866 2622175 2533561 1968760 2043994 2560856
16170 2560856 1966623 2108035 2417441 1784700 2167238 2983727 3202829 3089661 2804316
16161 2804316 3400814 2748419 2630110 2765199 2244930 2244971 2225840 2735860 2844532 2371521
$$ packed form
16226B569063j277490n06760P01288M78133p31022j28827N64146l54641M45695
16217A759585j00223P70226j16166p18971m27142K65422N27467K40025k72099
16208A928124N24425m04902K78752j90379M18698J90572n25237m02580j35421
16199A682052Q64712N7300q65310K57460k23456k15155N85866P78206P8631m32836
16189B567470k81742r93136O06503L57255N80186N21899p3981m74049j289762
16180A520643M71571R5883q16616J497917J64468l11691q8614n64801P5234N16862
16170B560856n94233J41412L09406o32741L82538Q16489K19102j13168k85345
16161B804316N96498o52395j18309J35089n20269M1j9131N10020J08672m73011
$$ plain form
16151 2371521 2332592 2603695 2071220 2192614 2732762 2609344 3389285 4115971 3781422 3094642
16141 3094642 3332803 3827660 2904331 3205997 3731525 2810562 2764533 3324629 2775959 2618956
16131 2618956 2805333 3965765 2965207 2966616 3468210 2222607 2792948 3184583 3434669
16122 3434669 3623597 3215297 3017120 3684003 2893052 2546300 3188966 2789179 2442666
16113 2442666 2568313 3430942 3592010 3404015 2760008 3173797 3218326 2304531 3930529
16104 3930529 4836159 3995485 3739406 3342580 2987410 3368696 3879743 3289776 1998168
16095 1998168 1685305 2983223 3441413 3308539 3436374 2931595 2820741 3769761 3273459
16086 3273459 2866284 3462546 3151803 2548385 2975055 2516152 2909783 2729715 2174203
$$ packed form
16151B371521l8929K71103n32475J21394N40148j23418P79941P26686l34549o86780
16141C094642K38161M94857r23329L01666N25528r20963m6029N60096n48670j57003
16131B618956J86377J160432j000558J409N01594j245603N70341L91635K50086
16122C434669J88928m08300j98177O66883p90951l46752O42666l99787l46513
16113B442666J25647Q62629J61068j87995o44007M13789M4529r13795J625998
16104C930529R05630q40674k56079l96826l55170L81286N11047n89967j291608
16095A998168l12863J297918M58190j32874J27835n04779j10854R49020m96302
16086C273459m07175N96262l10743o03418M26670m58903L93631j80068n55512
$$ plain form
16077 2174203 2920451 3337974 2514660 2970978 3432435 4132886 3773160 4108746 4110765 4133304
16067 4133304 3857300 3033361 3698251 3339297 2755556 2914962 2772135 3046291 2893562
16058 2893562 2739205 3063793 3426069 2767547 2398311 2900894 3430831 3824390 2492631
16049 2492631 2944574 3662600 3900954 3801498 4221514 4397288 3924819 2940218 2980522 3805742
16039 3805742 3825451 4095095 2706628 2616363 2591568 3001761 3836950 3461911 2835120 3143493
16029 3143493 3319562 3075698 3677894 3764058 3387089 3560556 3808014 2927367 3558386 4719849
16019 4719849 4404179 3715919 3977606 3916438 4094295 4374979 4059475 3028030 3900667
16010 3900667 3454087 3259621 3327965 4172379 4033703 3806408 3633493 2472414 2390133 2941326
$$ packed form
16077B174203P46248M17523q23314M56318M61457P00451l59726L35586K019K2539
16067D133304k76004q23939O64890l58954n83741J59406j42827K74156j52729
16058B893562j54357L24588L62276o58522l69236N02583N29937L93559j331759
16049B492631M51943P18026K38354r9456M20016J75774m72469r84601M0304Q25220
16039C805742J9709K69644j388467r0265k4795M10193Q35189l75039o26791L08373
16029C143493J76069k43864O02196Q6164l76969J73467K47458q80647O31019J161463
16019D719849l15670o88260K61687o1168J77857K80684l15504j031445Q72637
16010C900667m46580j94466O8344Q44414j38676k27295j72915j161079q2281N51193
$$ plain form
16000 2941326 3038669 3333034 4017233 3078471 3145548 3041375 2655934 4111809 4830882 4445764
15990 4445764 2363610 2205980 2637511 2900176 3252445 3528100 2538176 3224045 3175117
15981 3175117 2717006 3166128 3670573 2875478 3403851 3647595 3096468 3351234 4059836
15972 4059836 3572189 2590214 3407111 3460506 3468224 3408200 3669553 3952295 3475961 2953404
15962 2953404 3262792 3212552 3540970 4189663 4067183 4196698 4355777 3369867 2813777 3038798
15952 3038798 2391698 2811796 3787313 3347805 3446914 3465821 3469904 3398977 3190025 2946442
15942 2946442 3145050 3671130 4384612 3545916 3997759 4245615 3481683 4033100 4161826
15933 4161826 3944778 4000600 3998820 4117289 3989983 4509412 3326430 3370388 3519990 3485369
$$ packed form
16000B941326R7343K94365O84199r38762O7077j04173l85441J455875P19073l85118
15990D445764k082154j57630M31531K62665L52269K75655r89924O85869m8928
15981C175117m58111M49122N04445p95095N28373K43744n51127K54766P08602
15972D059836m87647r81975Q16897N3395P718o0024K61353K82742m76334n22557
15962B953404L09388n0240L28418O48693j22480J29515J59079r85910n56090K25021
15952C038798o47100M20098R75517m39508R9109J8907M083p0927k08952k43583
15942B946442J98608N26080P13482q38696M51843K47856p63932N51417J28726
15933D161826k17048N5822j780J18469j27306N19429j182982M3958J49602l4621
$$ plain form
15923 3485369 4159664 5016513 3836581 3385889 3759164 3925333 4310332 3733294 3392098
15914 3392098 3236349 4135630 4111443 3494662 4481364 4039315 3928444 3913371 4040791 4377672
15904 4377672 4446894 4119233 4397539 4757094 4849580 4219497 3649222 3940360 3029201 2565341
15894 2565341 3333293 3898953 4116915 3768331 3059068 2439084 3597436 2683990 3247382
15885 3247382 3746466 4182395 3542207 3229569 3219525 3606595 3443852 2468839 3470423
15876 3470423 2469328 3174138 2933296 3431104 3300051 3304295 3129732 3671257 3858160 3515003
15866 3515003 3713602 3368106 3022381 3497382 2855317 3637751 3735300 2563447 1762375
15857 1762375 2167363 3080524 2356946 2151167 3672276 3289402 2219593 3282337 3359915
$$ packed form
15923C485369O74295Q56849j179932m50692L73275J66169L84999n77038l41196
15914C392098j55749Q99281k4187o16781R86702m42049j10871j5073J27420L36881
15904D377672O9222l27661K78306L59555R2486o30083n70275K91138r11159m63860
15894B565341P67952N65660K17962l48584p09263o19984J158352r13446N63392
15885C247382M99084M35929o40188l12638j0044L87070j62743r75013J001584
15876C470423j001095P04810k40842M97808j31053M244j74563N41525J86903l43157
15866C515003J98599l45496l45725M75001o42065P82434R7549j171853q01072
15857A762375M04988R13161p23578k05779J521109l82874j069809J062744P7578
$$ plain form
15848 3359915 3272576 2914173 2947680 3493188 4006675 3636945 3687529 3862843 3768714 3813744
15838 3813744 3063588 3211284 3072948 3138254 3495258 3593425 4091277 3462069 4018750 3909862
15828 3909862 3622707 2541195 3393533 4164842 3249459 2613599 3170422 3130066 3523900
15819 3523900 3379229 2885905 3479209 2586636 2634846 3294510 3615183 3567698 3782079 3722436
15809 3722436 4141709 4131596 4429147 3881413 2860853 2628554 3682996 3412648 3993418
15800 3993418 3376842 3006195 3148587 3827897 3784675 3024384 2581174 2949875 3153543 3611619
15790 3611619 3901160 3836748 3885855 4061183 4214207 4538555 3889844 3277747 3665599 2993600
15780 2993600 3896324 3227663 2540957 2830251 3329001 3239633 2910601 3346582 4282481 4612449
$$ packed form
15848C359915q7339l58403L3507N45508N13487l69730N0584J75314r4129M5030
15838C813744p50156J47696j38336O5306L57004R8167M97852o29208N56681j08888
15828C909862k87155j081512Q52338P71309r15383o35860N56823m0356L93834
15819C523900j44671m93324N93304q92573M8210O59664L20673m7485K14381n9643
15809C722436M19273j0113K97551n47734j020560k32299J054442k70348N80770
15800C993418o16576l70647J42392O79310m3222p60291m43210L68701K03668M58076
15790C611619K89541o4412M9107J75328J53024L24348o48711o12097L87852o71999
15780B993600R02724o68661o86706K89294M98750q9368l29032M35981R35899L29968
$$ plain form
15770 4612449 4087108 3414858 3339165 3352438 3679520 4044435 3385472 3097481 3552390 4025470
15760 4025470 3216453 3059934 3472021 3468372 3079209 3158317 3589257 3119946 3268401 3132584
15750 3132584 3274207 3363515 2596119 3042011 2649991 3640231 5183216 4154848 3025471
15741 3025471 3172618 3721524 3921338 3628920 2817551 3242943 3398289 3508254 3128236
15732 3128236 3331241 2791273 1712867 1939891 2458044 3396305 2939321 2020069 2036073
15723 2036073 3126857 3131265 4212382 3355527 2881604 1964934 2732654 3910178 3533266
15714 3533266 4243618 3311405 3646313 4472459 4650781 3753359 3291614 3792124 2971843
15705 2971843 2358445 3508091 4079540 3899889 2654028 3485211 3915197 4236215 3597853
$$ packed form
15770D612449n25341o72250p5693J3273L27082L64915o58963k87991M54909M73080
15760D025470q09017j56519M12087l649l89163P9108M30940m69311J48455j35817
15750C132584J41623Q9308p67396M45892l92020R90240J542985j028368j129377
15741C025471J47147N48906J99814k92418q11369M25392J55346J09965l80018
15732C128236K03005n39968j078406K27024N18153R38261m56984r19252J6004
15723B036073J090784M408J081117q56855m73923r16670P67720J177524l76912
15714C533266P10352r32213L34908Q26146J78322q97422m61745N00510q20281
15705B971843o13398J149646N71449j79651j245861Q31183M29986L21018o38362
$$ plain form
15696 3597853 3287462 3708568 2757313 3474351 3450875 3732474 4077422 2655467 2571806 3556354
15686 3556354 4674633 3318205 2731701 2943551 3198059 2633858 2661682 2588192 1504480
15677 1504480 2360858 3073206 3610939 4437896 3920359 3835828 3531449 3609873 3809071 3229684
15667 3229684 3492606 3649878 3271112 3052418 2384843 3336796 4241254 3335208 3466378
15658 3466378 3726013 3506358 4415903 4174428 3921975 3084330 2937049 3696866 3416195
15649 3416195 3951524 4592548 3841279 2864938 3539629 4151596 4216372 4382374 3832000 3250256
15639 3250256 3602998 3094683 3783482 3372910 3039947 3262334 3795014 4448649 3779775
15630 3779775 2987306 2707764 2573076 3269744 3953786 3784103 3574181 3009763 2674762
$$ packed form
15696C597853l10391M21106r51255P17038k3476K81599L44948j421955q3661R84548
15686C556354J118279j356428n86504K11850K54508n64201K7824p3490j083712
15677A504480Q56378P12348N37733Q26957n17537q4531l04379P8424J99198n79387
15667C229684K62922J57272l78766k18694o67575R51953R04458r06046J31170
15658C466378K59635k19655R09545k41475k52453q37645j47281P59817k80671
15649C416195N35329O41024p51269r76341O74691O11967O4776J66002n50374n81744
15639C250256L52742n08315O88799m10572l32963K22387N32680O53635o68874
15630C779775p92469k79542j34688O96668O84042j69683k09922n64418l35001
$$ plain form
15621 2674762 3825316 4047043 3232032 3441590 3701594 3443793 2966498 3481520 2719689
15612 2719689 2082325 2372880 3859213 4319227 3961109 3283639 3554947 3532814 2719238
15603 2719238 3300304 3425414 3797591 3118496 3343078 3492768 3593876 3803098 3144167
15594 3144167 2571240 2786121 2722132 3238861 3632179 3561013 3742121 3433021 2878054 3240303
15584 3240303 3730974 3796616 3377457 4092940 4295837 3915645 3250918 3227416 3109498 3565497
$$ packed form
15621B674762J150554K21727q15011K09558K60004k57801m77295N15022p61831
15612B719689o37364K90555J486333M60014l58118o77470K71308k2133q13576
15603B719238N81066J25110L72177o79095K24582J49690J01108K09222o58931
15594C144167n72927K14881o3989N16729L93318p1166J81108l09100n54967L62249
15584C240303M90671O5642m19159P15483K02897l80192o64727k3502j17918M55999
$$ [...]
##END NTUPLES=NMR SPECTRUM
##END=
