##TITLE=1H_CG-1150-X
 CDCl3, 8 sc, 
 5.08.2021
##JCAMPDX= 6.0         $$ Bruker NMR JCAMP-DX V2.0
##DATA TYPE= NMR SPECTRUM
##DATA CLASS= NTUPLES
##ORIGIN= UXNMR, Bruker Analytische Messtechnik GmbH
##OWNER= root
$$ XWIN-NMR		Version 3.5
$$ Thu Aug  5 11:05:37 2021 Russian Standard Time (UT+4h)  she@DPX200
##.OBSERVE FREQUENCY= 200.131506
##.OBSERVE NUCLEUS= ^1H
##.ACQUISITION MODE= SIMULTANEOUS
##.ACQUISITION SCHEME= undefined
##.AVERAGES= 8
##.DIGITISER RES= 18
##SPECTROMETER/DATA SYSTEM= spect
##.PULSE SEQUENCE= zg30
##.SOLVENT NAME= CDCl3
##.SHIFT REFERENCE= (INTERNAL, CDCl3, 0, 17.5008)
##AUDIT TRAIL= $$ (NUMBER, WHEN, WHO, WHERE, WHAT)
$$ ##TITLE= Audit trail, XWIN-NMR		Version 3.5
$$ ##JCAMPDX= 5.01
$$ ##ORIGIN= Bruker BioSpin GmbH
$$ ##OWNER= she
$$ F:/spectra/data/she/nmr/H-F/1/pdata/1/auditp.txt
$$ ##AUDIT TRAIL=  $$ (NUMBER, WHEN, WHO, WHERE, WHAT)
(   1,<2021-08-05 11:04:25.39 +0400>,<she>,<DPX200>,
      <created by zg, POWCHK disabled, PULCHK disabled
       configuration hash MD5:
       00 E9 B6 7A A2 85 ED C7 34 08 36 98 17 FE 4E 26
       data hash MD5: 16K
       9B 59 72 AD C2 FC E9 EB 87 8E D8 E8 11 86 9D D7>)
(   2,<2021-08-05 11:04:27.48 +0400>,<she>,<DPX200>,
      <Start of raw data processing
       efp BC_mod = 2 LB = 0.24 FT_mod = 6 PKNL = 1 PHC0 = -13356.72 PHC1 = 13.00099 SI = 16K 
       data hash MD5: 16K
       16 B3 18 FA AF 8A C5 8D 74 4A 36 B0 9D E1 22 DD>)
(   3,<2021-08-05 11:04:46.79 +0400>,<she>,<DPX200>,
      <pk PHC0 = -2.855154 PHC1 = 3.6 
       data hash MD5: 16K
       84 57 A5 B1 99 1A E6 E3 B2 26 5A C4 F3 47 C9 C7>)
(   4,<2021-08-05 11:04:50.15 +0400>,<she>,<DPX200>,
      <abs ABSG = 5 
       data hash MD5: 16K
       C5 44 6C 25 D0 D3 26 02 4B CC 93 42 31 A3 3D 33>)
$$ ##END=
$$ 
$$ hash MD5
$$ CA D8 07 A1 1C BA B0 84 6E 4F B7 46 69 AA 0C 10
##$RELAX= 
##$RELAX= 
##$RELAX= 
##$RELAX= 
##$RELAX= 
##$RELAX= 
$$ Bruker specific parameters
$$ --------------------------
##$DU= <F:/spectra>
##$EXPNO= 1
##$NAME= <H-F>
##$PROCNO= 1
##$TYPE= <nmr>
##$USER= <she>
##$AMP= (0..31)
100 100 100 100 100 100 100 100 100 100 100 100 100 100 100 100 100 100 
100 100 100 100 100 100 100 100 100 100 100 100 100 100 
##$AQSEQ= 0
##$AQ_mod= 1
##$AUNM= <au_zg>
##$AUTOPOS= <>
##$BF1= 200.13
##$BF2= 200.13
##$BF3= 200.13
##$BF4= 200.13
##$BF5= 200.13
##$BF6= 200.13
##$BF7= 200.13
##$BF8= 200.13
##$BYTORDA= 1
##$CFDGTYP= 0
##$CFRGTYP= 5
##$CHEMSTR= <none>
##$CNST= (0..31)
1 1 145 1 1 1 1 1 1 1 1 1 1 1 1 1 1 1 1 1 1 1 1 1 1 1 1 1 1 1 1 1 
##$CPDPRG= <>
##$CPDPRG1= <>
##$CPDPRG2= <>
##$CPDPRG3= <>
##$CPDPRG4= <mlev>
##$CPDPRG5= <mlev>
##$CPDPRG6= <mlev>
##$CPDPRG7= <mlev>
##$CPDPRG8= <mlev>
##$CPDPRGB= <>
##$CPDPRGT= <>
##$D= (0..31)
0 1.2 0 0 0 0 0 0 0 0.06 0 0.03 0 0 0 0 0.0002 0 0 0 0 0 0 0 0 0 0 0 0 
0 0 0 
##$DATE= 1628147064
##$DBL= (0..7)
120 120 120 120 120 120 120 120 
##$DBP= (0..7)
150 150 150 150 150 150 150 150 
##$DBP07= 0
##$DBPNAM0= <>
##$DBPNAM1= <>
##$DBPNAM2= <>
##$DBPNAM3= <>
##$DBPNAM4= <>
$$ [...]
##$SUBNAM3= <"">
##$SUBNAM4= <"">
##$SUBNAM5= <"">
##$SUBNAM6= <"">
##$SUBNAM7= <"">
##$SUBNAM8= <"">
##$SUBNAM9= <"">
##$SW= 20.0188882624521
##$SWIBOX= (0..15)
0 0 2 0 0 0 0 0 0 0 0 0 0 0 0 0 
##$SW_h= 4006.41025641026
##$TD= 16384
##$TD0= 1
##$TE= 0
##$TE2= 300
##$TE3= 300
##$TEG= 300
##$TL= (0..7)
0 120 120 120 120 120 120 120 
##$TP= (0..7)
150 150 150 150 150 150 150 150 
##$TP07= 0
##$TPNAME0= <>
##$TPNAME1= <>
##$TPNAME2= <>
##$TPNAME3= <>
##$TPNAME4= <>
##$TPNAME5= <>
##$TPNAME6= <>
##$TPNAME7= <>
##$TPOAL= (0..7)
0.5 0.5 0.5 0.5 0.5 0.5 0.5 0.5 
##$TPOFFS= (0..7)
0 0 0 0 0 0 0 0 
##$TUNHIN= 0
##$TUNHOUT= 0
##$TUNXOUT= 0
##$USERA1= <user>
##$USERA2= <user>
##$USERA3= <user>
##$USERA4= <user>
##$USERA5= <user>
##$V9= 5
##$VALIST= <valist>
##$VCLIST= <CCCCCCCCCCCCCCC>
##$VD= 0
##$VDLIST= <DDDDDDDDDDDDDDD>
##$VPLIST= <PPPPPPPPPPPPPPP>
##$VTLIST= <TTTTTTTTTTTTTTT>
##$WBST= 1024
##$WBSW= 4
##$XGAIN= (0..3)
0 0 0 0 
##$XL= 0
##$YL= 0
##$YMAX_a= 92285
##$YMIN_a= -83855
##$ZGOPTNS= <>
##$ZL1= 120
##$ZL2= 120
##$ZL3= 120
##$ZL4= 120
##$ABSF1= 17.51299
##$ABSF2= -2.506048
##$ABSG= 5
##$ABSL= 3
##$ALPHA= 0
##$AQORDER= 0
##$ASSFAC= 0
##$ASSFACI= 0
##$ASSFACX= 0
##$ASSWID= 0
##$AUNMP= <proc_1d>
##$AZFE= 0.1
##$AZFW= 0.1
##$BCFW= 0
##$BC_mod= 2
##$BYTORDP= 0
##$COROFFS= 0
##$CY= -3
##$DATMOD= 1
##$DC= 0
##$DFILT= <>
##$DTYPP= 0
##$F1P= 0
##$F2P= 0
##$FCOR= 1
##$FTSIZE= 16384
##$FT_mod= 6
##$GAMMA= 0
##$GB= 0
##$INTBC= 1
##$INTSCL= 1.334414e-10
##$ISEN= 128
##$LB= 0.24
##$LEV0= 0
##$LPBIN= 0
##$MAXI= 10000
##$MC2= 0
##$MEAN= 0
##$ME_mod= 0
##$MI= 1.114404
##$NCOEF= 0
##$NC_proc= -8
##$NLEV= 6
##$NOISF1= 3.799351
##$NOISF2= 2.8
##$NSP= 0
##$NTH_PI= 0
##$NZP= 0
##$OFFSET= 17.50077
##$PC= 1
##$PHC0= -13359.58
##$PHC1= 16.60099
##$PH_mod= 1
##$PKNL= yes
##$PPARMOD= 0
##$PSCAL= 0
##$PSIGN= 0
##$REVERSE= no
##$SF= 200.130006774426
##$SI= 16384
##$SIGF1= 3
##$SIGF2= 2
##$SINO= 5.538805
##$SIOLD= 16384
##$SREGLST= <1H.CDCl3>
##$SSB= 0
##$STSI= 16384
##$STSR= 0
##$SW_p= 4006.41025641026
##$SYMM= 0
##$S_DEV= 0
##$TDeff= 16384
##$TDoff= 0
##$TI= <>
##$TILT= no
##$TM1= 0
##$TM2= 0
##$TOPLEV= 0
##$USERP1= <user>
##$USERP2= <user>
##$USERP3= <user>
##$USERP4= <user>
##$USERP5= <user>
##$WDW= 1
##$XDIM= 16384
##$YMAX_p= 330572516
##$YMIN_p= -1334823
$$ End of Bruker specific parameters
$$ ---------------------------------
##NTUPLES= NMR SPECTRUM
##VAR_NAME=  FREQUENCY,     SPECTRUM/REAL,   SPECTRUM/IMAG
##SYMBOL=    X,             R,               I
##VAR_TYPE=  INDEPENDENT,   DEPENDENT,       DEPENDENT
##VAR_FORM=  AFFN,          ASDF,            ASDF
##VAR_DIM=   16384,         16384,           16384
##UNITS=     HZ,            ARBITRARY UNITS, ARBITRARY UNITS
##FACTOR=    0.24454680195387, 1,            1
##FIRST=     3502.42933250116, 0,            0
##LAST=      -503.980923909104, 0,           0
##MIN=       -503.980923909104, -1334823,    0
##MAX=       3502.42933250116, 330572516,    0
$$ Real data points
##PAGE= N=1
##DATA TABLE= (X++(R..R)), XYDATA
$$ [...]
4900I63241j56998o00609R0615N72085o9023l620J06446o2741m53265J68617j23825
$$ 963241 806243 205634 296249 868334 799311 795691 902137 839396 386131 554748 430923
4889D30923J35172M11896K2677k33070J67066l55978l5941K21107j67982M26419
$$ 430923 566095 977991 1000668 767598 934664 578686 542745 763852 595870 1022289
4879A022289m88317m28986M45460P84936l08827m76763L591J26936j96967l4280
$$ 1022289 533972 104986 550446 1335382 1026555 549792 553383 680319 483352 449072
4869D49072j67003L25076L54211j68638k55211J28491l87711l81724m2847j84993
$$ 449072 282069 607145 961356 792718 537507 665998 278287 -103437 -146284 -331277
4859c31277L96023K45720m2302L32778L28854l17194k15004P6592k53266j87882
$$ -331277 64746 310466 268164 600942 929796 612602 397598 474190 220924 33042
4849C3042j77575j2477l85751P22890P02211l28917p6372L36352l25078L15046
$$ 33042 -144533 -157010 -542761 180129 882340 553423 477051 813403 488325 803371
4839H03371J55746l444J09104k98306k03924q1722j5677j61188M49724N25252
$$ 803371 959117 955673 1064777 766471 562547 480825 465148 303960 753684 1278936
4829A278936j12770m51261L2933j84472l90094J50730l3776M11821L31395k60157
$$ 1278936 1166166 714905 747838 563366 173272 324002 290226 702047 1033442 773285
4819G73285K95787n53658m5148K09908L50684J10331k71578M7236J78417K03197
$$ 773285 1069072 515414 470266 680174 1030858 1141189 869611 916847 1095264 1298461
4809A298461j33208l9559o36633L44378L08216m77456J73085L1764m65338O53300
$$ 1298461 1165253 1125694 489061 833439 1141655 664199 837284 869048 403710 1057010
4799A057010m41718K21582N92546m22540J4104j84261r9506j13971l2494j06838
$$ 1057010 615292 836874 1429420 1006880 1020984 836723 737217 623246 590752 483914
4789D83914N28287m3365l21705M6949p9841L07500K35416j32589n486K39501p78695
$$ 483914 1012201 968836 647131 694080 614239 921739 1157155 1024566 1019080 1258581 479886
4778D79886L54314n6244L53067N3177l4734L03591o5981k14178p9132J36834J08143
$$ 479886 834200 777956 1131023 1184200 1149466 1453057 1387076 1172898 1093766 1230600 1338743
4767A338743l49315j92451k04154J54626N58326j73826J04402J38987n33547Q2383
$$ 1338743 989428 796977 592823 747449 1305775 1131949 1236351 1375338 841791 924174
4757I24174K17662k62035m6616L77352N29563m42106r5960j41796K10805l9984
$$ 924174 1141836 879801 833185 1210537 1740100 1297994 1202034 1060238 1271043 1231059
4747A231059J44770j2316M5757k70667K18902J60815k19497m0867r2552N41475
$$ 1231059 1375829 1363513 1409270 1138603 1357505 1518320 1298823 1257956 1165404 1706879
4737A706879j65781l08971O2298P7001k9031m11963L65412j26687R4414J03174
$$ 1706879 1541098 1232127 1294425 1371426 1342395 930432 1295844 1169157 1263571 1366745
4727A366745o9645l3292l74094K91902L47692J93447J77953j37374k99289J83928
$$ 1366745 1297100 1263808 889714 1181616 1529308 1722755 1900708 1763334 1464045 1647973
4717A647973j38597l8840j1910l20288J57893K04290Q0980n88543N28227m02819
$$ 1647973 1509376 1470536 1458626 1138338 1296231 1500521 1581501 992958 1521185 1118366
4707A118366k0460j9673M59039J43572J6011k27076M5655J82605n3680K77806
$$ 1118366 1097906 1078233 1537272 1680844 1696855 1469779 1515434 1698039 1644359 1922165
4697A922165q9084J64649j66j55706l5460k01864k57703P0998J18558j75653j77145
$$ 1922165 1833081 1997730 1997564 1841858 1806398 1604534 1346831 1417829 1536387 1360734 1183589
4686A183589J75079K44110J98122q0516k63560p6581J99699N1066J14652k12704
$$ 1183589 1358668 1602778 1800900 1720384 1456824 1380243 1579942 1631008 1745660 1532956
4676A532956M5017n878L7135O2553j71481j92604m4320M08279L02117j9924k69218
$$ 1532956 1577973 1572095 1609230 1671783 1500302 1307698 1263378 1671657 1973774 1953850 1684632
4665A684632K51492j23277K0527j77607j29946P1836K30410J8320L6004K96643
$$ 1684632 1936124 1812847 1833374 1655767 1525821 1597657 1828067 1846387 1882391 2179034
4655B179034m13122M4972k42933K08352L54399J42857m36339P3731j07916k92912
$$ 2179034 1765912 1810884 1567951 1776303 2130702 2273559 1837220 1910951 1803035 1510123
4645A510123r6579L13327j89212M19559j57982j83958o3906M74064K71276m60154
$$ 1510123 1413544 1726871 1537659 1957218 1799236 1615278 1551372 2025436 2296712 1836558
4635A836558L43477o6973p3186K86311k78908j23414j02601j30705K39533M62848
$$ 1836558 2180035 2113062 2039876 2326187 2047279 1923865 1821264 1690559 1930092 2392940
4625B392940j77988k30673L99903L64147j14482k37158k26740l40598j27411k32995
$$ 2392940 2214952 1984279 2384182 2748329 2633847 2396689 2169949 1829351 1701940 1468945
4615A468945P35526M20780M5637k14065j28194J56279P5009o56039J28073M93518
$$ 1468945 2204471 2625251 2670888 2456823 2328629 2484908 2559917 1903878 2031951 2525469
4605B525469Q5408l65938l39198M87494J79171p7848J08452k33847R3902K92535
$$ 2525469 2610877 2244939 1905741 2393235 2572406 2494558 2603010 2369163 2463065 2755600
4595B755600K60511k17235O908M14636j78999j50565N7348L36182l48144k68716
$$ 2755600 3016111 2798876 2805784 3220420 3041421 2890856 2948204 3284386 2936242 2667526
4585B667526N0124M02195l37720K3414J54007M02308j90184J84333q6008k69472
$$ 2667526 2717650 3119845 2782125 2805539 2959546 3361854 3171670 3356003 3269995 3000523
4575C000523k69178M16025K87861L42675K12331n25486n19754j82072k9734R11186
$$ 3000523 2731345 3147370 3435231 3777906 3990237 3464751 2944997 2762925 2733191 3644377
4565C644377P0400L00520q6529k33784J87396n17063L19538J87031l01860K43440
$$ 3644377 3714777 4015297 3928768 3694984 3882380 3365317 3684855 3871886 3570026 3813466
4555C813466O19291l87774l81436L538l03j06779P00621j46332J47739n4868P9228
$$ 3813466 4432757 4044983 3663547 3667085 3666782 3560003 4260624 4114292 4262031 4207163 4286391
4544D286391q1635J55676J74507L20377j24487l22340J88377K77957k01795M36293
$$ 4286391 4204756 4360432 4534939 4855316 4730829 4408489 4596866 4874823 4673028 5109321
4534E109321K09575m46083K9291M83470K99002L58096k18836l42355q8816j53078
$$ 5109321 5318896 4872813 4902104 5385574 5684576 6042672 5823836 5481481 5392665 5239587
4524E239587O31397J46384J22922l67733n8946K65405K41887P94559K29466m14780
$$ 5239587 5870984 6017368 6140290 5772557 5713611 5979016 6220903 7015462 7244928 6830148
4514F830148J75908j55679N3310M96122m4696k4236k32754q8339Q1825J34395
$$ 6830148 7006056 6850377 6903687 7399809 7355113 7330877 7098123 7009784 7091609 7226004
4504G226004L25097j40530m8017k0409o75244O48836Q6945M49072j48789N39201
$$ 7226004 7551101 7410571 7362554 7342145 6666901 7315737 7402682 7851754 7702965 8242166
4494H242166j62619N07473L2387Q6267J16926P2946J92029l42578K02418p4733
$$ 8242166 8079547 8587020 8619407 8705674 8822600 8895546 9087575 8744997 8947415 8872682
4484H872682j35101J62367J10015M4818k22176R6462j71013k20253Q9318L54657
$$ 8872682 8737581 8899948 9009963 9054781 8832605 8929067 8758054 8537801 8627119 8981776
4474H981776K04490m05382O9676l95107N38031J16948M23304j64606k07566M14748
$$ 8981776 9186266 8780884 8850560 8455453 8993484 9110432 9533736 9369130 9161564 9576312
4464I576312K30158j92925K02715R8212o7052k04281k3257M78126p16375J70666
$$ 9576312 9806470 9613545 9816260 9914472 9847420 9643139 9619882 10098008 9381633 9552299
4454I552299M49379N18355l1512l20011j82397J45943J55027J08812j8203K27639
$$ 9552299 10001678 10520033 10488521 10168510 9986113 10132056 10287083 10395895 10377692 10605331
4444A0605331j5180m23340k86194J15992L84767j46754O1409J58576L12639n53721
$$ 10605331 10590151 10166811 9880617 9996609 10381376 10234622 10296031 10454607 10767246 10213525
4434A0213525L99969K68242j67264r6203N22576K38744P612q6111K91123j45683
$$ 10213525 10613494 10881736 10714472 10618269 11140845 11379589 11387201 11301090 11592213 11446530
4424A1446530p1014J44479L09332j19332J90988m77651p9978l03693Q1254J53321
$$ 11446530 11375516 11519995 11829327 11709995 11900983 11423332 11343354 11039661 11120915 11274236
4414A1274236O903J23369r8491l29821K21593K44385J88820o8681q7248l42841
$$ 11274236 11281139 11404508 11306017 10976196 11197789 11442174 11630994 11562313 11475065 11132224
4404A1132224K99985q0486K23971l23480l40177J92357k0781o1964l6505j81895
$$ 11132224 11432209 11351723 11575694 11252214 10912037 11104394 11083613 11021649 10985144 10803249
4394A0803249m15706J01892K46172r8574M51933j55231n2521K94587p95490K64893
$$ 10803249 10387543 10489435 10735607 10637033 11088966 10933735 10881214 11175801 10380311 10645204
4384A0645204o53244N0941P83961j39703j16990k77982J62214K08788k6255P4057
$$ 10645204 9991960 10042901 10826862 10687159 10570169 10292187 10454401 10663189 10636934 10710991
4374A0710991M13087q5406O7423J03815k35448N8516k72929m7849k68999J30508
$$ 10710991 11124078 11038672 11106095 11209910 10974462 11032978 10760049 10712200 10443201 10573709
4364A0573709j20411n0278M9563M97360j92826l17601L58439L85691p57293P5428
$$ 10573709 10453298 10403020 10452583 10949943 10757117 10439516 10797955 11183646 10426353 10501781
4354A0501781M41778r6277l2427L33043J95928K17367l36123M38738k7885k54165
$$ 10501781 10943559 10847282 10814855 11147898 11343826 11561193 11225070 11663808 11635923 11381758
4344A1381758j38360P8804n9858p2758K37696M05640n20104L947O15944q2748
$$ 11381758 11243398 11322202 11262344 11189586 11427282 11832922 11312818 11316765 11932709 11849961
4334A1849961m30582k7028J53492J48040L34131J10795J31711k54305j79263M80950
$$ 11849961 11419379 11392351 11545843 11693883 12028014 12138809 12270520 12016215 11836952 12317902
4324A2317902J79994O04397j84880J43841j06153j2846J90246L9593o4882j30958
$$ 12317902 12497896 13102293 12917413 13061254 12955101 12942255 13132501 13172094 13107212 12976254
4314A2976254L06620M93105n8775O7629j94108J52690j56299K89216L8283J59346
$$ 12976254 13282874 13775979 13717204 13784833 13590725 13743415 13587116 13876332 13914615 14073961
4304A4073961P63982L3891Q0719k04955L7307L46443N57190j02006K29444k41532
$$ 14073961 14837943 14871834 14952553 14747598 14784905 15131348 15688538 15586532 15815976 15574444
4294A5574444L60138J85651J89337L44718l267k55389N40531l26702l24022L60204
$$ 15574444 15934582 16120233 16309570 16654288 16651021 16395632 16936163 16609461 16285439 16645643
4284A6645643N21659m35301J6525N14610L5765O7120q9261o0747l41468L44960
$$ 16645643 17167302 16732001 16748526 17263136 17298901 17366021 17276760 17216013 16874545 17219505
4274A7219505K47286J20646J73803L32482K01750m99316q0081l4111J488k01052
$$ 17219505 17466791 17587437 17761240 18093722 18295472 17796156 17716075 17681964 17683452 17482400
4264A7482400K10542m68870r9193K20983J14321j70809k29765L7340k95682l42468
$$ 17482400 17692942 17224072 17124879 17345862 17460183 17289374 17059609 17096949 16801267 16458799
4254A6458799K02505k25393j05401k24631k83780j26642j15743l2800o6867j91806
$$ 16458799 16661304 16435911 16330510 16105879 15822099 15695457 15579714 15546914 15480047 15288241
4244A5288241R7591j28185m88565l35087l35736k21882J90834k89297j11363Q76482
$$ 15288241 15385832 15257647 14769082 14433995 14098259 13876377 14067211 13777914 13666551 14543033
4234A4543033n47014n04798n32123J28139P9870o73420K44264L0110J26548j83855
$$ 14543033 13996019 13491221 12959098 13087237 13167107 12493687 12737951 12768061 12894609 12710754
4224A2710754r7959l83846m44192l19075J08032J93440n0742j99143k71794j27766
$$ 12710754 12612795 12228949 11784757 11465682 11573714 11767154 11716412 11517269 11245475 11117709
4214A1117709k17197P577o60295k91J70274J08500L13599m26268l33355m55228
$$ 11117709 10900512 10908089 10247794 10247503 10417777 10526277 10839876 10413608 10080253 9625025
4204I625025J45770M68016K55880r8719l69543j90840k32900k67401j73652m0688
$$ 9625025 9770795 10238811 10494691 10395972 10026429 9835589 9602689 9335288 9161636 9120948
4194I120948L28912L98435j77825j79573L7557j33657M05462o2842j97190N8800
$$ 9120948 9449860 9848295 9670470 9490897 9528454 9394797 9800259 9737417 9540227 9599027
4184I599027k16355k94206j67840K83356J26333j91226l1369j79582j38927M0239
$$ 9599027 9382672 9088466 8920626 9203982 9330315 9139089 9107720 8928138 8789211 8829450
4174H829450k28772N28167M5885p9447L67352J24046j76647j46819j83897L78069
$$ 8829450 8600678 9128845 9174730 9095283 9462635 9586681 9410034 9263215 9079318 9457387
4164I457387J64480O3152n570M35320n43522L17624L09630j96142O73538J07855
$$ 9457387 9621867 9685019 9679449 10114769 9571247 9888871 10198501 10002359 10675897 10783752
4154A0783752p43242j76945N25044N06556k31753J83504J10960n26479L71725
$$ 10783752 10040510 9863565 10388609 10895165 10663412 10846916 10957876 10431397 10803122
4145A0803122n6542j32120N64579l3321j58689K11186m6960M38354n06339M69790
$$ 10803122 10746580 10614460 11179039 11145718 10987029 11198215 11151255 11589609 11083270 11553060
4135A1553060L09431M4619j5286L88613K18681o43881L81970m3478O10336M2150
$$ 11553060 11862491 11907110 11891824 12280437 12499118 11855237 12237207 12193729 12804065 12846215
4125A2846215L49589J75891M82062r3836k43385j48848K68532P64757N52178J82143
$$ 12846215 13195804 13371695 13853757 13759921 13516536 13367688 13636220 14400977 14953155 15135298
4115A5135298J9396j68131K24644N01049k38650K61523N45504n885M09227L37523
$$ 15135298 15154694 14986563 15211207 15712256 15473606 15735129 16280633 16274748 16683975 17021498
4105A7021498N17817r6533K68235N01809r5756J08983M98385L41153j53539N76602
$$ 17021498 17539315 17442782 17711017 18212826 18117070 18226053 18724438 19065591 18912052 19488654
4095A9488654J61922Q30419l51972K02665Q54543j49275L91889O29665K13070
$$ 19488654 19650576 20480995 20129023 20331688 21186231 21036956 21428845 22058510 22271580
4086B2271580J77127N01406R94600N01481L85055M13770L70472k80607O91123
$$ 22271580 22448707 22950113 23944713 24446194 24831249 25245019 25615491 25334884 26026007
4077B6026007N08028P12199O83976O20615K73955O59948l6557K4488M13926J776856
$$ 26026007 26534035 27246234 27930210 28550825 28824780 29484728 29448171 29472659 29886585 31663441
4067C1663441M58160N30106P84066k33069K55952N86471N00238N25890J244623
$$ 31663441 32121601 32651707 33435773 33202704 33458656 34045127 34545365 35071255 36315878
4058C6315878k1605J00799N36881M69302L35221L68604J29037k1594K44048O55514
$$ 36315878 36294273 36395072 36931953 37401255 37736476 38105080 38234117 38212523 38456571 39112085
4048C9112085Q3724J80210Q094K67391l80359L4590p627k88682j07647l94626
$$ 39112085 39195809 39376019 39384113 39651504 39271145 39305735 39298108 39009426 38901779 38507153
4038C8507153n85449k87154J766m92221o28664n82249m80138o95414p54973j37246
$$ 38507153 37921704 37634550 37636316 37144095 36515431 35933182 35453044 34757630 34002657 33865411
4028C3865411n10656n90296l94739j88982j147765p24381q48004n87382m59752
$$ 33865411 33354755 32764459 32369720 32180738 31032973 30308592 29460588 28873206 28413454
4019B8413454p10096q22695p45088l58395q41541K51870r26395o76589p43818
$$ 28413454 27703358 26880663 26135575 25777180 24935639 25187509 24261114 23584525 22840707
4010B2840707p61211l77555m71122n39847j22202j18056q69322m86574m23734
$$ 22840707 22079496 21701941 21230819 20690972 20568770 20450714 19581392 19094818 18671084
4001A8671084j99972p73339o24224l14865J56075l86963l98780l00196O9550l92282
$$ 18671084 18471112 17697773 17073549 16758684 16914759 16527796 16129016 15828820 15898370 15506088
3991A5506088k64445m95493K1782n55069l84217p2676o91712Q1186J13851m30247
$$ 15506088 15241643 14746150 14767932 14212863 13828646 13755970 13064258 13145444 13259295 12829048
3981A2829048o10103L2144P2584l29235o8864N1610l8257l60607J56014L44208
$$ 12829048 12218945 12251089 12323673 11994438 11925574 11977184 11938927 11578320 11734334 12078542
3971A2078542m54515j94179n32096K82316n38648l69800L13042r9475o6589m10982
$$ 12078542 11624027 11429848 10897752 11180068 10641420 10271620 10584662 10485187 10418598 10007616
3961A0007616m21300l67098j77020P6721J59181P9139m78921l63250l64660M88630
$$ 10007616 9586316 9219218 9042198 9118919 9278100 9357239 8878318 8515068 8150408 8639038
3951H639038j51339k65833j77023J10618J68846p4972M62055k45238l25676j58791
$$ 8639038 8487699 8221866 8044843 8155461 8324307 8249335 8711390 8466152 8140476 7981685
3941G981685O7045R9088n13100J98496j50586k43303o302L20107K01109L35984
$$ 7981685 8048730 8147818 7634718 7833214 7682628 7439325 7433023 7753130 7954239 8290223
3931H290223k89654n38646O01938l33190l52884l59777J24019q2638k35007M22606
$$ 8290223 8000569 7461923 8063861 7730671 7377787 7018010 7142029 7059391 6824384 7246990
3921G246990M91637m812o62945L68194K70364J8633j11408j14184k79817r761
$$ 7246990 7738627 7733815 7070870 7439064 7709428 7728061 7616653 7502469 7222652 7212891
3911G212891j14451K97977L79207k7293M78730o57001k05828M50009q1182J2399
$$ 7212891 7098440 7396417 7775624 7748331 8227061 7570060 7364232 7814241 7733059 7745458
3901G745458L70909j10681M55260O85794J71573K85978o1204J14396k87858j45000
$$ 7745458 8116367 8005686 8460946 9146740 9318313 9604291 9543087 9657483 9369625 9224625
3891I224625K43221R9525J63306j99020O09163J47930l999l57120l71558L60831
$$ 9224625 9467846 9567371 9730677 9531657 10140820 10288750 10284751 9927631 9556073 9916904
3881I916904K95106J20186N14532l38995P1466K19324p98517L76621L49936q9305
$$ 9916904 10212010 10332196 10846728 10507733 10579199 10798523 10000006 10376627 10726563 10637258
3871A0637258O81710J75829M13864N54673M27967J14190M04022O27435N33223
$$ 10637258 11318968 11494797 11908661 12463334 12891301 13005491 13409513 14036948 14570171
3862A4570171L78017R59529N95615N75719J456677J008351J255029J121882K251701
$$ 14570171 14948188 15907717 16503332 17079051 18535728 19544079 20799108 21920990 24172691
3853B4172691J443342K496618K530458K642355L449345N074094M409582O237812
$$ 24172691 25616033 28112651 30643109 33285464 36734809 41808903 46218485 52456297
3845E2456297P691212R074444J0354746R695372L101378r044848j4170611j2740511
$$ 52456297 60147509 69221953 79576699 89272071 92373449 83328601 69157990 56417479
3837E6417479p599165n053873k686609k081826j786181j747684k239452j829676
$$ 56417479 48818314 43764441 41077832 38996006 37209825 35462141 33222689 31393013
3829C1393013m27761r32953n72345n61036m84568o66038R9840K147j07228k36495
$$ 31393013 30965252 30032299 29459954 28898918 28414350 27748312 27848152 27850299 27743071 27506576
3819B7506576j54190K89983K8918N48318L6019k87421l16347j79891l60636k28947
$$ 27506576 27352386 27642369 27671287 28219605 28255624 27968203 27651856 27471965 27111329 26882382
3809B6882382j67117l99153p51736p46142L866n93816o25457l57046m32868n50979
$$ 26882382 26715265 26316112 25564376 24818234 24822100 24228284 23602827 23245781 22812913 22261934
3799B2261934p48499m62545o26947p00380m95780l36198o72788n04762o26744
$$ 22261934 21513435 21050890 20423943 19723563 19227783 18891585 18218797 17714035 17087291
3790A7087291l56130L9831q15750q94403k99062l806k99248o56863k9276M0213
$$ 17087291 16731161 16770992 15955242 15060839 14761777 14757971 14458723 13801860 13772584 13812797
3780A3812797k60478l68482n98824J27780K620m62694m88351K3414O8107l63787
$$ 13812797 13552319 13183837 12585013 12712793 12715413 12252719 11764368 11787782 11855889 11492102
3770A1492102k25013j15K090P1469r8521P9307m19693K2265K74696n12944L87871
$$ 11492102 11267089 11266974 11269064 11340533 11242012 11321319 10901626 10923891 11198587 10685643 11073514
3759A1073514l51004k46183n90958n3177N6810Q3102J91104n72688n10016J86560
$$ 11073514 10722510 10476327 9885369 9832192 9889002 9972104 10163208 9590520 9080504 9267064
3749I267064P7960k91087P3538o8664j10058K99012o9911k7572l18580o4529j71609
$$ 9267064 9345024 9053937 9127475 9058811 8948753 9247765 9177854 9150282 8831702 8767173 8595564
3738H595564R2473k07151p775j35950K98879l66334p25135m44353N33858J65843
$$ 8595564 8688037 8480886 8473111 8337161 8636040 8269706 7544571 7100218 7634076 7799919
3728G799919l50930k87090n28864r4295N2521J36183l3292k46019l79739J52397
$$ 7799919 7448989 7161899 6633035 6538740 6591261 6727444 6694152 6448133 6068394 6220791
3718F220791L2276j8918K06733N046l66265N79270N45534j62545n63234l13539
$$ 6220791 6253067 6234149 6440882 6445928 6079663 6658933 7204467 7041922 6478688 6165149
3708F165149J24250m9528K49855J2288M08183m952o1966O3460l8578J11867l64301
$$ 6165149 6289399 6239871 6489726 6502014 6910197 6905245 6843279 6906739 6868161 6980028 6615727
3697F615727K29492K47584N1256K35904J93985J17823J3840M5418P55708P13394
$$ 6615727 6845219 7092803 7144059 7379963 7573948 7691771 7705611 7751029 8506737 9220131
3687I220131J36825j50222L14267n33702K52054k90623o03053L18556K46440n50000
$$ 9220131 9356956 9206734 9521001 8987299 9239353 8948730 8345677 8664233 8910673 8360673
3677H360673l23378j2752l45386j96561j04158j55744L34195J24574J80149m6261
$$ 8360673 8037295 8024543 7679157 7482596 7378438 7222694 7556889 7681463 7861612 7815351
3667G815351k74289J35058L0007J15443J30968J80270M46678m47665J31606K47525
$$ 7815351 7541062 7676120 7706127 7821570 7952538 8132808 8579486 8131821 8263427 8510952
3657H510952J52556K91188M4576l97651L05444L72853k49866J44442O92446N6071
$$ 8510952 8663508 8954696 8999272 8601621 8907065 9279918 9030052 9174494 9866940 9923011
3647I923011k05715L00115J58636M69489O60612m21847L13415L52703J28185M21871
$$ 9923011 9717296 10017411 10176047 10645536 11306148 10884301 11197716 11550419 11678604 12100475
3637A2100475M56297N8095k06231J123007K6435K17963M6694L43804P72565L25407
$$ 12100475 12556772 12614867 12408636 13531643 13558078 13776041 13822735 14166539 14939104 15264511
3627A5264511K71535Q41952M56870Q84739N81812j1160N13832L47487K60787R31962
$$ 15264511 15536046 16377998 16834868 17719607 18301419 18290259 18804091 19151578 19412365 20344327
3617B0344327M63603Q54463Q01236K06103P65985M31382R60436Q32248K36041
$$ 20344327 20807930 21662393 22463629 22669732 23435717 23867099 24827535 25659783 25895824
3608B5895824N46911O80076N71267K26954N9079R52002K59639L40341J33737m35200
$$ 25895824 26442735 27122811 27694078 27921032 27980111 28932113 29191752 29532093 29665830 29230630
3598B9230630J04393k44967p0939L04949j595j42224n9578j90643j90145k05297
$$ 29230630 29335023 29090056 29019117 29324066 29322471 29180247 29120669 28930026 28739881 28534584
3588B8534584r68287m71208j77844K891r1597q05129n18787O4989J30006o33184
$$ 28534584 27566297 27095089 26917245 26920136 26828539 26023410 25504623 25569612 25699618 25066434
3578B5066434q68344q0402l38016J1770l30100n70539m11257k82056l1633l94067
$$ 25066434 24198090 24117688 23779672 23791442 23461342 22890803 22479546 22197490 22165857 21771790
3568B1771790k86655j023510k69479k14850p1674n30207j35373m92536q0958k71765
$$ 21771790 21485135 20461625 20192146 19977296 19905622 19375415 19240042 18747506 18666548 18394783
3558A8394783n92480n19422R0773M1335k35050n07273j78228n52626q18129m38729
$$ 18394783 17802303 17282881 17373654 17414989 17179939 16672666 16494438 15941812 15123683 14684954
3548A4684954Q4614L37604J97155l53775n24132K11134l68251j75340m77872K3237
$$ 14684954 14769568 15107172 15304327 14950552 14426420 14637554 14269303 14093963 13616091 13639328
3538A3639328O502L6957j30277k72311K49101L19941K63673k44515J4092N9480
$$ 13639328 13645830 13682787 13552510 13280199 13529300 13849241 14112914 13868399 13882491 13941971
3528A3941971M68740K8049l63546k6267k04963L29374K08847l44532o863K77211
$$ 13941971 14410711 14438760 14075214 14048947 13843984 14173358 14382205 14037673 14030810 14308021
3518A4308021M8249j47295M86966q533K0486O03290j3411J88922J87734K73252
$$ 14308021 14356270 14208975 14695941 14687408 14707894 15311184 15297773 15486695 15674429 15947681
3508A5947681l34828N53569K57011N40656J95549n4001K62902q3458J116763N90947
$$ 15947681 15612853 16166422 16423433 16964089 17159638 17105637 17368539 17285081 18401844 18992791
3498A8992791N52606N0377K50409O15239M19201O39245K8893L00831R33510L85573
$$ 18992791 19545397 19595774 19846183 20461422 20880623 21519868 21548761 21849592 22783102 23168675
3488B3168675K00694K87546J77708J122213K53266L28214N11358M10938M16832
$$ 23168675 23369369 23656915 23834623 24956836 25210102 25538316 26049674 26460612 26877444
3479B6877444O74723P85755O90873P29349J036122Q47622L28197J023688P59752
$$ 26877444 27552167 28337922 29028795 29758144 30794266 31641888 31970085 32993773 33753525
3470C3753525J014103J479419J038282J137860O50921P59435J499050J138950
$$ 33753525 34767628 36247047 37285329 38423189 39074110 39833545 41332595 42471545
3462D2471545J513841J468997J504165J280191J188345J819558R45395J180649
$$ 42471545 43985386 45454383 46958548 48238739 49427084 51246642 52192037 53372686
3454E3372686J330477J197902J037012O60590Q71430J39448N88835J00046M992
$$ 53372686 54703163 55901065 56938077 57598667 58470097 58609545 59198380 59298426 59303418
3445E9303418K31919p10914o21258j57065j056739j351783p51901j167117p09020
$$ 59303418 59535337 58824423 58203165 58046100 56989361 55637578 54885677 53718560 53009540
3436E3009540q87318j207300j276089j405696j209501p96255l63719m79822j086384
$$ 53009540 52122222 50914922 49638833 48233137 47023636 46227381 45863662 45383840 44297456
3427D4297456j066810n60978j49512m9549j17434m79599j77517m33408P7634J30082
$$ 44297456 43230646 42669668 42520156 42470607 42353173 41873574 41696057 41262649 41340283 41470365
3417D1470365l5742k97417l55883k06075j011474j073488o94783p85934q84020
$$ 41470365 41434623 41137206 40781323 40575248 39563774 38490286 37795503 37009569 36125549
3408C6125549r02951j173996j164025j094673q71341q86085j021102p04950j204825
$$ 36125549 35222598 34048602 32884577 31789904 30918563 30032478 29011376 28306426 27101601
3399B7101601m99576o54371l62269p18304q36182l55938q23304o78711j035072
$$ 27101601 26602025 25947654 25585385 24867081 24030899 23674961 22851657 22172946 21137874
3390B1137874n32419n14788j53704p41288n77883j92127p32847l13895o36168
$$ 21137874 20605455 20090667 19936963 19195675 18617792 18425665 17692818 17378923 16742755
3381A6742755j86227k30437l73663j88677o52866j4678n33198m70861k99536k80003
$$ 16742755 16556528 16326091 15952428 15763751 15110885 15096207 14563009 14092148 13792612 13512609
3371A3512609l49622l66179n57008K87178l94273j9341M69155k96174m63960l6061
$$ 13512609 13162987 12796808 12239800 12526978 12132705 12113364 12582519 12286345 11822385 11786324
3361A1786324P9144k75252m33163m10035o9136L43659k32130o82651K82920O537
$$ 11786324 11865468 11590216 11157053 10747018 10677882 11021541 10789411 10106760 10389680 10396217
3351A0396217Q9541m1996o40861L4889O19916M20741l20415J79313N83929J09260
$$ 10396217 10485758 10443762 9802901 9837790 10457706 10878447 10558032 10737345 11321274 11430534
3341A1430534j57722Q4636N41057L0287M14396N2764m60070p4755K91728O73995
$$ 11430534 11272812 11357448 11898505 11928792 12343188 12395952 11935882 11861127 12152855 12826850
3331A2826850L39716l0727m61842J5426k75605n08251m75960o57o88969k17681
$$ 12826850 13166566 13135839 12673997 12689423 12413818 11905567 11429607 11428950 10739981 10522300
3321A0522300n10650j40569N72290l43089m61455K11118j23778M01547k06941
$$ 10522300 10011650 9871081 10443371 10100282 9638827 9849945 9726167 10127714 9920773
3312I920773l30252j06109o13344j5125J16393M14245j70614L40489L5848o82227
$$ 9920773 9590521 9484412 8871068 8855943 8972336 9386581 9215967 9556456 9592304 8910077
3302H910077J55217K81437n94130k54489j04880J46168p8723K12037K38917P79730
$$ 8910077 9065294 9346731 8752601 8498112 8393232 8539400 8460677 8672714 8911631 9691361
3292I691361M2101o68545n68723j70658M68387M19776l75861L19233K98773j25337
$$ 9691361 9733462 9064917 8496194 8325536 8793923 9213699 8837838 9157071 9455844 9330507
3282I330507J41125K6410p3383N91431K00076J1274P6592p3014O56323k18912
$$ 9330507 9471632 9498042 9424659 10016090 10216166 10227440 10304032 10231018 10887341 10668429
3272A0668429J79314M68402K34501L94049j21280L05215L81460J7388N02712N68804
$$ 10668429 10847743 11316145 11550646 11944695 11823415 12128630 12510090 12527478 13030190 13598994
3262A3598994k02476L83304l21857k19525K04963k8551O83399Q0012j97475N00340
$$ 13598994 13396518 13779822 13457965 13238440 13443403 13414852 14098251 14178263 13980788 14481128
3252A4481128n30817P2068p5535l31948L04002O8675K89183L49530k94556l72006
$$ 14481128 13950311 14022379 13946844 13614896 13918898 13987573 14276756 14626286 14331730 13959724
3242A3959724o27912M58895P00578k71118L32714K35535K18727M6450n96935l8953
$$ 13959724 13331812 13790707 14491285 14220167 14552881 14788416 15007143 15053593 14456658 14417705
3232A4417705Q36091m52258K85046L79332K05994l9135l84936J5631M7087q412
$$ 14417705 15253796 14801538 15086584 15465916 15671910 15632775 15247839 15263470 15310557 15302145
3222A5302145M25491J21741J15064L16399J24710K79158N3709k24521N00393K56297
$$ 15302145 15727636 15849377 15964441 16280840 16405550 16684708 16738417 16513896 17014289 17270586
3212A7270586k24489J45428K32584L97011J69154J40428P32095P01021j07898
$$ 17270586 17046097 17191525 17424109 17821120 17990274 18130702 18862797 19563818 19455920
3203A9455920K8209k01639K23316N50095K6006N8838J38058m0586L74583N02220
$$ 19455920 19484129 19282490 19505806 20055901 20081907 20140745 20278803 20238217 20612800 21115020
3193B1115020m53821K41201j60652K51112P32385K44218O4290J08858K19862j53273
$$ 21115020 20661199 20902400 20741748 20992860 21725245 21969463 22033753 22142611 22362473 22209200
3183B2209200J31411R23521K55092O41032P08012L95854M96280P33256Q09518
$$ 22209200 22340611 23264132 23519224 24160256 24868268 25264122 25760402 26493658 27303176
3174B7303176R43169M32848J015807M67949R59922J247091J294661J713312K76840
$$ 27303176 28246345 28679193 29695000 30162949 31122871 32369962 33664623 35377935 35654775
3165C5654775J616843J328199K231990J464169J220219J528745J607880J598078
$$ 35654775 37271618 38599817 40831807 42295976 43516195 45044940 46652820 48250898
3157D8250898K264084J922376J688413R97159J537877J520293J614342J647406
$$ 48250898 50514982 52437358 54125771 55122930 56660807 58181100 59795442 61442848
3149F1442848J176909J360527J268279J197552J032573J090795L61873O79736
$$ 61442848 62619757 63980284 65248563 66446115 67478688 68569483 68931356 69611092
3141F9611092K46659Q37901o2261m1195M53577k38374l79833n13980l70052m00531
$$ 69611092 69857751 70695652 70633391 70592196 71045773 70807399 70427566 69913586 69543534 69143003
3131F9143003j206911j290666q81146j432460j461452q84728j766101j388637
$$ 69143003 67936092 66645426 65764280 64331820 62870368 61985640 60219539 58830902
3123E8830902j176348j601686k289796j809743k199799k048460j695083j571768
$$ 58830902 57654554 56052868 53763072 51953329 49753530 47705070 46009987 44438219
3115D4438219j646713j596781j375105j563649j083269p00340j472021j274062
$$ 44438219 42791506 41194725 39819620 38255971 37172702 36472362 35000341 33726279
3107C3726279n63822o21364o13286n57401l27121m80488n5495k00063K3561j19341
$$ 33726279 33162457 32541093 31927807 31370406 31043285 30562797 30507302 30307239 30330800 30211459
3097C0211459j15876K92888M87947O56543L15814L24343O44783M36958J218977
$$ 30211459 30095583 30388471 30876418 31532961 31848775 32173118 32817901 33254859 34473836
3088C4473836L37034K05308J4585n6393P5570l27588L2446O262J68676j33383
$$ 34473836 34810870 35016178 35030763 34974370 35049940 34722352 34754798 34761060 34929736 34796353
3078C4796353k65111k06725k11020r0145n38352k98809n94605l16722n85332q82395
$$ 34796353 34531242 34324517 34113497 34023352 33485000 33186191 32591586 32274864 31689532 30807137
3068C0807137m55725m04434n16712r24115q11292r51218o56385q4702j388966
$$ 30807137 30351412 29946978 29430266 28506151 27694859 26743641 26087256 26002554 24613588
3059B4613588n63995o21076j163756l03594p54307o24827q07741k61880j18889
$$ 24613588 24049593 23428517 22264761 21961167 21206860 20582033 19774292 19512412 19393523
3050A9393523m67296p08279m41337k88343p5874m07387m75823P7319k24781j43799
$$ 19393523 18926227 18217948 17776611 17488268 17412394 17005007 16529184 16606503 16381722 16237923
3040A6237923l68045j37749L19898O7203L22330J70356L8967k59405L9488K45435
$$ 16237923 15869878 15732129 16052027 16119230 16441560 16611916 16650883 16391478 16430966 16676401
3030A6676401q5590N77251M8097j39792J6438P07680R15781O25446N02305K42467
$$ 16676401 16590811 17168062 17216159 17076367 17092805 17800485 18716266 19341712 19844017 20086484
3020B0086484R46707O85043P65170J027371J166030O09255J466699J695749J184400
$$ 20086484 21033191 21718234 22483404 23510775 24676805 25286060 26752759 28448508 29632908
3011B9632908J309821J274388J903167J498503J932359J828786K552025K286653
$$ 29632908 30942729 32217117 34120284 35618787 37551146 39379932 41931957 44218610
3003D4218610J884832K183778K060002J881199K101365J580984Q70807J307908
$$ 44218610 46103442 48287220 50347222 52228421 54329786 55910770 56781577 58089485
2995E8089485J65803o8105m92278j004925j634265k043889k711838k550706l242665
$$ 58089485 58255288 58187183 57694905 56689980 55055715 53011826 50299988 47749282 44506617
2986D4506617k151580k496469k341456k504719k307306j613938j379658j444512
$$ 44506617 42355037 39858568 37517112 35012393 32705087 31091149 29711491 28266979
2978B8266979j177774j217846j482801p14766n84850r54315j044706m85698m52118
$$ 28266979 27089205 25871359 24388558 23673792 23088942 22134627 21089921 20604223 20152105
2969B0152105j220723j071085l88701l60027q71669l57948k80046o48323l74737
$$ 20152105 18931382 17860297 17471596 17111569 16239900 15881952 15601906 14953583 14578846
2960A4578846l22506Q5156p24670k84775n72486l69405r4040q1019j1228M00794
$$ 14578846 14256340 14341496 13616826 13332051 12759565 12390160 12296120 12215101 12203873 12604667
2950A2604667j60687k61227m40694N1116j38524N73740Q9659P9596J48166L40012
$$ 12604667 12443980 12182753 11742059 11793175 11654651 12228391 12318050 12397646 12545812 12885824
2940A2885824j61710j53863K13159Q46850O20462J07279M88579k3171j0617M02534
$$ 12885824 12724114 12570251 12783410 13630260 14250722 14358001 14846580 14823409 14812792 15215326
2930A5215326k7004J06844o4346M2725j45793m44472o84662n42098j67188o73878
$$ 15215326 15188322 15295166 15230820 15273545 15127752 14683280 13998618 13456520 13289332 12615454
2920A2615454k29625k14651p03370r89305o19091k9401o8633n09821l52447n34351
$$ 12615454 12385829 12171178 11467808 10478503 9859412 9830011 9761378 9251557 8899110 8364759
2910H364759n54924J00649r9919k49678k12009m59710j72054M07050j76881l1382
$$ 8364759 7809835 7910484 7810565 7560887 7348878 6889168 6717114 7124164 6947283 6915901
2900F915901L46381n89352p04280P9764l0661o8167J02477O9127L60803M4142
$$ 6915901 7262282 6672930 5968650 6048414 6017753 5949586 6052063 6121190 6481993 6526135
2890F526135K17744m33328j98016l98179K25176m7631j8674n27333L22610j96539
$$ 6526135 6743879 6310551 6112535 5714356 5939532 5891901 5873227 5345894 5668504 5471965
2880E471965R5793l7546L9436m6743m2763K23961o4897J50750N4486K11888J47265
$$ 5471965 5567758 5530212 5569648 5522905 5480142 5704103 5639206 5789956 5844442 6056330 6203595
2869F203595j39401l10776l21622j73464N84417M8111l19210m3445P10843R110
$$ 6203595 6064194 5753418 5431796 5258332 5842749 5890860 5571650 5528205 6239048 6248158
2859F248158j90664J2730n08212J49294N43200K25700p6332j649J60588k8850
$$ 6248158 6057494 6070224 5562012 5711306 6254506 6480206 6403874 6402225 6562813 6533963
2849F533963N13021j64119j05742M78002J2716k87883k82471K69347J21406P0246
$$ 6533963 7046984 6882865 6777123 7255125 7267841 6979958 6697487 6966834 7088240 7158486
2839G158486j26645J48880M12115M67514J5410r9377K25157J68006K02517K72442
$$ 7158486 7031841 7180721 7592836 8060350 8075760 7976383 8201540 8369546 8572063 8844505
2829H844505J20818L8201k78317J36760N82146K99875M03184n00974M29411N16558
$$ 8844505 8965323 9003524 8725207 8861967 9444113 9743988 10147172 9646198 10075609 10592167
2819A0592167J1920q4969O70811L85520Q1350O64307L79341M24934L59369K23471
$$ 10592167 10604087 10519118 11189929 11575449 11656799 12321106 12700447 13125381 13484750 13708221
2809A3708221J40169L76590N10127K92716K99044K43894O26620R41236K38757
$$ 13708221 13848390 14224980 14735107 15027823 15326867 15570761 16197381 17138617 17377374
2800A7377374M47379K21974R7178P06208O82670J04048N78834N27777N83039J047781
$$ 17377374 17824753 18046727 18143905 18850113 19532783 19636831 20215665 20743442 21326481 22374262
2790B2374262Q67633Q19572L18968M54162M99679J144136J041198Q60656J129153
$$ 22374262 23241895 24061467 24380435 24834597 25334276 26478412 27519610 28380266 29509419
2781B9509419J133415J312575J281132J128810J127193J108332J995763K164882
$$ 29509419 30642834 31955409 33236541 34365351 35492544 36600876 38596639 40761521
2773D0761521J750116K135243K936137L319611L112586K920454M092921M042570
$$ 40761521 42511637 44646880 47583017 50902628 54015214 56935668 61028589 65071159
2765F5071159M859250N623196N573591N293398N582190O333441O064259P096874
$$ 65071159 69930409 75553605 81127196 86420594 92002784 98336225 104400484 111497358
2757A11497358P899713Q578889R599650J0174301J0207132J0721900R047404P550204
$$ 111497358 119397071 127975960 137575610 147749911 157957043 168678943 177726347 185276551
2749A85276551O228188L821967Q12772k834873o459989j0025842j1728566j2057712
$$ 185276551 191504739 195326706 196139478 193304605 186844616 176818774 165090208 153032496
2741A53032496j2162920j1167876r118593q730557q131761o626724n736975n242276
$$ 153032496 140869576 129701700 120583107 111852550 103720789 97094065 91357090 86114814
2733H6114814m761330l943599m061706l556394l770945l706940l158966l233295
$$ 86114814 81353484 77409885 73348179 69791785 66020840 62313900 59154934 55921639
2725E5921639k709783k500160k215340j702141j802519j577485q05049o12382
$$ 55921639 53211856 50711696 48496356 46794215 44991696 43414211 42609162 41996780
2717D1996780r89072j137822n61187m93308K6787k49784k78449N46406L44958
$$ 41996780 41007708 39869886 39308699 38815391 38842178 38592394 38313945 38860351 39205309
2708C9205309O11898P80617Q22967J192630J343327J593564J592740J750411J619150
$$ 39205309 39817207 40597824 41420791 42613421 43956748 45550312 47143052 48893463 50512613
2699E0512613J247007M25472q99403j522049k254031k839580l140478l119029
$$ 50512613 51759620 52185092 51285689 49763640 47509609 44670029 41529551 38410522
2691C8410522k497381k796917k505524k131126j563479j473152j623202j284035
$$ 38410522 35913141 33116224 30610700 28479574 26916095 25442943 23819741 22535706
2683B2535706r96536j115510j500702J9111n13728j044112o69362p44596k92918
$$ 22535706 21539170 20423660 18922958 18942069 18428341 17384229 16714867 15970271 15677353
2674A5677353n93664o73981o15890k64343m69990m9077l16930n77078p60010o95259
$$ 15677353 15083689 14409708 13793818 13529475 13059485 13010408 12693478 12116400 11356390 10661131
2664A0661131m7111l73497n68182o54580o1513j1192k13779n56592N322k53726
$$ 10661131 10614020 10240523 9672341 9017761 8956248 8945056 8731277 8174685 8180007 7926281
2654G926281q4206r9561K30377l23424k92722l74485j99473l57913k99801Q2322
$$ 7926281 7842075 7742514 7972891 7649467 7356745 6982260 6782787 6424874 6125073 6207395
2644F207395l94269M14091j78008m23741L35902k85086l91662J32390K56104K234
$$ 6207395 5813126 6227217 6049209 5625468 5961370 5676284 5284622 5417012 5673116 5675350
2634E675350k50784n53583o7084K72997O4497j15091m26336J27896o7204l92120
$$ 5675350 5424566 4870983 4803899 5076896 5141393 5026302 4599966 4727862 4660658 4268538
2624D268538j75454J77292L66694r5551o81381k95896K90439M3009l87813j66479
$$ 4268538 4093084 4270376 4637070 4541519 3860138 3564242 3854681 3897690 3509877 3343398
2614C343398R5847L98343l1283P0199p02396k36463N36562n22493n631O3927K31851
$$ 3343398 3439245 3837588 3806305 3876504 3174108 2937645 3474207 2951714 2946083 3010010 3241861
2603C241861l60170k502J21197k51842k03826k23343K49048J55675J94236k16368
$$ 3241861 2881691 2879189 3000386 2748544 2544718 2321375 2570423 2726098 2920334 2703966
2593B703966J4210l81839K30817J62295o1807j29114j7897L71893m83682m47286
$$ 2703966 2718176 2336337 2567154 2729449 2667642 2538528 2520631 2892524 2408842 1961556
2583A961556O7995O19210P7919l75009J4854n15389L25083p209J86729l58153
$$ 1961556 2029551 2648761 2726680 2351671 2366525 1851136 2176219 2169010 2355739 1997586
2573A997586M38865j57924l46478R7333L8741k09324k94004M73765l06037j52861
$$ 1997586 2436451 2278527 1932049 2029382 2068123 1858799 1564795 2038560 1732523 1579662
2563A579662M49083K12612l11271M24m64947j36496l56236N48956N50197O5798
$$ 1579662 2028745 2241357 1930086 1930510 1465563 1329067 972831 1521787 2071984 2137782
2553B137782m26684l50673j32824r01J31099J17243K68383k42035m90530L84571
$$ 2137782 1711098 1360425 1227601 1226700 1357799 1475042 1743425 1501390 1010860 1395431
2543A395431L134o3855J77577k28438m45320L63062N21712m68040J03470Q0413
$$ 1395431 1398565 1334710 1512287 1283849 838529 1201591 1723303 1255263 1358733 1439146
2533A439146o9899l01870L52161l29626m73266J59839l89710L39830N67341q9172
$$ 1439146 1369247 1067377 1419538 1089912 616646 776485 386775 726605 1293946 1204774
2523A204774J92607k94265l84462L84370n819K5894J70627k34620p0618L17674
$$ 1204774 1397381 1103116 718654 1103024 1097205 1123099 1293726 1059106 988488 1306162
2513A306162l02194J52618l49056L6256M43200m47171q7348l39321q1466J75139
$$ 1306162 1003968 1156586 807530 843786 1286986 839815 752467 413146 331680 506819
2503E06819L09852M22174j58809o7351M31349R9391l06687K35058p5752o7970
$$ 506819 816671 1238845 1080036 1012685 1444034 1543425 1236738 1471796 1396044 1328074
2493A328074K87679P070K10018n22701R5986K02687J66377J38698l09334L83350
$$ 1328074 1615753 1622823 1832841 1310140 1406126 1608813 1775190 1913888 1604554 1987904
2483A987904k86033n03538k28820L4943M4917n47316o0776J33729K60441J34847
$$ 1987904 1701871 1198333 969513 1004456 1049373 502057 441281 575010 835451 970298
2473I70298M36791j71690m9050k38989k43568j52291l68487K5735l11352L16364
$$ 970298 1407089 1235399 1186349 947360 703792 551501 183014 208749 -102603 213761
2463B13761K79421N35518R899n96655N4559M41951K1852k40814j47015K89703
$$ 213761 493182 1028700 1038599 441944 496503 938454 960306 719492 572477 862180
2453H62180j39998m90894o0010M02443j45630K06655M17433r4937n5853j58110
$$ 862180 722182 231288 171278 573721 428091 634746 1052179 957242 901389 743279
2443G43279j31195m97335K44366K26808j97444k0321P3095j202l70281n7095K80619
$$ 743279 612084 114749 359115 585923 388479 368158 441253 440051 69770 12675 293294
2432B93294K67925J81645J71598m18217k55876L65084O2687n48141j24046M91030
$$ 293294 561219 742864 914462 496245 240369 605453 668140 119999 -4047 486983
2422D86983O4702k73131O18474j85971m48295k09575k42767K90581l63681K6859
$$ 486983 551685 278554 897028 711057 262762 53187 -189580 101001 -262680 -235821
2412b35821O79088l99245n3462M79656j58550k82088M42242m0447l70364K68100
$$ -235821 443267 44022 -9440 470216 311666 29578 471820 431373 61009 329109
2402C29109J70706P6003m78462q8946M95055k38046l42577J41348J63720k1805
$$ 329109 499815 575818 97356 8410 503465 265419 -77158 64190 227910 206105
2392B06105k92962L27462L1640k06566P7832o8060m60107L68395J34527l91603
$$ 206105 -86857 240605 272245 65679 143511 75451 -384656 -16261 118266 -273337
2382b73337m09503M61490k00891J49409K08655M15705L4144j77985n1793K0624
$$ -273337 -682840 -221350 -422241 -272832 -64177 351528 385672 207687 155894 176518
2372A76518L30154j77550L6258J69452k69944j06083Q4734j08070r5267j86542
$$ 176518 506672 329122 365380 534832 264888 158805 243539 135469 40202 -146340
2362a46340L54569j62847K04539k10248o1771l7259l10518N90738q743N822K51192
$$ -146340 208229 45382 249921 39673 -22098 -59357 -369875 220863 212120 217942 469134
2351D69134k07633j98831o76357L95281J13649R6290N16213k57733l71887p847
$$ 469134 261501 62670 -613687 -218406 -104757 -8467 507746 250013 -121874 -129721
2341a29721k0155L81094m99996k93066L61253K09418k8488j01792L25680j36055
$$ -129721 -149876 231218 -268778 -561844 -200591 8827 -19661 -121453 204227 68172
2331F8172k53241J69682j64644J22947L44559n6861N1821q8319M3991K6819k88454
$$ 68172 -185069 -15387 -180031 -57084 287475 230614 282435 194116 238107 264926 -23528
2320b3528J01711j32289k22061K73091K38055K52263r2111m15369L13323j05595
$$ -23528 78183 -54106 -276167 -3076 234979 487242 395131 -20238 293085 187490
2310A87490K69219R2561L7739K67849O13976M24510m32678k49450O3080N42391
$$ 187490 456709 549270 587009 854858 1468834 1893344 1460666 1211216 1274296 1816687
2300A816687L54493o61089m93395n82761K38902L45470m21771N9539k511K3275
$$ 1816687 2171180 1510091 1016696 433935 672837 1018307 596536 656075 653564 676839
2290F76839n77822K87441m8908k56122K44132M63254n22721j0772K68797n1896
$$ 676839 99017 386458 337550 81428 325560 788814 266093 255321 524118 472222
2280D72222o2529j90913N6900o5594L39583l93700j20114L66668j98700p5149
$$ 472222 409693 218780 275680 210086 549669 155969 35855 402523 203823 128674
2270A28674K99087M44441p3497j77645m18400R0128J71327k47091J1485J27325
$$ 128674 427761 872202 798705 621060 202660 292788 464115 217024 228509 355834
2260C55834k36285K57019J01320J50048k92402J20629N1504j8889r5476m08028
$$ 355834 119549 376568 477888 627936 335534 456163 507667 488778 393302 -14726
2250a4726l87199M73002O02335j01247k18623M3638j93225P23937L5647k66141
$$ -14726 -401925 71077 673412 572165 353542 397180 203955 927892 963539 697398
2240F97398q8603k34543l7879L9876j68971K49789K84201n35264l22751L36074
$$ 697398 608795 374252 336373 376249 207278 457067 741268 206004 -116747 219327
2230B19327k73405M3458L60848m8533p5767J12195J95064p8885k18264k92922
$$ 219327 -54078 -10620 350228 301695 225928 338123 533187 454302 236038 -56884
2220e6884P46862J5702j69723k49801K45853k18374M76990l2555J06016j71930
$$ -56884 689978 705680 535957 286156 532009 313635 790625 758070 864086 692156
2210F92156q2779L08985p7552R596R9748p6629J98206m28841K08679J20085J88509
$$ 692156 609377 918362 840810 850406 950154 873525 1071731 642890 851569 971654 1160163
2199A160163k34850J89724n2586m74714J91516o4771K73472J04138j4639k15884
$$ 1160163 925313 1115037 1062451 587737 779253 714482 987954 1092092 1077453 861569
2189H61569R821N29014j13218j06141K0764P3651J08153k89937r9417k19996J95140
$$ 861569 871390 1400404 1287186 1181045 1201809 1275460 1383613 1093676 994259 774263 969403
2178I69403j85442L30202N1089j48918J78840L11675L12016j06678m03534q0356
$$ 969403 783961 1114163 1165252 1016334 1195174 1506849 1818865 1712187 1308653 1228297
2168A228297M69310j36711N24680J77880k49818k21972L52842K28671J44085J66489
$$ 1228297 1697607 1560896 2085576 2263456 2013638 1791666 2144508 2373179 2517264 2683753
2158B683753n81047J96796J61463O3283J37352P71009J70406k84429j38145l530
$$ 2683753 2102706 2299502 2460965 2524248 2661600 3432609 3603015 3318586 3180441 3176911
2148C176911K7664p5492J0979P6183J87561k42852k44315K56004K19723K24075
$$ 3176911 3204575 3129083 3140062 3216245 3403806 3160954 2916639 3172643 3392366 3616441
2138C616441M94700k83067j17558J38359P75329K10891j2791M46583P7319k05426
$$ 3616441 4111141 3828074 3710516 3848875 4624204 4835095 4822304 5268887 5346206 5140780
2128E140780L82089k1624L65568J33946J14082J27813O5749P49731J56108L00352
$$ 5140780 5522869 5501245 5866813 6000759 6114841 6242654 6308403 7058134 7214242 7514594
2118G514594L83929j3934M37510L27910l34582J5121L11816M69784J81064p035
$$ 7514594 7898523 7884589 8322099 8650009 8315427 8330548 8642364 9112148 9293212 9286177
2108I286177O01672O26954K35448J38655L22960O61675J63996K91511L81255J87126
$$ 9286177 9887849 10514803 10750251 10888906 11211866 11873541 12037537 12329048 12710303 12897429
2098A2897429L62588O78389R94627M74124j54182J214439J069472P35274N53967
$$ 12897429 13260017 13938406 14933033 15407157 15252975 16467414 17536886 18272160 18826127
2089A8826127O18526J219484J304667J138853J340396J849509K241508K386995
$$ 18826127 19444653 20664137 21968804 23107657 24448053 26297562 28539070 30926065
2081C0926065K257015K379174L365650L808669L917880M777574N131972N948683
$$ 30926065 33183080 35562254 38927904 42736573 46654453 51432027 56563999 62512682
2073F2512682N619954N055215P260425J0224878J1895128J4263171J9326121K1738500
$$ 62512682 68132636 73187851 80448276 90673154 102568282 116831453 136157574 157896074
2065A57896074K7404620L1276395M0848713M0530250L2616464q360163n3943985
$$ 157896074 185300694 216577089 257425802 297956052 330572516 322212353 268268368
2058B68268368o5631243n1313097k9280964k0274848j3054339r634034p137096
$$ 268268368 202637125 151324028 122043064 101768216 88713877 79079843 71942747
2051G1942747o458575n473823m609740l338294l438738l835987m505396l920926
$$ 71942747 65484172 60010349 55400609 52062315 48623577 44787590 40282194 36361268
2043C6361268k982063j757670k054474j980311j112132j362176j356049m19153
$$ 36361268 33379205 31621535 29567061 27586750 26474618 25112442 23756393 23337240
2035B3337240j073150q83216j227833j294217q99990j49709r26367n84330j332429
$$ 23337240 22264090 21380874 20153041 18858824 17958834 17809125 16882758 16298428 14965999
2026A4965999o59751q71569l55576j105337K5143n27431k38974p41321o71886
$$ 14965999 14306248 13434679 13079103 11973766 11998909 11471478 11232504 10491183 9819297
2017I819297J26993l17278l98968o43519l07802K8659l59119j33873p65724p7324
$$ 9819297 9946290 9629012 9230044 8586525 8278723 8307382 7948263 7814390 7048666 6971342
2007F971342J94054J69405k87080k89142j59649l32896j37922k28907j53198M68171
$$ 6971342 7165396 7334801 7047721 6758579 6598930 6266034 6128112 5899205 5746007 6214178
1997F214178R0703p29492p5119p5005K77285k48216P7695n11851Q8577J79527
$$ 6214178 6304881 5575389 5500270 5425265 5702550 5454334 5532029 5020178 5108755 5288282
1987E288282o51821m03177P8350O0030M2438k31955l67439m18491j55521q5767
$$ 5288282 4636461 4233284 4311634 4371664 4414102 4182147 3814708 3396217 3240696 3154929
1977C154929o9362P0466j45074q8655l77656k85015r3244m56542j21210O13980
$$ 3154929 3085567 3156033 3010959 2922304 2544648 2259633 2166389 1709847 1588637 2202617
1967B202617j10518o49586K75733L23111Q2869l31121L4927K56289Q0709J33675
$$ 2202617 2092099 1442513 1718246 2041357 2124226 1793105 1828032 2084321 2165030 2298705
1957B298705k56449j91284N8947q3919o2060J73737j36275q3619o8281n9566q9373
$$ 2298705 2042256 1850972 1909919 1826000 1763940 1937677 1801402 1717783 1649502 1589936 1500563
1946A500563k93511J61540l30299n1915J74907K25212k98252J59829j48081K49281
$$ 1500563 1207052 1368592 1038293 986378 1161285 1386497 1088245 1248074 1099993 1349274
1936A349274k81514j16456N19767k62455n61156L88470K49304K33095l29896l7848
$$ 1349274 1067760 951304 1471071 1208616 647460 1035930 1285234 1518329 1188433 1150585
1926A150585l04490J13656N1595p8195q2728K74682K02351k99869l76390m65633
$$ 1150585 846095 959751 1011346 933151 850423 1125105 1327456 1027587 651197 185564
1916A85564N39489K83477j28417M41451n7614r2063L70323n05979n43658J69707
$$ 185564 725053 1008530 880113 1321564 1263950 1171887 1542210 1036231 492573 662280
1906F62280K04662L04199k00550p61418J90101M02812k77906j5513K5990K24543
$$ 662280 866942 1171141 970591 209173 399274 802086 524180 508667 534657 759200
1896G59200K3418j33248j48269J06025j676Q5359k22629J55075M20799l28875
$$ 759200 782618 649370 501101 607126 605450 690809 468180 623255 1044054 715179
1886G15179N23748n9867n25251k2551r5346j28922q5675L2838K91555j58154k20225
$$ 715179 1238927 1179060 653809 631258 535912 406990 321315 354153 645708 487554 267329
1875B67329L9135o8720l53990K19483L69471K27097r6927M8666R7759K05067o85884
$$ 267329 306464 237744 -116246 103237 472708 699805 602878 651544 749303 954370 268486
1864B68486L02318n92606J57468N48861m59325l67469k47444J60575M41658k90204
$$ 268486 570804 -21802 135666 684527 225202 -142267 -389711 -229136 212522 -77682
1854g7682M04002p4193l83398J38632J17694p7426l05706j85764L34778N19952
$$ -77682 326320 252127 -131271 7361 125055 47629 -258077 -443841 -109063 410889
1844D10889R841q6580K00018K46141k0515k07989j87200K02274j2421j14575n5531
$$ 410889 420730 334150 534168 780309 759794 551805 364605 566879 554458 439883 384352
1833C84352j03034L98605o3639k07881K08896J90709K5257l90310O41758j11086
$$ 384352 281318 679923 616284 408403 617299 808008 833265 442955 1084713 973627
1823I73627l49707L54464O7950J89909L96588j37974J090j23202p1401n17817
$$ 973627 623920 978384 1046334 1236243 1632831 1494857 1495947 1372745 1301344 783527
1813G83527l27804J32556k24703L5101M47386l30679j50134j43802j16355j9874
$$ 783527 455723 588279 363576 398677 846063 515384 365250 221448 105093 85219
1803H5219L19363j65356k56951O52241o5308k15004j55385r5614L8633k29378
$$ 85219 404582 239226 -17725 634516 569208 354204 198819 103205 141838 -87540
1793h7540o3774j19791N21427K37381j31489l27849o6093j52452K42415M40629
$$ -87540 -151314 -271105 250322 487703 356214 28365 -37728 -190180 52235 492864
1783D92864l59710K04030n1734k6261k93469Q4942j17847K48983O9532j3327j48171
$$ 492864 133154 337184 285450 259189 -34280 50662 -67185 181798 251330 238003 89832
1772H9832J62389j70097J06122J22222L49478M24135o16768j54542K13936m64894
$$ 89832 252221 82124 188246 310468 659946 1084081 467313 312771 526707 61813
1762F1813n29965M28695R3575M370K2220Q2459j34282N4279r4969J01543J81181
$$ 61813 -468152 -39457 54118 58488 80708 163167 28885 83164 -11805 89738 270919
1751B70919K5372j12744J07234o74671M32123n3025K65040P5987o70322j24477
$$ 270919 296291 183547 290781 -383890 48233 -4792 260248 336235 -334087 -458564
1741d58564N88853K51027o20890j13450o2241M39925j0671P5385n1290j07946
$$ -458564 130289 381316 -239574 -353024 -415265 24660 13989 89374 38084 -69862
1731f9862m77169L35413J05867j86028K49570J72611j89306k22101j58282M76584
$$ -69862 -547031 -211618 -105751 -291779 -42209 130402 -58904 -281005 -439287 37297
1721C7297j13706J82260J6630K18638N8843n65148k46798M15443M2302j22594
$$ 37297 -76409 105851 122481 341119 399962 -165186 -411984 3459 45761 -76833
1711g6833J7664o3186k21121J7486K30593l94875J51835j95445j94287K47714
$$ -76833 -59169 -122355 -343476 -325990 -95397 -490272 -338437 -533882 -728169 -480455
1701d80455M75290J61448k17908j54822K97880j28661J57233m2686K40664m26855
$$ -480455 -5165 156283 -61625 -216447 81433 -47228 110005 67319 307983 -118872
1691a18872j00049K10928M13312l85423m02584J29107P82602J87204n53392j34150
$$ -118872 -218921 -7993 405319 19896 -382688 -253581 529021 716225 162833 28683
1681B8683j43600J92037R8624q9335m4888R311n35242K17841k6922K8663K16732
$$ 28683 -114917 77120 175744 86409 41521 50832 -484410 -266569 -293491 -264828 -48096
1670d8096K90786k85879n6415l3926n2974K87746L78640K64824l89434N3239J28201
$$ -48096 242690 -43189 -99604 -133530 -186504 101242 479882 744706 355272 408511 536712
1659E36712m00206j67504J1068k45100K19883M44821j62472p28276L04936K6918
$$ 536712 136506 -30998 -19930 -265030 -45147 399674 237202 -491074 -186138 -159220
1649a59220m75066j06121Q28541p8336j70070K14086p06539J92251J43624k94912
$$ -159220 -634286 -740407 88134 9798 -160272 53814 -652725 -460474 -316850 -611762
1639f11762N01078J85189k74839J96532m75719j19926L68081N00867k92311m72258
$$ -611762 -110684 74505 -200334 -3802 -479521 -599447 -231366 269501 -22810 -495068
1629d95068L53685O50477N96334o3236l42794l15983n23945K4846r5719m72863
$$ -495068 -141383 509094 1105428 1042192 699398 383415 -140530 -115684 -211403 -684266
1619f84266K99980N1001L16859j1753j83719J7307k56305J89921K32391J66572
$$ -684266 -384286 -333285 -16426 -28179 -211898 -194591 -450896 -260975 -28584 137988
1609A37988o84395o9J85743K41742J20636m2251l28652k27283M81225J89661l70268
$$ 137988 -546407 -546476 -360733 -118991 1645 -40606 -369258 -596541 -115316 74345 -295923
1598b95923k89991J89090P2133L40038l32087M11022L53471n03008J54602P6756
$$ -295923 -585914 -396824 -324691 15347 -316740 94282 447753 -55255 99347 176103
1588A76103O8446k84681l56145j84608M96105p8475j57944m13004N38135K09100
$$ 176103 244549 -40132 -396277 -580885 -84780 -163255 -321199 -734203 -196068 13032
1578A3032j89918K71529j20524K06516Q2744L65889j21895n75300J45661j17408
$$ 13032 -176886 94643 -25881 180635 263379 629268 507373 -67927 77734 -39674
1568c9674m22711K33053K04002J46755k93046M9025O7178L58288o3508P3421r9851
$$ -39674 -462385 -229332 -25330 121425 -171621 -122596 -55418 302870 239362 312783 212932
1557B12932l19615J90607l79931R0036N82209m4426j22886k8869l03852M92669
$$ 212932 -106683 83924 -296007 -205971 376238 331812 208926 180057 -123795 368874
1547C68874J03639m3699k7070N7017m7277j199059p2844Q20965N60388m19961
$$ 368874 472513 428814 401744 458761 411484 -787575 -860419 -39454 520934 100973
1537A00973o54804j01356k08757J74676N68754N3759k68901L66921P5484p9639
$$ 100973 -553831 -655187 -863944 -689268 -120514 -66755 -335656 31265 106749 27110
1527B7110p6059j30793J09823R3449P0315n0594K6596m67928k6010M7956K01785
$$ 27110 -48949 -179742 -69919 23530 93845 43251 69847 -398081 -424091 -376135 -174350
1516a74350J88082k37173m00248L82027J82780q2425N6070k20504L23885J60486
$$ -174350 13732 -223441 -623689 -241662 -58882 -141307 -85237 -305741 18144 178630
1506A78630J61972J97819k55397k82912j24942L03290m06371N4082j7684n3320
$$ 178630 340602 538421 283024 112 -124830 178460 -227911 -173829 -191513 -244833
1496b44833q1002k24966K49499p086j87376P7782L18130L42881k36776J34042
$$ -244833 -325835 -550801 -301302 -308388 -495764 -417982 -99852 243029 6253 140295
1486A40295j91449j86883L5247m7726O27436K2246m64589k68093K53494k72495
$$ 140295 -51154 -238037 -202790 -250516 376920 399166 -65423 -333516 -80022 -352517
1476c52517L00746p9247j55516M94415m6764l85866J23433K38896J27442j81681
$$ -352517 -51771 -131018 -286534 207881 161117 -224749 -101316 137580 265022 83341
1466H3341K3999J19418K39645o07327O4312q2839l22678O4757J79596M70185r150
$$ 83341 107340 226758 466403 -140924 -76612 -159451 -482129 -417372 -237776 232409 223259
1455B23259k29386j53024j58740j36946Q61N17192k05144M3965j97912n9824N029
$$ 223259 -6127 -159151 -317891 -454837 -453976 63216 -141928 -97963 -295875 -355699 -350670
1444c50670j19428M07575K04362P1897l0746R9623q8175j8740n82931k03323K53889
$$ -350670 -470098 -62523 141839 213736 182990 282613 194438 175698 -407233 -610556 -356667
1433c56667M51065r3431K69632n79552j43223Q5643R1899J13932j95989J9366
$$ -356667 94398 967 270599 -308953 -452176 -366533 -274634 -160702 -356691 -337325
1423c37325K63189K46824n11767l5720N6019M1243P1629M80023L44918J28086
$$ -337325 -74136 172688 -339079 -374799 -318780 -277537 -205908 274115 619033 747119
1413G47119l72222r03974k74947M26422K58620L0824J98698j48070k40122j4870
$$ 747119 374897 -529077 -804024 -377602 -118982 -88158 110540 -37530 -277652 -292522
1403b92522L21781j56948j844J64668r6934n63820M57734o2055j97478K85991
$$ -292522 29259 -127689 -129533 35135 -61799 -625619 -167885 -229940 -427418 -141427
1393a41427J15982L38355j38537N6094k6959J4971K1290j87954j030K31158k44716
$$ -141427 -25445 312910 174373 230467 203508 218479 239769 51815 50785 281943 37227
1382C7227l91920K66739L26424p2864l98100k14459j72485J21629M15521M0879
$$ 37227 -354693 -87954 238470 165606 -232494 -446953 -619438 -497809 -82288 -41409
1372d1409j60113K85612K94330M45410k07018n63996N38342k92490J72777l1104
$$ -41409 -201522 84090 378420 823830 616812 52816 591158 298668 471445 440341
1362D40341L52071o66224Q2801L82029P627j99418n1875Q6703k66207m4735m21926
$$ 440341 792412 126188 208989 591018 598645 399227 347352 434055 167848 123113 -298813
1351b98813j5375p1811L27493l3833k18803J14865M25605l8923k8432K50826l06902
$$ -298813 -314188 -385999 -58506 -92339 -311142 -196277 229328 190405 161973 412799 105897
1340A05897m04911K53059k84560L21864J16764j45621K89988k5802j4612l53182
$$ 105897 -299014 -45955 -330515 -8651 108113 -37508 252480 226678 212066 -141116
1330a41116Q4875M8395O0781K5660K2139l40439P3485k28327o3973O11423l59767
$$ -141116 -56241 -7846 52935 78595 100734 -239705 -166220 -394547 -458520 152903 -206864
1319b06864J88501j23866k91769o0454N2290M71236K07023k57324m45406k55412
$$ -206864 -18363 -142229 -433998 -494452 -442162 29074 236097 -21227 -466633 -722045
1309g22045N07414K23094K73873p2192k03793K20431j02444q1624J86954o5332
$$ -722045 -214631 8463 282336 210144 6351 226782 124338 42714 229668 164336
1299A64336O8914j05751n3197L6729J42738K7523n89024R7016p8132J16959K04702
$$ 164336 233250 127499 74302 111031 253769 281292 -307732 -210716 -288848 -171889 32813
1288C2813k35280K99K1370K35516J21617j32887K72850o6650m51039J38685K27549
$$ 32813 -202467 -202168 -180798 54718 176335 43448 316298 249648 -201391 -62706 164843
1277A64843J58216P5933m79991k62749j78343K31338p8460j79541L76247m1681
$$ 164843 323059 398992 -80999 -343748 -522091 -290753 -369213 -548754 -172507 -214188
1267b14188Q1068J07868l19689J68528R8623q1860l87979n1146L85865J97269
$$ -214188 -133120 -25252 -344941 -176413 -77790 -159650 -547629 -598775 -212910 -15641
1257a5641J05572j96174k2369M25799m27059l78461N53424K88328m04035k25979
$$ -15641 89931 -106243 -128612 297187 -129872 -508333 45091 333419 -70616 -296595
1247b96595l35067o034O34498k37087J23728m17132J70411K8040J99588l2200
$$ -296595 -631662 -637696 -3198 -240285 -116557 -533689 -363278 -335238 -135650 -167850
1237a67850n5075J85531L2419M109M6154k70825K54959K66827l1725j54773O1151
$$ -167850 -222925 -37394 -4975 -866 45288 -225537 29422 296249 264524 109751 170902
1226A70902J80511k46707n98276k30811O73088q7905K90417m71063o6705K30055
$$ 170902 351413 104706 -493570 -724381 -51293 -139198 151219 -319844 -386549 -156494
1216a56494J80209j23680m98040P27851j28544p6616K58789p71645R878L33416
$$ -156494 23715 -99965 -598005 129846 1302 -75314 183475 -588170 -578292 -244876
1206b44876J52831Q5372J96853l34426j23443J63094R0835n54217K61790N81918
$$ -244876 -92045 -6673 190180 -144246 -267689 -104595 -13760 -567977 -306187 275731
1196B75731l0927m06068k08259l4897k99592l3487O09816K56867k66156m0161
$$ 275731 244804 -161264 -369523 -404420 -704012 -737499 -127683 129184 -136972 -177133
1186a77133j7185N0567N4605l76450L70774J902l3394N827j42738M508L80983
$$ -177133 -194318 -143751 -89146 -465596 -94822 -92920 -126314 -120487 -263225 -258717 122266
1175A22266r4460k52802K88233J33113K31319k85083n66156k68080L15355N5675
$$ 122266 27806 -224996 63237 196350 427669 142586 -423570 -691650 -376295 -320620
1165c20620O7885L42124N00663j50383l12863Q092k58007k63340J17240J63030
$$ -320620 -252735 89389 590052 439669 126806 134898 -123109 -386449 -269209 -106179
1155a06179Q687j14296J16989m10584J68525M05008k49590j56859J64644j63383
$$ -106179 -97492 -211788 -94799 -505383 -336858 68150 -181440 -338299 -173655 -337038
1145c37038K14224j51078Q3668J76593m2275j1865K29812J28036k12489J87908
$$ -337038 -122814 -273892 -190224 -13631 -55906 -67771 162041 290077 77588 265496
1135B65496j56060l52436P8047K02015p8277k95184j16597M61153L20474j04019
$$ 265496 109436 -243000 -164953 37062 -41215 -336399 -452996 8157 328631 224612
1125B24612n84272M1443M62600k06232J54896k51090N296L34141J9113k90224
$$ 224612 -359660 -318217 144383 -61849 93047 -158043 -152747 181394 200507 -89717
1115h9717N16190J51389l26591m70696M19340O6705k3719r0105M014l92650j01732
$$ -89717 426473 577862 251271 -219425 199915 266620 242901 152796 156810 -235840 -337572
1104c37572Q45730l24492p6797m74388J28145M95908k11433k92383j86538l030
$$ -337572 508158 183666 106869 -367519 -239374 256534 45101 -247282 -433820 -436850
1094d36850J8085L36636K7753n5758K08549j43232l39807j75889M05295j75570
$$ -436850 -418765 -82129 -54376 -110134 98415 -44817 -384624 -560513 -155218 -330788
1084c30788l13190P57529J57700M9794k09101j42971L53832j13767Q3595J6271
$$ -330788 -643978 113551 271251 321045 111944 -31027 322805 209038 292633 308904
1074C08904j86328L1413M31364l49942J73198m92240j13872Q0121j7377J36634
$$ 308904 122576 153989 585353 235411 408609 -83631 -197503 -117382 -134759 1875
1064A875K45329K44659o27440j73174O1175M3012J81064k12136Q633J36064j1247
$$ 1875 247204 491863 -135577 -308751 -247576 -204564 -23500 -235636 -227003 -90939 -102186
1053a02186J02435J12765R5373k32500l70691n8873o5466N46345k1944k35191
$$ -102186 249 113014 208387 -24113 -394804 -453677 -519143 27202 5258 -229933
1043b29933J27155K08739l70007m2424K14373K87258J07312j19383n63369M11529
$$ -229933 -102778 105961 -264046 -306470 -92097 195161 302473 183090 -380279 31250
1033C1250n3990L4600k47015J74331J50334k91862J39680K14543j75277J63344
$$ 31250 -22740 11860 -235155 -60824 89510 -202352 -62672 151871 -23406 139938
1023A39938l72337n20051N94738N9336j11772N6859p1598K63457m00475k6870
$$ 139938 -232399 -752450 -157712 -98376 -210148 -153289 -224887 38570 -361905 -388775
1013c88775L99891J05565k38188L3162p875j38112K58249p52339J04799j04211
$$ -388775 11116 116681 -121507 -88345 -96220 -234332 23917 -728422 -623623 -727834
1003g27834M51996J75376J57031m33048L52005q7978j30400k34627M38377o6168
$$ -727834 -275838 -100462 56569 -376479 -24474 -112452 -242852 -477479 -39102 -105270
993a05270k13060J35804J38994L14794j79172J70694P70830n19371j13156J5172
$$ -105270 -318330 -182526 -43532 271262 92090 262784 1033614 514243 401087 416259
983D16259j41863l00330l86737J19260k33223J3191q3774L76590K85928j15628
$$ 416259 274396 -25934 -412671 -293411 -526634 -513443 -597217 -220627 65301 -50327
973e0327j1312J02637M48081j51326l52906K29708J06388j31692J8800k63701
$$ -50327 -61639 40998 489079 337753 -15153 214555 320943 189251 208051 -55650
963e5650L45303j52737L1924j54058L72394J21782l20306O6457L7328m43403k62480
$$ -55650 289653 136916 168840 14782 387176 508958 188652 255109 292437 -150966 -413446
952d13446J57651J65488N4219k97399j04757K24449K06401m12814j06017Q3824
$$ -413446 -255795 -90307 -36088 -333487 -438244 -213795 -7394 -420208 -526225 -442401
942d42401K15567k61586L31360N18083r2567j28401k12047j67385L39540j23961
$$ -442401 -226834 -488420 -157060 361023 268456 140055 -71992 -239377 100163 -23798
932b3798J06644J90132j8357l84759M158k04397L76117m96665j60723K6882P1102
$$ -23798 82846 272978 254621 -130138 -125980 -330377 45740 -450925 -611648 -584766 -513664
921e13664L56767j8935j78071J05357K62298l2343P7561J62687j64967j7718L79193
$$ -513664 -156897 -175832 -353903 -248546 13752 -18591 58970 221657 56690 38972 418165
910D18165M28247m40807l12911J15484m90906K07939K87528j60280m45099L4486
$$ 418165 846412 405605 92694 208178 -282728 -74789 212739 52459 -392640 -358154
900c58154M95681L21222m8241j9651j61334o09680l39836L31882L78757N6710
$$ -358154 137527 458749 410508 390857 229523 -380157 -719993 -388111 -9354 47356
890D7356m73158L57594J15109L3996L55511p08687q9360l0225K30543k53042k37827
$$ 47356 -425802 -68208 46901 80897 436408 -272279 -361639 -391864 -161321 -414363 -652190
879f52190L7653K47277J36862L13149j93583j46768N5034q4317M3740O09872l91394
$$ -652190 -614537 -367260 -230398 82751 -110832 -257600 -202566 -286883 -243143 366729 -24665
868b4665P8125J00694K19873j43845j3588M7517o27288J31047K60951L19233L06234
$$ -24665 53460 154154 374027 230182 216594 264111 -363177 -232130 28821 348054 654288
857F54288j43251l33350K51767j09160J92225J75473p20325L60460J42489l32931
$$ 654288 511037 177687 429454 320294 512519 687992 -32333 328127 470616 137685
847A37685P9294n33981J44833K84214J47670l63169M27493k73921K79714j61051
$$ 137685 216979 -317002 -172169 112045 259715 -103454 324039 50118 329832 168781
837A68781N4765n930j53603K12870K3063k15143n8993J48676k40196k3739J56942
$$ 168781 223546 217616 64013 276883 299946 84803 25810 174486 -65710 -89449 67493
826F7493o16638K08263J97569L28912r6072l46098K99722L94639m76946m85501
$$ 67493 -549145 -340882 -143313 185599 89527 -256571 43151 437790 -39156 -524657
816e24657K18574R0330l1772l2701j2857j90265K92072l1025j4937j79506K15334
$$ -524657 -306083 -215753 -247525 -280226 -293083 -483348 -191276 -222301 -237238 -416744 -201410
805b01410J95680K44823J0044l01826N31182l32376R1901k67916k9487O5619l2240
$$ -201410 -5730 239093 249137 -52689 478493 146117 238018 -29898 -59385 6234 -26006
794b6006L5807N978O33063L6238o74339p1809J11714K62174j71618m18385N38847
$$ -26006 9801 15779 648842 685080 10741 -61068 50646 312820 141202 -277183 261664
783B61664j10686k94431j95310J33424j67420J82773l09090K07826K87036j29657
$$ 261664 150978 -143453 -338763 -205339 -372759 -189986 -499076 -291250 -4214 -133871
773a33871j28047k05943R2259K63756M04989k71581j04636J19993O4574j08149
$$ -133871 -261918 -467861 -375602 -111846 293143 21562 -83074 36919 101493 -6656
763f656L39517l1332N4028j24845q15081K32274J73518p2608k65306L86344O957
$$ -6656 332861 301529 355557 230712 -584369 -352095 -178577 -251185 -516491 -130147 -123190
752a23190L9112k4107p4384N18144N4015m39592j37791p2902m9747l76792K20442
$$ -123190 -84078 -108185 -182569 335575 389590 -50002 -187793 -260695 -310442 -687234 -466792
741d66792K35802J86944K10625J40775j90257k61333k51823j13303M04442P791
$$ -466792 -230990 -44046 166579 307354 117097 -144236 -396059 -509362 -104920 -97129
731i7129L58972K36792J43212J05470l99109j63976J76074J77934o80796m34466
$$ -97129 261843 498635 641847 747317 348208 184232 360306 538240 -142556 -577022
721e77022M66001O9808R2514k02439K69894J75831j96819j28792r390J70341K92713
$$ -577022 -111021 -41213 51301 -151138 118756 294587 97768 -31024 -40414 129927 422640
710D22640j4540n11948k09538k38648O32836j36559L74004M11457j41658j81480
$$ 422640 408100 -103848 -313386 -552034 80802 -55757 318247 729704 588046 406566
700D06566m02421r9282P5785j02481j07212J64882L2876j58721K35478l97763
$$ 406566 4145 -95137 -19352 -121833 -229045 -64163 -31287 -190008 45470 -352293
690c52293k8122Q90819p34321M48346J91736l16642k05443J75066M59927m29437
$$ -352293 -380415 510404 -223917 224429 416165 99523 -105920 69146 529073 99636
680I9636k11168r7922J68654j52369m30895L69058l4083J4064J75976M35297q2071
$$ 99636 -111532 -209454 -40800 -193169 -624064 -255006 -289089 -275025 -99049 336248 254177
669B54177l16529J29369N55666n04916p36551N8821J67779j49124J50913M01487
$$ 254177 -62352 67017 622683 117767 -618784 -559963 -392184 -541308 -390395 11092
659A1092J41684m93199N62136J62109j39524l91804k87517L96316L75618n6964
$$ 11092 152776 -340423 221713 383822 244298 -147506 -435023 -38707 336911 279947
649B79947k69999N20890l42849j49536L69216M65055r04483K18561J98610o1359
$$ 279947 9948 530838 187989 38453 407669 872724 -31759 186802 385412 324053
639C24053j15989k77345L22647l27631o00482L96801J747M8637N4650K08562j47421
$$ 324053 208064 -69281 253366 -74265 -674747 -277946 -276199 -227562 -172912 35650 -111771
628a11771j26995M45483P464K445m32053L38197K74826n46946k16815K66765J66465
$$ -111771 -238766 206717 214181 216626 -215427 122770 397596 -149350 -366165 -99400 67065
617F7065K25744m681m94888p2777p998L06381J73777l34355R6992l344K84861
$$ 67065 292809 288128 -206760 -279537 -287535 18846 192623 -141732 -44740 -48084 236777
606B36777K77119K9586l91180p98657L67975K58218j20093L20702J8962L03294
$$ 236777 513896 543482 152302 -646355 -278380 -20162 -140255 180447 199409 502703
596E02703j26592l40363j43050R4536k54728J49411K23341K36355n6632n46931
$$ 502703 376111 35748 -107302 -12766 -267494 -118083 105258 341613 284981 -261950
586b61950p3996M8581j91150J15940N76310j04643n56522P31986K64717k35379
$$ -261950 -335946 -287365 -478515 -362575 213735 109092 -447430 284556 549273 313894
576C13894j00792l70255o5141L93120L5222r9202k35218k08935K05216J18211
$$ 313894 213102 -157153 -222294 170826 206048 106846 -128372 -337307 -132091 -13880
566a3880L48196l76422J85824j46834K9883Q2471j36763Q0227j24583k81821L19133
$$ -13880 334316 -42106 143718 -3116 26767 109238 -27525 52702 -71881 -353702 -34569
555c4569K38860k82374K17685m00839l9766K45836L4874K11045O6029K07859q9687
$$ -34569 204291 -78083 139602 -261237 -301003 -55167 -20293 190752 256781 464640 374953
544C74953k40195K20113K55318j06035L70893o40665j10465L16729p9223l30356
$$ 374953 134758 354871 610189 504154 875047 234382 123917 440646 361423 31067
534C1067j61476K43080j82200M02449M94620o79229L3837M50231o0372k17537
$$ 31067 -130409 112671 -69529 332920 827540 148311 182148 632379 572007 354470
524C54470k74842L71844k32454l00586k0683q089J70388K54268J86923J32347
$$ 354470 79628 451472 219018 -81568 -102251 -110340 60048 314316 501239 633586
514F33586n3907m25531j37289j15001K61682J60689k49580K40259K914Q899m13211
$$ 633586 579679 154148 16859 -98142 163540 324229 74649 314908 317822 326721 -86490
503h6490K40579l9142m5904j20378J88916m25010l61788L20738l61427L35586
$$ -86490 154089 114947 69043 -51335 137581 -287429 -649217 -328479 -689906 -354320
493c54320M89132J14093l73812J94783M49528l24335J94947k04527l91340j52750
$$ -354320 134812 248905 -124907 69876 519404 195069 390016 185489 -205851 -358601
483c58601K16677K94986L6622j52307k29853j33046J86452L91121P1253j7526
$$ -358601 -141924 153062 189684 37377 -192476 -325522 -139070 252051 323304 305778
473C05778J03911K872N416k26043m2556K45815k20836N04020k62047n85036K48354
$$ 305778 409689 412561 417977 191934 149378 395193 174357 678377 416330 -168706 79648
462G9648P5019n9430j17877j27017K88315k33280L79330L23233n84511k19345
$$ 79648 154667 95237 -22640 -149657 138658 -94622 284708 607941 23430 -195915
452a95915J60398J82058p4597n20051J38311M32508j99845n46194R3105j38756
$$ -195915 -35517 146541 71944 -448107 -309796 122712 -77133 -623327 -530222 -668978
442f68978J46794N2244k71378N50989k31337J21768L48608J72632k0520J93581
$$ -668978 -522184 -469940 -741318 -190329 -421666 -299898 48710 221342 200822 394403
432C94403r8926m15822N33226K4992l93656L24135l04797j70036k05225K60459
$$ 394403 295477 -120345 412881 437873 44217 368352 63555 -106481 -311706 -51247
422e1247L0128k48830L96453k25729r0286k65298Q48670Q5746n35227K26289k33027
$$ -51247 -21119 -269949 126504 -99225 -189511 -454809 393861 479607 -55620 170669 -62358
411f2358k49845L02861j98498k80887P12313r0277m90558O60179j27981r4467
$$ -62358 -312203 -9342 -207840 -488727 223586 133309 -357249 302930 174949 80482
401H0482j09339m85214k3227K41395L99600J50662l8446N6112o7663M1622P8622
$$ 80482 -28857 -514071 -537298 -295903 103697 254359 215913 272025 204362 245984 324606
390C24606k47900Q8697J58096K54217n88835K17638J78734j25410k05512m07305
$$ 324606 76706 165403 323499 577716 -11119 206519 385253 259843 54331 -352974
380c52974L30373j69007r817j2879J98994K50552k78582Q8750M9705K43180j01637
$$ -352974 -22601 -191608 -201425 -214304 -15310 235242 -43340 45410 95115 338295 236658
369B36658j78355j30542l7239j22783P1620j57094p7097K15275J39219N3944J64988
$$ 236658 58303 -72239 -109478 -232261 -160641 -317735 -394832 -179557 -40338 13606 178594
358A78594N6410j62376k40095J22688M6814l3488N7055k35504l5406N28879n7324
$$ 178594 235004 72628 -167467 -44779 2035 -31453 25602 -209902 -245308 283571 226247
347B26247l41097J62748K00197n1514m20329J08034l20043J45493L62946j33096
$$ 226247 -114850 47898 248095 196581 -223748 -115714 -435757 -290264 72682 -60414
337f0414J96637M49290l30405p5468k72874K19140J3605J59920l58301K0196J71488
$$ -60414 136223 585513 255108 179640 -93234 125906 139511 299431 -58870 -38674 132814
326A32814m41071L73418O5078k01798J71486K66964k23819k98411j4517l42488
$$ 132814 -308257 65161 130239 -71559 99927 366891 143072 -155339 -169856 -512344
316e12344J13254M20472L46027j29541K21107j24742q5221k48881j62930Q5472
$$ -512344 -399090 21382 367409 237868 458975 334233 249012 131 -162799 -77327
306g7327l48448N47255k6678N4697J71361k5246j86431L10883k99979l717K6598
$$ -77327 -425775 121480 94802 149499 320860 295614 109183 420066 120087 116370 142968
295A42968k34636o8835K91179m01980j25509L70284M4607J87238j8743J86146
$$ 142968 -91668 -160503 130676 -271304 -396813 -26529 18078 205316 186573 372719
285C72719m28481j11479M90116j40220P9193Q6244L6354K65875n9665l14896k11515
$$ 372719 -55762 -167241 322875 182655 261848 348092 384446 650321 590656 275760 64245
274F4245P5869J35920j10161L6633k7541m14894Q2192O0323l72761M26700j26658
$$ 64245 140114 276034 165873 202506 174965 -239929 -157737 -97414 -470175 -43475 -170133
263a70133K84111L38723j91118l64455m8632L50109M35875n57286j47146j38880
$$ -170133 113978 452701 261583 -102872 -151504 198605 634480 77194 -69952 -208832
253b08832L8591P1302k75933M46681K77879L41261k67621k04635j04309k48501
$$ -208832 -170241 -98939 -374872 71809 349688 690949 423328 218693 114384 -134117
243a34117K66860l07729J829O21280m24614j08047K27107N7608j92438k40154
$$ -134117 132743 -174986 -173157 448123 23509 -84538 142569 200177 7739 -232415
233b32415K1744L64874k6034j97547k92246j21532M25728J47409j96793M24782
$$ -232415 -210671 154203 128169 -69378 -361624 -483156 -57428 89981 -106812 317970
223C17970R718m28149J04185J59896j72394P6814k61106O261J6601n8765j29188
$$ 317970 327688 -100461 3724 163620 -8774 68040 -193066 -186805 -170204 -228969 -358157
212c58157j20190K59511J76900M2990j32314n2595O08591p511n21462j76118M07912
$$ -358157 -478347 -218836 -41936 1054 -131260 -183855 424736 417225 -104237 -280355 127557
201A27557J00054j24697L04530K23300k72614l35142k65998K28329L86995k93180
$$ 127557 227611 102914 407444 630744 358130 22988 -243010 -14681 372314 79134
191G9134k6586K56658o85926R7670L09626l48428K50938J00067P6458l8842k99825
$$ 79134 52548 309206 -376720 -279050 30576 -317852 -66914 33153 109611 70769 -229056
180b29056K37364p03J78447k69041m0042M6432J04727M5308N0162J65981K58375
$$ -229056 8308 7605 186052 -82989 -123031 -76599 28128 73436 123598 289579 547954
169E47954o9502j28376m59337n1517K64944J16282K56378l04115J82826m76088
$$ 547954 478452 350076 -109261 -160778 104166 220448 476826 172711 355537 -120551
159a20551R6182M34681p723j83453j94292l74661K17882J67144p4080O5447K50877
$$ -120551 -24369 410312 402589 219136 24844 -349817 -131935 35209 -38871 26576 277453
148B77453k09441K26645J17128j36923K04379j30924l76782K84039L9944k2633
$$ 277453 68012 294657 411785 274862 479241 348317 -28465 255574 295518 272885
138B72885M38132j13298l42811J2744k87942J23377L8605K198k43460J61774l52447
$$ 272885 711017 597719 254908 267652 -20290 103087 141692 143890 -99570 62204 -290243
127b90243j64461K67475J39077L98696k66079J87028q2694q0770J81113q9013
$$ -290243 -454704 -187229 -48152 350544 84465 271493 188799 108029 289142 200129
117B00129J90330m241j88275K9653j2292K19682p52406k37838M19464L30848J42044
$$ 200129 390459 386218 197943 227596 215304 434986 -317420 -555258 -135794 195054 337098
106C37098j47160K51259k16274j94722p6182k6193j47990K06166L50165n2465
$$ 337098 189938 441197 224923 30201 -45981 -72174 -220164 -13998 336167 283702
96B83702L85919k15829m47221O64682k20841k75926k2860j4050K03672l77971
$$ 283702 669621 453792 6571 671253 450412 174486 151626 137576 341248 -36723
86c6723J71858o9368j23069J01023q5706J3002L9365J5781j38889M8550k02998
$$ -36723 135135 65767 -57302 43721 -41985 -28983 10382 26163 -112726 -64176 -267174
75b67174L57737K56494J22720o6677k88886j93203L4028L32192m38758k25232
$$ -267174 90563 347057 469777 403100 114214 -78989 -44961 287231 -151527 -376759
65c76759l5341K78797J4984j0970J8798K41353p5121k4371L1989J08144j50244
$$ -376759 -412100 -133303 -118319 -129289 -110491 130862 55741 31370 63359 171503 21259
54B1259J841K28330j35071M9317k89851R1603L10081J37906k37314j07881q2397
$$ 21259 23100 251430 116359 165676 -124175 -32572 277509 415415 178101 70220 -12177
43a2177K12777J05687l04932J53373J9271J52475l01926m0938k26107K29561K20818
$$ -12177 200600 306287 1355 154728 173999 326474 24548 -16390 -242497 -12936 207882
32B07882l7960l35304m9591L56403j09078q7442L07968K14953m82827P8985k42608
$$ 207882 169922 -165382 -214973 141430 32352 -55090 252878 467831 -14996 63989 -178619
21a78619M61017L8182j95689J18601M4882K70730l46501N9589j71968J03235Q3199
$$ -178619 282398 320580 124891 243492 288374 559104 212603 272192 100224 203459 286658
10B86658j88143K68833k33075l7830K2165K07177o7240K3498k71664k12546
$$ 286658 98515 367348 134273 96443 118608 325785 258545 282043 10379 -202167
0b02167
$$ -202167
$$ Imaginary data points
##PAGE= N=2
##DATA TABLE= (X++(I..I)), XYDATA
16383a693816M63609k01712l37782J23361L15814j51903R4297p8221j9404j45988
$$ -1693816 -1230207 -1431919 -1769701 -1646340 -1330526 -1482429 -1388132 -1466353 -1485757 -1631745
16373a631745k22531K88561J30590k86694J08951L64207K14358J89007r9105k00916
$$ -1631745 -1854276 -1565715 -1435125 -1721819 -1612868 -1248661 -1034303 -845296 -944401 -1145317
16363a145317j09344k11674J08440O4097R9730P9618m1116J03353k16498Q0482
$$ -1145317 -1254661 -1466335 -1357895 -1293798 -1194068 -1114450 -1155566 -1052213 -1268711 -1188229
16353a188229J11567J48620r8932j63370M7157J01655N7195N0871k98190K562
$$ -1188229 -1076662 -928042 -1026974 -1190344 -1143187 -1041532 -984337 -933466 -1231656 -1229094
16343a229094l9838O4878J48342P5487o7230J63672j49472n4463M30405N2442
$$ -1229094 -1268932 -1204054 -1055712 -980225 -1047455 -883783 -1033255 -1087718 -657313 -604871
16333f04871L5275L60713j33564k51119N54682k0689j65242O2439O1812l42580
$$ -604871 -569596 -208883 -342447 -593566 -38884 -59573 -224815 -162376 -100564 -443144
16323d43144P4408o7430J8068L63864R5783J53828J91758j50751m11087n0701
$$ -443144 -368736 -436166 -418098 -54234 41549 195377 387135 236384 -174703 -225404
16313b25404O0710L41177M8896k95955K10232P9839k9287J74541M3407R4792l06943
$$ -225404 -164694 176483 225379 -70576 139656 219495 190208 364749 408156 502948 196005
16302A96005k41769J6448K15545p8691J93855P0636j16829j64139o238K2537L62
$$ 196005 -45764 -29316 186229 107538 301393 372029 255200 91061 84823 107360 107722
16291A07722L34762j05065m8252j14728K52953o6251J45123P34481j92078m47224
$$ 107722 442484 337419 289167 174439 427392 361141 506264 1240745 1048667 601443
16281F01443Q8444J54479k43885L22481l56657J40293K86396n95224L27524J41871
$$ 601443 689887 844366 600481 922962 566305 706598 992994 397770 725294 867165
16271H67165K13106L22867k09601j96211K84342P8617k37451R4314J59243j96905
$$ 867165 1080271 1403138 1193537 997326 1281668 1360285 1122834 1217148 1376391 1179486
16261A179486n0088Q4984N4992m86214k12111M5818M33080N550k69929n1826J08784
$$ 1179486 1129398 1214382 1269374 783160 571049 616867 1049947 1055497 785568 733742 842526
16250H42526L54316J23527p4693l32601J99633J37912o39077J89190J92844J57573
$$ 842526 1196842 1320369 1245676 913075 1112708 1250620 611543 800733 993577 1151150
16240A151150M4807l72623K20812j23266L2055J74106O1597N2643M76930o47022
$$ 1151150 1195957 823334 1044146 920880 952935 1127041 1188638 1241281 1718211 1071189
16230A071189L05976M28089q6828L42096l40588K8762k35595n27738J09018M49480
$$ 1071189 1377165 1805254 1718426 2060522 1719934 1748696 1513101 985363 1094381 1543861
16220A543861N5353l85079R4697K4221L55474J96188k588l00113k35064L44831
$$ 1543861 1599214 1214135 1308832 1333053 1688527 1884715 1882127 1582014 1346950 1691781
16210A691781K84511j69851l37689j95937j13634J70112K789K48913M95851p412
$$ 1691781 1976292 1806441 1468752 1272815 1159181 1329293 1332082 1580995 2076846 2069434
16200B069434l68980J69221J67212l80221q6841K97032l74495O0369L98649l31360
$$ 2069434 1700454 1869675 2036887 1656666 1569825 1866857 1492362 1552731 1951380 1620020
16190A620020j19740j16867j46549M52217j65844L4696M6849L32451Q13K9780
$$ 1620020 1500280 1383413 1236864 1689081 1523237 1557933 1604782 1937233 1938046 1967826
16180A967826j82581l17738M94002k16388J15359J92714L01887p64247k37409
$$ 1967826 1785245 1467507 1961509 1745121 1860480 2053194 2355081 1590834 1353425
16171A353425M59393n53J6194N5926k99316O4940L9107K30479L87745o47802L18392
$$ 1353425 1812818 1812265 1828459 1884385 1585069 1650009 1689116 1919595 2307340 1659538 1977930
16160A977930M03589Q3299k7169L18580n05667j22001j27292j66883P9433J35102
$$ 1977930 2381519 2464818 2437649 2756229 2250562 2128561 2001269 1834386 1913819 2048921
16150B048921J17512K35073q2542j50031m31668L00246L0030L34637m22921j39556
$$ 2048921 2166433 2401506 2318964 2168933 1737265 2037511 2067541 2402178 1979257 1839701
16140A839701R8121N7546j3835M03693L28356m18231m41j06677J80802l77774
$$ 1839701 1937822 1995368 1981533 2385226 2713582 2295351 2294910 2188233 2369035 1991261
16130A991261q9134J09297j67732K32265J05367k78229j8333J02449l31330K29677
$$ 1991261 1902127 2011424 1843692 2075957 2181324 1903095 1884762 1987211 1655881 1885558
16120A885558L58125j08157J06318k27157J84238m82728j3632N56509m21561j81594
$$ 1885558 2243683 2135526 2241844 2014687 2198925 1716197 1702565 2259074 1837513 1655919
16110A655919M44188j31285p7885J57339J51892J19785J01379m82083N12701K17387
$$ 1655919 2100107 1968822 1890937 2048276 2200168 2319953 2421332 1939249 2451950 2669337
16100B669337l39202k51082l6054K08597k37954k23328N51342j89224o8013K7086
$$ 2669337 2330135 2079053 2042999 2251596 2013642 1790314 2341656 2152432 2084419 2111505
16090B111505K38990k13149r6148l7858K05850j53119k56326P732K11894J93996
$$ 2111505 2350495 2137346 2041198 2003340 2209190 2056071 1799745 1807477 2019371 2213367
16080B213367J87517k0926j82752n15584N82768N87597o95927P2364J51973n61558
$$ 2213367 2400884 2379958 2197206 1681622 2264390 2851987 2156060 2228424 2380397 1818839
16070A818839J71513L1720O6907L6855m02985K08882j7743L76993j18569m13809
$$ 1818839 1990352 2022072 2088979 2125834 1722849 1931731 1913988 2290981 2172412 1758603
16060A758603J22060L21141m5862N9338r4413K79289k57258k78447P9879o4314
$$ 1758603 1880663 2201804 2155942 2215280 2120867 2400156 2142898 1864451 1944330 1880016
16050A880016K95438K2115N59357l57662m7343k74739j35200N84805K87515Q2000
$$ 1880016 2175454 2197569 2756926 2399264 2351921 2077182 1941982 2526787 2814302 2896302
16040B896302o36273n87598K75247K23620l03312j26846J12693M96565j23178
$$ 2896302 2260029 1672431 1947678 2171298 1867986 1741140 1853833 2350398 2227220
16031B227220J98606l82219r1454J46713j82158L52150L84651m68963L78234k14592
$$ 2227220 2425826 2043607 1952153 2098866 1916708 2268858 2653509 2184546 2562780 2348188
16021B348188l16744P1558L50587j9617J29321l20794J20927L30082k31813P1803
$$ 2348188 2031444 2103002 2453589 2433972 2563293 2242499 2363426 2693508 2461695 2533498
16011B533498l94032j66245K30999R4915J80203k68827j55256J80338n34646R8006
$$ 2533498 2139466 1973221 2204220 2299135 2479338 2210511 2055255 2235593 1700947 1798953
16001A798953K04867J90063l5928N09776j13904j67914M29186n59167O975K54371
$$ 1798953 2003820 2193883 2157955 2667731 2553827 2385913 2815099 2255932 2262907 2517278
15991B517278j85344K77307p0631o46368n7114J50843l2312L60365M4663L5238
$$ 2517278 2331934 2609241 2538610 1892242 1835128 1985971 1953659 2314024 2358687 2393925
15981B393925l0211J98011J22021l06384r3406K82308l61113q368K87970j63136
$$ 2393925 2363714 2561725 2683746 2377362 2283956 2566264 2205151 2196783 2484753 2321617
15971B321617M3844j39633j55030l41985L36244j58796J89329K23294n5159k61775
$$ 2321617 2365461 2225828 2070798 1728813 2065057 1906261 2095590 2318884 2263725 2001950
15961B001950J16369M60664r1070j27320L01000j36310k74767n2433L16748k24298
$$ 2001950 2118319 2578983 2487913 2360593 2661593 2525283 2250516 2198083 2514831 2290533
15951B290533K96464J54386L4923n36840l87707M03629j15183n6540K28934q2880
$$ 2290533 2586997 2741383 2776306 2239466 1851759 2255388 2140205 2083665 2312599 2229719
15941B229719Q525j51508j35440P150k78493N28475j3086L5063Q9370J9509J12646
$$ 2229719 2238244 2086736 1951296 1958446 1679953 2208428 2195342 2230405 2319775 2339284 2451930
15930B451930K48068k95229K27118j04305l35406K32356n36468K43185J46142
$$ 2451930 2699998 2404769 2631887 2527582 2192176 2424532 1888064 2131249 2277391
15921B277391k4854K99679k83935J43835L95020m38685l15647M30064l54279K04571
$$ 2277391 2252537 2552216 2268281 2412116 2807136 2368451 2052804 2482868 2128589 2333160
15911B333160M85182J97065o15820n3604k74523L47587J89109K2314k29532k41860
$$ 2333160 2818342 3015407 2399587 2345983 2071460 2419047 2608156 2630470 2400938 2159078
15901B159078L07123J44851j77398k6990l7936J59927N35398l03519k70221K30694
$$ 2159078 2466201 2611052 2433654 2406664 2368728 2528655 3064053 2760534 2490313 2721007
15891B721007j5153j42064l85396O3904K54559q0896n4705K02177K7055p15547
$$ 2721007 2705854 2563790 2178394 2242298 2496857 2415961 2361256 2563433 2590488 1874941
15881A874941O0238K65579j55134l67602K28270l3402Q7676R149J23954m0029
$$ 1874941 1935179 2200758 2045624 1678022 1906292 1872890 1960566 1969715 2093669 2053640
15871B053640L13103J57016o980l3728j68848L3226r9401L90410j90026J40524
$$ 2053640 2366743 2523759 2516779 2483051 2314203 2347429 2248028 2638438 2448412 2588936
15861B588936o9523k95834l38888L97603k2849O6162K11222l4364j26110n10649
$$ 2588936 2519413 2223579 1884691 2282294 2259445 2325607 2536829 2502465 2376355 1865706
15851A865706L04393J45763K65124o469J7820n51748P4701Q1376L74526N4083
$$ 1865706 2170099 2315862 2580986 2574517 2592337 2040589 2115290 2196666 2571192 2625275
15841B625275n63481K56399O0655j13635K32196j63908n31257L40346P2966J60759
$$ 2625275 2061794 2318193 2378848 2265213 2497409 2333501 1802244 2142590 2215556 2376315
15831B376315L98241L673J14916m76232k64101r591K10173l4698n672J84732O1843
$$ 2376315 2774556 2778229 2893145 2416913 2152812 2143221 2353394 2318696 2313024 2497756 2559599
15820B559599L9091m5059L3136r2558K38495k74272r316J69302j24539n53064
$$ 2559599 2598690 2553631 2586767 2494209 2732704 2458432 2449116 2618418 2493879 1940815
15810A940815K59775J7889L91095j93891J38784Q1195p37414P4316J87357J20525
$$ 1940815 2200590 2218479 2609574 2415683 2554467 2635662 1898248 1972564 2159921 2280446
15800B280446m46824J07085K60768j6222O5787K17015L04996Q9330n74372l81717
$$ 2280446 1833622 1940707 2201475 2185253 2251040 2468055 2773051 2862381 2288009 1906292
15790A906292Q4831J8462k47007M09604l0158O8659M26729k2991k62191k06764
$$ 1906292 1991123 2009585 1762578 2172182 2142024 2210683 2637412 2614421 2352230 2145466
15780B145466J13213k647o3628K4468P6008J39723j80141J91705m5181j17050
$$ 2145466 2258679 2256032 2192404 2216872 2292880 2432603 2252462 2444167 2398986 2281936
15770B281936K410M8458n9958K95688K91646k52191J5618m75042m2430n06477
$$ 2281936 2284346 2332804 2272846 2568534 2860180 2607989 2623607 2148565 2106135 1599658
15760A599658K89230M31439M3557J60280k82339k33378J68329K29533l72680r0345
$$ 1599658 1888888 2320327 2363884 2524164 2241825 2008447 2176776 2406309 2033629 1943284
15750A943284K04530J35719q8141J2919j56015K24241k88439K51161j04185K65620
$$ 1943284 2147814 2283533 2195392 2208311 2052296 2276537 1988098 2239259 2135074 2400694
15740B400694J32812l92772J6252J07363K0282m62377L37014L93214j3108m44565
$$ 2400694 2533506 2140734 2156986 2264349 2284631 1822254 2159268 2552482 2539374 2094809
15730B094809k64230O74797j68141n34617J52443J42212q9272J0981N50854M8168
$$ 2094809 1830579 2505376 2337235 1802618 1955061 2097273 2008001 2018982 2569836 2618004
15720B618004M82068J26083p42665k22806k4066k28224R4910J02744k39441Q809
$$ 2618004 3100072 3226155 2483490 2260684 2236618 2008394 2103304 2206048 1966607 1975416
15710A975416P8041P18616k92437j95691J82711j43881k17430j13920N06876p3504
$$ 1975416 2053457 2772073 2479636 2283945 2466656 2322775 2105345 1991425 2498301 2424797
15700B424797Q4725p7596K21368K15822k72427J85984k09157m74493j07296L88556
$$ 2424797 2509522 2431926 2653294 2869116 2596689 2782673 2573516 2099023 1991727 2380283
15690B380283K12327K0743l58419K25576L05318j80698k63807K85753L54376m37631
$$ 2380283 2592610 2613353 2254934 2480510 2785828 2605130 2341323 2627076 2981452 2543821
15680B543821k78377O4945l77745O5285K31088k08316J06448k00731O30109q9309
$$ 2543821 2265444 2330389 1952644 2017929 2249017 2040701 2147149 1946418 2576527 2487218
15670B487218j03692R9585k44805k43665L8100K28541L2027K32121K55604n22804
$$ 2487218 2383526 2483111 2238306 1994641 2032741 2261282 2293309 2525430 2781034 2258230
15660B258230J846m14457M68015j69797p395j40156j44737N88955j02138L46725
$$ 2258230 2260076 1845619 2313634 2143837 2136442 1996286 1851549 2440504 2338366 2685091
15650B685091j86556o499k41703k55574J21307K6979l3693K75054j4087l17885
$$ 2685091 2498535 2492036 2250333 1994759 2116066 2143045 2109352 2384406 2370319 2052434
15640B052434L16238M27615l56386r0115L94175J35513J93945r4718l03990M0621
$$ 2052434 2368672 2796287 2439901 2349786 2743961 2879474 3073419 2978701 2674711 2715332
15630B715332j26494j06927j3054q0118k44423J64355J97601J16956l04595K35450
$$ 2715332 2588838 2481911 2468857 2388739 2144316 2308671 2506272 2623228 2318633 2554083
15620B554083K69890m31801p06501M65697O18367l62701K13256m2643J32475L0961
$$ 2554083 2823973 2392172 1685671 2151368 2769735 2407034 2620290 2577647 2710122 2741083
15610B741083l5068j67591K08936l20491k59786o9168J11252N04471j74285K47970
$$ 2741083 2706015 2538424 2747360 2426869 2167083 2097915 2209167 2713638 2539353 2787323
15600B787323j73939O8418K19612o92502M59274K03146m4692K01461l5544l58029
$$ 2787323 2613384 2681802 2901414 2208912 2668186 2871332 2826640 3028101 2992557 2634528
15590B634528m60312j66133J38491L73032l65260M67588k48852j67920K15210
$$ 2634528 2174216 2008083 2146574 2519606 2154346 2621934 2373082 2205162 2420372
15581B420372j32752J84816p4358j51048L7560J87119k28684L42240l2890m6088
$$ 2420372 2287620 2472436 2398078 2247030 2284590 2471709 2243025 2585265 2552375 2506287
15571B506287o7362K31166j2161j77187k95836j42327j73718L16002j66860l3013
$$ 2506287 2438925 2670091 2657930 2480743 2184907 2042580 1868862 2184864 2018004 1984991
15561A984991L34079K66603J33669k18231k64820n3797M29287n58786K18058O48122
$$ 1984991 2319070 2585673 2719342 2501111 2236291 2182494 2611781 2052995 2271053 2919175
15551B919175l23388m90052N40969K65362m03334m80943J62269O51067j44605
$$ 2919175 2595787 2105735 2646704 2912066 2508732 2027789 2190058 2841125 2696520
15542B696520j40003J06930n006l87849O8539Q14170l46980J42485l87393J55876
$$ 2696520 2556517 2663447 2658441 2270592 2339131 3153301 2806321 2948806 2561413 2717289
15532B717289J229m4302j76925p359R3160k23930o58J09348K78258K15203J29282
$$ 2717289 2718518 2674216 2497291 2489932 2583092 2359162 2358504 2467852 2746110 2961313 3090595
15521C090595k47668l43799k06215J09506J00599j30321q1546J75593M4408M4668
$$ 3090595 2842927 2499128 2292913 2402419 2503018 2372697 2291151 2466744 2511152 2555820
15511B555820J20089M2335K34477l57914m0541j59308N5060L83384k55679m18981
$$ 2555820 2675909 2718244 2952721 2594807 2554266 2394958 2450018 2833402 2577723 2158742
15501B158742K17209j34034j14582K32005K90920l23965m12723p1262L26087J61421
$$ 2158742 2375951 2241917 2127335 2359340 2650260 2326295 1913572 1842310 2168397 2329818
15491B329818K90366n193K673r282o9162l76296r713M69295l20328l70864K29377
$$ 2329818 2620184 2614991 2617664 2608382 2539220 2162924 2153211 2622506 2302178 1931314 2160691
$$ [...]
##END NTUPLES=NMR SPECTRUM
##END=
