##TITLE=1H_CG-1150-IVd
 CDCl3
 8 sc, 
 28.8.2023
##JCAMPDX= 6.0         $$ Bruker NMR JCAMP-DX V2.0
##DATA TYPE= NMR SPECTRUM
##DATA CLASS= NTUPLES
##ORIGIN= UXNMR, Bruker Analytische Messtechnik GmbH
##OWNER= root
$$ XWIN-NMR		Version 3.5
$$ Mon Aug 28 14:43:00 2023 Russian Standard Time (UT+4h)  she@DPX200
##.OBSERVE FREQUENCY= 200.13135
##.OBSERVE NUCLEUS= ^1H
##.ACQUISITION MODE= SIMULTANEOUS
##.ACQUISITION SCHEME= undefined
##.AVERAGES= 8
##.DIGITISER RES= 18
##SPECTROMETER/DATA SYSTEM= spect
##.PULSE SEQUENCE= zg30
##.SOLVENT NAME= CDCl3
##.SHIFT REFERENCE= (INTERNAL, CDCl3, 0, 15.7491)
##AUDIT TRAIL= $$ (NUMBER, WHEN, WHO, WHERE, WHAT)
$$ ##TITLE= Audit trail, XWIN-NMR		Version 3.5
$$ ##JCAMPDX= 5.01
$$ ##ORIGIN= Bruker BioSpin GmbH
$$ ##OWNER= she
$$ F:/spectra/data/she/nmr/H-F/1/pdata/1/auditp.txt
$$ ##AUDIT TRAIL=  $$ (NUMBER, WHEN, WHO, WHERE, WHAT)
(   1,<2023-08-28 14:41:52.26 +0400>,<she>,<DPX200>,
      <created by zg, POWCHK disabled, PULCHK disabled
       configuration hash MD5:
       00 E9 B6 7A A2 85 ED C7 34 08 36 98 17 FE 4E 26
       data hash MD5: 16K
       18 46 96 85 9C A1 02 15 07 6F 48 0A 3E A3 CF 80>)
(   2,<2023-08-28 14:41:55.79 +0400>,<she>,<DPX200>,
      <Start of raw data processing
       efp BC_mod = 2 LB = 0.24 FT_mod = 6 PKNL = 1 PHC0 = -21060.83 PHC1 = 29.05272 SI = 16K 
       data hash MD5: 16K
       95 63 9F 26 FF 29 7E 11 71 74 C5 C4 C6 37 BC 67>)
(   3,<2023-08-28 14:42:13.51 +0400>,<she>,<DPX200>,
      <pk PHC0 = 11.71604 PHC1 = -14 
       data hash MD5: 16K
       03 FC AA 6B D8 68 9D 9D 3A E3 F6 86 78 18 AB 9D>)
(   4,<2023-08-28 14:42:17.50 +0400>,<she>,<DPX200>,
      <abs ABSG = 5 
       data hash MD5: 16K
       80 23 B0 D2 38 BA 32 4C BB A8 50 2D 59 18 C6 4C>)
$$ ##END=
$$ 
$$ hash MD5
$$ 13 00 57 7F 2B C3 7D 7E 6E CE DD 28 A7 3C E9 9B
##$RELAX= 
##$RELAX= 
##$RELAX= 
##$RELAX= 
##$RELAX= 
##$RELAX= 
$$ Bruker specific parameters
$$ --------------------------
##$DU= <F:/spectra>
##$EXPNO= 1
##$NAME= <H-F>
##$PROCNO= 1
##$TYPE= <nmr>
##$USER= <she>
##$AMP= (0..31)
100 100 100 100 100 100 100 100 100 100 100 100 100 100 100 100 100 100 
100 100 100 100 100 100 100 100 100 100 100 100 100 100 
##$AQSEQ= 0
##$AQ_mod= 1
##$AUNM= <au_zg>
##$AUTOPOS= <>
##$BF1= 200.13
##$BF2= 200.13
##$BF3= 200.13
##$BF4= 200.13
##$BF5= 200.13
##$BF6= 200.13
##$BF7= 200.13
##$BF8= 200.13
##$BYTORDA= 1
##$CFDGTYP= 0
##$CFRGTYP= 5
##$CHEMSTR= <none>
##$CNST= (0..31)
1 1 145 1 1 1 1 1 1 1 1 1 1 1 1 1 1 1 1 1 1 1 1 1 1 1 1 1 1 1 1 1 
##$CPDPRG= <>
##$CPDPRG1= <>
##$CPDPRG2= <>
##$CPDPRG3= <>
##$CPDPRG4= <mlev>
##$CPDPRG5= <mlev>
##$CPDPRG6= <mlev>
##$CPDPRG7= <mlev>
##$CPDPRG8= <mlev>
##$CPDPRGB= <>
##$CPDPRGT= <>
##$D= (0..31)
0 1.2 0 0 0 0 0 0 0 0.06 0 0.03 0 0 0 0 0.0002 0 0 0 0 0 0 0 0 0 0 0 0 
0 0 0 
##$DATE= 1693219311
##$DBL= (0..7)
120 120 120 120 120 120 120 120 
##$DBP= (0..7)
150 150 150 150 150 150 150 150 
##$DBP07= 0
##$DBPNAM0= <>
##$DBPNAM1= <>
##$DBPNAM2= <>
##$DBPNAM3= <>
##$DBPNAM4= <>
$$ [...]
##$SUBNAM3= <"">
##$SUBNAM4= <"">
##$SUBNAM5= <"">
##$SUBNAM6= <"">
##$SUBNAM7= <"">
##$SUBNAM8= <"">
##$SUBNAM9= <"">
##$SW= 18.05172834244
##$SWIBOX= (0..15)
0 0 2 0 0 0 0 0 0 0 0 0 0 0 0 0 
##$SW_h= 3612.71676300578
##$TD= 16384
##$TD0= 1
##$TE= 0
##$TE2= 300
##$TE3= 300
##$TEG= 300
##$TL= (0..7)
0 120 120 120 120 120 120 120 
##$TP= (0..7)
150 150 150 150 150 150 150 150 
##$TP07= 0
##$TPNAME0= <>
##$TPNAME1= <>
##$TPNAME2= <>
##$TPNAME3= <>
##$TPNAME4= <>
##$TPNAME5= <>
##$TPNAME6= <>
##$TPNAME7= <>
##$TPOAL= (0..7)
0.5 0.5 0.5 0.5 0.5 0.5 0.5 0.5 
##$TPOFFS= (0..7)
0 0 0 0 0 0 0 0 
##$TUNHIN= 0
##$TUNHOUT= 0
##$TUNXOUT= 0
##$USERA1= <user>
##$USERA2= <user>
##$USERA3= <user>
##$USERA4= <user>
##$USERA5= <user>
##$V9= 5
##$VALIST= <valist>
##$VCLIST= <CCCCCCCCCCCCCCC>
##$VD= 0
##$VDLIST= <DDDDDDDDDDDDDDD>
##$VPLIST= <PPPPPPPPPPPPPPP>
##$VTLIST= <TTTTTTTTTTTTTTT>
##$WBST= 1024
##$WBSW= 4
##$XGAIN= (0..3)
0 0 0 0 
##$XL= 0
##$YL= 0
##$YMAX_a= 494460
##$YMIN_a= -561328
##$ZGOPTNS= <>
##$ZL1= 120
##$ZL2= 120
##$ZL3= 120
##$ZL4= 120
##$ABSF1= 15.73147
##$ABSF2= -2.320379
##$ABSG= 5
##$ABSL= 3
##$ALPHA= 0
##$AQORDER= 0
##$ASSFAC= 0
##$ASSFACI= 0
##$ASSFACX= 0
##$ASSWID= 0
##$AUNMP= <proc_1d>
##$AZFE= 0.1
##$AZFW= 0.1
##$BCFW= 0
##$BC_mod= 2
##$BYTORDP= 0
##$COROFFS= 0
##$CY= -3
##$DATMOD= 1
##$DC= 0
##$DFILT= <>
##$DTYPP= 0
##$F1P= 0
##$F2P= 0
##$FCOR= 1
##$FTSIZE= 16384
##$FT_mod= 6
##$GAMMA= 0
##$GB= 0
##$INTBC= 1
##$INTSCL= 3.70164e-10
##$ISEN= 128
##$LB= 0.24
##$LEV0= 0
##$LPBIN= 0
##$MAXI= 10000
##$MC2= 0
##$MEAN= 0
##$ME_mod= 0
##$MI= 1.114404
##$NCOEF= 0
##$NC_proc= -6
##$NLEV= 6
##$NOISF1= 3.799351
##$NOISF2= 2.8
##$NSP= 0
##$NTH_PI= 0
##$NZP= 0
##$OFFSET= 15.74909
##$PC= 1
##$PHC0= -21049.11
##$PHC1= 15.05272
##$PH_mod= 1
##$PKNL= yes
##$PPARMOD= 0
##$PSCAL= 0
##$PSIGN= 0
##$REVERSE= no
##$SF= 200.130004492991
##$SI= 16384
##$SIGF1= 3
##$SIGF2= 2
##$SINO= 5.538805
##$SIOLD= 16384
##$SREGLST= <1H.CDCl3>
##$SSB= 0
##$STSI= 16384
##$STSR= 0
##$SW_p= 3612.71676300578
##$SYMM= 0
##$S_DEV= 0
##$TDeff= 16384
##$TDoff= 0
##$TI= <>
##$TILT= no
##$TM1= 0
##$TM2= 0
##$TOPLEV= 0
##$USERP1= <user>
##$USERP2= <user>
##$USERP3= <user>
##$USERP4= <user>
##$USERP5= <user>
##$WDW= 1
##$XDIM= 16384
##$YMAX_p= 421961010
##$YMIN_p= -857249
$$ End of Bruker specific parameters
$$ ---------------------------------
##NTUPLES= NMR SPECTRUM
##VAR_NAME=  FREQUENCY,     SPECTRUM/REAL,   SPECTRUM/IMAG
##SYMBOL=    X,             R,               I
##VAR_TYPE=  INDEPENDENT,   DEPENDENT,       DEPENDENT
##VAR_FORM=  AFFN,          ASDF,            ASDF
##VAR_DIM=   16384,         16384,           16384
##UNITS=     HZ,            ARBITRARY UNITS, ARBITRARY UNITS
##FACTOR=    0.220516191357247, 1,           1
##FIRST=     3151.86549142626, 0,            0
##LAST=      -460.851271579519, 0,           0
##MIN=       -460.851271579519, -857249,     0
##MAX=       3151.86549142626, 421961010,    0
$$ Real data points
##PAGE= N=1
##DATA TABLE= (X++(R..R)), XYDATA
$$ [...]
5637G00005o7168k0062j28672k9350L431K0056N9633L9979Q960j8901J02526m3375
5625F27062j47872j13388M5017r781N4173P4079K6128q7316J10762K7805n5812
5614E50857R0571J3999j45979N5213M9366j3999Q4801O4076n12J12793J65641
5603A026827m8903l9670N3909J25498Q8325M046J4864n0649q0921m0795k6145
5592A026386J1755p7339q420k7635j2094K4771j9871L9314j23852l731J10742
5581I40026n1366K8555L2582J46958P5060j4749J71198J07193O1803J06746k4570
5570A579436P1666J09230o3796K0882J8089k8441J8787j5615j01260k10275j39524
5559A259179J3084j1795j79016j79341P3501l5236o6659J2873J4390L3370L2775
$$ plain form
5637 700005 632837 612775 484103 454753 458184 478240 537873 577852 586812 567911 670437 627062
5625 627062 479190 365802 410819 401038 455211 529290 555418 468102 578864 606669 550857
5614 550857 641428 655427 509448 564661 614027 600028 684829 748905 748393 861186 1026827
5603 1026827 977924 938254 992163 1117661 1205986 1210032 1224896 1174247 1093326 1052531 1026386
5592 1026386 1038141 960802 952382 924747 912653 937424 917553 956867 833015 829284 940026
5581 940026 888660 917215 949797 1096755 1171815 1157066 1328264 1435457 1497260 1604006 1579436
5570 1579436 1651102 1760332 1696536 1717418 1735507 1707066 1725853 1710238 1608978 1398703 1259179
5559 1259179 1272263 1260468 1081452 902111 975612 940376 873717 886590 900980 934350 967125
5548I67125K8290q104L5730L2360j55515N5177l7438O7434J12877m0716j0304
5537A046916Q8293O7126k4264n3535r1199k2942j0323j51534m9390J7163r5443
5526G20868k6831m0452J14857o4886l2103n8906K5129m1876k0340N9935J6138
5515F51533q2297p1478q4968O9840j221N3717P3264m3876k01q239l4589j9230
5503E02255O3868L3269O4197m222n9359L2454o6726q9973l8343k4060Q6703j6118
5491D83945M8483j176p2505M7486j3573M2929K8073n9458q0489L3187K8165K7134
5479E12201P8058J08374J03942J3147K5100l4471Q930K070k7353L1954M9626m9073
5467H22505J3905J740o8639j19959J1927j03824J488J03198m7191o579l9139N0669
$$ plain form
5548 967125 995415 987311 1023041 1055401 899886 955063 917625 985059 1097936 1057220 1046916
5537 1046916 1135209 1202335 1178071 1124536 1033337 1010395 1000072 848538 799148 816311 720868
5526 720868 694037 653585 768442 703556 671453 612547 637676 595800 575460 635395 651533
5515 651533 569236 497758 412790 482630 481409 535126 608390 564514 564313 556074 521485 502255
5503 502255 566123 599392 663589 659367 600008 632462 565736 475763 437420 413360 500063 483945
5491 483945 532428 531252 458747 506233 492660 535589 563662 504204 423715 456902 485067 512201
5479 512201 590259 698633 802575 815722 840822 806351 815281 817351 789998 821952 871578 822505
5467 822505 836410 838150 769511 649552 661479 557655 559143 662341 615150 608571 569432 620101
5455F20101K9319M5487P679N3416m1858L0481J71933R2260J72485L5427J48641
5444A365371Q6006J83320o3625l3847j73936k25066j19445j44196o7468j43930
5434F63184q572O1755r0843j0371O468Q8672K3473o6240J729m1584L2763l0796
5422F29638K7077r561J08228N6617J49315L3030J39561K28756Q9169O2772J53949
5411A668551K3764j21033j80833k74036j90347r9604o0905m9477q820l0113k1176
5400F55971l1464N4661K2218p3069J3765j3293k7260m7880M1089q408r935m4508
5388E31887n5799J25734p385M6061J06525N9473J1350J0949Q1422O1544q1755
5377H90006n7884o4003n1596L4581N3543j96789J136p5583q0441O7862Q1807m2964
$$ plain form
5455 620101 649420 694907 702586 756002 714144 744625 916558 1008818 1181303 1216730 1365371
5444 1365371 1451377 1634697 1571072 1537225 1363289 1138223 1018778 874582 807114 663184
5434 663184 654612 716367 625524 615153 621621 710293 733766 667526 669255 627671 660434 629638
5422 629638 656715 647154 755382 811999 961314 994344 1133905 1362661 1451830 1514602 1668551
5411 1668551 1692315 1571282 1390449 1116413 926066 826462 765557 716080 707260 677147 655971
5400 655971 624507 679168 701386 628317 642082 628789 601529 553649 594738 586330 576395 531887
5388 531887 476088 601822 594437 640498 747023 806496 817846 828795 910217 971761 890006
5377 890006 832122 768119 716523 751104 804647 607858 608994 533411 452970 520832 602639 559675
5365E59675n8409J5320m2756k6572l0057P5620j1567k786O4559R3094j20954L782
5353E18949m4294N027o3348N5674Q6150j1378n4307O516J21275j2760K9705k0700
5341F16509j45018Q943j4334m3032p2094P1115K2511N7933M4066k4553l4749p242
5329D80055j4938l952K9294o6518P7843n7010q8924j9259J2237O1883j802l8114
5317C70795J07217k4297o477j0228N2437M011K0931q2396N4599M8109j30400O3183
5305D67484p5444q7399O0274L7070L3475K4973M5393M3168l5793l0540j661P2446
5293E53446n6037j114M3573o6204m867p7482j561L2051r9973J9166J04787j8643
5281D27142k7265M872P1941n7500k6118k865O7572R7747o4069j16913q816L0426
$$ plain form
5365 559675 501266 516586 473830 447258 417201 492821 481254 478468 543027 636121 515167 518949
5353 518949 474655 479682 416334 472008 558158 546780 492473 498989 620264 607504 637209 616509
5341 616509 471491 480434 466100 423068 350974 422089 444600 502533 546599 522046 487297 480055
5329 480055 465117 461165 490459 423941 501784 444774 355850 336591 348828 410711 408909 370795
5317 370795 478012 453715 447238 437010 489447 493458 514389 431993 486592 534701 404301 467484
5305 467484 392040 304641 364915 401985 435460 460433 505826 548994 513201 482661 481000 553446
5293 553446 497409 496295 539868 473664 468797 391315 389754 421805 321832 340998 445785 427142
5281 427142 399877 404749 476690 419190 393072 390207 457779 555526 491457 374544 365728 396154
5269C96154N094K3546L7104j0843j06653Q564P9068j2892J3616M8860n0230r4750
5257C36638L6068P4200R3056n5863M5563k4969j432K0465n7560o0853J5170O7015
5245D87498n8550P4759p4796j6684k0739J67579N2297M6292j25107R135O9458
5234F11142J6535p1033j00993M558o123N801Q7632o1780r8932k1583P0161P6800
5222E12185l7107n1651J3073O3578J10395M1992M145j13557l7362Q5951J2146
5211F03788n9777n5657L9872P4662j8326n3662L0128j2988J62288l2172L1047
5200G09203l6578J3804N8222q1657R962J72453P088P4122O0590P09R5243O9255
5188A152416p7078O5250N2675p3119m3732M375j5888o4971j44806p1575L4283
$$ plain form
5269 396154 401248 424794 461898 451055 344402 352966 432034 419142 432758 481618 431388 336638
5257 336638 372706 446906 539962 484099 529662 504693 503261 523726 466166 405313 420483 487498
5245 487498 428948 503707 428911 412227 391488 559067 611364 657656 532549 541684 611142
5234 611142 627677 556644 455651 460209 454086 459887 547519 485739 386807 365224 435385 512185
5222 512185 475078 423427 436500 500078 610473 652465 656610 543053 505691 591642 603788
5211 603788 544011 488354 528226 602888 584562 530900 561028 548040 710328 678156 709203
5200 709203 672625 686429 744651 662994 672956 845409 852497 926619 987209 987918 1083161 1152416
5188 1152416 1075338 1140588 1193263 1120144 1076412 1080787 1064899 999928 855122 783547 817830
5177H17830K518j1289j01565o8249N357K8086J8947m9704L3659R823O2160N6518
5165H04091k9814k5216k5979o8984L5846P467N1351N4753r7052J5001n0577J36704
5153H07591O6124j6649o5942o8871J45626p7193k2868J05109O984j05284K0178
5142G94805l2009P0338K6070L082P7962J2356L5777K6540Q6452n4527j4451P2380
5130A104775O9196J4172N5200o3137Q4562P7786l5457l1102J18559P7610M9253
5119A521417N5645k3453L2510J32229N6380O3965J26608J07391K20598J50522
5109B443812K46826K89808J77627J75491J19383m0681k0591j12509j44503r3858
5099C040805k22193j29061j37314o2519R9387O9711m3474J011J28032J05611J67448
$$ plain form
5177 817830 820348 809059 707494 639245 644602 672688 691635 641931 675590 685413 747573 804091
5165 804091 774277 749061 723082 654098 689944 697411 748762 803515 706463 721464 670887 807591
5153 807591 873715 857066 791124 722253 867879 790686 767818 872927 879911 774627 794805
5142 794805 762796 833134 859204 862286 940248 952604 988381 1014921 1101373 1046846 1032395 1104775
5130 1104775 1173971 1188143 1243343 1180206 1264768 1342554 1307097 1275995 1394554 1472164 1521417
5119 1521417 1577062 1553609 1586119 1718348 1774728 1838693 1965301 2072692 2293290 2443812
5109 2443812 2690638 2980446 3158073 3333564 3452947 3412266 3391675 3279166 3134663 3040805
5099 3040805 2818612 2689551 2552237 2489718 2589105 2658816 2615342 2616353 2744385 2849996 3017444
5088C017444K09992J54847J81709J40217K99287k8680p5444o0513j26934j94656
5078C517269j60384j78421k29087q4208m5895J01337J4276K6730J02054R0693
5068C154364K57443J71150R9065J55218J26329J6112k8544r12j01511j080j32793
5057C714841o1283m4970j89953r8152l6555N1007o7710q5842N2537R9342J409
5046C334671P3088O2258l1071n167q3977q4625q9490n2054k87991j65692j58565
5035B511385k01901j34998j49272k03294r4368K231j25858n9704L6120l6186N0733
5024A594888N188m7640J07726K0404j9059p8002l9837J65055M1998n5290J46911
5013A842342J16062j0762O2812k7571q5095j20934j1890j3269j23114l2969n574
$$ plain form
5088 3017444 3227436 3382283 3563992 3704209 4003496 3974816 3899372 3838859 3711925 3517269
5078 3517269 3356885 3178464 2949377 2865169 2819274 2920611 2934887 2961617 3063671 3154364
5068 3154364 3411807 3582957 3682022 3837240 3963569 3979681 3951137 3950225 3848714 3847634 3714841
5057 3714841 3653558 3608588 3418635 3320483 3283928 3334935 3267225 3181383 3233920 3333262 3334671
5046 3334671 3407759 3470017 3438946 3433779 3349802 3265177 3175687 3123633 2835642 2669950 2511385
5035 2511385 2309484 2174486 2025214 1821920 1727552 1729783 1603925 1544221 1580341 1544155 1594888
5024 1594888 1600076 1552436 1660162 1680566 1661507 1583505 1543668 1708723 1750721 1695431 1842342
5013 1842342 1958404 1947642 2010454 1982883 1897788 1776854 1764964 1751695 1628581 1595612 1590038
5002A590038o4649r4876K8837o8404r9274Q1792M3480r351R4606R8K5121M8771
4990A576189j05470k6421R0598j80151j23306N9564k5807k3515n5285J8218n7347
4979A147267l6639R2511P8811k11648j2837J3686L6817p7342m6142O014K8281
4968A018779L1273n1935j4076r9245J35753m9886j766Q8547K0180p2749j02860
4957I02015m7706J35722L5146q3421Q6418o638N6839K3849o8842p7859j6130O7271
4945A006664P2423n512n0229J10267p2624q9771M8008J2653L2877O0530K9805
4934A155091K641q877l897j4580M4424j2026j25347o7636K4757l8935R2463Q2890
4922A130968k2605J13333j8467L378Q644N794J8576m5892O6775J697m1801k7703
$$ plain form
5002 1590038 1525389 1430513 1459350 1390946 1291672 1373464 1416944 1407593 1502199 1502297 1527418 1576189
4990 1576189 1470719 1444298 1534896 1354745 1231439 1291003 1265196 1241681 1186396 1204614 1147267
4979 1147267 1110628 1203139 1281950 1070302 1057465 1071151 1107968 1030626 984484 990498 1018779
4968 1018779 1050052 998117 984041 884796 1020549 970663 968897 1057444 1077624 1004875 902015
4957 902015 854309 990031 1025177 941756 1028174 1021536 1078375 1102224 1033382 955523 939393 1006664
4945 1006664 1079087 1073575 1023346 1133613 1060989 971218 1019226 1031879 1064756 1125286 1155091
4934 1155091 1157732 1148855 1144958 1130378 1174802 1162776 1037429 969793 994550 955615 1048078 1130968
4922 1130968 1108363 1221696 1203229 1206607 1215251 1221045 1239621 1193729 1260504 1262201 1220400 1192697
4910A192697L3683q426n5541N2835L9726K5068O3123j0091K3311Q8185j38589
4899A305981J9272N3904o4571J90694m3930j05317L1130O59J1982O7121M3856
4888A510781R020N7118M9647J0099l2092J7836Q3929n6181N4489J9085L9388j1716
4876A751403K3349J4943M6268n436l1337Q2747O9806j7291k476P5280Q800k860
4864B013196M2570Q5915m9302P8145Q3387O8019L6138L6650K9362O892L5955J8812
4852B485739P2628M9185J19101M2374p7442N4161J40037J31288p8571M370o4000
4841B878870J01293Q3847J01854L5282R9923P3512Q0635o9917R3069J13382J47291
4830C739041J18105N2466J74347P2861L284K631K3643j90156p6826n217K1911
$$ plain form
4910 1192697 1226380 1217954 1162413 1215248 1254974 1280042 1343165 1333074 1356385 1444570 1305981
4899 1305981 1325253 1379157 1314586 1505280 1461350 1356033 1387163 1387822 1399804 1466925 1510781
4888 1510781 1519801 1576919 1626566 1636665 1604573 1622409 1706338 1650157 1704646 1723731 1763119 1751403
4876 1751403 1774752 1789695 1835963 1830527 1799190 1881937 1951743 1934452 1931976 2007256 2016056 2013196
4864 2013196 2055766 2141681 2092379 2170524 2253911 2321930 2358068 2394718 2424080 2430972 2466927 2485739
4852 2485739 2558367 2607552 2726653 2769027 2691585 2745746 2885783 3017071 2938500 2942870 2878870
4841 2878870 2980163 3064010 3165864 3201146 3301069 3374581 3455216 3385299 3478368 3591750 3739041
4830 3739041 3857146 3909612 4083959 4156820 4160104 4162735 4186378 3996222 3919396 3914179 3936090
4819C936090k2447K0746l8687K8189K3303M4581J04888R1083Q692Q9481Q7719
4808D373638J59114Q4247J51101K3518J75243O174J36802K22919J15659J98838
4798E647253J36087P8869J81178K54257k8072J69519K02076J47820J0724K30020
4788G029731J23555Q7111J52389J51970K24637J58826P3032R8076Q0639J60825
4778H340791K94394L06237K18484K79814K00149L00877L71795K59749L60815L54765
4768A1287870L52442N13505N49675O17493Q04617J055999J195766J414917J731661
4759A9523945K202662K350641K819624L710774M839422O599689Q757942R755823
4751F0560522J0403930P498223K257904l152989r738693j1725428j1714160r487088
$$ plain form
4819 3936090 3913643 3934389 3895702 3923891 3947194 3991775 4096663 4187746 4196438 4285919 4373638
4808 4373638 4532752 4616999 4768100 4791618 4966861 4973035 5109837 5332756 5448415 5647253
4798 5647253 5783340 5862209 6043387 6297644 6269572 6439091 6641167 6788987 6799711 7029731
4788 7029731 7153286 7240397 7392786 7544756 7769393 7928219 8001251 8099327 8179966 8340791
4778 8340791 8635185 8941422 9159906 9439720 9639869 9940746 10312541 10572290 10933105 11287870
4768 11287870 11640312 12153817 12703492 13320985 14125602 15181601 16377367 17792284 19523945
4759 19523945 21726607 24077248 26896872 30607646 35447068 42046757 50804699 60560522
4751 60560522 70964452 78462675 80720579 77567590 67828897 56103469 44389309 34902221
4743C4902221o320093m245119k984153k340785j703760j392106j267950r40288
4735A3707967q02629o65463m76613n22203l29291l51981l03010k17094j64740
4726I874943k26475j50292j12367j16963J2296q4683J549J2980O1377j13381j26358
4715I032626r5709k4313P3813%L9009K43184J25470M1007J80082J99228K38819
4704A0053216K33336L13551M08011L72109L19700M33838O01122P53326N17732
4695A4005941P91217P70983P92724J130297J295425J780050K185077K773756L445957
4686B8971427M679512O343834Q001897Q603763R409711P078963K125420j106978
4678G4107549o384744r363621r759602r978850p791009n131747l929445k952390
$$ plain form
4743 34902221 28582128 24337009 21352856 19012071 17308311 15916205 14648255 13707967
4735 13707967 12905338 12239875 11763262 11241059 10911768 10559787 10256777 10039683 9874943
4726 9874943 9648468 9498176 9385809 9268846 9281142 9196459 9198008 9210988 9272365 9158984 9032626
4715 9032626 8936917 8912604 8986417 8986417 9025426 9268610 9394080 9435087 9615169 9814397 10053216
4704 10053216 10286552 10600103 11008114 11380223 11699923 12133761 12734883 13488209 14005941
4695 14005941 14797158 15568141 16360865 17491162 18786587 20566637 22751714 25525470 28971427
4686 28971427 33650939 39994773 47996670 56600433 66010144 73089107 75214527 74107549
4678 74107549 67722805 58359184 48599582 38620732 30829723 25697976 21768531 18816141
4670A8816141k239749j809320j267640j255890r46223p41272p65607n08954m54194
4661H827292m92382l78997k83921l57823l13560k80026k09204k12388j30034k96872
4651E872085k38477j17695n7291j36629j18326j84984j52215k24574j90263j2669
4641D438962q2528j11143o5056o6922o2988l2152j44744j38960l6897j02033l4617
4630C560922j16954n5522K8249l6517j53259j11107m4121K2344M4849m2624j538
4619C094722j13474j50990R099J14065p5152L3383l1790p033L3728o6502p4003
4608B766053M5178q4406Q282R6092K4595m9920k18N7913p745l9919n7425j8175
4596B740305k7891Q302n5392J4706R2421k05839k9370k6634n496J293n1533o5997
$$ plain form
4670 18816141 16576392 14767072 13499432 12243542 11297319 10556047 9790440 9281486 8827292
4661 8827292 8334910 7955913 7671992 7314169 7000609 6720583 6511379 6298991 6168957 5872085
4651 5872085 5633608 5515913 5458622 5321993 5203667 5018683 4866468 4641894 4451631 4438962
4641 4438962 4356434 4245291 4180235 4113313 4050325 4018173 3873429 3734469 3697572 3595539 3560922
4630 3560922 3443968 3388446 3416695 3380178 3226919 3115812 3071691 3094035 3138884 3096260 3094722
4619 3094722 2981248 2830258 2839357 2953422 2878270 2911653 2879863 2872830 2906558 2840056 2766053
4608 2766053 2811231 2726825 2735107 2831199 2855794 2805874 2805656 2863569 2855824 2815905 2758480 2740305
4596 2740305 2712414 2720716 2665324 2680030 2772451 2566612 2537242 2510608 2505112 2506405 2454872 2388875
4584B388875j53J2628R6937m6548j024R384K9254J59797P640M6873L9919N7994
4572B801576k0490q6700L4112K8149o9274p4888n1131P0952n38k5526K0522O3740
4560B690504r8852j7707K5320k1704L2229l2992J01073P0622n4108k7389l3055
4549B633941Q9315O3640j6306J15652J2909r8651J9404J19652J02884J6801q937
4538C050304p2438m5957j6913P8706m796m1417J15990k1479P5504O8615l1977
4527C154142p6410L9958M5706M2372J025R764N985J15796m1788q886P7253k1592
4515C343325Q8542R1498o4459k6549K8332N9455P0860m137Q9967J15029K03988
4504C995851J8905l158L6754j1009M7653J4057J925N4795Q8278L5778M3020L9194
$$ plain form
4584 2388875 2388722 2401350 2498287 2451739 2450715 2460099 2489353 2649150 2656790 2703663 2743582 2801576
4572 2801576 2781086 2694386 2728498 2756647 2687373 2612485 2561354 2632306 2631768 2606242 2626764 2690504
4560 2690504 2591652 2573945 2599265 2577561 2609790 2576798 2677871 2748493 2694385 2666996 2633941
4549 2633941 2723256 2786896 2770590 2886242 2899151 2800500 2819904 2939556 3042440 3059241 3050304
4538 3050304 2977866 2931909 2914996 2993702 2988906 2947489 3063479 3042000 3117504 3186119 3154142
4527 3154142 3077732 3117690 3163396 3205768 3206793 3216557 3222542 3338338 3296550 3287664 3364917 3343325
4515 3343325 3431867 3523365 3458906 3432357 3460689 3520144 3591004 3586867 3676834 3791863 3995851
4504 3995851 4014756 4011598 4048352 4037343 4084996 4099053 4100978 4155773 4244051 4279829 4322849 4362043
4492D362043m3158P6770O6614R1659P5714J5670R260O9771R4274J53665J948P5119
4480E049349O2479J50021Q5639M5569l2680J12172J20462k5525J13491Q6781N989
4469E773747M826J95361J69658R1560R9790J99598J5643N4436J41153K12988P9017
4458G037777l3192K27350K30281J68265K43968K09247K21689J15734M3509P8578
4448H543206R1555Q0365J09820K21483J78752J30525K52622K93160J47481L77132
4438A0426101M93003K77066K40051L88081K72012K15777K40042L88926L20651
4429A3261710M69726M19972N44251O29306O87708Q08386R10206Q29616Q36668
4420A9397549J086202J160366J222428J220560J180777J130876J108632R94497
$$ plain form
4492 4362043 4318885 4395655 4462269 4553928 4629642 4645312 4654572 4724343 4818617 4972282 4974230 5049349
4480 5049349 5111828 5261849 5347488 5393057 5360377 5472549 5593011 5567486 5680977 5767758 5773747
4469 5773747 5778573 5973934 6143592 6235152 6334942 6534540 6550183 6604619 6745772 6958760 7037777
4458 7037777 7004585 7231935 7462216 7630481 7874449 8083696 8305385 8421119 8464628 8543206
4448 8543206 8634761 8715126 8824946 9046429 9225181 9355706 9608328 9901488 10048969 10426101
4438 10426101 10919104 11196170 11436221 11824302 12096314 12312091 12552133 12941059 13261710
4429 13261710 13731436 14151408 14695659 15324965 16012673 16821059 17731265 18560881 19397549
4420 19397549 20483751 21644117 22866545 24087105 25267882 26398758 27507390 28501887
4412B8501887Q33276O20514N67167L70813K58446K50470J15357K35734K93844
4403C2047508K93371O42726Q71624J036432J178336J305954J236285J313979J167554
4394D1093769J004225P27658M91590L22912m6960j09785l15459m05863l12185
4385D2449902m23791m99387n05625m78272n10266l93795l17230o6085K16746N22432
4375C9994629Q18184J042005J017732J099259Q56398N81340M84226R6217M7407
4366D6037397J55847J02071M97166M03654N67528N22082L64962R5968l75199n69966
4356D7801510j013349j289869j600544j930238j962961k153794k308883k204236
4348C3337636k137967j966843j807149j506497j244693j075169j061123r93478
$$ plain form
4412 28501887 29335163 29955677 30522844 30893657 31152103 31402573 31517930 31753664 32047508
4403 32047508 32340879 32983605 33855229 34891661 36069997 37375951 38612236 39926215 41093769
4394 41093769 42097994 42825652 43317242 43640154 43593194 43483409 43167950 42762087 42449902
4385 42449902 42026111 41526724 41021099 40542827 40032561 39638766 39321536 39255451 39472197 39994629
4375 39994629 40812813 41854818 42872550 43971809 44828207 45409547 45893773 45989990 46037397
4366 46037397 46193244 46295315 46792481 47196135 47763663 48285745 48650707 48746675 48371476 47801510
4356 47801510 46788161 45498292 43897748 41967510 40004549 37850755 35541872 33337636
4348 33337636 31199669 29232826 27425677 25919180 24674487 23599318 22538195 21544717
4340B1544717p60884o48315n39185k65506m35729k41903k45686m32123m16958
4331A7558428k46792j63267k17493k11270j89471k036n8295r2604l8330l725j48722
4320A6186423j11492m6227j58694j40662M3698J37720J23475K24285J14871K13806
4310A6587203L46403L65833K17431L75449M23389M40451N42007N37609N90850
4301B0426625O05248L86654M69054N01671L03270K76013M42517O09347P03112
4292B4723511Q02732Q45770J037258J216696J518465J525222J962317K001214
4284C5633185K078140K181156K258039K192485K092757J934084J540204J255966
4276E1166016P71969M81357L1073l78238m76102n42098o65361p66489p73837o96484
$$ plain form
4340 21544717 20783833 20135518 19596333 19330827 18895098 18653195 18407509 17975386 17558428
4331 17558428 17311636 17148369 16930876 16719606 16530135 16528099 16469804 16377200 16338870 16335145 16186423
4320 16186423 16074931 16028704 15870010 15729348 15773046 15910766 16034241 16258526 16373397 16587203
4310 16587203 16933606 17299439 17516870 17892319 18315708 18756159 19298166 19835775 20426625
4301 20426625 21031873 21418527 21887581 22389252 22692522 22968535 23411052 24020399 24723511
4292 24723511 25526243 26372013 27409271 28625967 30144432 31669654 33631971 35633185
4284 35633185 37711325 39892481 42150520 44343005 46435762 48369846 49910050 51166016
4276 51166016 51937985 52419342 52450415 52072177 51596075 51053977 50388616 49622127 48848290 48151806
4266D8151806m91614m78620l92205l20560l67422n85476p63510o31106o85060
4257D3436233o33639n60470m16059k62622J21693K35568N42710M53525M77305
4248D3394244N76863O32984N99936L98426J75335j10994j88800m98347n48140
4239D4431507p87754j001765r98835j073834j075198j207026j102578q60853q31477
4230C5492187p86168o17877n81837n88392n00471n86515n74515n75175p24749
4221B9956488p07208p90901j088996r24776j124499j298481j090830j066859r24751
4212B0939187q63198p78725o63023n86764m78443m29486l38835l45560l57954
4203A6097199l16925k50717m2671j09955j7753j39033k59337k31595l72719m05766
$$ plain form
4266 48151806 47660192 47181572 46789367 46468807 46101385 45515909 44752399 44121293 43436233
4257 43436233 42802594 42242124 41826065 41563443 41685136 41920704 42463414 42916939 43394244
4248 43394244 43971107 44604091 45204027 45602453 45777788 45666794 45477994 44979647 44431507
4239 44431507 43643753 42641988 41643153 40569319 39494121 38287095 37184517 36323664 35492187
4230 35492187 34706019 34088142 33506305 32917913 32417442 31830927 31256412 30681237 29956488
4221 29956488 29249280 28458379 27369383 26444607 25320108 24021627 22930797 21863938 20939187
4212 20939187 20075989 19297264 18634241 18047477 17569034 17139548 16800713 16455153 16097199
4203 16097199 15780274 15529557 15486886 15376931 15359178 15220145 14960808 14729213 14356494 13950728
4193A3950728l92998l91911k71527l12988k77063L7841q8754p8685j2736J02930
4183A2264837K4287Q873q8785l8807J16031M4580Q5747P0820m3276L8501J01874
4172A2584682l6593j37655o3672M0377j02005J52523Q7816J21063J20152Q2888
4162A2849576J27296J18956M2056l1127K1819J75149J89352M2371Q8110K23639
4152A3847197L03904J56899K05578K10870K24792K29325J81277K37459K19902
4143A5817203K62418L23463L13140L82543M58552L67771L77189L80243J63762
4134A8846284R518j27462k99597n09474n33720m66358l98319k83092n1555J08407
4124A6294632L2393Q6264R6848J81324L33572K36260J29691L36528M50741L93232
$$ plain form
4193 13950728 13557730 13165819 12894292 12581304 12304241 12342082 12253328 12174643 12161907 12264837
4183 12264837 12289124 12297997 12209212 12170405 12286436 12331016 12416763 12487583 12444307 12482808 12584682
4172 12584682 12548089 12410434 12346762 12387139 12285134 12437657 12525473 12646536 12766688 12849576
4162 12849576 12976872 13095828 13137884 13106757 13128576 13303725 13493077 13535448 13623558 13847197
4152 13847197 14151101 14308000 14513578 14724448 14949240 15178565 15359842 15597301 15817203
4143 15817203 16079621 16403084 16716224 17098767 17557319 17925090 18302279 18682522 18846284
4134 18846284 18855802 18728340 18428743 17919269 17385549 16919191 16520872 16237780 16186225 16294632
4124 16294632 16327025 16413289 16510137 16691461 17025033 17261293 17390984 17727512 18178253 18571485
4114A8571485L82417N3023n1463j16910k03067k11801j32191p1243L1198n1307
4104A8200141k45543j05859j1641j28179M0595P4481n8359Q4892K11628K38973
4094A8301129J74472J41430K56702L50319L45584K75518L44619K02849K25919
4085B0618541L20406L55044L86262L02842K42675K52839K71362K88039K46542
4076B3284552M43248M41756L04184N26917N65001N46459N28537N11567N31855
4067B7684076N63441O97602O70184P40018Q04831Q01346R36605J010614J052845
4058C4961562J246311J420075J705899J798182J976917K413312L034524L602209
4050E2158991M178564M945607N287346N106629M352032K556686M58243j559378
$$ plain form
4114 18571485 18953902 19006925 18955462 18838552 18635485 18423684 18291493 18220250 18251448 18200141
4104 18200141 17954598 17848739 17837098 17708919 17749514 17823995 17765636 17850528 18062156 18301129
4094 18301129 18475601 18617031 18873733 19224052 19569636 19845154 20189773 20392622 20618541
4085 20618541 20938947 21293991 21680253 21983095 22225770 22478609 22749971 23038010 23284552
4076 23284552 23727800 24169556 24473740 25000657 25565658 26112117 26640654 27152221 27684076
4067 27684076 28247517 28945119 29615303 30355321 31160152 31961498 32898103 33908717 34961562
4058 34961562 36207873 37627948 39333847 41132029 43108946 45522258 48556782 52158991
4050 52158991 56337555 61283162 66570508 71677137 76029169 78585855 79044098 77484720
4042G7484720l140372l844972l981097l103662j951570j044342m37294R5856L07932
4033F0385199P40135J168603J457678J923331K385053K696971L195721L771791
4025G7724482M335512M803132N545681O444450P408926Q600107J0055731J1576928
4017A36494949J3071902J4345348J4902434J4199109J1780765P909068K488785
4010B15192360l779104r222663j3129258j5041012j4880021j3455901j2046027
4003A33638374j0542959r103264q035821o733400n474047m361008l581807l027804
3995H2778264k547389k094024j812009j609204j462462j406341j407591j561523
3987F8877721j632360j806300j782483j577192j355797j155784r83138o96382
$$ plain form
4042 77484720 74344348 70499376 66518279 63414617 61463047 60418705 59981411 60077267 60385199
4033 60385199 61125334 62293937 63751615 65674946 68059999 70756970 73952691 77724482
4025 77724482 82059994 86863126 92408807 98853257 106262183 114862290 124918021 136494949
4017 136494949 149566851 163912199 178814633 193013742 204794507 212703575 215192360
4010 215192360 211413256 202190593 189061335 174020323 159140302 145684401 133638374
4003 133638374 123095415 113992151 105956330 99222930 93748883 89387875 85806068 82778264
3995 82778264 80230875 78136851 76324842 74715638 73253176 71846835 70439244 68877721
3987 68877721 67245361 65439061 63656578 62079386 60723589 59567805 58584667 57888285
3979E7888285n04020m63373l91467m76448n99353q71302j022461j134951j144052
3970E1280858j260277r82713q86739p35030o30975m48703k21252j63586l7335
3961D5914248J16165J60330K80968L72308N13289Q17218J006593J159872J647423
3952E1988414K199750K976663L794383M733470N943226P689697J0252488J4547339
3944A04125430K0827826K8698056L2492917L0106406J5131828j1362362l3635741
3937A86384360m2862535l4762412k2359871j4554866j0321989p664955n808205
3930D8049527m525136l640179k811935k238062j765079j449919j448859j394121
3922B8776237j364771j372370j178096j027723q07618p83287o55643o52517n59306
$$ plain form
3979 57888285 57384265 56920892 56529425 56052977 55453624 54582322 53559861 52424910 51280858
3970 51280858 50020581 49037868 48151129 47416099 46785124 46336421 46115169 45951583 45914248
3961 45914248 46030413 46190743 46471711 46844019 47357308 48174526 49181119 50340991 51988414
3952 51988414 54188164 57164827 60959210 65692680 71635906 79325603 89578091 104125430
3944 104125430 124953256 153651312 186144229 216250635 231382463 220020101 186384360
3937 186384360 143521825 108759413 86399542 71844676 61522687 53857732 48049527
3930 48049527 43524391 39884212 37072277 34834215 33069136 31619217 30170358 28776237
3922 28776237 27411466 26039096 24861000 23833277 23025659 22242372 21586729 20934212 20374906
3913B0374906o25065m91105m72797m94825m82156n22875n39785n03826m49012
3904A5793460k83244j67602j48583r0606l7596P0689M9585J33300n6730L3026
3894A5295699j0299p9166j2571L9711n0652q1269p5789l8686k05464m58092m52260
3883A3871162n42885n52024l09925l38340k37243j62548j62835k08063q2571r2090
3873A1182638k23231n8182o8342k16143r3152m4311r33o3291L9293j5562n6023
3862A0382761J45968K3499J2875Q3238j50275n3744q3750j36540o8680p8941n8283
3851A0018128p267m5429j99759j22048k80021j46334j25781o3651j42394j45703
3841H739741J17797J02147j4621O8598J53577J14550Q5303J80577J08745p8336
$$ plain form
3913 20374906 19749841 19258736 18785939 18291114 17808958 17286083 16746298 16242472 15793460
3904 15793460 15510216 15342614 15194031 15103425 15065829 15136518 15186103 15319403 15262673 15295699
3894 15295699 15285400 15206234 15193663 15233374 15182722 15101453 15025664 14986978 14781514 14323422 13871162
3883 13871162 13328277 12776253 12466328 12127988 11890745 11728197 11565362 11357299 11274728 11182638
3873 11182638 10959407 10901225 10832883 10616740 10523588 10479277 10478344 10415053 10454346 10438784 10382761
3862 10382761 10528729 10552228 10565103 10648341 10498066 10444322 10360572 10224032 10155352 10076411 10018128
3851 10018128 10010861 9965432 9765673 9643625 9363604 9217270 9091489 9027838 8885444 8739741
3841 8739741 8857538 8959685 8945064 9013662 9167239 9281789 9367092 9547669 9656414 9578078
3831I578078K942J1922n2973k13335k24429j72162j62141k00501j76271L7294
3821H428424O6191o689l0110P4676R7313k5876O2329O9351J27951K4775L5355
3810H923690N0168J09256n6931m3873j0152N6038O3472J00740R6810J14750J06069
3799I510037M7810J72184J10567J61664J42467l6012N0412R9026J08109J09531
3789A0475795J13808O9389L399J04255r520k7185p9250k3850j6221L9108m722
3778A0645006j3350m2920J0385Q3612J53237K4675J4059N4067q0404P8604J74058
3767A1101029O6675N8445K61539K21130J07465K19346J65094O6222Q529O5696
3757A2341170J14055J5955J10301J77413J72639J10714L75215J19540J61068K03921
$$ plain form
3831 9578078 9581020 9592942 9539969 9326634 9102205 8930043 8767902 8567401 8391130 8428424
3821 8428424 8494615 8487926 8457816 8532492 8629805 8603929 8666258 8735609 8863560 8888335 8923690
3810 8923690 8973858 9083114 9026183 8982310 8972158 9028196 9091668 9192408 9289218 9403968 9510037
3799 9510037 9557847 9730031 9840598 10002262 10144729 10108717 10159129 10258155 10366264 10475795
3789 10475795 10589603 10658992 10662391 10766646 10757126 10729941 10650691 10626841 10610620 10649728 10645006
3778 10645006 10631656 10588736 10599121 10682733 10835970 10860645 10874704 10928771 10848367 10926971 11101029
3767 11101029 11167704 11226149 11487688 11708818 11816283 12035629 12200723 12266945 12275474 12341170
3757 12341170 12455225 12471180 12581481 12758894 12931533 13042247 13417462 13537002 13698070 13901991
3747A3901991K94505K67226L75743K55059K97011L05012K76465M28746M69484
3738A6871242O27163O37321O64484Q27481Q39881R39319J011874J009382J166810
3729B4594957J090214P96452R39458Q15618O49335N09630L73896K97037J88880
3720C0255477J26915K21096K42761K95826M13205L53698L66132M10692M98053
3711C3183855K60314M01170L21758K12094J93217K90992L65789N14680N09705
3702C6253574R61363J110374J353628J617441K035281K419568K733032K996524
3694E1480785L259229L515616L513823L305554L166080K651159K114861J501290
3686G4508397J005776N21026K1695l97276n28122o09662n54223o38803l03307
$$ plain form
3747 13901991 14196496 14463722 14839465 15094524 15391535 15696547 15973012 16401758 16871242
3738 16871242 17498405 18135726 18800210 19627691 20467572 21406891 22418765 23428147 24594957
3729 24594957 25685171 26481623 27421081 28236699 28886034 29395664 29769560 30066597 30255477
3720 30255477 30382392 30603488 30846249 31142075 31555280 31908978 32275110 32685802 33183855
3711 33183855 33444169 33845339 34167097 34379191 34572408 34863400 35229189 35743869 36253574
3702 36253574 37214937 38325311 39678939 41296380 43331661 45751229 48484261 51480785
3694 51480785 54740014 58255630 61769453 65075007 68241087 70892246 73007107 74508397
3686 74508397 75514173 76035199 76056894 75659618 75131496 74521834 73967611 73328808 73025501
3677G3025501k45237m23272l41709o57567j122253j486016j943372k454051k876995
3668F1475029l183479l331641l408218l408441l225963k984878k826895k574322
3660C6531192k099547j888621j650385j518203j353819j075109r18903r25692
3652B5100913o97397n27396n76461l85366m88069l11156k93308l69342n13879
3643B0938539n51191o28480o25234l73952m26285l75977k09915k36008k06548
3634A7304949k16391p6262j22813l60531l63461j37102j50477k52830j56809j73450
3624A5294823j38643J4071j72346q4536j83715J8671R742N6155K1606J5550Q1835
3613A4933213J4488J9026Q1423J07436M4426L4907P3298J44099J5989O6390J62459
$$ plain form
3677 73025501 72780264 72356992 72015283 71357716 70235463 68749447 66806075 64352024 61475029
3668 61475029 58291550 54959909 51551691 48143250 44917287 41932409 39105514 36531192
3660 36531192 34431645 32543024 30892639 29374436 28020617 26945508 26026605 25100913
3652 25100913 24403516 23876120 23299659 22914293 22426224 22115068 21821760 21452418 20938539
3643 20938539 20387348 19758868 19133634 18759682 18333397 17957420 17747505 17511497 17304949
3634 17304949 17088558 17012296 16889483 16528952 16165491 16028389 15877912 15625082 15468273 15294823
3624 15294823 15156180 15170251 14997905 14913369 14729654 14748325 14758067 14814222 14835828 14851378 14933213
3613 14933213 14947701 14966727 15048150 15155586 15200012 15234919 15308217 15452316 15468305 15534695 15697154
3602A5697154J08301m7303k9610J46863J94522J84468J27744K07049Q7342J39716
3592A6816246J12243K44977K32648J77876J41049K83130L28345K09380L51166
3583A8897060L18080L59048L13269L13102N28465L70877K77049N17463N70364
3574B2464777M97450O05497P15138P91623Q03456Q97759R83071J184631J253204
3565C0196606J315513J588778J752438J794636J956119J842128J987344K075822
3557D4509384J907468J965113J791812J795798J787855J709438J603726J507442
3549E8578036J236483J214565R26731O56528J91676l53573q80129j158933j455716
3540E8955668j673598j648374j908322j801480j597038j453870j289357j217618
$$ plain form
3602 15697154 15805455 15758152 15728542 15875405 16069927 16254395 16382139 16589188 16676530 16816246
3592 16816246 16928489 17173466 17406114 17583990 17725039 18008169 18336514 18545894 18897060
3583 18897060 19215140 19574188 19887457 20200559 20729024 21099901 21376950 21894413 22464777
3574 22464777 22962227 23567724 24282862 25074485 25877941 26775700 27758771 28943402 30196606
3565 30196606 31512119 33100897 34853335 36647971 38604090 40446218 42433562 44509384
3557 44509384 46416852 48381965 50173777 51969575 53757430 55466868 57070594 58578036
3549 58578036 59814519 61029084 61955815 62612343 62804019 62450446 61570317 60411384 58955668
3540 58955668 57282070 55633696 53725374 51923894 50326856 48872986 47583629 46366011
3532D6366011q42794o22487m21953k32137M0383M10561O49202P18401R07068J183511
3522D8155766J512552J771123K024596K368775K756208L079081L554067M029741
3514F9251909M495132N091693N190125N833064O140604O287277O344447O238907
3506A14873158N645260M868894M159012L040380J976709J121048K17388l88978
3498A35512871r55676j261279j534684j716078j837772j965420k118304k272358
3490A21851300k603250k875753l206436l630519m014775m480130m650985m765515
3482I1623937m859645m887672m848079m786353m645129m218330l833953l654609
3474E5890167l212739k901750k463858k252819k030840j941330j577262j382842
$$ plain form
3532 46366011 45523217 44900730 44478777 44246640 44287023 44697584 45346786 46065187 46972255 48155766
3522 48155766 49668318 51439441 53464037 55832812 58589020 61668101 65222168 69251909
3514 69251909 73747041 78838734 84028859 89861923 96002527 102289804 108634251 114873158
3506 114873158 120518418 125387312 129546324 132586704 134563413 135684461 135901849 135512871
3498 135512871 134557195 133295916 131761232 130045154 128207382 126241962 124123658 121851300
3490 121851300 119248050 116372297 113165861 109535342 105520567 101040437 96389452 91623937
3482 91623937 86764292 81876620 77028541 72242188 67597059 63378729 59544776 55890167
3474 55890167 52677428 49775678 47311820 45059001 43028161 41086831 39509569 38126727
3466C8126727j439716j436980j396896j239007j066809j087298j139185r99094
3458B8321742q78911q72612p84851p27603n25475n21597m56068l52959j58914
3449B3042752k06982j24627j09789J2221N8328J91073J22897J44845R9979K61554
3439B3492251J26193J17400L7237R70k8125j99067l11798m49298m40084n16446
3429B1829233o80248o54072n80172p33272p23629o44115n69262n26578n96395
3420A6121490n01143l74590k89115l26547j88045k30688l86176k27161j49622
3411A3448403j60500j92470k01110j44271j45102r9167L384k6642l3553J6460
3401A2465432K6679m0516P3043L1162J9201m235l0702L4419K9863K0545L6147
$$ plain form
3466 38126727 36687011 35250031 33853135 32614128 31547319 30460021 29320836 28321742
3458 28321742 27442831 26570219 25785368 25057765 24532290 24010693 23554625 23201666 23042752
3449 23042752 22835770 22711143 22601354 22613575 22671903 22862976 22985873 23130718 23230697 23492251
3439 23492251 23618444 23735844 23773081 23774051 23745926 23546859 23235061 22785763 22345679 21829233
3429 21829233 21148985 20494913 19914741 19181469 18457840 17813725 17244463 16717885 16121490
3420 16121490 15620347 15245757 14956642 14630095 14442050 14211362 13825186 13598025 13448403
3411 13448403 13287903 13095433 12894323 12750052 12604950 12505783 12509167 12482525 12448972 12465432
3401 12465432 12492111 12451595 12524638 12555800 12575001 12570766 12540064 12574483 12604346 12624891 12661038
3390A2661038P1242Q1221P620J75830J16657N553Q7513K40553Q1929J11074P0178
3379A3710408K26628J16670J45923J46582K20222K02207J35967L7143L37496L02145
3369A5581391K21423K24758K53548L63371K21352M28823L58225J88429K98247
3360A8139567L02082L87078K45887J63563K53832K27418J78263K36998J31408
3351B0266096K29222K42915K37384M02549L53878L10343L91854M01819N72300
3342B3408360L51629N61518M84709N80444P81419P42605O64347P50872O42082
3333B8967985P64044O09284N13080O08200M51999L13913L23782K47335K87682
3324C3087304K73699M07350N06333M74115N35383N67847N83260N67301N50991
$$ plain form
3390 12661038 12732280 12813501 12821121 12996951 13113608 13119161 13206674 13447227 13529156 13640230 13710408
3379 13710408 13937036 14053706 14199629 14346211 14566433 14768640 14904607 14941750 15279246 15581391
3369 15581391 15802814 16027572 16281120 16644491 16865843 17294666 17652891 17841320 18139567
3360 18139567 18441649 18828727 19074614 19238177 19492009 19719427 19897690 20134688 20266096
3351 20266096 20495318 20738233 20975617 21378166 21732044 22042387 22434241 22836060 23408360
3342 23408360 23759989 24321507 24806216 25386660 26168079 26910684 27575031 28325903 28967985
3333 28967985 29732029 30341313 30854393 31462593 31914592 32228505 32552287 32799622 33087304
3324 33087304 33361003 33768353 34274686 34748801 35284184 35852031 36435291 37002592 37553583
3315C7553583M80757M51404L90601K69463N33876M99489N73049O41721P01336
3306D2095279P52671O79587Q13703Q00273Q10467Q38017Q81469Q77745Q69120
3297D9418331Q20167R64162J186968J222078J322529J342202J618349J768980
3289E9663766J869347J984374K246103K510494K827690L237302L237732L652264
3281H1229072L805891M119856M226109M049970L854785L654431L407918L222120
3273A11570152K740020K596197K433477K519331K610426K996747L318823M200921
3265A34986094N106894O449584Q241606J0247285J0213121Q757629J815712n384605
3257A80433320j0650489j0458566p111496n263712m230509l461152k989494k865058
$$ plain form
3315 37553583 38034340 38485744 38876345 39145808 39679684 40179173 40752222 41393943 42095279
3306 42095279 42847950 43527537 44341240 45141513 45951980 46789997 47671466 48549211 49418331
3297 49418331 50238498 51202660 52389628 53611706 54934235 56276437 57894786 59663766
3289 59663766 61533113 63517487 65763590 68274084 71101774 74339076 77576808 81229072
3281 81229072 85034963 89154819 93380928 97430898 101285683 104940114 108348032 111570152
3273 111570152 114310172 116906369 119339846 121859177 124469603 127466350 130785173 134986094
3265 134986094 140092988 146542572 154784178 165031463 175244584 184002213 185817925 180433320
3257 180433320 169782831 159324265 152212769 146949057 142718548 139257396 136267902 133402844
3249A33402844k472468k279841j954696j612220j334673j043359q62346l50921
3241A21492320j33278K25130K24209Q25101J102099J441898J647239K658674L497804
3232A32981196O028841Q741721J3209139J4437168J3919614N254229j0522005
3225A84049903k2129055k6826341j9677095j4228477j0290486q221344o374331
3218G6302774n276740m105541l603079k931384k707228k184172j805252j406928
3210E2282450j144812q32735n28145j65766n6723M78740Q27024R58870J415946
3201E3234849K186019K821372M157971N993315P618169P712240N799151j129239
3193H8393847p204883j1176838r775751o175358m061991k718981k281017j703043
$$ plain form
3249 133402844 130930376 128650535 126695839 125083619 123748946 122705587 121843241 121492320
3241 121492320 121359042 121584172 121808381 122633482 123735581 125177479 126824718 129483392 132981196
3232 132981196 139010037 147751758 160960897 175398065 189317679 194571908 184049903
3225 184049903 161920848 135094507 115417412 101188935 90898449 82677105 76302774
3218 76302774 71026034 66920493 63317414 60386030 57678802 55494630 53689378 52282450
3210 52282450 51137638 50304903 49776758 49610992 49554269 50033009 50860033 51818903 53234849
3201 53234849 55420868 58242240 62400211 68393526 76011695 83723935 89523086 88393847
3193 88393847 81188964 70012126 60236375 54061017 49999026 47280045 44999028 43295985
3185D3295985j551954j516404j432019j435426j398134j207167j135590j015069
3177C2604222j182521j096952j064832j011040r10539p26965q67591p49968p16354
3168B4277460m11258n77193l94984m24140m49954k90933k71489k67449j2962r2002
3158B1085096n343J59462J3854J00783J21091m7247P319k0287j84670j40493P1558
3147B1161123l2174O3118R8149J99382J43320L26339J92790K57489L75622N27352
3137B3312510M65455N29793M91899O93339Q02809P69768R67072J026657J077881
3128C0137183J207331J213604J248823J124870J285855J291239J308056J347495
3120D0164456J380124J204995J337552J224245J091602J212684J170053J220909
$$ plain form
3185 43295985 41744031 40227627 38795608 37360182 35962048 34754881 33619291 32604222
3177 32604222 31421701 30324749 29259917 28248877 27338338 26611373 25743782 24993814 24277460
3168 24277460 23866202 23289009 22894025 22469885 22019931 21728998 21457509 21190060 21177098 21085096
3158 21085096 21079753 21239215 21253069 21353852 21474943 21427696 21435015 21414728 21230058 21089565 21161123
3147 21161123 21128949 21192067 21290216 21489598 21632918 21959257 22152047 22409536 22785158 23312510
3137 23312510 23777965 24307758 24799657 25492996 26295805 27065573 28032645 29059302 30137183
3128 30137183 31344514 32558118 33806941 34931811 36217666 37508905 38816961 40164456
3120 40164456 41544580 42749575 44087127 45311372 46402974 47615658 48785711 50006620
3112E0006620J322781J402084J528294J858456K036485K404725L021446L277022
3104F6857913L863469M176550M522641M825898M981363M863554M519651M022355
3096A02633394L158750K076588R99179l69506j886439l245798m332128n341804
3088I3692236o042212o425909o395594o186534n927976n454661m976145m361369
3080D7921836l947567l354564k939399k570923k338316k055415j899991j578526
3072B7237135j347765j295075j102414j106830r62262q38571p23979p54834o80872
3063A8424533n16076o53762n49809m62522m45222m35632l21571k71908n36677
3054A4231354k53512k24904k74226k33597l19248l25868k57700j92203k70187
$$ plain form
3112 50006620 51329401 52731485 54259779 56118235 58154720 60559445 63580891 66857913
3104 66857913 70721382 74897932 79420573 84246471 89227834 94091388 98611039 102633394
3096 102633394 105792144 107868732 108867911 108498405 106611966 103366168 99034040 93692236
3088 93692236 87650024 81224115 74828521 68641987 62714011 57259350 52283205 47921836
3080 47921836 43974269 40619705 37680306 35109383 32771067 30715652 28815661 27237135
3072 27237135 25889370 24594295 23491881 22385051 21422789 20584218 19860239 19105405 18424533
3063 18424533 17908457 17254695 16704886 16242364 15797142 15361510 15039939 14768031 14231354
3054 14231354 13977842 13752938 13478712 13245115 12925867 12599999 12342299 12150096 11879909
3045A1879909l56578k02721j01720j52158j64769k27831j41534k38574j07043
3036A0186981j60682j45549k35382j71035k6490j53041j75133j69685n9299j66461
3026H724224j59314j22251j15004m7243j18785m2723p0156j5995q4694j41951
3016G806108l3529K0257L8225L6747j20765r9339o0786j1354m1444p1714n2799
3005G409607p5627m0175p7886o9855L3344m212J34620O0429R1776K9046L7445
2994G528512k4262J26354Q4400J779L3220m7581n4585Q7715m1308M0292K9029
2983G763565L607N7290o869R3052j28251j6283J37181N975O0412J44904Q9713
2972H204296O1604M2636M2057k4903p7425J50676M4263j3149M3468N5575J8971
$$ plain form
3045 11879909 11523331 11320610 11218890 11066732 10901963 10674132 10532598 10294024 10186981
3036 10186981 10026299 9880750 9645368 9474333 9447843 9294802 9119669 8949984 8890685 8724224
3026 8724224 8564910 8442659 8327655 8280412 8161627 8118904 8048748 8032753 7948059 7806108
3016 7806108 7772579 7792836 7831061 7867808 7747043 7647704 7586918 7575564 7534120 7462406 7409607
3005 7409607 7333980 7293805 7215919 7146064 7179408 7175196 7309816 7370245 7462021 7491067 7528512
2994 7528512 7504250 7630604 7715004 7716783 7750003 7702422 7647837 7735552 7694244 7734536 7763565
2983 7763565 7767172 7824462 7817593 7910645 7782394 7766111 7903292 7909267 7969679 8114583 8204296
2972 8204296 8265900 8308536 8350593 8325690 8248265 8398941 8443204 8430055 8473523 8529098 8548069
2961H548069Q8267K03961J1779J31315J35801J27874J36846J30497K5697J60111
2951I700217J48109M0799J99434K25000M6160J52839J18104K34882J03165J81129
2941A1149838L84161J48276K11961K33189J14234R2474J72804R1821P6012Q7517
2931A2762287K90539J88085K01218J99788J54384K66741L67679K11021K18712
2922A4860454K87320L09978L27954K33036K35180J93541J12381J73507L17673
2913A7051024J43363K52050K32835K11831J65119K79967L80944K46905K14306
2904A9178344J77599L44569M10035K39227K90565L49602L98371M50545L61687
2895B2200544L36594N46957M77038M71000N87149P84531P48275Q10822P61659
$$ plain form
2961 8548069 8636336 8840297 8852076 8983391 9119192 9247066 9383912 9514409 9540106 9700217
2951 9700217 9848326 9889125 10088559 10313559 10359719 10512558 10630662 10865544 10968709 11149838
2941 11149838 11533999 11682275 11894236 12127425 12241659 12334133 12506937 12598758 12674770 12762287
2931 12762287 13052826 13240911 13442129 13641917 13796301 14063042 14430721 14641742 14860454
2922 14860454 15147774 15457752 15785706 16018742 16253922 16447463 16559844 16733351 17051024
2913 17051024 17194387 17446437 17679272 17891103 18056222 18336189 18717133 18964038 19178344
2904 19178344 19355943 19700512 20110547 20349774 20640339 20989941 21388312 21838857 22200544
2895 22200544 22537138 23084095 23561133 24032133 24619282 25403813 26152088 26962910 27724569
2886B7724569O58962M11656L14766L60974M77478N35271N65011O04885O77992
2877C2331564P93148Q39426R11451Q37614J041461J080014J191462J179672J239323
2868D1445135J440550J589430J690195J796310J933196K073355K217687K357373
2860E6543231K620417K721222K972486L188781L467383L771860M289522M471787
2852H4046689M658720M895728M650700M703253M915024N507137O845747Q189561
2844A28412559Q980573Q800063O809315L411217j30985k082084j938514j66014
2836A52096130K539599N293923P986822J0717484J3444677J6417818K0083013
2829B28579466K4312238K9062737L3373718L5707421L3727306K5676751J1521373
$$ plain form
2886 27724569 28383531 28795187 29109953 29470927 29948405 30483676 31048687 31653572 32331564
2877 32331564 33124712 33964138 34875589 35713203 36754664 37834678 39026140 40205812 41445135
2868 41445135 42885685 44475115 46165310 47961620 49894816 51968171 54185858 56543231
2860 56543231 59163648 61884870 64857356 68046137 71513520 75285380 79574902 84046689
2852 84046689 88705409 93601137 98251837 102955090 107870114 113377251 120222998 128412559
2844 128412559 137393132 146193195 153002510 156413727 156282742 154200658 152262144 152096130
2836 152096130 154635729 159929652 167916474 178633958 192078635 208496453 228579466
2829 228579466 252891704 281954441 315328159 351035580 384762886 410439637 421961010
2822D21961010o874527k4643878l7200648m2256157m0655612l5613408k9549579
2815B05167201k4002553j9664359j6204405j3490917j1507464j0068323q661997
2808A01567183p579586o776300n931148n324577m758844m263725l803742l460707
2800E9668554l067105k911735k690656k383012k276282k114634k048573j893725
2792D0282832j885087j792182j762541j676584j537800j385659j185057j170766
2784B7887156j150254r55655q69809p72268q45679q34117p11180o83872o35458
2775B0428864o60348o62671o87520o85862l93537m87997n89647n77232n18039
2766A5166011m09550l73444m95854l07091l47510m30102k64657k48991l27456
$$ plain form
2822 421961010 415086483 390442605 353241957 310985800 270330188 234716780 205167201
2815 205167201 181164648 161500289 145295884 131804967 120297503 110229180 101567183
2808 101567183 93987597 87211297 81280149 75955572 71196728 66933003 63129261 59668554
2800 59668554 56601449 53689714 50999058 48616046 46339764 44225130 42176557 40282832
2792 40282832 38397745 36605563 34843022 33166438 31628638 30242979 29057922 27887156
2784 27887156 26736902 25781247 24911438 24139170 23293491 22459374 21748194 21064322 20428864
2775 20428864 19768516 19105845 18418325 17732463 17338926 16850929 16261282 15684050 15166011
2766 15166011 14756461 14383017 13887163 13580072 13232562 12802460 12537803 12288812 11961356
2757A1961356k92006l35160k60365k02302k34870k13133j47296j84857k30470
2748I860897k77223j69372j40362k15718k16475j66473j11456k22791j22382j33387
2738H085258j92180l11524j10613j71200j78911j24435j51182j37318k71140j47228
2728F289527q1704j86083j51709n1408J9159r1088q8992p6015k0778j49425j6512
2717E394972M7890l1198j79877j08180J7787m9780j0292r6394j41618p9709l1101
2706D732500j03162O6743P587q2664q1635p6850k53462k2749J1601r6647k9288
2695D071974J2542p6782n1186j03339o0907L4194L5868J3513j38734J8864j9355
2684C736652j69379k0297l6635q9684K1914j07297p5817p3271K2986j7328j4865
$$ plain form
2757 11961356 11669350 11334190 11073825 10871523 10636653 10423520 10276224 10091367 9860897
2748 9860897 9583674 9414302 9273940 9058222 8841747 8675274 8563818 8341027 8218645 8085258
2738 8085258 7893078 7581554 7470941 7299741 7120830 6996395 6845213 6707895 6436755 6289527
2728 6289527 6207823 6021740 5870031 5818623 5837782 5746694 5657702 5581687 5560909 5411484 5394972
2717 5394972 5442862 5411664 5231787 5123607 5141394 5091614 5081322 4984928 4843310 4763601 4732500
2706 4732500 4629338 4696081 4703668 4621004 4539369 4462519 4209057 4186308 4197909 4101262 4071974
2695 4071974 4084516 4007734 3956548 3853209 3792302 3826496 3862364 3875877 3737143 3756007 3736652
2684 3736652 3567273 3546976 3510341 3420657 3442571 3335274 3259457 3186186 3209172 3191844 3176979
2673C176979r5635j34267o7874J5719n2648j5258l0499j8370m3759J457o2417
2662B673428j12171j82401L8261r0523o9107k2221M4654o527p2867n3848r293
2651B137385J43512J8854R7003l4784M4691J08343J8318J3391R196j9592m9952
2640B486365j76790m6419n9663j29232J40372l4944j53542n2175q0508l0826J3412
2629A876050Q5412R547Q012j58940K1142L9959l3644J09204j2856j17933m956
2618A820997J6661J2813K1975L2540p3027n473L8935p5892l0350n3696p6926R5782
2606A724339K1106M925P643j08875k9263K2197k1899j75n2986r518K2610j04163
2594A475941K2245O3381M9244m6045r6735j2513O5575p9967l1956J073R3160M2847
$$ plain form
2673 3176979 3081344 2947077 2879203 2894922 2842274 2827016 2796517 2778147 2734388 2735845 2673428
2662 2673428 2561257 2378856 2417117 2326594 2257487 2235266 2279920 2273393 2200526 2146678 2137385
2651 2137385 2280897 2299751 2396754 2361970 2406661 2515004 2533322 2546713 2555909 2536317 2486365
2640 2486365 2309575 2263156 2203493 2074261 2214633 2179689 2026147 1973972 1893464 1862638 1876050
2629 1876050 1961462 1971009 1979021 1820081 1841223 1881182 1847538 1956742 1943886 1825953 1820997
2618 1820997 1837658 1850471 1872446 1904986 1831959 1826486 1865421 1789529 1759179 1705483 1628557 1724339
2606 1724339 1745445 1750370 1758013 1649138 1619875 1642072 1620173 1619998 1567012 1557494 1580104 1475941
2594 1475941 1498186 1561567 1610811 1564766 1468031 1455518 1521093 1441126 1409170 1410243 1503403 1546250
2582A546250k7908j3528n9263o8049L2936R6163K7973J5939R7124j01087r4699
2571A451851J6236o6867J30683n154K9695n339L2585Q7386J6749L3336O4404N8622
2559A844187r794P5272j478j6195O3228r398M3868N4385O0278J21256J78836j3952
2547B390493J54221K8906O9557J66077J61402J96029J22566N3586P2005p8913
2537C335929j90312j56986k08965j94450k28273j10883j56830j02631n1716j31873
2527A803010j10135J79j2178j10997j41606J1184l4740n5776m8765j252J43616
2516A442540j032j11120j6307n7J50968L5596j12639O2370O7203r4807j21001
2505A301714j7227J0536K9084k0065j75491m5649r0331R116j5329r1717R0624
$$ plain form
2582 1546250 1518342 1504814 1445551 1377502 1410438 1506601 1534574 1550513 1647637 1546550 1451851
2571 1451851 1468087 1401220 1531903 1526749 1556444 1551105 1583690 1671076 1687825 1721161 1785565 1844187
2559 1844187 1834393 1909665 1908187 1891992 1955220 1945822 1989690 2044075 2104353 2225609 2404445 2390493
2547 2390493 2544714 2573620 2643177 2809254 2970656 3166685 3289251 3342837 3414842 3335929
2537 3335929 3145617 2988631 2779666 2585216 2356943 2246060 2089230 1986599 1934883 1803010
2527 1803010 1692875 1693054 1680876 1569879 1428273 1439457 1404717 1348941 1300176 1298924 1442540
2516 1442540 1441508 1330388 1314081 1314024 1464992 1500588 1387949 1450319 1517522 1422715 1301714
2505 1301714 1284487 1295023 1324107 1304042 1128551 1082902 992571 1001687 986358 894641 985265
2494I85265m6625J3574j5626o3262k750q0826l3248L5730k8180l7252N792N3224
2482G85816O4655Q346K6288o4773j29518j15123j6094l2622R2160L8791j1177
2471F46749O2939j508k3479P5385l4763p9200k162K1149L8187m6430J5907m1614
2459F31160j48970J36770p7693j19142J65416q8063J2576j9366N5224P85J0347
2448E59044N0012K151J6720p5572m9904m7347p5589J09766P9788p9528L8705O7823
2436E96069N1936o5455k0026O1252o5057k0147M1322J26656n6201j05490L2982
2425E77841M5579q9353N0311n277K7161P702m7900m9022j11382J7779P4288k369
2413D95358K0928j883P658k85l8256R617l1644J09570J261l1448r270P4767j37108
$$ plain form
2494 985265 938640 952214 936588 873326 870576 789750 756502 792232 764052 726800 732592 785816
2482 785816 850471 858817 885105 820332 690814 575691 559597 526975 619135 657926 646749
2471 646749 709688 708180 684701 760086 725323 646123 643961 665110 703297 656867 672774 631160
2459 631160 482190 618960 541267 422125 587541 499478 512054 492688 547912 548697 559044
2448 559044 609056 611207 627927 552355 502451 455104 379515 489281 569069 489541 528246 596069
2436 596069 648005 582550 562524 623776 558719 538572 579894 706550 650349 544859 577841
2425 577841 623420 534067 584378 579101 606262 613964 566064 517042 405660 423439 497727 495358
2413 495358 516286 514403 522061 521776 483520 493137 461493 571063 572324 540876 531606 606373 469265
2400D69265m5185M0302O004j08762o333J9016M2864P7166l1211o1078K6589R795
2388D38432o4959P0059L3789j03860O9069L8455k340m1323M0091L2335l2386O2805
2376E40167N9096P254p0138K7323j30552K169J285P4578L8165l6316j14913N9701
2364D57819J81306o8668K1303j1576N0698j2341L5019j157K1934j41109j25472
2353D07756M2263K30m4215J4654l116o1808j0305l5501K8758O7961k2012N3319
2341D37984o8817n7465K4126m525j9836P940K1158o1193Q9618N5276J7914j33742
2329C08438k4446R149k1399K0137O1611k399N6329K0902j11188j18248N8969M9467
2317C07322M0660L2924r9897j5018O037n1560l795o6376J02691k1124j7237O4396
$$ plain form
2400 469265 424080 464382 470386 361624 355291 374307 417171 494337 463126 402048 428637 438432
2388 438432 373473 443532 477321 373461 442530 480985 478645 437322 477413 509748 477362 540167
2376 540167 599263 606517 536379 563702 433150 435319 436604 511182 549347 513031 398118 457819
2364 457819 639125 570457 591760 580184 630882 618541 653560 652403 674337 533228 407756
2353 407756 450019 450249 406034 420688 417572 355764 345459 309958 338716 406677 384665 437984
2341 437984 369167 311702 335828 331303 311467 319407 340565 279372 368990 424266 442180 308438
2329 308438 283992 293141 271742 291879 353490 351091 407420 428322 317134 198886 257855 307322
2317 307322 347982 380906 281009 265991 272028 220468 216673 150297 252988 231864 214627 279023
2305B79023K2397n5968J30187n9187P28l4492Q1460j7114j07706Q6868k5389j7529
2293B83278k5798K5241j24052o6471o5747M9511J06743O0076J4987J19128l9570
2282C37326j45116l6129J24642k6086K8978J22228M2828n9080q0203l004o5307
2271B41077L594q2161M4798n9650r1291N5180J34482J0231j100N6516N5518o1188
2259C06006n1252j1381m1866l3124J6276Q0040J323j8808o6879O3376L2516n159
2247B71068l4806K9025R2912j12764m0789J43509q2214o0817J3188J0691l6519
2236A92484J30766K0266l669M463J8903P885R3801o4451j06817K7815K8496p2705
2224B77237M1391K3249l0992N6448k2194J6421o598P7694o0117n8812N3708j0541
$$ plain form
2305 279023 301420 245452 375639 316452 317180 282688 364148 347034 239328 326196 300807 283278
2293 283278 257480 282721 158669 92198 26451 75962 182705 242781 257768 376896 337326
2282 337326 192210 156081 280723 254637 283615 405843 448671 389591 309388 306384 241077
2271 241077 244671 162510 207308 147658 56367 111547 246029 256260 255160 311676 367194 306006
2259 306006 254754 243373 201507 168383 184659 264699 266022 247214 180335 243711 276227 271068
2247 271068 236262 265287 358199 245435 204646 348155 265941 205124 218312 229003 192484
2236 192484 323250 343516 339847 344310 363213 371098 464899 400448 293631 321446 349942 277237
2224 277237 318628 341877 310885 367333 345139 361560 354962 432656 372539 313727 367435 356894
2212C56894L3121n6613R9041L0960m6215L6958q9925j21131J97002j1665J0824
2201D39251M0936N760j0846J8255P5289k3234O6871K2503K2853J7549o4466j17708
2189D93013N3330L335J0938M5597K6462q0602l517K8228J4206R4662q579L0521
2177G07594J22447J1331l5392r9338J6511J66090M8268j34741J420O2642J4810
2166H81642j07816L0889O0129M863j7218k4061j9659M7673M1318l8775R862p9513
2154G89334J29020P8118N5483K8815p368k7654J4289O6804Q6529N398N4787M2444
2142A315999L4880K5818J8120J19880q5744m0641J36311J25522L9578l3815O8315
2131A724223Q0246J33475L5120P2774J49594M1143J26161o6919K7456P5873P1657
$$ plain form
2212 356894 390015 333402 432443 463403 417188 454146 364221 243090 440092 428427 439251
2201 439251 480187 485947 475101 493356 568645 545411 612282 634785 657638 675187 610721 493013
2189 493013 546343 549678 560616 606213 632675 552073 548556 576784 590990 685652 677073 707594
2177 707594 830041 841372 805980 706642 723153 889243 937511 802770 804190 866832 881642
2166 881642 773826 804715 864844 869707 852489 828428 808769 856442 897760 858985 868847 789334
2154 789334 918354 996472 1051955 1080770 1073402 1045748 1060037 1126841 1213370 1218768 1273555 1315999
2142 1315999 1350879 1376697 1394817 1514697 1428953 1388312 1524623 1650145 1689723 1655908 1724223
2131 1724223 1804469 1937944 1973064 2045838 2195432 2236575 2362736 2295817 2323273 2399146 2470803
2120B470803m693J25491J85669K19435R5903O6928J65391J84259J02950K14477
2110C826613K41236M18158K01107M58975N08180M75865L00033L01838L85917O26632
2100G744554O95457J033221J326221J715294J958455K908569L898305N879959
2092B7160035O973028P519203L924682l237348q615836r627891n721206l790053
2084A4584614k500229k055180j447758j144233o69861o51530l68759k85734j82027
2075E279303j81802k17120m36876m47804l39838k87550l17596k40923q3076q7446
2065B639272k58441j16283O8299n1269q6054j05416j93076o7484j17686j25363
2055A586499n7376r6428k3939j03373o1541p1226n0939L8236l3946j48761p9787
$$ plain form
2120 2470803 2466110 2591601 2777270 2996705 3092608 3159536 3324927 3509186 3612136 3826613
2110 3826613 4067849 4486007 4687114 5146089 5654269 6130134 6430167 6732005 7117922 7744554
2100 7744554 8440011 9473232 10799453 12514747 14473202 17381771 21280076 27160035
2092 27160035 34133063 41652266 45576948 42339600 33723764 24095873 18374667 14584614
2084 14584614 12084385 10029205 8581447 7437214 6767353 6115823 5747064 5461330 5279303
2075 5279303 5097501 4880381 4443505 3995701 3655863 3368313 3050717 2809794 2726718 2639272
2065 2639272 2380831 2264548 2332847 2281578 2195524 2090108 1897032 1829548 1711862 1586499
2055 1586499 1529123 1432695 1408756 1305383 1243842 1172616 1121677 1159913 1125967 977206 897419
2044H97419r2619N4018P9553K3702J0094L3176J7016r7393j13882L801J1276Q8
2032H26249j287j41185k953K1345R620j07915j8367M9378o7619j00244K4396n0572
2020D40846p8249J03187n4077m9444K3461L4117K2775Q738J1707k2379m1661J5609
2008D14630J6868m6224r2726k7015M3217k5592l5662J07912q1433R375p4557P3115
1996B81908R7840Q989q0400j22059N5611J01313R90q254p9243k7006j4875m0554
1984A74260m758P1938L8772m311l6609J3690j1983j17702J05824L1385q0565O5311
1972B45252K5506Q863l4970r0727o207P3221N7478o2913r1719l5509L5974J8623
1960A42872k9844R158N1616n3437n4639O2351m6330M3992J12514L5801j79824
$$ plain form
2044 897419 804800 858818 938371 962073 972167 1005343 1022359 924966 811084 814885 826161 826249
2032 826249 824962 683777 680824 702169 711789 603874 585507 634885 567266 467022 491418 440846
2020 440846 362597 465784 411707 362263 385724 419841 442616 451354 463061 440682 399021 414630
2008 414630 431498 385274 292548 265533 308750 283158 247496 355408 273975 283350 208793 281908
1996 281908 379748 388737 308337 186278 241889 343202 344192 335938 256695 229689 214814 174260
1984 174260 169502 241440 280212 275901 239292 252982 240999 123297 229121 260506 179941 245252
1972 245252 270758 279621 244651 153924 147717 220938 278416 215503 123784 88275 124249 142872
1960 142872 113028 122186 173802 120365 65726 128077 81747 125739 238253 274054 94230
1949I4230o8365M8521P2627Q6964p0030o6362K876l999K1487L6023n7542m753
1937I1677M0774J0713j6193j5259N3145n543n8853q9435o6136O4320K4268Q469
1925D1947k1730M5141n2982J02061k0046M1078j9332j45757m013L2642Q9638J6651
1913A05298O2732N994j7752p504k6067r428m5580q3647m6286l7334Q4656J22941
1901A08023j02278k2288K0358l4540N8926n594L8098J3722m0646J17552p0920
1890H0413j0613k7197l3787P9028L634J40N4994p343q9479n9587N646M1876J300
1877C9025n0350p5362J01748N7290P7473J4692r0732q783L5366l7837r047p1990
1865a8507J036K4222J2091K9652l0883p8541K8659N1736K1215n3711K8012m22
$$ plain form
1949 94230 25865 74386 147013 233977 163947 97585 100461 96462 117949 153972 96430 91677
1937 91677 132451 143164 126971 111712 164857 159314 100461 11026 -55110 9210 33478 41947
1925 41947 20217 65358 12376 114437 94391 135469 116137 -29620 -33633 -991 88647 105298
1913 105298 168030 174024 156272 148768 122701 113273 67693 -15954 -62240 -99574 -14918 108023
1901 108023 5745 -16543 3815 -30725 28201 22607 60705 74427 33781 151333 80413
1890 80413 69800 42603 8816 87844 91478 91618 146612 139269 49790 -9797 -4151 37725 39025
1877 39025 -11325 -86687 15061 72351 149824 164516 73784 65001 100367 62530 53483 -18507
1865 -18507 -17471 6751 18842 48494 17611 -60930 -32271 19465 40680 -13031 14981 14559
1853A4559J0014N4837k4843J6149j9464L2792j08278J36026j5897Q839k4076p3212
1841G446m6833m2761N7113K7717p8114M6949J89439o9112j1717n9223m2000K7353
1829F257P4249q4689K7145R937R3497O3722m9709O277O407O6063l0983k7725P7355
1816B37803l7291k3780j31498o0895Q3942r9496m1897N9143J96184L200j34466
1805E0949n6497K9240m6571m778M6723L390j0166K059L6566L993k4525k2025K040
1792A0398N5022j36510O6846O3098j17719J29007R059j83725P2665M6477k4952
1781a0334L8576P5900L6794k3876P1853o3273j78647Q6006k3307m9827Q5706m0237
1769E334q5962P0731L6403N481K3936N883R2022j61930K5896R463m2062P442M7507
$$ plain form
1853 14559 24573 79410 54567 70716 51252 84044 -24234 111792 95895 104734 80658 7446
1841 7446 -39387 -82148 -25035 2682 -75432 -28483 160956 91844 80127 20904 -21096 6257
1829 6257 80506 -4183 22962 32899 126396 190118 140409 146686 153093 219156 188173 160448 237803
1816 237803 200512 176732 45234 -15661 68281 -31215 -73112 -13969 182215 185415 50949
1805 50949 -5548 23692 -22879 -27657 19066 22456 12290 14349 50915 54908 30383 8358 10398
1792 10398 65420 -71090 -4244 58854 -58865 70142 79201 -104524 -31859 14618 -10334
1781 -10334 28242 104142 140936 117060 188913 125640 -53007 32999 9692 -40135 45571 5334
1769 5334 -80628 -9897 26506 31987 55923 61806 153828 -8102 17794 27257 -14805 -7363 40144
1756D0144l1137j6057j40600M7663J00734k2559r256l660J07386J2676p457q4472
1744f595J0627l8697q9282k2447O1576J0337K937L1873o336k9030o7683P278J3947
1731a21495J08880L7818n3377M5337J3261j8284M3386l188n0017j6937n9854O4020
1719a0450q4160J12019K2869k4497o4576m9676j1634j4476O5238Q0097O1096P632
1707H9482N0611R51j66428j57638J34158J7055k3141p710K5483p3926N1616j0867
1695g0354n298K5662O4832j0598L6107J2999r2129M4985k1207l6087n1706m3674
1683a46468O2561O7872j50812Q0121k0042J19958N7512l5135N8869r2684K4498
1672B6250q4924K770J845M8988N3966K9646K9880j4465m9743j8691r7587n33N1724
$$ plain form
1756 40144 9007 -7050 -147650 -99987 747 -21812 -31068 -34728 72658 85334 77877 -6595
1744 -6595 4032 -34665 -123947 -146394 -84818 -74481 -71544 -39671 -46007 -75037 -142720 -135442 -121495
1731 -121495 -12615 25203 -28174 17163 30424 12140 55526 52338 2321 -14616 -74470 -10450
1719 -10450 -94610 17409 40278 15781 -48795 -98471 -110105 -124581 -59343 20754 81850 89482
1707 89482 140093 141044 -25384 -183022 -48864 -31809 -54950 -62660 -37177 -111103 -59487 -70354
1695 -70354 -75652 -49990 14842 4244 40351 53350 -38779 6206 -15001 -51088 -102794 -146468
1683 -146468 -83907 -16035 -166847 -86726 -106768 13190 70702 35567 94436 1752 26250
1672 26250 -58674 -55904 -54059 -5071 48895 78541 108421 93956 44213 25522 -72065 -72598 -20874
1659b0874l4709q1572N8374K387o388o9993J02804K4180j59924r890N8225J12163
1647b5217N7283m2213J4858M0601K2920n0710p2610R2462K9593j18636r409P4383
1635A3305j7158K1721p2562j288Q9K5522K7367L0284L5097l9216n07k2411m4607
1622d4364m1342n8367L7466P4689j49435J5759J38121J7119l1960R435l2308q6342
1610a51529O9912R276o0486m9808R2109j13043J64815J16348k13797O1459m485
1599g9229j6098o975k8387R7451l9222P6192m7325k7014o3891k1712J06663K9393
1587b0154K8429Q4895j01650l1195J03985k0407p6045p018j9476j1422j0705M2515
1575c8248J3151L9492n2465M2382J3471n0693K6079o7246P4326J0491K847k2549
$$ plain form
1659 -20874 -55583 -137155 -78781 -76394 -82782 -152775 -49971 -25791 -185715 -195605 -137380 -25217
1647 -25217 32066 -10147 4711 45312 68232 17522 -55088 37374 66967 -51669 -61078 13305
1635 13305 -3853 17868 -54694 -55982 -55893 -30371 -3004 27280 62377 23161 22654 243 -44364
1622 -44364 -85706 -144073 -106607 -31918 -181353 -165594 -27473 -10354 -42314 -32879 -65187 -151529
1610 -151529 -81617 -72341 -132827 -182635 -90526 -203569 -38754 77594 -136203 -74744 -79229
1599 -79229 -95327 -102302 -130689 -33238 -72460 3732 -43593 -70607 -134498 -156210 -49547 -20154
1587 -20154 8275 93170 -8480 -39675 64310 43903 -32142 -39160 -58636 -70058 -80763 -38248
1575 -38248 -25097 14395 -38070 4312 17783 -32910 -6831 -74077 249 10740 13587 -8962
1563h962j15986N3999R4010n5733R4272m1665N1231n0652j22367k2703M2301M5130
1551c7125n538o5479N1347J0805j4390o5368l346R9140L3560L63q3945k8984J5766
1538i3194j2726L8865K0976q5995M1789N6540N9261N6577j06947l9825l0578m4927
1526a40184j7263M2289K0994O1211O992l9843n1567J8003j9695K329R94m387J17016
1513c111j9549j9254m5974N4456N5954k9750N251o0828j3998L5077J6393k6529
1501e1862O1488K0607n8357K9768l7953m1785J09137K4139r6133K4652n3342P4532
1489D891k3972m5236P0971P0402o5106N402l3230j8498K1761K9734O8936J2907
1477I8962p7358O280R2489m7919J5186k8285o4351o8415j4475R0830J05092o4055
$$ plain form
1563 -8962 -124948 -70949 23061 -32672 61600 19935 71166 20514 -101853 -124556 -82255 -37125
1551 -37125 -42663 -108142 -56795 -45990 -60380 -125748 -129094 -29954 3606 3969 -79976 -108960 -93194
1538 -93194 -105920 -67055 -46079 -132074 -90285 -33745 25516 82093 -24854 -64679 -95257 -140184
1526 -140184 -157447 -115158 -94164 -32953 -25961 -65804 -117371 -99368 -119063 -116734 -115740 -120127 -3111
1513 -3111 -22660 -41914 -87888 -33432 22522 -7228 -1977 -62805 -76803 -41726 -25333 -51862
1501 -51862 9626 30233 -28124 1644 -36309 -78094 31043 55182 -40951 -16299 -69641 4891
1489 4891 -19081 -64317 6654 77056 11950 17352 -15878 -34376 -12615 17119 86055 98962
1477 98962 21604 27884 120373 72454 87640 59355 -4996 -73411 -87886 2944 108036 43981
1465D3981p0255j3925R5165m2740k0412R5478j7054j33423q2054J3542p501L1240
1453a07958L0852L3015o7624L4745K5796r0927N2227M1078m6692K6491j5652R9894
1441A5245R0896k8069j15611j7105L0797j3548K7539K050p1674l9270J35299J6913
1429C3462o5411m2905L0735M9176J4165o4013q1472M8586J23882J0224j3797L0017
1417G2649k6787q8269J4099j0400J9513j6470J34314m727j20626o4497j4489J7613
1405h8077N5672n9397R4525l5058n6111o2631k8669J09283N610n0272J1089O6110
1393c7926n1838K26l8833J0099R9766m4340M1540O6720l4764K0243m9924N322
1381a3709L199n7381n9783R1370K1518J0228j11640j0044m5424N4872O0058m4532
$$ plain form
1465 43981 -26274 -40199 54966 12226 -8186 87292 70238 -63185 -145239 -131697 -139198 -107958
1453 -107958 -77106 -44091 -111715 -76970 -51174 -142101 -89874 -48796 -95488 -68997 -84649 15245
1441 15245 106141 78072 -37539 -54644 -23847 -37395 -9856 -7806 -79480 -118750 16549 33462
1429 33462 -31949 -74854 -44119 5057 19222 -44791 -126263 -77677 46205 56429 42632 72649
1417 72649 45862 -42407 -28308 -38708 -19195 -35665 98649 93922 -26704 -91201 -105690 -88077
1405 -88077 -32405 -91802 2723 -32335 -88446 -151077 -179746 -70463 -64853 -115125 -104036 -37926
1393 -37926 -89764 -89538 -128371 -118272 -18506 -62846 -21306 45414 10650 30893 -19031 -13709
1381 -13709 -10510 -67891 -127674 -36304 -14786 -4558 -116198 -126242 -171666 -116794 -56736 -101268
1369a01268m9447M4184L4017M5352j1394o4106l5069M7616M8611p8292L2770O0018
1357b7008l3219j0067j7499j9206k8339r526P4376M0927o994r586q3630J16460
1345a3311L2160k6608Q222j917l9616n0952L8024n8675K72J8026K415P206K2906
1332f1848k5994p0405L4024p0438j026N8639N5159P5805O984K293n6673j7249
1320g0729O1608r2578r281K3593K8417k3177j8814O3107L6246n4066o3863J01028
1308a8509M6915j01985M0627m7747o4142O288k8823M1959j1030J6414K8462k3487
1296a15058j31487P7974O2772L8836m4880L4632N3335k1885n60J2864j8201J1995
1284c9663K2586n441J1597R1383l4336j04528m8347R9581k1556r7654J03127K209
$$ plain form
1369 -101268 -150715 -106531 -72514 -27162 -38556 -102662 -137731 -90115 -41504 -119796 -87026 -27008
1357 -27008 -60227 -70294 -87793 -106999 -135338 -144864 -70488 -29561 -36555 -46141 -129771 -13311
1345 -13311 18849 -7759 463 -1454 -41070 -92022 -53998 -112673 -112401 -94375 -91960 -84754 -61848
1332 -61848 -87842 -158247 -124223 -194661 -195687 -137048 -81889 -6084 900 3193 -53480 -70729
1320 -70729 -9121 -101699 -110980 -87387 -58970 -82147 -100961 -37854 -1608 -55674 -119537 -18509
1308 -18509 28406 -73579 -32952 -80699 -144841 -138553 -167376 -125417 -136447 -120033 -91571 -115058
1296 -115058 -246545 -168571 -105799 -66963 -111843 -77211 -23876 -45761 -46321 -33457 -51658 -39663
1284 -39663 -17077 -22518 -10921 80462 46126 -58402 -106749 -7168 -28724 -126378 -23251 -21042
1272b1042n7637P6988m564j33043N2855J5693K6893l1533l9519L0226p8971R6935
1260f6719P0142N8955m7725p9991L3669J00450n6052n3183k2432J9067m3801m022
1248i1642k3400J06721J39244K5209q8035r9612N5821N3642j15193k2891R577
1237e0559l063J814m2220J19327m2161j3723J6997l0743M6403M5368r1306o3896
1225a07762j6411N0348L4893n8585j9587k0716l8383Q1115J1417l9592K0440J12014
1213I191K2049j28563M9503q603j320j3447Q437O7638m9988l7173K8212j2866
1201f6930m3541O82l2869K5837L6275P883p114p932M594K3070N0230L391L6082
1188B9658l9067m6452N612q0722l5950J3941R9105j5135K7564J6181O5921k8879
$$ plain form
1272 -21042 -78679 -1691 -6255 -139298 -86443 -70750 -43857 -75390 -114909 -84683 -163654 -66719
1260 -66719 3423 62378 14653 -65338 -31669 68781 12729 -40454 -62886 -43819 -87620 -91642
1248 -91642 -115042 -8321 130923 156132 68097 -31515 24306 77948 -37245 -60136 -50559
1237 -50559 -53622 -51808 -94028 25299 -16862 -30585 -13588 -44331 2072 47440 -43866 -107762
1225 -107762 -124173 -73825 -38932 -97517 -117104 -137820 -176203 -95088 -83671 -123263 -102823 9191
1213 9191 31240 -97323 -47820 -56423 -57743 -71190 -62753 4885 -45103 -82276 -54064 -66930
1201 -66930 -110471 -109789 -142658 -116821 -80546 -72663 -79777 -87709 -83115 -60045 -9815 -6424 29658
1188 29658 -9409 -55861 -50249 -130971 -166921 -152980 -53875 -69010 -41446 -25265 40656 11777
1176A1777O240k07042J34069O4298l1027j747j03771N6928j12r325L0670j5195
1164f4237j09319K2280P4967q0115R5768J06408j12915Q8867k6666k7756J03011
1153G0293j50810n4558p457m0332L1575P8149M9412n4537j25252n9887J00127
1142a63277L6406q668O7722L5647n2346n1929J16381M2459n8245M2309j36500
1131a30041P2408j0534m3370j36457N532P0275J17092O8785o6863l6063J15768
1120B6532N892n3609L5863k2755j04201L427M9917o2011q3935L0868Q4933K8032
1108f1047j00339k8230m758k9246J92844K4726N096L1423j49475J4680L0357o310
1096h0279J04948n661k5553K3681o7498L8511J30468j51800M1274r3199K9637
$$ plain form
1176 11777 18017 -189025 -54956 9342 -21685 -23432 -127203 -70275 -70387 -79712 -49042 -64237
1164 -64237 -173556 -151276 -76309 -156424 -60656 45752 -67163 21704 -4962 -32718 70293
1153 70293 -80517 -135075 -142532 -182864 -151289 -73140 -23728 -78265 -203517 -263404 -163277
1142 -163277 -126871 -135539 -67817 -32170 -84516 -136445 -20064 22395 -35850 6459 -130041
1131 -130041 -57633 -68167 -111537 -247994 -242462 -172187 -55095 13690 -53173 -89236 26532
1120 26532 32424 -21185 14678 -8077 -112278 -108851 -58934 -120945 -204880 -174012 -89079 -61047
1108 -61047 -161386 -189616 -194374 -223620 -30776 -6050 -954 30469 -119006 -104326 -73969 -80279
1096 -80279 24669 19008 -6545 17136 -50362 -11851 118617 -33183 8091 -85108 -55471
1085e5471L517N8370M0231n1675l1892p5519N6620L4641j4718L0863K4699k7093
1073g427q559k6282l1105Q3901Q5966j8514k4560l2460o4624N7029o9653r1419
1061a47707J9464M7150O7353k8109O3167l1065L9812m1454j52872K7851R0742
1050d5668j4001K5635L0269P5452p9865o0489K0305l4411p4496J38160J3670j01090
1038a06529P6487J2434l7359q3543J4994M7841k3129M5153J09388j3721o0142
1027a8126o4982K4720L9530o480N3106k8166l8438l1735L3515M7375N6774q3270
1015a6177q8283n79m0530Q9107N309n0050k3848k4284j5191M5769j4697P4037
1003e9417l7546M8063J54264o2854m5866l5692Q2612m7898M3705R2o4105l666
$$ plain form
1085 -55471 -51954 6416 46647 -5028 -36920 -112439 -55819 -21178 -35896 -5033 19666 -7427
1073 -7427 -15986 -42268 -73373 10528 96494 77980 53420 20960 -43664 13365 -56288 -147707
1061 -147707 -128243 -81093 -13740 -41849 21318 -9747 30065 -11389 -164261 -136410 -45668
1050 -45668 -59669 -34034 -3765 71687 -8178 -68667 -48362 -82773 -157269 -19109 -5439 -106529
1038 -106529 -30042 -17608 -54967 -138510 -123516 -75675 -98804 -53651 55737 42016 -18126
1027 -18126 -83108 -58388 -18858 -25338 27768 -398 -38836 -70571 -37056 10319 67093 -16177
1015 -16177 -104460 -105039 -145569 -56462 -51153 -101203 -125051 -149335 -164526 -118757 -133454 -59417
1003 -59417 -96963 -48900 105364 42510 -3356 -39048 43564 -4334 39371 39463 -24642 -28308
991b8308P684N8111m1638N1062o983o2K8747m0900O713p6863P1416j8830l7857
978b7708k5099N0481l5920N5330L601n6454n4801J27704m1096q0527J49039j1206
966E3344p1699J8789p2924L5401P3432l079J3234q815k8166n6955L7789J9884
954A0235Q2833j9698k2819P4528p9638j49193J22231L170k5330o8695K6328p724
942e3772K3522K9162k1351n7879M8403n2209O3236l0282k3816n457J66887j08584
930b2140n0963L8621L5166M6465R942J9224l7104q4743j1877J6588J7707J2561
918a0553p9348L2351L2807P7492Q890k9907L8219j03589j0391K875r8282J78719
906C9283r0269l1828J16011J6417q9544L8523o8005k4295R3992L8385l8406M8270
$$ plain form
991 -28308 -20624 37487 -4151 46911 39928 39866 68613 27713 34426 -42437 28979 10149 -27708
978 -27708 -52807 -2326 -38246 17084 20685 -35769 -90570 37134 -3962 -84489 64550 53344
966 53344 -18355 434 -72490 -37089 36343 33264 46498 37683 9517 -47438 -9649 10235
954 10235 93068 73370 50551 125079 45441 -103752 18479 21649 -3681 -72376 -46048 -53772
942 -53772 -30250 -1088 -22439 -80318 -31915 -84124 -20888 -51170 -74986 -80443 86444 -22140
930 -22140 -73103 -34482 684 47149 57091 76315 39211 -45532 -57409 -40821 -23114 -10553
918 -10553 -89901 -57550 -24743 52749 61639 31732 69951 -33638 -44029 -41154 -139436 39283
906 39283 -50986 -82814 33197 49614 -39930 -1407 -69412 -93707 285 38670 264 48534
894D8534J9510k6698k4444j18137Q1766k8241o516R7631J3219l0716K7305m7869
882E344o8103k4679K4037J00077N5364k8613p5226q2324Q0284L3052j0274q0755
870g1816K311P400l2633k6100k6288M3826L7987J4993j3016o3168N3437K7728
858d5339O4347m5042n5830J02108r6437o957J03285k1842k0842M8830k5933m0977
846d0629J2048R1281q1011M286q4740L4567m9428O5620j18071O1291J01218N3330
834D9762l7311M9966p3077J6395J4673N9788m9569n7981L8831m3109m0174K2534
822d9272L2204o9033J2781O0939k502M9333k187k3740n7479O410L341l3943R5862
809B2714j48650q7970Q3599J08224Q9947p929q9663J14391j720m2707k4709J43389
$$ plain form
894 48534 68044 41346 16902 -101235 -19469 -47710 -54226 43405 56624 25908 53213 5344
882 5344 -62759 -87438 -63401 36676 92040 63427 -11799 -94123 -13839 19213 8939 -71816
870 -71816 -69505 -62105 -94738 -120838 -147126 -103300 -65313 -50320 -63336 -126504 -73067 -45339
858 -45339 19008 -26034 -81864 20244 -76193 -83150 20135 -1707 -22549 26281 348 -40629
846 -40629 -28581 62700 -18311 -14025 -98765 -64198 -113626 -48006 -166077 -104786 -3568 49762
834 49762 12451 62417 -10660 5735 20408 80196 30627 -27354 11477 -31632 -71806 -49272
822 -49272 -17068 -86101 -73320 -12381 -14883 34450 32263 8523 -48956 -42546 -39205 -73148 22714
809 22714 -125936 -213906 -130307 -22083 67864 59935 -29728 84663 82943 40236 15527 158916
797A58916r2310r0129j10575P6768l4472l723Q9899Q4154l6961j06224J582J30692
785F7617l0252p335l2549j20940K447K8138K896l525P6186n5095l0420j9902N4011
772f8723M2169k7626J1018L8169O1507p4069j0281N1422n8484M8043j01983l58
760h9196R0227P97k8709K1233k7031O9133M5078q2726L8846m8495K6904n2699
748c6638r2520j7666P4356L6433r2285J03033l1464K0303j0387j0527O163M3387
736g812p301J0642N5619J2024O6905n5134r3072J0072L2802L3673O8964j04798
724B2584K4626J4986m643j11111J01916R1888n209m4819p9930n0961l9703r4198
712a74574J20546j5266j4331K246q286Q4805P4551k8810n3027m7554k4751M6779
$$ plain form
797 158916 66606 -23523 -134098 -57330 -91802 -95525 -5626 78528 41567 -64657 -63075 67617
785 67617 37365 30030 -2519 -123459 -121012 -92874 -89978 -93503 -17317 -72412 -102832 -122734 -68723
772 -68723 -26554 -54180 -43162 -4993 56514 -17555 -27836 23586 -34898 13145 -88838 -89196
760 -89196 1031 1828 -26881 -5648 -32679 36454 81532 -1194 37652 -10843 16061 -36638
748 -36638 -129158 -146824 -72468 -36035 -128320 -25287 -56751 -36448 -46835 -57362 -51199 -7812
736 -7812 -15113 -4471 51148 63172 130077 74943 -18129 -8057 24745 58418 127382 22584
724 22584 47210 62196 57553 -53558 48358 140246 135037 90218 10288 -40673 -80376 -174574
712 -174574 -54028 -69294 -83625 -81379 -89665 -4860 69691 40881 -12146 -59700 -84451 -37672
700c7672M2323J18593n2807l5044o694j22326m1604J49402O7344N441j1393k5194
688E0369k513m4706j1062L4122J0015o8279k6288m8166N4564M4113q1520O9627
676a9724n9921N5581J0068L4461o531Q3255m4248j01476O4563j13354k984L1119
664f9191P2294m1059k5276P9075p3705O5728L6407o1534j40756Q7258J30176M5384
652A04801r3406l7841R0229j3702k4615j8045l945n2309N1329J9355M0236L0994
640I3081j34069J9369L202K1605l0499k106n234K5843m3656m089J0573k8450P1819
627b611N9619l7282q8243l7375R8712O5383j6265j1314j8421M2413l8226l8241
615b1851o108N3538L4090n0509m026r443L6143j7555K5017j0039o3757p738m4734
$$ plain form
700 -37672 4651 123244 70437 35393 28699 -93627 -135231 14171 81515 86956 75563 50369
688 50369 47856 3150 -7912 26210 36225 -32054 -58342 -106508 -51944 -7831 -89351 -19724
676 -19724 -79645 -24064 -13996 20465 13934 97189 52941 -48535 16028 -97326 -100310 -69191
664 -69191 3103 -37956 -63232 15843 -57862 7866 44273 -17261 -158017 -70759 59417 104801
652 104801 11395 -26446 63783 50081 25466 7421 3476 -48833 2496 21851 62087 93081
640 93081 -40988 -21619 -18417 3188 -27311 -29417 -34651 -8808 -52464 -56553 -45980 -74430 -2611
627 -2611 57008 19726 -68517 -105892 -7180 58203 41938 30624 12203 54616 16390 -21851
615 -21851 -27959 25579 59669 9160 5134 -4309 31834 14279 39296 29257 -34500 -42238 -86972
602h6972j3661K0194O6950K5690Q9767o7960l0788L0506J3671o9686j8724K3864
590a7149L7283M577L0575r68q0873P7560R1483j7648k3979N8396n8370j05157
578d270k3169j2214j30590J23544J01274N2190Q5443r3712j31849q758M9783K9017
566C6689p002n4279k8492J72002o284j36034m5204q6328l7027L2305P3947j3104
554i8811J01488n8465l1042O3182J3642k4641m3932L1970M7664k0125O120M4520
542C1570L2567J07616k4505j24766R783o0723K3242o2245n7009K391J09429J6950
530D300n1141M190J2163Q1484P2889o7922O7574r1929j73994K5914J77515M196
518F5239o405j19119m7583L7422K8024Q2484M5435j02265k8788J93491k7287j28553
$$ plain form
602 -86972 -100633 -80439 -13489 12201 101968 34008 3220 33726 47397 -22289 -41013 -17149
590 -17149 20134 24711 55286 54318 -26555 51005 142488 124840 100861 159257 100887 -4270
578 -4270 -27439 -39653 -170243 -46699 54575 106765 192208 98496 -33353 -42111 7672 36689
566 36689 29687 -24592 -53084 118918 112634 -23400 -68604 -154932 -191959 -159654 -85707 -98811
554 -98811 2677 -55788 -86830 -23648 -10006 -34647 -78579 -46609 1055 -19070 -12950 31570
542 31570 64137 171753 147248 22482 32265 -28458 -5216 -67461 -124470 -122079 -12650 4300
530 4300 -46841 -42651 -30488 50996 123885 55963 123537 31608 -142386 -116472 61043 65239
518 65239 58834 -60285 -107868 -70446 -42422 40062 85497 -16768 -45556 147935 120648 -7905
506g905m8051j8475n681P1733l7989N474L1151Q6831o3991J8l2766q5184O1130
493d3705P8957M4046j00263o0263P7345M8324M101p3047l6893M9155n3185q677
481g4105P8748J48262o9458J5311n385j61252J08010j0722m5829j13016J3935
470a15501N94J1766K4897K4956Q6448K1401j11420r545M542M4618J1067k0924
458b7101J28830L7563o1760r6670j14562J40393L8085j5054J9933K7090J58995
447B35742m7010j78117o0236K2124j4885k2731L3861l3299o41J1790o0133J12303
435a232L6479j28876J45147j3404j00055P3797N2380j8906j2048k6016J09608
424A16874j4658r7120J0660k5491j7096M5549J43915N4457q5953m2247L0014n5514
$$ plain form
506 -7905 -55956 -74431 -80112 -8379 -46368 -40894 -9743 77088 13097 13115 -19651 -104835 -43705
493 -43705 35252 79298 -20965 -81228 -3883 44441 48542 -24505 -61398 -12243 -65428 -74105
481 -74105 4643 152905 83447 98758 93373 -67879 40131 29409 -16420 -129436 -115501
470 -115501 -114907 -103141 -78244 -53288 33160 54561 -56859 -66404 -61862 -17244 -6177 -27101
458 -27101 101729 139292 77532 -19138 -133700 6693 44778 29724 49657 76747 235742
447 235742 188732 10615 -49621 -27497 -42382 -65113 -31252 -64551 -65192 -53402 -113535 -1232
435 -1232 35247 -93629 51518 38114 -61941 11856 64236 45330 33282 7266 116874
424 116874 102216 5096 15756 -9735 -26831 18718 162633 217090 131137 88890 118904 63390
412F3390J7255P8503m6782j48553J18983J5929o9134J4156m8518n3042n637R8667
400C5217m8304k0504J5666Q4164l1943Q8775J0784m1132J8094p4589l6551o1779
388f2102O2686M244Q9092L7718j07845r5765o262O9944J13398Q442m6819m2685
376B4046J1208j924K9578J301r0154J3428L9180m5057N2088j5952P4880o7757
364B4865J625L7078M0053q3410J20790J51631j19410j61729P800K9778k8490L1022
352E1603J0410o2055k1168R4411J7369L9699J8730l3973r7619m602K8725k4700
340A6830J219K4143o6811j6221O1909k5743J2887J4012n5250J11791N2604k8118
328A03252k3984j32966q369O0982j1446m1437J3449n6824J06608K6900q6401J72202
$$ plain form
412 63390 80645 159148 112366 -36187 82796 98725 29591 43747 -4771 -57813 -63450 35217
400 35217 -13087 -33591 -17925 66239 34296 123071 133855 92723 110817 36228 -323 -62102
388 -62102 584 4828 93920 131638 23793 -71972 -78234 -8290 105108 113550 66731 24046
376 24046 35254 33330 62908 64209 -25945 -12517 26663 -18394 33694 17742 92622 24865
364 24865 26490 63568 103621 20211 141001 292632 173222 11493 19293 49071 20581 51603
352 51603 62013 -42 -21210 73201 90570 130269 148999 115026 17407 12805 41530 16830
340 16830 18049 42192 -24619 -40840 21069 -4674 8213 22225 -33025 78766 131370 103252
328 103252 79268 -53698 -62067 -1085 -12531 -53968 -40519 -97343 9265 36165 -50236 121966
316A21966L0591j89881N3659m3537K1771L9043l3490k0765o3193N536L3467J23013
304G8180p2779l0931O9985l1165k885J50494q6285k5690J096N4996p352j3334
292H4330o1946l7748O4485l8846K6099L6988j21444l2256J21653M1390q7114O6362
280F1953m2440r9688J61486P0246n0553k5572O0460K3381o0981n3657O7711K2372
268A34718j04468O7309n4706p308m8303K4811P1285j0602N7102l040m3027J7774
256A01545j1542J5025l7472m3665Q0386m684o0066J0580o5992l7610K4684Q9594
244F0783k4243Q2211r6514R4132L6331O101n5921j43821O6811n1198k5990O6662
232A5344J27379o6708K5025q4587l7304Q337L8723L6643R0911j00485p3341O8262
$$ plain form
316 121966 152557 -37324 16335 -27202 -5431 33612 122 -20643 -83836 -78300 -44833 78180
304 78180 5401 -25530 44455 13290 10405 160899 74614 48924 50020 105016 97664 84330
292 84330 22384 -15364 49121 10275 36374 73362 -48082 -80338 41315 82705 -4409 61953
280 61953 19513 -80175 81311 151557 101004 75432 135892 159273 98292 44635 112346 134718
268 134718 30250 97559 42853 35545 -12758 12053 83338 72736 129838 126798 83771 101545
256 101545 90003 105028 67556 23891 104277 99593 39527 50107 -15885 -53495 -28811 60783
244 60783 36540 118751 22237 116369 152700 158801 102880 -40941 25870 -25328 -51318 15344
232 15344 142723 76015 101040 16453 -20851 -12514 26209 62852 153763 53278 -20063 48199
220D8199K3242k372O7089n2661o328p1777J7650j7316m180Q0756J6296K0960k2357
207I7201j49406J8613J11137m0577n2546Q3770M7878l7846r3505P8255L0864o8742
195B5096J4232P3064j9633j21043K062k6368m4512J03776J3093k8166N1303L4114
183G7018O2068p9660K2840l497r0387j7387l2167O0896q6339R2457k2463o9171
171h5792R7629R7997k4496n8337K0668n8394R7431Q4266j68669L8963j4597j01706
159g5037J32838K2106O6272k6152k9905j03024O8228N4470J179m2517k4624J2910
147E6744L2816n3325q974L0095r627l5165O5408P8458L3003r4195o5325L238P371
134D0522J2106L3387M074K3319J8360l3616j222R5453j8820p0834K973J6784r485
$$ plain form
220 48199 71441 69069 136158 83497 77169 5392 23042 5726 1546 82302 98598 119558 97201
207 97201 -52205 -33592 77545 36968 -15578 68192 116070 78224 -15281 62974 93838 25096
195 25096 39328 112392 92759 -28284 -26222 -52590 -97102 6674 19767 -8399 42904 77018
183 77018 139086 59426 82266 78769 -11618 -29005 -61172 -276 -86615 5842 -16621 -85792
171 -85792 11837 109834 85338 27001 47669 -10725 86706 170972 2303 41266 26669 -75037
159 -75037 57801 79907 146179 120027 90122 -12902 55326 109796 110975 68458 43834 56744
147 56744 89560 36235 27261 57356 47729 12564 77972 156430 189433 95238 29913 33151 40522
134 40522 52628 86015 90089 113408 131768 98152 96930 192383 173563 102729 105702 122486 113001
121A13001l6595L175m7036k2493K1281j4057p448J4135j4673j36N487j8936j1871
108a6166n565Q2441l4936n0481P7623J5677o5986K4768N6983n1347M1052K7176
96A01239K4172L0661l82l9550q4608k9770K3482M440j8097p0580Q5596L3824M4078
83A04505k1657M3655n2743m3544N5953R1620n6270m3790M3116j251l0445j04061
71a4912O4597p7246K4109M1705P1748l3842j0467k3511k4335P7849k6189o0923
59H583L8389J5294l7440N2546l5398M320p815k2249j5455J9463m453M5302l790
46E7297M561P475o610O6796k0346l6480j2051k0866J09284P329j04492k4674L1174
33E8397m2413M7999R0153j0866n7163p8375k1430J11343j4394J6055O7352m2388
$$ plain form
121 113001 76406 79581 32545 10052 31333 17276 9828 23963 9290 9154 14641 -4295 -16166
108 -16166 -21731 60710 25774 -24707 52916 68593 2607 27375 84358 33011 74063 101239
96 101239 125411 156072 155690 116140 31532 1762 25244 29684 11587 -58993 26603 60427 104505
83 104505 82848 126503 73760 30216 86169 177789 121519 77729 120845 119594 89149 -14912
71 -14912 49685 -27561 -3452 38253 110001 76159 65692 42181 17846 95695 69506 8583
59 8583 46972 62266 24826 77372 41974 46294 38479 16230 775 20238 15785 61087 57297
46 57297 61858 69333 62723 129519 109173 72693 60642 39776 149060 156389 51897 27223 58397
33 58397 15984 63983 154136 143270 86107 7732 -13698 97645 83251 99306 166658 124270
21A24270n554p1952K7245j9238J9699K9184j1926m117o4636k2303K987O104M4624
8E4387M6046o7861J9403M3769j4786K2692m7709l3609
0B2332
$$ plain form
21 124270 118716 46764 74009 54771 74470 103654 91728 87611 22975 672 3659 9763 54387
8 54387 100433 32572 51975 95744 80958 103650 55941 22332
0 22332
$$ Imaginary data points
##PAGE= N=2
##DATA TABLE= (X++(I..I)), XYDATA
16383b248328M7030J3842J624K6208P061L7498K2808J02132l4431J396J08847
16372a914313O3354M8761j0658M2145J8563K0050L6082K1574Q6558M5804N2085
16361a489995j1710M5635J3563O7436J6528J1376K638J5567Q6116N5504N1705
16350a135637J1651O3843k5613N3566R6424P5054K3253k3317L0118l1061M421
16339h57298N6147N0022l9244J06884N5343m1315Q5204J4409N6683N5456k9028
16328d86737J4674P2888M4757O4945N852m2036L2180J06630J8456L2706L7257
16317i8428j0717j3972O7957N0923M4131K1696j8724N9468K1462M2650J4662Q4929
16305B66037L3910m2227j7215Q4858O7623J1576J6691P2094N2607m6783K1563
$$ plain form
16383 -2248328 -2201298 -2187456 -2185832 -2159624 -2152563 -2115065 -2092257 -1990125 -2024556 -2023160 -1914313
16372 -1914313 -1850959 -1802198 -1812856 -1770711 -1752148 -1732098 -1696016 -1674442 -1587884 -1542080 -1489995
16361 -1489995 -1501705 -1456070 -1442507 -1375071 -1358543 -1347167 -1344529 -1328962 -1242846 -1187342 -1135637
16350 -1135637 -1123986 -1060143 -1085756 -1032190 -935766 -860712 -837459 -860776 -830658 -861719 -857298
16339 -857298 -801151 -751129 -790373 -683489 -628146 -669461 -584257 -569848 -513165 -457709 -486737
16328 -486737 -472063 -399175 -354418 -289473 -283621 -325657 -293477 -186847 -168391 -135685 -98428
16317 -98428 -109145 -123117 -55160 -4237 39894 61590 42866 102334 123796 166446 181108 266037
16305 266037 299947 257720 240505 325363 392986 404562 421253 493347 545954 499171 520734
16294E20734J8467M9200j372J02866n19k9496M5929J22725m0267J7682j7533P0700
16282H59116m2059N0677J02196L4335J1635J8215O1205j7620k4758J4646J8147
16271A085735P7625j5407n2214N3447N4785L2974K2561P8581R5199k674j57734
16260A272878P4228N7802j5527l196J04025n542l614P7630P9303p4953j6510j9651
16248A526873L6381N8178N6464L4895R9520j4156r7741q467J28059p914m834R3843
16236A901101M8805j6160r1648N3490L6024k5280J02553J8904l8532l9390q520
16225A941347N748O4612j2012Q8320P2766m8407l159O7431q868n9112P9117r090
16213B178693L9604k9791R4853J6237M6353k450k8867L6984M7020r6828P3972
$$ plain form
16294 520734 539201 588401 587029 689895 689376 659880 705809 828534 788267 805949 788416 859116
16282 859116 817057 867734 969930 1004265 1015900 1034115 1095320 1077700 1052942 1067588 1085735
16271 1085735 1163360 1147953 1095739 1149186 1203971 1236945 1259506 1338087 1433286 1430612 1272878
16260 1272878 1347106 1404908 1389381 1386185 1490210 1484668 1481054 1558684 1637987 1563034 1546524 1526873
16248 1526873 1563254 1621432 1677896 1712791 1812311 1798155 1700414 1691947 1820006 1812092 1807258 1901101
16236 1901101 1949906 1933746 1842098 1895588 1931612 1906332 2008885 2027789 1989257 1949867 1941347
16225 1941347 1947095 2011707 1999695 2088015 2160781 2112374 2109215 2176646 2167778 2108666 2187783 2178693
16213 2178693 2218297 2188506 2283359 2299596 2345949 2343499 2314632 2351616 2398636 2301808 2375780
16202B375780O4375m9475O6945m4691q6253P7425J14104o7147k9793l8739O1161
16191B443692P5400N9655K0708m4836l6638l1474L8711N080L4320n5630l4933
16180B474055R6934J00028M1439k8688J2599M444p4084n470O5172j3144q2857
16169B590428N6259N1857k0202J27284L116l1432r7849r052O4493P7291J268k2522
16157B790939M1494j8004p6603k2408N5311r777K2033K518L5040K3066l3589R468
16145B819488J41529j31836m9418O6387R6014j8096o0832J7594K8613k2089N8768
16134B946122K8705l5121N7055l895P0386M2646k9409j7798J0574l311m3699l3788
16122B988467K9405M082K0544r252K495N69j2831m6436K5270J1241p849M8938
$$ plain form
16202 2375780 2440155 2390680 2457625 2412934 2326681 2404106 2518210 2451063 2421270 2382531 2443692
16191 2443692 2519092 2578747 2599455 2554619 2517981 2486507 2525218 2530298 2564618 2508988 2474055
16180 2474055 2570989 2671017 2712456 2683768 2696367 2700811 2626727 2621257 2686429 2673285 2590428
16169 2590428 2646687 2698544 2678342 2805626 2808742 2777310 2679461 2670409 2734902 2812193 2813461 2790939
16157 2790939 2832433 2814429 2737826 2715418 2770729 2760952 2782985 2785503 2820543 2843609 2810020 2819488
16145 2819488 2961017 2829181 2779763 2846150 2942164 2924068 2863236 2880830 2909443 2887354 2946122
16134 2946122 2974827 2939706 2996761 2992866 3063252 3105898 3076489 3058691 3069265 3065954 3022255 2988467
16122 2988467 3017872 3021954 3042498 3033246 3035741 3036310 3023479 2977043 3002313 3013554 3005705 3054643
16110C054643L7432k3018k4997p8197J03467n92p0407k2108Q8803N3124r6912
16099C021238j154J6729K9075J7477q8926P5201K0980k3132K3941M2531n0942
16088C083018j16950J14175p2358l6172o326K3840K8717O8198O14J18121j13324
16077C091553r0092N1116m4940K9901n9843N7946l411L5719N0299m6059m3131
16066C029058n6104J34950p265k0492M2534J1319q767K9603K7200n0566K8706
16055C160176K7064N160m4142q7944L4276M1899n839L3632k8951M6103r1070L5333
16043C125697Q1076p5652J15843l5134j20143j2233k4150L8211m2834L7494P3584
16032C161759K9675j43835P8189l687o2480K7655K606n254L534J27993k8295k6471
$$ plain form
16110 3054643 3092075 3069057 3044060 2965863 3069330 3068738 2998331 2976223 3065026 3118150 3021238
16099 3021238 3020084 3036813 3065888 3083365 2994439 3069640 3090620 3067488 3091429 3133960 3083018
16088 3083018 2966068 3080243 3007885 2971713 2965387 2989227 3017944 3086142 3086756 3204877 3091553
16077 3091553 3001461 3052577 3007637 3037538 2977695 3035641 3032230 3067949 3118248 3072189 3029058
16066 3029058 2972954 3107904 3100639 3080147 3122681 3134000 3125233 3154836 3182036 3131470 3160176
16055 3160176 3187240 3192400 3148258 3060314 3094590 3136489 3130650 3164282 3135331 3181434 3090364 3125697
16043 3125697 3206773 3131121 3246964 3211830 3091687 3079454 3055304 3093515 3050681 3088175 3161759
16032 3161759 3191434 3047599 3125788 3122101 3059621 3087276 3089882 3084628 3088162 3216155 3187860 3161389
16020C161389P4690j20807n2637M6516k7960j2008m1341K0854l2227N2855J15760
16009C185084P8684k9189L9624j30677p1207R3357P68K3083k5021O9780k5024
15998C209262l1372K8513n4775L4079M399n3118l0249J3195O1300n2080L4713
15987C163867K4336K764J7978n485k1077q5271J20230m4749n1562L3664m1752
15976C112943J04554M4289p6638o0542Q191N6849K6483j5871m4324J3690k4939
15965C144685O2952O1522L0056l9124l1585m4129p5187n751j8128K7546J5032
15954C127889J95935r8408j4157J4430k8004M3549K8336K2062j01529L1798P658
15943C229559q3372N5758M4630M9214l2041o4216j1859p470J576Q332L0733P058
$$ plain form
16020 3161389 3236079 3115272 3062635 3109151 3081191 3069183 3027842 3048696 3016469 3069324 3185084
16009 3185084 3263768 3234579 3274203 3143526 3072319 3165676 3166444 3189527 3164506 3234286 3209262
15998 3209262 3177890 3206403 3151628 3185707 3190106 3136988 3106739 3119934 3181234 3129154 3163867
15987 3163867 3188203 3190967 3208945 3203460 3182383 3097112 3217342 3172593 3121031 3154695 3112943
15976 3112943 3217497 3261786 3185148 3124606 3132797 3189646 3216129 3200258 3155934 3169624 3144685
15965 3144685 3207637 3269159 3299215 3260091 3228506 3184377 3109190 3103439 3085311 3112857 3127889
15954 3127889 3323824 3225416 3211259 3225689 3197685 3241234 3269570 3291632 3190103 3221901 3229559
15943 3229559 3146187 3201945 3246575 3295789 3263748 3199532 3187673 3180203 3181779 3190111 3220844 3227902
15931C227902J7755k2452L2303J1464J305L567N387o5009k6219P2335N2405n1018
15919C259725R4423m9035k7350J8863j01556l6228L65K7613O5111Q1125j30049
15908C203007j70638L754J16005k7516L5352Q3044p0918J5480o1658M8422j126
$$ plain form
15931 3227902 3245657 3223205 3255508 3266972 3268277 3271844 3277231 3212222 3186003 3258338 3310743 3259725
15919 3259725 3354148 3305113 3277763 3296626 3195070 3158842 3159207 3186820 3251931 3333056 3203007
15908 3203007 3032369 3036123 3152128 3124612 3159964 3243008 3172090 3187570 3125912 3174334 3173208
$$ [...]
##END NTUPLES=NMR SPECTRUM
##END=
