##TITLE=1H_CG-1150-II
 CDCl3
 8 sc, 
 1.8.2023
##JCAMPDX= 6.0         $$ Bruker NMR JCAMP-DX V2.0
##DATA TYPE= NMR SPECTRUM
##DATA CLASS= NTUPLES
##ORIGIN= UXNMR, Bruker Analytische Messtechnik GmbH
##OWNER= root
$$ XWIN-NMR		Version 3.5
$$ Tue Aug  1 14:05:14 2023 Russian Standard Time (UT+4h)  she@DPX200
##.OBSERVE FREQUENCY= 200.13135
##.OBSERVE NUCLEUS= ^1H
##.ACQUISITION MODE= SIMULTANEOUS
##.ACQUISITION SCHEME= undefined
##.AVERAGES= 8
##.DIGITISER RES= 18
##SPECTROMETER/DATA SYSTEM= spect
##.PULSE SEQUENCE= zg30
##.SOLVENT NAME= CDCl3
##.SHIFT REFERENCE= (INTERNAL, CDCl3, 0, 15.7381)
##AUDIT TRAIL= $$ (NUMBER, WHEN, WHO, WHERE, WHAT)
$$ ##TITLE= Audit trail, XWIN-NMR		Version 3.5
$$ ##JCAMPDX= 5.01
$$ ##ORIGIN= Bruker BioSpin GmbH
$$ ##OWNER= she
$$ F:/spectra/data/she/nmr/H-F/1/pdata/1/auditp.txt
$$ ##AUDIT TRAIL=  $$ (NUMBER, WHEN, WHO, WHERE, WHAT)
(   1,<2023-08-01 14:03:44.14 +0400>,<she>,<DPX200>,
      <created by zg, POWCHK disabled, PULCHK disabled
       configuration hash MD5:
       00 E9 B6 7A A2 85 ED C7 34 08 36 98 17 FE 4E 26
       data hash MD5: 16K
       C7 67 89 F7 EC 24 18 D7 14 8E 02 96 F3 E3 52 C9>)
(   2,<2023-08-01 14:03:47.25 +0400>,<she>,<DPX200>,
      <Start of raw data processing
       efp BC_mod = 2 LB = 0.24 FT_mod = 6 PKNL = 1 PHC0 = -21196.29 PHC1 = 5.052721 SI = 16K 
       data hash MD5: 16K
       7E E4 DA 93 CD 2C CA D8 A2 FF D8 A0 12 5D 60 87>)
(   3,<2023-08-01 14:04:07.29 +0400>,<she>,<DPX200>,
      <pk PHC0 = 1.014883 PHC1 = 0 
       data hash MD5: 16K
       E5 37 90 51 5B 7C 3D AB D7 F9 2F 49 0A B3 A4 F9>)
(   4,<2023-08-01 14:04:11.21 +0400>,<she>,<DPX200>,
      <abs ABSG = 5 
       data hash MD5: 16K
       0B 6F 0A DE B9 9D C1 CA 20 E1 35 D2 79 2C B8 17>)
(   5,<2023-08-01 14:04:24.09 +0400>,<she>,<DPX200>,
      <pk PHC0 = -0.3960949 PHC1 = 0 
       data hash MD5: 16K
       C9 10 2C 78 F2 8F C2 E0 38 75 90 A4 45 55 9B E4>)
(   6,<2023-08-01 14:04:27.46 +0400>,<she>,<DPX200>,
      <abs ABSG = 5 
       data hash MD5: 16K
       AC F3 A4 DF 47 E3 7F 4D 73 98 DD 27 B9 B9 38 64>)
$$ ##END=
$$ 
$$ hash MD5
$$ 15 B4 A5 EC 1E ED 50 51 76 29 C3 ED 0B 10 3D 0F
##$RELAX= 
##$RELAX= 
##$RELAX= 
##$RELAX= 
##$RELAX= 
##$RELAX= 
$$ Bruker specific parameters
$$ --------------------------
##$DU= <F:/spectra>
##$EXPNO= 1
##$NAME= <H-F>
##$PROCNO= 1
##$TYPE= <nmr>
##$USER= <she>
##$AMP= (0..31)
100 100 100 100 100 100 100 100 100 100 100 100 100 100 100 100 100 100 
100 100 100 100 100 100 100 100 100 100 100 100 100 100 
##$AQSEQ= 0
##$AQ_mod= 1
##$AUNM= <au_zg>
##$AUTOPOS= <>
##$BF1= 200.13
##$BF2= 200.13
##$BF3= 200.13
##$BF4= 200.13
##$BF5= 200.13
##$BF6= 200.13
##$BF7= 200.13
##$BF8= 200.13
##$BYTORDA= 1
##$CFDGTYP= 0
##$CFRGTYP= 5
##$CHEMSTR= <none>
##$CNST= (0..31)
1 1 145 1 1 1 1 1 1 1 1 1 1 1 1 1 1 1 1 1 1 1 1 1 1 1 1 1 1 1 1 1 
##$CPDPRG= <>
##$CPDPRG1= <>
##$CPDPRG2= <>
##$CPDPRG3= <>
##$CPDPRG4= <mlev>
##$CPDPRG5= <mlev>
##$CPDPRG6= <mlev>
##$CPDPRG7= <mlev>
##$CPDPRG8= <mlev>
$$ [...]
##$SUBNAM3= <"">
##$SUBNAM4= <"">
##$SUBNAM5= <"">
##$SUBNAM6= <"">
##$SUBNAM7= <"">
##$SUBNAM8= <"">
##$SUBNAM9= <"">
##$SW= 18.05172834244
##$SWIBOX= (0..15)
0 0 2 0 0 0 0 0 0 0 0 0 0 0 0 0 
##$SW_h= 3612.71676300578
##$TD= 16384
##$TD0= 1
##$TE= 0
##$TE2= 300
##$TE3= 300
##$TEG= 300
##$TL= (0..7)
0 120 120 120 120 120 120 120 
##$TP= (0..7)
150 150 150 150 150 150 150 150 
##$TP07= 0
##$TPNAME0= <>
##$TPNAME1= <>
##$TPNAME2= <>
##$TPNAME3= <>
##$TPNAME4= <>
##$TPNAME5= <>
##$TPNAME6= <>
##$TPNAME7= <>
##$TPOAL= (0..7)
0.5 0.5 0.5 0.5 0.5 0.5 0.5 0.5 
##$TPOFFS= (0..7)
0 0 0 0 0 0 0 0 
##$TUNHIN= 0
##$TUNHOUT= 0
##$TUNXOUT= 0
##$USERA1= <user>
##$USERA2= <user>
##$USERA3= <user>
##$USERA4= <user>
##$USERA5= <user>
##$V9= 5
##$VALIST= <valist>
##$VCLIST= <CCCCCCCCCCCCCCC>
##$VD= 0
##$VDLIST= <DDDDDDDDDDDDDDD>
##$VPLIST= <PPPPPPPPPPPPPPP>
##$VTLIST= <TTTTTTTTTTTTTTT>
##$WBST= 1024
##$WBSW= 4
##$XGAIN= (0..3)
0 0 0 0 
##$XL= 0
##$YL= 0
##$YMAX_a= 105510
##$YMIN_a= -73831
##$ZGOPTNS= <>
##$ZL1= 120
##$ZL2= 120
##$ZL3= 120
##$ZL4= 120
##$ABSF1= 15.72816
##$ABSF2= -2.323689
##$ABSG= 5
##$ABSL= 3
##$ALPHA= 0
##$AQORDER= 0
##$ASSFAC= 0
##$ASSFACI= 0
##$ASSFACX= 0
##$ASSWID= 0
##$AUNMP= <proc_1d>
##$AZFE= 0.1
##$AZFW= 0.1
##$BCFW= 0
##$BC_mod= 2
##$BYTORDP= 0
##$COROFFS= 0
##$CY= -3
##$DATMOD= 1
##$DC= 0
##$DFILT= <>
##$DTYPP= 0
##$F1P= 0
##$F2P= 0
##$FCOR= 1
##$FTSIZE= 16384
##$FT_mod= 6
##$GAMMA= 0
##$GB= 0
##$INTBC= 1
##$INTSCL= 3.70164e-10
##$ISEN= 128
##$LB= 0.24
##$LEV0= 0
##$LPBIN= 0
##$MAXI= 10000
##$MC2= 0
##$MEAN= 0
##$ME_mod= 0
##$MI= 1.114404
##$NCOEF= 0
##$NC_proc= -9
##$NLEV= 6
##$NOISF1= 3.799351
##$NOISF2= 2.8
##$NSP= 0
##$NTH_PI= 0
##$NZP= 0
##$OFFSET= 15.73808
##$PC= 1
##$PHC0= -21195.67
##$PHC1= 5.052721
##$PH_mod= 1
##$PKNL= yes
##$PPARMOD= 0
##$PSCAL= 0
##$PSIGN= 0
##$REVERSE= no
##$SF= 200.130006698118
##$SI= 16384
##$SIGF1= 3
##$SIGF2= 2
##$SINO= 5.538805
##$SIOLD= 16384
##$SREGLST= <1H.CDCl3>
##$SSB= 0
##$STSI= 16384
##$STSR= 0
##$SW_p= 3612.71676300578
##$SYMM= 0
##$S_DEV= 0
##$TDeff= 16384
##$TDoff= 0
##$TI= <>
##$TILT= no
##$TM1= 0
##$TM2= 0
##$TOPLEV= 0
##$USERP1= <user>
##$USERP2= <user>
##$USERP3= <user>
##$USERP4= <user>
##$USERP5= <user>
##$WDW= 1
##$XDIM= 16384
##$YMAX_p= 348600514
##$YMIN_p= -638014
$$ End of Bruker specific parameters
$$ ---------------------------------
##NTUPLES= NMR SPECTRUM
##VAR_NAME=  FREQUENCY,     SPECTRUM/REAL,   SPECTRUM/IMAG
##SYMBOL=    X,             R,               I
##VAR_TYPE=  INDEPENDENT,   DEPENDENT,       DEPENDENT
##VAR_FORM=  AFFN,          ASDF,            ASDF
##VAR_DIM=   16384,         16384,           16384
##UNITS=     HZ,            ARBITRARY UNITS, ARBITRARY UNITS
##FACTOR=    0.220516191357247, 1,           1
##FIRST=     3149.66206076258, 0,            0
##LAST=      -463.054702243202, 0,           0
##MIN=       -463.054702243202, -638014,     0
##MAX=       3149.66206076258, 348600514,    0
$$ Real data points
##PAGE= N=1
##DATA TABLE= (X++(R..R)), XYDATA
$$ [...]
$$ plain form
5577 2134920 2249862 2141930 1876323 1790677 1742077 1917797 1917999 1801370 1898934 1841293 1810032
5566 1810032 1969486 1780330 1824751 1771112 1733895 1930739 2141417 2191274 2293537 2387545
5556 2387545 2402435 2389630 2330899 2354404 2615267 2485739 2474943 2254668 2440298 2347072 2303813
5545 2303813 2284960 2688806 2732027 2509960 2439439 2288589 2170268 2125606 2058453 2054905 2460687
5534 2460687 2236625 2231123 2177377 2049162 1994920 2131148 2205584 1922982 1848471 2018527 2066839
5523 2066839 2161823 2069362 2061457 2149200 2295115 2267781 2138569 2196302 2536033 2277905 2026531
5512 2026531 1945024 1779977 1982956 1883921 1826078 1811627 1865110 1716829 1764092 1654953 1720945
5501 1720945 1867716 1944417 1844689 1768709 2160447 2183099 2059889 1971818 2047181 2266007 2152536
$$ packed form
5577B134920J14942j07932k65607q5646m8600J75720K02j16629R7564n7641l1261
5566A810032J59454j89156M4421n3639l7217J96844K10678M9857J02263R4008
5556B387545J4890j2805n8731K3505K60863j29528j0796k20275J85630r3226m3259
5545B303813j8853M03846M3221k22067p0521j50850j18321m4662o7153l548M05782
5534B460687k24062n502n3746j28215n4242J36228P4436k82602p4511J70056M8312
5523B066839R4984r2461p905Q7743J45915k7334j29212N7733L39731k58128k51374
5512B026531q1507j65047K02979r9035n7843j4451N3483j48281M7263j09139O5992
5501A720945J46771P6701r9728p5980L91738K2652j23210q8071P5363K18826j13471
$$ plain form
5490 2152536 2239427 2169939 2179960 2319424 2060329 1949840 2012826 2002395 1799888 1674571
5480 1674571 1735433 1866351 2125435 2018913 2065780 2304524 2305509 2279316 2393417 2583763 2413308
5469 2413308 2661675 2589538 2762481 2969253 2791396 2830188 2957750 2751464 2637913 2674110
5459 2674110 2751583 2593807 2680002 2643113 2647663 2606237 2433877 2253023 2519683 2587846 2394022
5448 2394022 2334663 2394118 2506640 2349735 2390154 2545868 2322609 2295410 2453511 2522943
5438 2522943 2631175 2654472 2617572 2653240 2522270 2953689 2888928 2888152 3007422 3042480 3039149
5427 3039149 2665646 2768006 2985807 3149984 2832730 2577094 2513920 2404473 2200001 2181017
5417 2181017 2476029 2435351 2295935 2407431 2393627 2196780 2185914 2105714 1945316 1992505
$$ packed form
5490B152536Q6891o9488J0021J39464k59095j10489O2986j0431k02507j25317
5480A674571O0862J30918K59084j06522M6867K38744R85k6193J14101J90346j70455
5469B413308K48367p2137J72943K06772j77857L8792J27562k06286j13551L6197
5459B674110P7473j57776Q6195l6889M550m1426j72360j80854K66660O8163j93824
5448B394022n9359N9455J12522j56905M0419J55714k23259k7199J58101O9432
5438B522943J08232K3297l6900L5668j30970M31419o4761p76J19270L5058l331
5427C039149l73503J02360K17801J64177l17254k55636o3174j09447k04472j8984
5417B181017K95012m0678j39416J11496j3804j96847j0866q0200j60398M7189
$$ plain form
5407 1992505 2333588 2373260 2339417 2414874 2248240 2187962 2302583 2468622 2585870 2546510
5397 2546510 2660085 2727190 2460106 2438627 2269882 2131074 2406687 2295923 2208222 2382918
5387 2382918 2195119 2125149 2177130 2152134 1698367 1693542 1813684 1896645 1773833 1844624 2111178
5376 2111178 2323742 2405630 2125861 2018534 2045281 1782569 1874831 2077768 2030451 2055503
5366 2055503 1984647 1868772 2075192 1904691 2045560 2353036 1995911 1740613 1721902 1755264
5356 1755264 1953075 2181856 2268145 2166613 2094910 1999041 2149964 2357492 2147211 2431255
5346 2431255 2554368 2336042 2089102 2169011 2453536 2314761 2215930 2079981 2255062 2366071
5336 2366071 2206313 2278446 2638908 2343458 2270171 2227451 2214979 2589878 2502042 2523737 2304630
$$ packed form
5407A992505L41083L9672l3843P5457j66634o0278J14621J66039J17248l9360
5397B546510J13575O7105k67084k1479j68745j38808K75613j10764q7701J74696
5387B382918j87799o9970N1981k4996m53767m825J20142Q2961j22812P0791K66554
5376B111178K12564Q1888k79769j07327K6747k62712R2262K02937m7317K5052
5366B055503p0856j15875K06420j70501J40869L07476l57125k55298j8711L3362
5356A755264J97811K28781Q6289j01532p1703r5869J50923K07528k10281K84044
5346B431255J23113k18326k46940P9909K84525j38775r8831j35949J75081J11009
5336B366071j59758P2133L60462k95450p3287m2720j2472L74899q7836K1695k19107
$$ plain form
5325 2304630 2322176 2493016 2434575 2564018 2335091 2539719 2568797 2266289 2465407 2538783
5315 2538783 2387575 2373674 2318335 2423840 2491583 2612542 2344304 2526165 2656636 2650646
5305 2650646 2836336 2839642 2629505 2742999 2597442 2720590 2862553 2863885 2729131 2836120
5295 2836120 2892555 2761872 2832113 2835871 2714643 2881856 3045842 2911465 3245128 2946492
5285 2946492 3007714 3134901 3269167 3091175 3135739 3187246 3043558 2815763 3055603 2959199
5275 2959199 3133980 3128303 2943140 2932448 3052545 2997047 3243588 3370417 3489253 3676374
5265 3676374 3510442 3364303 3351023 3630030 3546354 3716593 3706673 3566385 3576804 3692591
5255 3692591 3711586 3883338 3910965 4143455 4572527 4647428 4388164 4504844 4690075 4586452
$$ packed form
5325B304630J7546J70840n8441J29443k28927K04628K9078l02508J99118P3376
5315B538783j51208j3901n5339J05505O7743J20959k68238J81861J30471n990
5305B650646J85690L306k10137J13494j45557J23148J41963J332j34754J06989
5295B836120N6435j30683P0241L758j21228J67213J63986j34377L33663k98636
5285B946492O1222J27187J34266j77992M4564N1507j43688k27795K39840r6404
5275B959199J74781n677j85163j0692J20097n5498K46541J26829J18836J87121
5265C676374j65932j46139j3280K79007q3676J70239r920j40288J0419J15787
5255C692591J8995J71752K7627K32490M29072P4901k59264J16680J85231j03623
$$ plain form
5245 4586452 4466945 4446337 4814435 5058260 5236316 5390298 5579283 5554730 5539587 5589277
5235 5589277 5706403 5787538 6183066 6358350 6536742 6687197 6826998 7177729 7637136 7905099
5225 7905099 7958126 8079861 8303583 8807897 9267511 9467760 10025925 10478483 10984214 11222332
5215 11222332 11936406 12731096 13770553 14549823 15004103 15605889 16655882 17526158 18429128
5206 18429128 19564865 20386125 21395861 22489574 23584007 24468141 25402682 25822676 26112493
5197 26112493 26054170 26078927 25996455 25474381 24650085 23827491 22588354 21327843 20141311
5188 20141311 19117578 18204798 17251590 16099108 14990437 14246602 13334678 12558249 11894853
5179 11894853 10994520 10302276 9888938 9403704 9070371 8940414 8367524 8200019 7996552
$$ packed form
5245D586452j19507k0608L68098K43825J78056J53982J88985k4553j5143M9690
5235E589277J17126Q1135L95528J75284J78392J50455J39801L50731M59407K67963
5225G905099N3027J21735K23722N04314M59614K00249N58165M52558N05731K38118
5215A1222332P14074P94690J039457P79270M54280O01786J049993Q70276R02970
5206A8429128J135737Q21260J009736J093713J094433Q84134R34541M19994K89817
5197B6112493n8323K4757q2472n22074q24296q22594j239137j260511j186532
5188B0141311j023733r12780r53208j152482j108671p43835r11924p76429o63396
5179A1894853r00333o92244m13338m85234l33333j29957n72890j67505k03467
$$ plain form
5170 7996552 7891170 7790643 7419808 7169122 6826580 6597787 6452351 6206751 6020058 5863239
5160 5863239 5715327 5870016 5916631 5507753 5084354 5160962 5124361 4893840 4885544 4624206
5150 4624206 4583284 4622448 4541711 4396696 4315073 4396774 4244083 4271379 4097001 4171766 4070283
5139 4070283 3938602 4280190 4414102 4120791 4274952 4521098 4483595 4580291 4214276 3761319
5129 3761319 3910886 3833851 4019895 4288981 4003400 4197895 4210574 4240467 4378076 4405649
5119 4405649 4465771 4352025 4414596 4668591 4987506 5129264 5018760 4953591 4898433 5035569
5109 5035569 5068749 5322038 5173801 5238447 5340516 5258602 5061246 5120806 4931483 5032197
5099 5032197 4936629 4944982 4843611 4746529 4875790 5132568 5131972 5130849 5300726 5287395 5264526
$$ packed form
5170G996552j05382j00527l70835k50686l42542k28793j45436k45600j86693j56819
5160E863239j47912J54689M6615m08878m23399P6608l6601k30521q296k61338
5150D624206m0922L9164q0737j45015q1623Q1701j52691K7296j74378P4765j01483
5139D070283j31681L41588J33912k93311J54161K46146l7503R6696l66015m52957
5129C761319J49567p7035J86044K69086k85581J94495J2679K9893J37609K7573
5119D405649O0122j13746O2571K53995L18915J41758j10504o5169n5158J37136
5109E035569L3180K53289j48237O4646J02069q1914j97356N9560j89323J00714
5099E032197r5568Q353j01371r7082J29261K56778n96j123J69877j3331k2869
$$ plain form
5088 5264526 5427654 5322680 5321423 5248087 5349954 5705956 5920542 5762275 5593919 5482814
5078 5482814 5286753 5447228 5214089 5562972 5584609 5454960 5594695 5695352 5980310 6219458
5068 6219458 6316715 6536422 6382154 6222691 6332514 6351845 6215648 6353362 6605496 6888971
5058 6888971 6886512 6461444 6473326 6484641 6118968 6029424 5881647 5919770 6032381 5976032 5767433
5047 5767433 5800418 5740046 5868134 5821711 5694337 5543864 5665614 5457152 5163068 5142668
5037 5142668 4950814 4835063 4685308 4720508 4939743 4903683 4799560 4833228 4667257 4515392
5027 4515392 4523908 4454353 4635018 4651669 4535933 4663702 4819711 4647456 4973233 5231659
5017 5231659 5243341 5150929 5261568 5563594 5647486 5382277 5397387 5597395 5696298 5813211
$$ packed form
5088E264526J63128j04974j257p3336J01867L56002K14586j58267j68356j11105
5078E482814j96061J60475k33139L48883K1637j29649J39735J00657K84958K39148
5068F219458R7257K19707j54268j59463J09823J9331j36197J37714K52134K83475
5058F888971k459m25068J1882J1315l65673q9544j47777L8123J12611n6349k08599
5047E767433L2985o0372J28088m6423j27374j50473J21750k08462k94084k0400
5037E142668j91854j15751j49755L5200K19235l6060j04123L3668j65971j51865
5027D515392Q516o9555J80665J6651j15736J27769J56009j72255L25777K58426
5017E231659J1682r2412J10639L02026Q3892k65209J5110K00008R8903J16913
$$ plain form
5007 5813211 5723536 5790760 6112564 6593886 6747579 6506743 6805379 6838719 7228962 7503721
4997 7503721 7299617 7627387 7683290 7903164 7961082 7973994 7852630 7773442 7917683 7852160
4987 7852160 7841284 7653001 7224484 6970384 7092936 7153111 6931180 6745728 6611803 6140862
4977 6140862 5918012 5979620 5959109 5919444 5839420 5925183 5619740 5555684 5532890 5434645 5632101
4966 5632101 5703197 5580977 5321986 5271454 5335216 5192144 5179617 4932721 5053070 5264930
4956 5264930 5147364 5034141 4807541 4846803 4890404 4789099 4702710 4654929 4537377 4460204
4946 4460204 4388739 4498611 4721804 4641584 4733426 4854329 4674575 4611934 4627267 4764136
4936 4764136 4846245 4868470 4804548 4636690 4677324 4731910 4641362 4574682 4794351 4670447 4723627
$$ packed form
5007E813211q9675O7224L21804M81322J53693k40836K98636L3340L90243K74759
4997G503721k04104L27770N5903K19874N7918J2912j21364p9188J44241o5523
4987G852160j0876j88283m28517k54100J22552O0175k21931j85452j33925m70941
4977F140862k22850O1608k0511l9665q0024Q5763l05443o4056k2794r8245J97456
4966E632101P1096j22220k58991n0532O3762j43072j2527k46896J20349K11860
4956E264930j17566j13223k26600L9262M3601j01305q6389m7781j17552p7173
4946D460204p1465J09872K23193q0220R1842J20903j79754o2641J5333J36869
4936D764136Q2109K2225o3922j67858M0634N4586r0548o6680K19669j23904N3180
$$ plain form
4925 4723627 4770302 4837827 5048520 5007748 4913548 4840882 4954522 5113156 5193371 5042779 4854459
4914 4854459 4945449 4932230 5083167 5095973 5104701 4565494 4637021 4845222 4894367 5042602 5289465
4903 5289465 5173374 4806391 5111778 5182473 5436915 5711145 5535491 5329645 5269853 5530316
4893 5530316 5522516 5453106 5431272 5495779 5621198 5899554 5869994 5637801 5845788 6092830 5764054
4882 5764054 5858226 6150000 5998045 5746614 5865336 6066037 6147094 6177859 6151405 6169590
4872 6169590 6140121 6174593 6146587 5974676 5923349 6364219 6569975 6128296 6310357 6307630 6641143
4861 6641143 6862267 6785883 7105400 6972689 7080823 6945687 7151743 7491038 7746025 7721360
4851 7721360 7811846 7662260 7802646 8051842 8172987 8128818 8364378 8636075 8897574 9059958
$$ packed form
4925D723627M6675O7525K10693m0772r4200p2666J13640J58634Q0215j50592j88320
4914D854459R0990j3219J50937J2806Q728n39207P1527K08201M9145J48235K46863
4903E289465j16091l66983L05387P0695K54442K74230j75654k05846n9792K60463
4893E530316p800o9410k1834O4507J25419K78356k9560k32193K07987K47042l28776
4882E764054R4172K91774j51955k51431J18722K00701Q1057L0765k6454J8185
4872F169590k9469L4472k8006j71911n1327M40870K05756m41679J82061k727L33513
4861F641143K21124p6384L19517j32711J08134j35136K06056L39295K54987k4665
4851G721360R0486j49586J40386K49196J21145m4169K35560K71697K61499J62384
$$ plain form
4841 9059958 9226003 9565590 9668019 9888385 10071002 9890633 9889319 10140798 10161576 10296977
4831 10296977 10263009 10276934 10314053 10455017 10830007 10845028 10919385 10986810 11035864 11033907 10974883
4820 10974883 11024280 11387825 11830250 12110045 12241335 12375616 12682820 12738993 13114776 13743968
4810 13743968 14103299 14713767 15258523 15586268 15884434 16584042 17465340 17944075 18122469
4801 18122469 18775061 19257184 19646065 20042127 20483054 20936725 21423701 22002407 22870911
4792 22870911 23276631 23793230 24091585 24640606 25163007 25673131 26108696 26490014 26959991
4783 26959991 27465235 28063174 28451489 29369316 29830811 30620449 31203267 31854819 32547006
4774 32547006 33352837 34345991 34900696 35559495 36448315 37509990 38509946 39714858 41184575
$$ packed form
4841I059958J66045L39587J02429K20366J82617j80369j314K51479K0778J35401
4831A0296977l3968J3925L7119J40964L74990J5021P4357O7425M9054j957n9024
4820A0974883M9397L63545M42425K79795J31290J34281L07204N6173L75783O29192
4810A3743968L59331O10468N44756L27745K98166O99608Q81298M78735J78394
4801A8122469O52592M82123L88881L96062M40927M53671M86976N78706Q68504
4792B2870911M05720N16599K98355N49021N22401N10124M35565L81318M69977
4783B6959991N05244N97939L88315R17827M61495P89638N82818O51552O92187
4774C2547006Q05831R93154N54705O58799Q88820J061675R99956J204912J469717
$$ plain form
4765 41184575 42705032 44070491 45601628 47574977 49991907 53011649 56565262 60026903
4757 60026903 64203630 69764069 75829102 82867770 90727082 99942524 110267691 121237856
4749 121237856 132476010 142233336 148518531 149779698 145607741 136389140 124326463 111958391
4741 111958391 100065764 89668827 81015409 73646909 67143136 61908667 57512490 53819702
4733 53819702 50723249 48033345 45691366 43787919 41919809 39938815 38749830 38209741
4725 38209741 37486513 36497868 35477022 34935375 34637984 34362832 33985429 33295670 33055152
4716 33055152 32743792 32846962 32718192 32727820 33136431 33166169 33333351 33759475 33899876 34103367
4706 34103367 34776989 35338662 36163157 36931137 38076042 38916488 40007057 41119660 42509706
$$ packed form
4765D1184575J520457J365459J531137J973349K416930L019742L553613L461641
4757F0026903M176727N560439O065033P038668P859312R215442J0325167J0970165
4749A21237856J1238154R757326O285195J261167m171957r218601j2062677j2368072
4741A11958391j1892627j0396937q653418p368500o503773n234469m396177l692788
4733E3819702l096453k689904k341979j903447j868110j980994j188985n40089
4725C8209741p23228r88645j020846n41647k97391k75152l77403o89759k40518
4716C3055152l11360J03170j28770R628M08611K9738J67182M26124J40401K03491
4706C4103367O73622N61673Q24495P67980J144905Q40446J090569J112603J390046
$$ plain form
4697 42509706 44026153 45674030 47932894 50828406 53999209 57536581 61767594 66635801
4689 66635801 72528014 79492737 87479873 96321611 106188922 116768155 127205169 136102611
4681 136102611 142216401 143964666 140622675 132691070 122081561 110467968 98971297 88187462
4673 88187462 78968984 71170282 64451720 58899399 53959700 49646625 45981188 42998264
4665 42998264 40245658 37601181 35229622 33278711 31357049 30077099 28784774 27352325
4657 27352325 26398816 25354348 24481904 23722174 22919545 21954618 21205521 20487139 19851815
4648 19851815 19251985 18779558 18428449 18420904 17771376 17102642 16855916 16317253 15883803 15816875
4638 15816875 15566576 14891968 14467886 14109424 13937219 13853211 13565507 13279589 12883711 12716956
$$ packed form
4697D2509706J516447J647877K258864K895512L170803L537372M231013M868207
4689F6635801N892213O964723P987136Q841738R867311J0579233J0437014Q897442
4681A36102611O113790J748265l341991p931605j0609509j1613593j1496671j0783835
4673H8187462r218478p798702o718562n552321m939699m313075l665437k982924
4665D2998264k752606k644477k371559j950911j921662j279950j292325j432449
4657B7352325r53509j044468q72444p59730q02629r64927p49097p18382o35324
4648A9851815n99830m72427l51109p545o49528o68734k46726n38663m33450o6928
4638A5816875k50299o74608m24082l58462j72205q4008k87704k85918l95878j66755
$$ plain form
4628 12716956 12716842 12274184 12213704 12060319 11864666 11694292 11499005 11406817 11313715 11110457
4618 11110457 11092776 11187054 11080476 10986215 10719653 10602634 10542022 10297769 10085681 9889370
4608 9889370 10287771 10218765 9954378 9604871 9488778 9572671 9419508 9379860 9273480 9440958
4598 9440958 9329107 9179950 9343788 9333396 9135423 8880656 8881335 9037835 8845927 8555136
4588 8555136 8295969 8372974 8352301 8221024 8068993 8417746 8230149 8311671 8112599 8180360
4578 8180360 8413320 8259755 8035664 8092196 8218457 8367301 8012135 7961257 7892660 8051208
4568 8051208 7764709 7501589 7776529 7685220 7749451 7871685 7870588 7984064 7974282 7847272 7835619
4557 7835619 7613398 7801599 7667249 7467841 7488473 7672638 7337705 7336524 7350050 7264475
$$ packed form
4628A2716956j14m42658o0480j53385j95653j70374j95287r2188r3102k03258
4618A1110457j7681R4278j06578r4261k66562j17019o0612k44253k12088j96311
4608I889370L98401o9006k64387l49507j16093Q3893j53163l9648j06380J67478
4598I440958j11851j49157J63838j0392j97973k54767O79J56500j91908k90791
4588H555136k59167P7005k0673j31277j52031L48753j87597Q1522j99072O7761
4578H180360K32960j53565k24091N6532J26261J48844l55166n0878o8597J58548
4568H051208k86499k63120K74940r1309O4231J22234j097J13476r782j27010j1653
4557G835619k22221J88201j34350j99408K0632J84165l34933j181J3526q5575
$$ plain form
4547 7264475 7156916 7275738 7331705 7289539 7521353 7281149 7186166 7380077 7359974 7498554
4537 7498554 7740788 7853638 7597669 7697441 7690838 7534651 7379164 7289218 7173408 7608719
4527 7608719 7751865 7715830 7410793 7460150 7598058 7769806 7844787 7892790 8030027 7660075
4517 7660075 7753684 7856694 7965093 7970700 8108934 8190942 7963105 7995252 8373522 8640012
4507 8640012 8583792 8282340 8538556 8781448 8809922 8789086 9021523 9030600 9044967 9045388 9030873
4496 9030873 9540104 9549594 9376258 9519559 9860397 10043423 10184849 10162611 10107041 10120702
4486 10120702 10182848 10591086 10635234 10773140 10734427 10591568 10960704 11460024 11371601 11454215
4476 11454215 11512014 11169250 11191410 11412158 11746969 11962745 12097776 12339227 12424302 12277752
$$ packed form
4547G264475j07559J18822N5967m2166K31814k40204r4983J93911k0103J38580
4537G498554K42234J12850k55969R9772o603j56187j55487q9946j15810M35311
4527G608719J43146l6035l05037M9357J37908J71748P4981M8003J37237l69952
4517G660075R3609J03010J08399N607J38234Q2008k27837L2147L78270K66490
4507H640012n6220l01452K56216K42892K8474k0836K32437R077J4367M21j4515
4496I030873N09231R490j73336J43301L40838J83026J41426k2238n5570J3661
4486A0120702O2146M08238M4148J37906l8713j42859L69136M99320q8423Q2614
4476A1454215N7799l42764K2160K20748L34811K15776J35031K41451Q5075j46550
$$ plain form
4466 12277752 12762512 12974970 13066250 13447340 13587126 13672445 13606773 13672379 13573192 13595349
4456 13595349 13881092 13910175 14028151 14015763 13972871 14488933 14515786 14633117 14786637 14841756
4446 14841756 15089885 15435833 15371475 15670764 16018811 16319978 16903036 17172221 17265825 17430872
4436 17430872 17576488 17882207 18106232 18333092 18959533 19356358 20055297 20514107 21002140
4427 21002140 21593353 21940154 22507829 23273635 24069394 24885055 25422179 26119229 26766903
4418 26766903 27836017 28301620 29141188 29693089 30028173 30826810 31633520 32374783 32977319
4409 32977319 33266193 33816079 34131867 34754639 35195008 35554538 36156959 36521859 37106271
4400 37106271 37549777 37859341 38138064 38564984 38695757 38791569 38890341 39112476 39065016 39288398
$$ packed form
4466A2277752M84760K12458R1280L81090J39786Q5319o5672O5606r9187K2157
4456A3595349K85743K9083J17976j2388m2892N16062K6853J17331J53520N5119
4446A4841756K48129L45948o4358K99289L48047L01167N83058K69185R3604J65047
4436A7430872J45616L05719K24025K26860O26441L96825O98939M58810M88033
4427B1002140N91213L46801N67675P65806P95759Q15661N37124O97050O47674
4418B6766903J069114M65603Q39568N51901L35084P98637Q06710P41263O02536
4409C2977319K88874N49886L15788O22772M40369L59530O02421L64900N84412
4400C7106271M43506L09564K78723M26920J30773R5812R8772K22135m7460K23382
$$ plain form
4390 39288398 39568408 39740249 39609370 39408144 39829213 40138458 40465651 40578665 40798098
4381 40798098 40944931 41136975 41702580 41867795 42162427 42457311 42574491 42694185 42834170
4372 42834170 42856190 42823194 42653031 42732009 42499055 42285858 42056542 41790886 41566857 41221683
4362 41221683 40333316 39755744 39158271 38223712 37507232 36966456 36494124 35807544 34722320
4353 34722320 33661071 33163278 32700047 32029960 31185213 30682989 30330299 29693845 29162362
4344 29162362 28696443 28246384 27556792 27416613 26891264 26681554 26578322 26206307 26107152 25849971
4334 25849971 25305007 24969822 24915337 24972915 24685997 24506755 24391078 24320790 24281532 24372302
4324 24372302 24577549 24660358 24450270 24603410 24809727 24952228 25261920 25388387 25612809 25852413
$$ packed form
4390C9288398K80010J71841j30879k01226M21069L09245L27193J13014K19433
4381D0798098J46833J92044N65605J65215K94632K94884J17180J19694J39985
4372D2834170K2020l2996j70163P8978k32954k13197k29316k65656k24029l45174
4362D1221683q88367n77572n97473r34559p16480n40776m72332o86580j085224
4353C4722320j061249m97793m63231o70087q44747n02224l52690o36454n31483
4344B9162362m65919m50059o89592j40179n25349k09710j03232l72015r9155k57181
4334B5849971n44964l35185n4485N7578k86918j79242j15677p0288l9258R0770
4324B4372302K05247Q2809k10088J53140K06317J42501L09692J26467K24422K39604
$$ plain form
4314 25852413 26155295 26277807 26751669 27000169 27051962 27152589 27157402 27266895 27858749 28270221
4304 28270221 28672491 29067364 29932411 30402013 30821537 31415489 31901099 32283709 32990998
4295 32990998 33928574 34676088 35620526 36091833 36751590 37632908 38464591 39150908 39425894
4286 39425894 40015046 40424597 41082785 41855440 42228863 42916321 43501118 43774500 44141057
4277 44141057 44594165 44622191 44725281 44908323 45050176 45384570 45409448 45468462 45478263 45645225
4267 45645225 46037926 46052310 45784660 45969144 46030517 45769572 45913207 46075901 46020741 46392423
4257 46392423 46462148 46378185 45927869 45569807 45315588 45284895 45358646 45147326 44900899 44972526
4247 44972526 45319341 45132227 44737651 44798673 44703788 44428283 44306377 44020693 43917960 43655960
$$ packed form
4314B5852413L02882J22512M73862K48500N1793J00627M813J09493N91854M11472
4304B8270221M02270L94873Q65047M69602M19524N93952M85610L82610P07289
4295C2990998R37576P47514R44438M71307O59757Q81318Q31683O86317K74986
4286C9425894N89152M09551O58188P72655L73423O87458N84797K73382L66557
4277D4141057M53108K8026J03090J83042J41853L34394K4878N9014R801J66962
4267D5645225L92701J4384k67650J84484O1373k60945J43635J62694n5160L71682
4257D6392423O9725q3963m50316l58062k54219l0693P3751k11320k46427P1627
4247D4972526L46815j87114l94576O1022r4885k75505j21906k85684j02733k62000
$$ plain form
4237 43655960 43378991 42972776 42412190 42247819 41762849 41315314 41134188 40737697 40230261
4228 40230261 39626155 39053056 38661133 38675091 38168430 37395183 36916541 36454571 36070648 35629704
4218 35629704 35280556 34873793 34074281 33613657 33491961 33278538 33040908 33047217 32919842 32635687
4208 32635687 32567305 32217810 31864696 31703553 31784375 31739086 31431470 31016467 30616137 30565254
4198 30565254 30484008 30433801 30458116 30420132 30256965 30366823 30357343 30597016 31001898 30999060 30742622
4187 30742622 30916096 30787883 31036166 31160165 30942575 30890873 31107843 31112379 31147787 31262302
4177 31262302 30920736 31002479 31354328 31471905 31366061 31495155 31480827 31646583 31699531 31691281
4167 31691281 31675701 31712043 31744122 32082184 32164097 32349789 32639512 32765926 32872114 33045804
$$ packed form
4237D3655960k76969m06215n60586j64371m84970m47535j81126l96491n07436
4228D0230261o04106n73099l91923J3958n06661p73247m78642m61970l83923m40944
4218C5629704l49148m06763p99512m60624j21696k13423k37630O309j27375k84155
4208C2635687o8382l49495l53114j61143Q0822m5289l07616m15003m00330n0883
4198C0565254q1246n0207K4315l7984j63167J09858r480K39673M04882k838k56438
4187C0742622J73474j28213K48283J23999k17590n1702K16970M536L5408J14515
4177C1262302l41566Q1743L51849J17577j05844J29094j4328J65756N2948q250
4167C1691281j5580L6342L2079L38062Q1913J85692K89723J26414J06188J73690
$$ plain form
4157 33045804 33325180 33510495 33906321 34295612 34781882 34959054 35419312 35593446 35925447
4148 35925447 36440821 36681455 36827038 36672333 36907853 37532844 37838344 38299092 39220087
4139 39220087 39640148 39976970 40457405 40729315 41493351 42155351 42842668 43374574 44051882
4130 44051882 44963079 45466159 45918128 46271553 46746680 47224582 47843064 48346827 48503338
4121 48503338 48653906 48800825 48901212 49263775 49312356 49846026 50264393 50544900 50713011 50749958
4111 50749958 51102751 51496716 51640477 52196935 52644144 53295452 53922810 54458990 55236451
4102 55236451 55832266 56457569 57198048 58818187 59919123 61261353 62822892 64646512 66816755
4093 66816755 69183673 71881546 74965811 78453894 82511910 87027648 91376875 96048203
$$ packed form
4157C3045804K79376J85315L95826L89291M86270J77172M60258J74134L32001
4148C5925447N15374K40634J45583j54705K35520O24991L05500M60748R20995
4139C9220087M20061L36822M80435K71910P64036O62000O87317N31906O77308
4130D4051882R11197N03080M51969L53425M75127M77902O18482N03763J56511
4121D8503338J50568J46919J00387L62563M8581N33670M18367K80507J68111L6947
4111E0749958L52793L93965J43761N56458M47209O51308O27358N36180P77461
4102E5236451N95815O25303P40479J620139J100936J342230J561539J823620K170243
4093F6816755K366918K697873L084265L488083M058016M515738M349227M671328
$$ plain form
4085 96048203 100159230 103845348 106601772 107907499 107115437 105046146 102101465 98441445
4077 98441445 94697850 91085404 87804311 85170841 83130120 81586326 80712477 80144878
4069 80144878 79896367 80433095 81261134 82147304 83478227 85392670 86313803 86406724 86715495
4060 86715495 87421300 89245518 91547027 93906277 96395327 98665933 100757627 102266539
4052 102266539 102694189 102301804 101217599 99873707 98306352 97086891 96017315 95646796
4044 95646796 94952092 94987725 94989946 95187715 95700970 96583303 97656770 98583953 99648245 101316581
4034 101316581 103126534 104650864 106257635 108195160 110316724 112444792 114379512 116608363
4026 116608363 118929820 121174086 123906736 126414868 128753061 130886711 132705931 134541630
$$ packed form
4085I6048203M111027L686118K756424J305727p92062k069291k944681l660020
4077I8441445l743595l612446l281093k633470k040721j543794q73849n67599
4069H0144878k48511N36728Q28039Q86170J330923J914443R21133R2921L08771
4060H6715495P05805J824218K301509K359250K489050K270606K091694J508912
4052A02266539M27650l92385j084205j343892j567355j219461j069576l70519
4044I5646796o94704L5633K221J97769N13255Q82333J073467R27183J064292J668336
4034A01316581J809953J524330J606771J937525K121564K128068J934720K228851
4026A16608363K321457K244266K732650K508132K338193K133650J819220J835699
$$ plain form
4018 134541630 136003420 136880968 137266535 137326642 137190479 136257851 134805766 133352244 131772600
4009 131772600 129658449 127428814 125388108 123312009 120804230 118557929 116226781 113877722
4001 113877722 112199314 110125220 107502442 105076839 102644977 100044620 97519334 95038937
3993 95038937 92269191 90127378 88264961 86052061 84001310 82354025 80159124 78233558
3985 78233558 76344696 74381161 72992320 71459982 69536187 67999338 66396179 65074958
3977 65074958 63646665 61855248 60525189 59279887 58142829 57039986 55682328 54401857
3969 54401857 53413014 52577468 51338984 50097536 49010962 48147521 47256082 46793175 46285046
3960 46285046 45388731 44458070 43935466 43488981 43203519 42994996 43154208 43121094 42644408 41646818
$$ packed form
4018A34541630J461790Q77548L85567O0107j36163r32628j452085j453522j579644
4009A31772600k114151k229635k040706k076099k507779k246301k331148k349059
4001A13877722j678408k074094k622778k425603k431862k600357k525286k480397
3993I5038937k769746k141813j862417k212900k050751j647285k194901j925566
3985G8233558j888862j963535j388841j532338j923795j536849j603159j321221
3977F5074958j428293j791417j330059j245302j137058j102843j357658j280471
3969E4401857r88843q35546j238484j241448j086574q63441q91439m62907n08129
3960D6285046q96315r30661n22604m46485k85462k08523J59212l3114m76686r97590
$$ plain form
3950 41646818 40562319 39477881 38483014 37862277 37092696 36463987 35795016 35421193 34947762
3941 34947762 34344798 33940485 33747460 33459781 33172347 32986924 32663396 32119601 31832356
3932 31832356 31492761 31350708 31565540 31260523 30981408 30599447 30267192 30051600 29827690
3923 29827690 29473332 29144193 29043375 28793403 28641448 28400383 28014217 27605686 27541746 27355982
3913 27355982 27208535 27009535 26969110 27055512 26943930 26775684 26549216 26223752 26098778 25857863
3903 25857863 25918656 25852976 25845664 25498212 25349120 25060048 25308304 25543685 25326924 25204768
3893 25204768 24958170 25005394 25150806 25003355 24828960 24470111 24254813 24289004 24293589 24207239
3883 24207239 24538714 24412627 24207046 24156799 23728554 23691189 23701087 23626559 23589094 23735024
$$ packed form
3950D1646818j084499j084438r94867o20737p69581o28709o68971l73823m73431
3941C4947762o02964m04313j93025k87679k87434j85423l23528n43795k87245
3932C1832356l39595j42053K14832l05017k79115l81961l32255k15592k23910
3923B9827690l54358l29139j00818k49972j51955k41065l86166m08531o3940j85764
3913B7355982j47447j99000m0425Q6402j11582j68246k26468l25464j24974k40915
3903B5857863O0793o5680p312l47452j49092k89072K48256K35381k16761j22156
3893B5204768k46598M7224J45412j47451j74395l58849k15298L4191M585q6350
3883B4207239L31475j26087k05581n0247m28245l7365R898p4528l7465J45930
$$ plain form
3873 23735024 23752464 24027238 23607895 23228606 23222734 23631148 23805840 23692638 23536995 23463613
3863 23463613 23402102 23306634 23499485 23538124 23492671 23653453 23745030 23515144 23426021 23306248
3853 23306248 23250015 23115227 23203971 23037572 23067162 22939894 22871603 22933854 22940243 22970205 23131265
3842 23131265 23000151 22932436 22920124 22635502 22739852 22839612 22964218 23045842 23196927 23175560
3832 23175560 23239349 23285425 23321245 23176226 23400345 23144129 22952490 23090542 23111948 23056095
3822 23056095 23202854 23076752 22852057 22968064 22937081 23162197 23069570 23342185 23269224 23364098
3812 23364098 23425016 23433745 23827297 23829096 23688271 23473484 23674311 24012905 24275376 24136097
3802 24136097 23887625 24012609 24236440 24315109 24368034 24025538 24299720 24530042 24513383 24641389
$$ packed form
3873B3735024J7440K74774m19343l79289n872M08414J74692j13202j55643p3382
3863B3463613o1511r5468J92851L8639m5453J60782R1577k29886q9123j19773
3853B3306248n6233j34788Q8744j66399K9590j27268o8291O2251O389K9962J61060
3842B3131265j31114o7715j2312k84622J04350R9760J24606Q1624J51085k1367
3832B3175560O3789M6076L5820j45019K24119k56216j91639J38052K1406n5853
3822B3056095J46759j26102k24695J16007l0983K25116r2627K72615p2961R4874
3812B3364098O0918Q729L93552J799j40825k14787K00827L38594K62471j39279
3802B4136097k48472J24984K23831P8669N2925l42496K74182K30322j6659J28006
$$ plain form
3792 24641389 24737300 24900559 25153506 25636166 25945283 25905812 25682502 25543247 25504283 25795969
3782 25795969 25986628 25985390 25889129 25648056 25617753 25644062 25761893 25878870 25584097 25560545
3772 25560545 25904933 25932489 26293173 26319694 26357909 26301538 26452245 26682079 26718155 27069911
3762 27069911 27133188 27322173 27508462 27507040 27849403 28038332 28477211 28839505 29108509 29368691
3752 29368691 29440082 29615416 30299692 31065513 31196876 31491600 32331674 32974058 33484848 34034082
3742 34034082 34790413 35642083 36411806 37098516 37761385 38423809 39049705 39502146 39777339
3733 39777339 40195450 40697940 41125395 41234678 41494274 41829336 42439416 42981239 43595059
3724 43595059 44078433 44521704 45037409 45560579 45999017 46490529 47236347 47859546 48334364
$$ packed form
3792B4641389R5911J63259K52947M82660L09117l9471k23310j39255l8964K91686
3782B5795969J90659j238r6261k41073l0303K6309J17831J16977k94773k3552
3772B5560545L44388K7556L60684K6521L8215n6371J50707K29834L6076L51756
3762B7069911O3277J88985J86289j422L42363J88929M38879L62294K69004K60182
3752B9368691P1391J75334O84276P65821J31363K94724Q40074O42384N10790N49234
3742C4034082P56331Q51670P69723O86710O62869O62424O25896M52441K75193
3733C9777339M18111N02490M27455J09283K59596L35062O10080N41823O13820
3724D3595059M83374M43271N15705N23170M38438M91512P45818O23199M74818
$$ plain form
3715 48334364 49134732 49622290 50564294 51926038 53389632 54965947 56762613 58498450 60439702
3706 60439702 62320934 63908889 65643217 67278725 68717789 70047320 71052106 71956484
3698 71956484 72254616 72415751 72436234 72190270 71962633 71875484 71504922 71181985 71003220 70406010
3688 70406010 69634480 68659736 67731395 66421924 65003408 63285983 61416879 59466245 57174931
3679 57174931 54883400 53289335 51119119 49406307 47631606 45651163 44593771 43168456
3671 43168456 42038068 41114948 40023305 39235306 38407174 37576109 37154684 36622297 35972302
3662 35972302 35229433 34807891 34325556 33760524 33560046 33505010 33578189 33197019 32938987 32810081
3652 32810081 32603631 32434712 32337763 32054865 32172142 31845316 31537251 31643723 31645886 31341824
$$ packed form
3715D8334364Q00368M87558R42004J361744J463594J576315J796666J735837J941252
3706F0439702J881232J587955J734328J635508J439064J329531J004786R04378
3698G1956484K98132J61135K0483k45964k27637q7149l70562l22937j78765n97210
3688G0406010p71530r74744r28341j309471j418516j717425j869104j950634k291314
3679E7174931k291531j594065k170216j712812j774701j980443j057392j425315
3671D3168456j130388r23120j091643p87999q28132q31065m21425n32387o49995
3662C5972302p42869m21542m82335n65032k00478n5036P3179l81170k58032j28906
3652C2810081k06450j68919r6949k82898J17277l26826l08065J06472K163l04062
$$ plain form
3642 31341824 31164342 31148069 31163929 31295678 31210902 31155147 30785875 30698431 30505931 30784428
3632 30784428 30663995 30706970 30566608 30539917 30605654 30517067 30461714 30566409 30806781 30668688
3622 30668688 30832254 30738321 30899769 31070645 31125466 31117308 31366411 31653057 31794191 32103302
3612 32103302 32276342 32293145 32741473 33191075 33303610 33506153 33734585 33790694 33997558 34258962
3602 34258962 34464514 34596442 34611123 34869697 35240466 35342356 35430497 35676702 35775802 36094798
3592 36094798 36524715 36719335 37065136 37447996 37896319 38532451 39122730 39677293 40108309
3583 40108309 40627462 41562748 42486299 42986455 43676814 44708476 46010460 47286847 48211299
3574 48211299 49328780 50593148 51627282 52686193 53875369 55108651 56176005 57147433
$$ packed form
3642C1341824j77482j6273J5860J31749q4776n5755l69272q7444j92500K78497
3632C0784428j20433M2975j40362k6691O5737q8587n5353J04695K40372j38093
3622C0668688J63566r3933J61448J70876N4821q158K49103K86646J41134L09111
3612C2103302J73040J6803M48328M49602J12535K02543K28432N6109K06864K61404
3602C4258962K05552J31928J4681K58574L70769J01890Q8141K46205R9100L18996
3592C6094798M29917J94620L45801L82860M48323O36132N90279N54563M31016
3583D0108309N19153R35286R23551N00156O90359J031662J301984J276387R24452
3574D8211299J117481J264368J034134J058911J189176J233282J067354R71428
$$ plain form
3566 57147433 58270165 59303755 60427355 61574000 62535908 63696356 64809955 65755372
3558 65755372 66765882 67705290 68438292 68962207 69204311 68729875 68310757 68049826 67395081
3549 67395081 66881995 66153115 65485825 64884776 64129526 63756217 63536055 63442953 63803811 64011993
3539 64011993 64149130 64503214 65406977 66560827 67592361 69027896 70830294 72817144 75001211
3530 75001211 77376627 80029325 83102170 86340365 90125089 93898009 98151535 102533605
3522 102533605 106584499 110375894 114207660 117783095 121000124 123427673 125512114 126702354
3514 126702354 127615842 127899418 127773138 127346810 125968339 124469414 122562560 120267748 117899638
3505 117899638 115358138 112526574 109144676 105801711 102565326 98994500 95213567 91434310
$$ packed form
3566E7147433J122732J033590J123600J146645R61908J160448J113599R45417
3558F5755372J010510R39408P33002N23915K42104m74436m19118k60931o54745
3549F7395081n13086p28880o67290o01049p55250l73309k20162r3102L60858K08182
3539F4011993J37137L54084R03763J153850J031534J435535J802398J986850K184067
3530G5001211K375416K652698L072845L238195L784724L772920M253526M382070
3522A02533605M050894L791395L831766L575435L217029K427549K084441J190240
3514A26702354R13488K83576j26280m26328j378471j498925j906854k294812k368110
3505A17899638k541500k831564l381898l342965l236385l570826l780933l779257
$$ plain form
3497 91434310 88099809 84753324 81449426 78159371 75351700 72818292 70413923 68081436
3489 68081436 65931424 64031543 61917862 60035871 58551475 56951378 55455558 54160230
3481 54160230 53193817 52221476 51169410 49964186 49023792 48342729 47604746 47146785 46406889
3472 46406889 45345978 44631401 43804030 42668470 41987921 41496669 40630297 40191882 39679530
3463 39679530 39097725 38748283 38588664 38090075 37928460 37783261 37894516 37625890 37663689 37631292
3453 37631292 37356455 37272334 37221580 37038391 36596006 36165068 35609966 35017476 34793594 34363492
3443 34363492 33796448 33308821 32836606 32300595 31653506 31039239 30562911 30361094 30229349
3434 30229349 30055444 30087260 29612846 29071857 28947391 28816998 28557570 28027943 27928182 27655249
$$ packed form
3497I1434310l334501l346485l303898l290055k807671k533408k404369k332487
3489F8081436k150012j899881k113681j881991j484396j600097j495820j295328
3481E4160230r66413r72341j052066j205224r40394o81063p37983m57961p39896
3472D6406889j060911p14577q27371j135560o80549m91252q66372m38415n12352
3463C9679530n81805l49442j59619m98589j61615j45199J11255k68626L7799l2397
3453C7631292k74837q4121n0754j83189m42385m30938n55102n92490k23882m30102
3443C4363492n67044m87627m72215n36011o47089o14267m76328k01817j31745
3434C0229349j73905L1816m74414n40989j24466j30393k59428n29627r9761k72933
$$ plain form
3424 27655249 27390807 27402175 27499316 27717202 27381474 27064285 27055692 26995634 26910013 26929964 26828406
3413 26828406 26502066 26734694 27100299 27114890 27049541 26879102 27006291 27207009 27136661 27217155
3403 27217155 27195669 27677137 27594277 27731063 27817100 27692791 28016611 28345257 28064635 28228687
3393 28228687 28410302 28867859 29050586 28918946 29092185 29547929 29645011 29680711 29634022 29931004
3383 29931004 30427348 30948897 31062740 31124245 31293163 31521906 31849215 32319077 32878879 33006259
3373 33006259 33265942 33451469 33903524 34121724 34375945 34716994 34624490 34834571 35292201 35479491
3363 35479491 35704874 36013432 36374904 36482578 36501571 36897071 37354988 37643259 38064862 38585983
3353 38585983 39162364 39755312 40382276 41078917 41683946 42377894 43218802 43814094 44665757
$$ packed form
3424B7655249k64442J1368R7141K17886l35728l17189q593o0058q5621J9951j01558
3413B6828406l26340K32628L65605J4591o5349j70439J27189K00718p0348Q0494
3403B7217155k1486M81468q2860J36786Q6037j24309L23820L28646k80622J64052
3393B8228687J81615M57557J82727j31640J73239M55744R7082L5700m6689K96982
3383B9931004M96344N21549J13843O1505J68918K28743L27309M69862N59802J27380
3373C3006259K59683J85527M52055K18200K54221L41049r2504K10081M57630J87290
3363C5479491K25383L08558L61472J07674J8993L95500M57917K88271M21603N21121
3353C8585983N76381N92948O26964O96641O05029O93948Q40908N95292Q51663
$$ plain form
3344 44665757 45140338 45665622 46519462 47132134 47706338 48025546 48347902 48759883 49152370
3335 49152370 49530667 50090472 50783009 51379665 51852084 52265680 52947578 53683653 53866867
3326 53866867 54108096 54695329 55219303 55727753 56388015 56802541 57552435 58252244 58867801
3317 58867801 59641109 60379683 61417763 61779898 62620078 63545441 64341081 65051573 65895467
3308 65895467 67017799 68014454 68921393 70321873 71363600 72680053 74227840 76052285
3300 76052285 77866992 79770471 81629896 83607698 85928972 88440643 90813418 93509305
3292 93509305 96262873 99092363 101861985 104847398 107594018 110037980 112140699 114251649
3284 114251649 116205737 117803506 119416399 120843368 122349428 123866151 125443026 126960353
$$ packed form
3344D4665757M74581N25284Q53840O12672N74204L19208L22356M11981L92487
3335D9152370L78297N59805O92537N96656M72419M13596O81898P36075J83214
3326E3866867K41229N87233N23974N08450O60262M14526P49894O99809O15557
3317E8867801P73308P38574J038080L62135Q40180R25363P95640P10492Q43894
3308F5895467J122332R96655R06939J400480J041727J316453J547787J824445
3300G6052285J814707J903479J859425J977802K321274K511671K372775K695887
3292I3509305K753568K829490K769622K985413K746620K443962K102719K110950
3284A14251649J954088J597769J612893J426969J506060J516723J576875J517327
$$ plain form
3276 126960353 128404070 129557301 130893455 132322732 133295489 134191221 134802322 134732277 134720515
3267 134720515 134541581 134261242 133444974 132743846 131662561 130805875 129576261 128233902 126840505
3258 126840505 125693639 124314318 123183245 122111208 121015703 119808258 118725243 117803691
3250 117803691 116874653 116091118 115325749 114477429 113747230 113022178 112575546 112047559 111688496
3241 111688496 111643395 111481467 111231955 110425097 109254087 107770012 105952428 103999859 102473136
3232 102473136 100805428 98749649 96933751 94883771 92453726 90032040 87078576 84571660
3224 84571660 81895385 79302397 77196616 74844223 72582477 70800277 69173266 67736931
3216 67736931 66422252 65192560 64148670 63421723 63074760 62572310 61902277 61475177 61119407
$$ packed form
3276A26960353J443717J153231J336154J429277R72757Q95732O11101p0045j1762
3267A34720515j78934k80339q16268p01128j081285q56686j229614j342359j393397
3258A26840505j146866j379321j131073j072037j095505j207445j083015r21552
3250A17803691r29038p83535p65369q48320p30199p25052m46632n27987l59063
3241A11688496m5101j61928k49512q06858j171010j484075j817584j952569j526723
3232A02473136j667708k055779j815898k049980k430045k421686k953464k506916
3224H4571660k676275k592988k105781k352393k261746j782200j627011j436335
3216F7736931j314679j229692j043890p26947l46963n02450o70033m27100l55770
$$ plain form
3207 61119407 60581736 60021983 59555678 58947013 58360278 57636381 56989607 56503890 55839373
3198 55839373 54880702 54020032 53380970 52830173 51926151 50750886 50031456 49067923 48506109
3189 48506109 47513887 46794619 46059685 45091038 44724221 44395571 43982530 43290427 42715044
3180 42715044 42431883 42246227 42052564 41699495 41591389 41620796 41770129 41738199 41460432 41225325
3170 41225325 41462639 41745059 41715764 41841991 41672958 41868555 42076117 42309183 41963385 42298434
3160 42298434 42212644 42182026 42245508 42285413 42645583 43024393 43446864 43852422 44248198 44439174
3150 44439174 44880259 45305189 45762652 46653159 47210854 47642168 48396930 49087704 49925306
3141 49925306 50778892 51631573 52480160 53455000 54316636 55315612 56101341 57163735 57985281
$$ packed form
3207F1119407n37671n59753m66305o08665n86735p23897o46774m85717o64517
3198E5839373r58671q60670o39062n50797r04022j175265p19430r63533n61814
3189D8506109r92222p19268p34934r68647l66817l28650m13041o92103n75383
3180D2715044k83161j85656j93663l53069j08106K9407J49333l1930k77767k35107
3170D1225325K37314K82420k9295J26227j69033J95597K07562K33066l45798L35049
3160D2298434q5790l0618O3482L9905L60170L78810M22471M05558L95776J90976
3150D4439174M41085M24930M57463Q90507N57695M31314P54762O90774Q37602
3141D9925306Q53586Q52681Q48587R74840Q61636R98976P85729J062394Q21546
$$ plain form
3132 57985281 58992636 59992218 61005247 61872396 63196388 64593963 65572178 67092050 68556013
3123 68556013 69851942 71285342 73160806 75193312 77193788 79191180 81593375 84257649
3115 84257649 87582765 90752537 93865341 97244613 100238906 102771678 105082320 106841064
3107 106841064 107740541 107752803 106558336 104510373 101925951 98380982 94261464 89749786
3099 89749786 85170542 80360319 75939726 71376600 67213394 63701785 59936284 57084202
3091 57084202 54300081 51736152 49232836 47284954 45385780 43649843 42258561 40998020
3083 40998020 39460242 38561543 37663072 36626906 35673178 34793474 34231843 33552871 32955380
3074 32955380 32200099 31650666 30954754 30662368 30566257 30380894 29857646 29161446 28933576 28556178
$$ packed form
3132E7985281J007355R99582J013029Q67149J323992J397575R78215J519872J463963
3123F8556013J295929J433400J875464K032506K000476J997392K402195K664274
3115H4257649L325116L169772L112804L379272K994293K532772K310642J758744
3107A06841064Q99477J2262j194467k047963k584422l544969m119518m511678
3099H9749786m579244m810223m420593m563126m163206l511609l765501k852082
3091E7084202k784121k563929k503316j947882j899174j735937j391282j260541
3083D0998020j537778q98699q98471j036166r53728q79704n61631o78972n97491
3074C2955380p55281n49433o95912k92386r6111j85363n23248o96200k27870l77398
$$ plain form
3064 28556178 27817885 27263074 27201436 26914367 26399665 26114690 25774430 25297987 25053679 25142165
3054 25142165 24798596 24583108 24638555 24306407 23973526 23611704 23267087 23151028 22821983 22697883
3044 22697883 22284303 22102012 22040358 21854154 21846314 21696613 21325564 21333389 20927854 20850451
3034 20850451 20856469 20551228 20334357 20145475 20094064 19982979 19746016 19619539 19284738 19084560
3024 19084560 19285330 19185557 19217635 18981476 18683341 18491580 18555272 18428020 18399815 18822467
3014 18822467 18779276 18808329 18668645 18367260 18486895 18738550 18931968 18569477 18766248 18621713
3004 18621713 18544128 18556885 18575091 18588799 18737004 19077712 19090488 18757034 18755058 18563106 18640827
2993 18640827 18761040 18566367 18634118 18517111 18473482 18363978 18596883 18627723 18270081 18424547
$$ packed form
3064B8556178p38293n54811o1638k87069n14702k84975l40260m76443k44308Q8486
3054B5142165l43569k15488N5447l32148l32881l61822l44617j16059l29045j24100
3044B2697883m13580j82291o1654j86204p840j49701l71049P825m05535p7403
3034B0850451O018l05241k16871j88882n1411j11085k36963j26477l34801k00178
3024A9084560K00770r9773L2078k36159k98135j91761O3692j27252k8205M22652
3014A8822467m3191K9053j39684l01385J19635K51655J93418l62491J96771j44535
3004A8621713p7585J2757J8206J3708J48205L40708J2776l33454j976j91952P7721
2993A8640827J20213j94673O7751j17007m3629j09504K32905L0840l57642J54466
$$ plain form
2983 18424547 18489786 18578115 18496168 18994595 19085837 18956822 19226169 19577774 19569572 19409482
2973 19409482 19562596 19807951 19846896 19777374 19777917 19988582 20398568 20582099 20729522 20604704
2963 20604704 20965319 20718942 20919295 21036381 21274110 21549718 21520058 21875021 22096387 22296155
2953 22296155 22604955 22894271 23339811 23527195 23719013 23982275 23895561 24001252 24356813 24420955
2943 24420955 24776887 25108276 25346762 25482405 25791287 26452703 27014295 27382884 27736562
2934 27736562 28195943 28367622 28853103 29229320 29152599 29537598 29804221 30399966 30820112 31190859
2924 31190859 31560042 31818470 32421246 32752304 33110786 33393754 33440830 34300345 34766684 35095077
2914 35095077 36044532 36736508 37106427 37589281 38284161 39040965 40161661 40900106 41641515
$$ packed form
2983A8424547O5239Q8329q1947M98427R1242j29015K69347L51605q202j60090
2973A9409482J53114K45355L8945o9522N43K10665M09986J83531J47423j24818
2963B0604704L60615k46377K00353J17086K37729K75608k9660L54963K21366J99768
2953B2296155L08800K89316M45540J87384J91818K63262q6714J05691L55561O4142
2943B4420955L55932L31389K38486J35643L08882O61416N61592L68589L53678
2934B7736562M59381J71679M85481L76217p6721L84999K66623N95745M20146L70747
2924C1190859L69183K58428O02776L31058L58482K82968M7076Q59515M66339L28393
2914C5095077R49455O91976L69919M82854O94880P56804J120696P38445P41409
$$ plain form
2905 41641515 42654441 43582389 44534074 45526829 46841791 48059303 49485197 51123559 52293432
2896 52293432 53600165 54676076 55689471 56790369 57954741 59353256 60704961 62469690
2888 62469690 64369939 65835609 67934943 70053104 71608521 73623475 76213048 78374460
2880 78374460 80625615 83013961 85187111 87516254 89845369 92450330 95549781 98027220
2872 98027220 100635393 103708263 106770732 109815840 112894798 115947057 118961425 122371971
2864 122371971 125858688 128965827 132219356 135227696 138253474 141480940 145278177 150018582
2856 150018582 155208616 161108403 167496641 173878623 179597613 183727060 186064306 187624532
2848 187624532 189114459 191762900 195595661 201334594 208808684 218225257 230202196 244127531
$$ packed form
2905D1641515J012926R27948R51685R92755J314962J217512J425894J638362J169873
2896E2293432J306733J075911J013395J100898J164372J398515J351705J764729
2888F2469690J900249J465670K099334K118161J555417K014954K589573K161412
2880G8374460K251155K388346K173150K329143K329115K604961L099451K477439
2872I8027220K608173L072870L062469L045108L078958L052259L014368L410546
2864A22371971L486717L107139L253529L008340L025778L227466L797237M740405
2856A50018582N190034N899787O388238O381982N718990M129447K337246J560226
2848A87624532J489927K648441L832761N738933P474090R416573J1976939J3925335
$$ plain form
2840 244127531 260352225 278698489 298297845 317662331 334721085 346104987 348600514
2833 348600514 340944089 324039288 300697561 274471612 248450543 224927530 204479373
2826 204479373 186949882 171902261 159057586 148057222 138491452 129966282 122588666
2819 122588666 116076139 110121850 104883092 100516148 96371846 92795685 89523587 86171952
2811 86171952 82772888 79638043 76831739 74156801 71397620 68709804 66260272 63783179
2803 63783179 61702352 59625516 57676495 55966688 54225823 52118023 50254653 48617227
2795 48617227 46492488 44685972 43515113 41862640 40337141 39273201 38458923 37303681
2787 37303681 36005294 34875538 34033079 32982692 32235834 31633656 30922037 30190244 29606715
$$ packed form
2840B44127531J6224694J8346264J9599356J9364486J7058754J1383902K495527
2833C48600514p656425j6904801k3341727k6225949k6021069k3523013k0448157
2826B04479373j7529491j5047621j2844675j1000364r565770q525170p377616
2819A22588666o512527n954289n238758m366944m144302l576161l272098l351635
2811H6171952l399064l134845k806304k674938k759181k687816k449532k477093
2803F3783179k080827k076836j949021j709807j740865k107800j863370j637426
2795D8617227k124739j806516j170859j652473j525499j063940q14278j155242
2787C7303681j298387j129756q42459j050387p46858o02178p11619p31793n83529
$$ plain form
2778 29606715 29017427 28193971 27517337 26657529 26490697 26250493 25768944 25258415 24686171
2769 24686171 24314140 24208259 23985825 23511330 23204491 22976431 23019242 22728822 22453780 22257051
2759 22257051 21951177 22025928 22020221 21950853 22049384 21976023 21963242 22153631 22083549 22212293 22027494
2748 22027494 21570953 21063855 20526539 20421851 20172905 19724357 19002259 18585611 18171134
2739 18171134 17633282 17146632 17053758 17002393 16818496 16486616 16096215 16114296 16031173 16008155
2729 16008155 15665498 15621549 15577498 15633133 15605011 15243102 14978919 15241157 15347913 15331419
2719 15331419 15575904 15699008 15670400 15487770 15571039 15468418 15475664 15805093 15851050 15915003
2709 15915003 16442423 16810520 16849401 17072669 17053730 17164789 17658247 17696337 17734213 17988648
$$ packed form
2778B9606715n89288q23456o76634q59808j66832k40204m81549n10529n72244
2769B4686171l72031j05881k22434m74495l06839k28060M2811k90420k75042j96729
2759B2257051l05874P4751n707o9368R8531p3361j2781J90389p0082J28744j84799
2748B2027494m56541n07098n37316j04688k48946m48548p22098m16648m14477
2739A8171134n37852m86650r2874n1365j83897l31880l90401J8081q3123k3018
2729A6008155l42657m3949m4051N5635k8122l61909k64183K62238J06756j6494
2719A5331419K44485J23104k8608j82630Q3269j02621P246L29429M5957O3953
2709A5915003N27420L68097L8881K23268j8939J11059M93458L8090L7876K54435
$$ plain form
2699 17988648 18319685 18762310 18895035 18734668 19177875 19441419 19777297 20080937 20160810 20508804
2689 20508804 20807241 20918185 20867472 20637717 20599642 20686500 20328472 19927511 19670623 19367778
2679 19367778 19058714 19062941 19059287 18574022 18021951 17527045 17124518 16463781 15988015 15610796
2669 15610796 15212737 15005591 14422410 13951404 13618783 13542354 13239858 12911228 12469834 12001096
2659 12001096 11982141 11715674 11175429 10884945 10623322 10004041 9868737 9857606 9682223 9377052
2649 9377052 9254100 9158911 9088512 8919446 8674142 8502609 8127746 7846060 7834489 7588567
2639 7588567 7596197 7786563 7685341 7428396 7081108 7028322 6910621 6719841 6632362 6653241
2629 6653241 6537168 6348704 6238299 6383954 6252921 6308911 6116948 6008419 5959878 5871400
$$ packed form
2699A7988648L31037M42625J32725j60367M43207K63544L35878L03640P9873L47994
2689B0508804K98437J10944n0713k29755l8075Q6858l58028m00961k56888l02845
2679A9367778l09064M227l654m85265n52071m94906m02527o60737m75766l77219
2669A5610796l98059k07146n83181m71006l32621p6429l02496l28630m41394m68738
2659A2001096j8955k66467n40245k90484k61623o19281j35304j1131j75383l05171
2649I377052j22952r5189p0399j69066k45304j71533l74863k81686j1571k45922
2639G588567P630J90366j01222k56945l47288n2786j17701j90780q7479K0879
2629F653241j16073j88464j10405J45655j31033N5990j91963j08529m8541q8478
$$ plain form
2619 5871400 5785548 5437591 5371538 5548217 5515760 5481106 5354445 5356580 5307229 5300759 5325417
2608 5325417 5071390 5021097 5030440 5053468 4914667 4561499 4650335 4681056 4860812 4910523 4716914
2597 4716914 4642365 4640023 4719950 4540884 4680827 4930069 4963219 4967173 4711987 4718497 4758841
2586 4758841 4714803 4901484 4816137 4703883 4439175 4240741 4505170 4699624 4806270 4572297
2576 4572297 4715910 4915527 4741730 4784470 4707287 4822466 4776898 4748585 5090226 5123900
2566 5123900 4945771 4992038 4866217 5114384 4960095 4984097 5286713 5314423 5541757 5604982
2556 5604982 5684434 5722281 5920918 6385251 6373385 6246275 6101518 6257535 6280051 5864231
2546 5864231 5797910 5811030 5745426 5388958 4938887 5090659 5028415 5166534 5098614 5234159
$$ packed form
2619E871400q5852l47957o6053J76679l2457l4654j26661K135m9351o470K4658
2608E325417k54027n0293R343K3028j38801l53168Q8836L0721J79756M9711j93609
2597D716914p4549k342P9927j79066J39943K49242L3150L954k55186O510M0344
2586D758841m4038J86681q5347j12254k64708j98434K64429J94454J06646k33973
2576D572297J43613J99617j73797M2740p7183J15179m5568k8313L41641L3674
2566E123900j78129M6267j25821K48167j54289K4002L02616K7710K27334O3225
2556E604982P9452L7847J98637M64333j1866j27110j44757J56017K2516m15820
2546E864231o6321J3120o5604l56468m50071J51772o2244J38119o7920J35545
$$ plain form
2536 5234159 5306437 5431856 5573889 5350918 4970445 5119721 5420088 5286813 5279741 5183913
2526 5183913 5214031 5160676 4924690 4828441 5183771 5102342 4932863 4784677 4666774 4920416
2516 4920416 5058906 4888275 5031998 5454374 5374671 5166741 5128429 4888421 4694042 4488242
2506 4488242 4356328 4235392 4282375 4251089 4080152 3975569 3698774 3732993 3742033 3520883
2496 3520883 3418027 3391788 3221733 3199861 3199853 3269906 3374313 3105044 2852056 2460026 2483429
2485 2483429 2483521 2546868 2847615 2924330 2589421 2551649 2467048 2406507 2430352 2435303 2606943 2519661
2473 2519661 2332560 1920752 2134870 2191507 2036423 2014647 2073351 2263047 2218132 2270195
2463 2270195 2373660 2434231 2217084 2218142 2355740 2504560 2194921 2283021 2317526 2250568 2252253
$$ packed form
2536E234159P2278J25419J42033k22971l80473J49276L00367j33275p072r5828
2526E183913L0118n3355k35986r6249L55330q1429j69479j48186j17903K53642
2516D920416J38490j70631J43723M22376p9703k07930l8312k40008j94379k05800
2506D488242j31914j20936M6983l1286j70937j04583k76795L4219R040k21150
2496C520883j02856k6239j70055k1872qP0053J04407k69269k52988l92030K3403
2485B483429R2O3347L00747P6715l34909l7772q4601o0541K3845M951J71640q7282
2473B519661j87101m11808K14118N6637j55084k1776N8704J89696m4915N2063
2463B270195J03465O0571k17147J058J37598J48820l09639Q8100L4505o6958J685
$$ plain form
2452 2252253 2186124 2057777 1882913 1720926 1686119 1558146 1847870 2116691 2176383 2007318
2442 2007318 2154744 2361082 1911206 2077889 2530570 2141465 2235805 2188662 2104727 2120866
2432 2120866 1948843 2201002 1972749 2167660 1862056 1723549 1680860 1971152 2055483 2009828
2422 2009828 1748472 1756095 1928926 2068417 2192435 1988258 1937556 1996468 1828489 1830164 1576817
2411 1576817 1555684 1884281 2110031 1931857 1926783 2107024 2088511 1907945 1825422 2012691
2401 2012691 1932891 1632469 1540047 1873255 1987967 1931375 1942462 1835408 2054900 2264934
2391 2264934 2039331 2109748 2127481 2159534 2252294 2126690 2458978 2396148 2330765 2381617 2498886
2380 2498886 2277133 1885875 1971046 2066037 2247330 2131027 2092187 2068537 2121102 2157894 2211011
$$ packed form
2452B252253o6129j28347j74864j61987l4807j27973K89724K68821N9692j69065
2442B007318J47426K06338m49876J66683M52681l89105R4340m7143q3935J6139
2432B120866j72023K52159k28253J94911l05604j38507m2689K90292Q4331m5655
2422B009828k61356P623J72831J39491J24018k04177n0702N8912j67979J675k53347
2411A576817k1133L28597K25750j78174n074J80241j8513j80566q2523J87269
2401B012691p9800l00422r2422L33208J14712n6592J1087j07054K19492K10034
2391B264934k25603P0417J7733L2053R2760j25604L32288o2830o5383N0852J17269
2380B498886k21753l91258Q5171R4991J81293j16303l8840k3650N2565L6792N3117
$$ plain form
2369 2211011 2308034 2336080 2295985 2257369 2207189 2299169 2153478 2163508 2261696 2150231 2020226
2358 2020226 2209505 2224077 2429839 1971769 1872254 1907058 1941708 1922713 1952721 1911689 1705485
2347 1705485 1846479 1606223 1724805 1749138 1707049 1478811 1819356 1872591 1777418 1596749
2337 1596749 1720406 1580174 1279829 1426212 1475393 1839567 1406768 1249134 1253066 1369301
2327 1369301 1387378 1413784 1399374 1213796 1219186 1326083 1314185 1509901 1586472 1584398 1460137
2316 1460137 1372428 1438167 1042660 854205 1138945 1476151 1376178 1292472 1227013 1006686
2306 1006686 1044394 1000240 1120420 1467100 1524574 1578660 1449900 1692402 1438672 1407199
2296 1407199 1458350 1719425 1591029 1221570 1445993 1276290 1335484 1312998 1485165 1458927
$$ packed form
2369B211011R7023K8046m0095l8616n0180R1980j45691J0030R8188j11465j30005
2358B020226J89279J4572K05762m58070r9515L4804L4650j8995L0008m1032k06204
2347A705485J40994k40256J18582K4333m2089k28238L40545N3235r5173j80669
2337A596749J23657j40232l00345J46383M9181L64174m32799j57634L932J16235
2327A369301J8077K6406j4410j85578N390J06897j1898J95716P6571k074j24261
2316A460137q7709O5739l95507j88455K84740L37206r9973q3706o5459k20327
2306A006686L7708m4154J20180L46680N7474N4086j28760K42502k53730l1473
2296A407199N1151K61075j28396l69459K24423j69703N9194k2486J72167k6238
$$ plain form
2286 1458927 1270162 1277368 1392327 1097367 907752 1042269 1143981 1329667 1148091 1104982
2276 1104982 862320 829077 1049991 1193840 1178898 1046541 1045865 1022137 1145831 1245496 1065937
2265 1065937 1144810 1283996 995138 876864 1025663 1366934 1226343 1146544 1167726 1046224
2255 1046224 996073 732489 922721 1179082 1256347 1470744 1455373 1035985 1080128 1440386
2245 1440386 1098804 1258445 1430689 1291196 1252980 1246800 1413632 1311817 1248839 1475143
2235 1475143 1412359 1351090 1297174 1377486 1625283 1537255 1251916 1198843 1370737 1394592 1438822
2224 1438822 1341150 1716235 1873654 1790812 1648112 1479337 1511580 1616377 1833178 1976102
2214 1976102 1784323 1717171 1647811 1619569 1517505 1631864 1894522 1955258 1950024 1985463 1998665
$$ packed form
2286A458927j88765P206J14959k94960j89615J34517J01712J85686j81576m3109
2276A104982k42662l3243K20914J43849j4942j32357o76k3728J23694R9665j79559
2265A065937P8873J39186k88858j18274J48799L41271j40591p9799K1182j21502
2255A046224n0151k63584J90232K56361P7265K14397j5371m19388M4143L60258
2245A440386l41582J59641J72244j39493l8216o180J66832j01815o2978K26304
2235A475143o2784o1269n3916Q0312K47797q8028k85339n3073J71894K3855M4230
2224A438822r7672L75085J57419q2842j42700j68775L2243J04797K16801J42924
2214A976102j91779o7152o9360k8242j02064J14359K62658O0736n234L5439J3202
$$ plain form
2203 1998665 1849265 1758051 1971368 2058480 2222363 2119346 2433574 2599743 2465764 2251334
2193 2251334 2399117 2614250 2602995 2674053 2457775 2314453 2291102 2519578 2598739 3028939
2183 3028939 2981570 2594537 2455008 2534921 2484634 2473189 2502033 2729793 2816522 2475219 2518811
2172 2518811 2728375 2659760 2730395 2566471 2503782 2651930 2646748 2821205 3221615 3082709
2162 3082709 2784086 2944821 3129603 3262718 3371843 3501607 3478590 3718077 3730028 3482973
2152 3482973 3620496 3819355 3913153 4010929 4295933 4555716 4628461 4919251 5293157 5304798
2142 5304798 5115071 5385658 6001522 6289783 6330735 6500015 7113522 7264104 7371388 7693143
2132 7693143 8066483 7947592 7810993 8086991 8598011 8646699 8823338 9403181 9808087 10211560
$$ packed form
2203A998665j49400r1214K13317Q7112J63883j03017L14228J66169j33979k14430
2193B251334J47783K15133j1255P1058k16278j43322k3351K28476P9161M30200
2183C028939m7369l87033j39529P9913n0287j1445K8844K27760Q6729l41303M3592
2172B518811K09564o8615P0635j63924o2689J48148n182J74457M00410j38906
2162C082709k98623J60735J84782J33115J09125J29764k3017K39487J1951k47055
2152C482973J37523J98859R3798R7776K85004K59783P2745K90790L73906J1641
2142E304798j89727K70587O15864K88261M0952J69280O13507J50582J07284L21755
2132G693143L73340j18891j36599K75998N11020M8688J76639N79843M04906M03473
$$ plain form
2122 10211560 10943418 11635089 12300159 13038571 14132308 15577267 16810677 18107733 19220066
2113 19220066 19889802 21099405 22751024 24916339 27880950 31865283 37229428 43611679
2105 43611679 51158536 61356598 74970241 94453566 118572567 136434219 125906799
2098 125906799 96869291 72764290 55602813 44375931 36006072 30275424 26282745
2091 26282745 23518515 21195157 19246526 17879593 17317554 16569958 16125029 14933265 13470839
2082 13470839 12068443 11092685 10145284 9599461 8673095 8110373 7789743 7677224 7458902
2073 7458902 7066222 6509040 6064561 5545917 5349601 5148342 4754676 4740486 4670687 4797701
2063 4797701 4599886 4170481 4290664 4104527 3847917 3823237 3608270 3266230 2991532 3232249
$$ packed form
2122A0211560P31858O91671O65070P38412J093737J444959J233410J297056J112333
2113A9220066O69736J209603J651619K165315K964611L984333N364145O382251
2105D3611679P546857J0198062J3613643J9483325K4119001J7861652j0527420
2098A25906799k9037508k4105001j7161477j1226882q369859n730648l992679
2091B6282745k764230k323358j948631j366933n62039p47596m44929j191764j462426
2082A3470839j402396r75758r47401n45823r26366n62722l20630j12519k18322
2073G458902l92680n57182m44479n18644j96316k01259l93666j4190o9799J27014
2063D797701j97815m29405J20183j86137k56610k4680k14967l42040k74698K40717
$$ plain form
2053 3232249 3195419 2977016 2991625 2781080 2671210 2831290 2588719 2473947 2452478 2317821
2043 2317821 2063349 2055548 2205430 2010060 1866367 2104109 2077866 2024316 2049521 1800998
2033 1800998 1761603 1821966 1558782 1588193 1610038 1529740 1677750 1726953 1692838 1402762 1367370
2022 1367370 1532368 1207366 1327694 1380396 1192965 902917 829460 819926 867862 906766 749463
2011 749463 818492 1271848 890422 1188427 1128594 821924 675548 895817 970395 543378
2001 543378 412456 359760 697600 618618 840036 634217 537406 707226 895247 744020
1991 744020 658833 844123 525593 522151 657195 345639 351810 406485 380893 493674 275729
1980 275729 391386 437308 754546 958460 871628 878074 645878 530387 665174 507540
$$ packed form
2053C232249l6830k18403J4609k10545j09870J60080k42571j14772k1469j34657
2043B317821k54472p801J49882j95370j43693K37742k6243n3550K5205k48523
2033A800998l9395O0363k63184K9411K1845q0298J48010M9203l4115k90076l5392
2022A367370J64998l25002J20328N2702j87431k90048p3457r534M7936L8904j57303
2011G49463O9029M53356l81426K98005n9833l06670j46376K20269P4578m27017
2001E43378j30922n2696L37840p8982K21418k05819r6811J69820J88021j51227
1991G44020q5187J85290l18530l442J35044l11556O171N4675k5592J12781k17945
1980B75729J15657M5922L17238K03914q6832O446k32196j15491J34787j57634
$$ plain form
1970 507540 638652 540141 575275 824312 532542 148645 126444 404911 610149 570638
1960 570638 400795 327872 299619 563000 902629 805099 362378 134719 384825 406338
1950 406338 310910 398013 505251 458831 431146 358727 248598 260148 437751 340126 449359
1939 449359 436642 371065 481955 524434 496887 372412 418388 278771 268924 40566 -18017
1928 -18017 247014 366203 240616 200246 118807 292567 194478 342099 257621 117410 136926
1917 136926 284726 333015 338456 438734 568412 478853 503703 274554 83425 363884 660184
1906 660184 399625 342954 355982 196466 167851 91568 16044 54615 30036 63025 262178
1895 262178 482128 596615 520912 194226 125077 243508 291192 367384 270139 260186 214160
$$ packed form
1970E07540J31112r8511L5134K49037k91770l83897k2201K78467K05238l9511
1960E70638j69843p2923k8253K63381L39629r7530m42721k27659K50106K1513
1950D06338r5428Q7103J07238m6420k7685p2419j10129J1550J77603r7625J09233
1939D49359j2717o5577J10890M2479k7547j24475M5976j39617r847k28358n8583
1928a8017K65031J19189j25587m0370q1439J73760r8089J47621q4478j40211J9516
1917A36926J47800M8289N441J00278J29678q9559K4850k29149j91129K80459K96300
1906F60184k60559n6671J3028j59516k8615p6283p5524L8571k4579L2989J99153
1895B62178K19950J14487p5703l26686o9149J18431M7684P6192r7245r953m6026
$$ plain form
1884 214160 46042 360176 222868 8704 230225 271202 8106 153292 258059 169157
1874 169157 422456 139780 187164 -98442 111527 76277 162468 291100 272404 19512
1864 19512 -223733 31915 176106 126683 179004 133254 225453 203791 276399 383626 474549
1853 474549 564111 71054 232119 298562 121607 141675 65683 94807 -86088 -106739 141351
1842 141351 44371 142696 115391 6371 246878 417113 63452 129952 395515 602095
1832 602095 785921 638357 728921 1146088 1070424 700563 707576 433526 380919 129718 -120
1821 -120 80696 72737 347498 487927 325261 254690 233605 264257 79572 54848 -61808
1810 -61808 -309157 -157530 -5266 20871 58456 348896 323257 361476 214721 -114378 -159453
$$ packed form
1884B14160j68118L14134j37308k14164K21521M0977k63096J45186J04767q8902
1874A69157K53299k82676M7384k85606K09969l5250Q6191J28632j8696k52892
1864A9512k43245K55648J44191m9423N2321m5750R2199k1662P2608J07227R0923
1853D74549Q9562m93057J61065O6443j76955K0068p5992K9124j80895k0651K48090
1842A41351r6980R8325k7305j09020K40507J70235l53661O6500K65563K06580
1832F02095J83826j47564R0564M17167p5664l69861P013k74050n2607k51201j29838
1821a20Q0816p959K74761J40429j62666p0571k1085L0652j84685k4724j16656
1810f1808k47349J51627J52264K6137L7585K90440k5639L8219j46755l29099m5075
$$ plain form
1799 -159453 -47942 228209 -25854 -203126 141181 76505 11063 247912 23334 123566
1789 123566 83579 -7078 65568 -9974 170732 -39128 -33473 -177000 -318101 -103190 -301569
1778 -301569 -286042 -141121 103706 121618 -51793 127136 62173 25464 77575 -175403 -25135
1767 -25135 119158 -158236 -157311 -68879 -73399 -191142 -151654 82516 120818 251099 184024
1756 184024 72698 -36536 -173321 -143765 -78028 -236380 -62802 15120 5768 -150729 -154824
1745 -154824 211827 203623 52499 127937 466426 379965 175746 55173 60967 29358 53514
1734 53514 78678 223970 361966 127380 -189491 -112360 -237897 32699 139344 11957
1724 11957 59987 154122 262622 33896 -127786 -61198 -137443 252551 269180 -86172 -23231
$$ packed form
1799a59453J11511K76151k54063j77272L44307o4676o5442K36849k24578J00232
1789A23566l9987r0657P2646p5542J80706k09860N655j43527j41101K14911j98379
1778c01569J5527J44921K44827J7912j73411J78929o4963l6709N2111k52978J50268
1767b5135J44293k77394R25Q8432m520j17743L9488K34170L8302J30281o7075
1756A84024j11326j09234j36785K9556O5737j58352J73578P7922r352j56497m095
1745a54824L66651q204j51124P5438L38489q6461k04219j20573N794l1609K4156
1734E3514K5164J45292J37996k34586l16871P7131j25537K70596J06645j27387
1724A1957M8030R4135J08500k28726j61682O6588p6245L89994J6629l55352O2941
$$ plain form
1713 -23231 -202040 10300 327870 148198 77934 207167 364295 358425 215294 171059 156469
1702 156469 -153006 -124742 -224530 -280260 -86770 14493 16770 9471 237946 110075 -11874
1691 -11874 6167 128995 -47939 -43457 128317 168527 -14571 63875 166510 11213 49253
1680 49253 131758 255462 66315 113661 61381 50028 145827 -158970 -122347 -19760 2816
1669 2816 -49619 -149135 38788 290677 -48275 -4716 -42981 106651 151144 -195664 -195598 -36182
1657 -36182 -305385 -274577 -99566 -52890 -1563 -183160 -200304 -20897 91205 -90730 -61536
1646 -61536 -37373 210220 292943 321742 293186 434718 470907 198142 -46233 -55933 -90544
1635 -90544 -248680 162868 11740 -128879 235680 173410 -101562 234502 307013 -150840
$$ packed form
1713b3231j78809K12340L17570j79672p0264J29233J57128n870j43131m4235j4590
1702A56469l09475K8264r9788n5730J93490J01263K277p299K28475j27871j21949
1691a1874J8041J22828j76934M482J71774M0210j83098P8446J02635j55297L8040
1680D9253Q2505J23704j89147M7346n2280j1353R5799l04797L6623J02587K2576
1669B816n2435r9516J87923K51889l38952M3559l8265J49632M4493l46808O6J59416
1657c6182k69203L0808J75011M6676N1327j81597j7144J79407J12102j81935K9194
1646f1536K4163K47593Q2723K8799k8556J41532L6189k72765k44375r700l4611
1635i0544j58136M11548j51128j40619L64559o2270k74972L36064P2511m57853
$$ plain form
1625 -150840 -48109 117823 183504 -31079 182058 109422 40848 -92654 155844 44183
1615 44183 304198 137939 -19351 141108 177029 249207 131767 161768 -24203 -178516
1605 -178516 -206815 166756 207559 -82788 -79694 42076 -205655 -319710 -146230 -300798
1595 -300798 -266868 -152770 -16303 137728 -155516 118886 300081 450017 36821 86234
1585 86234 271163 237807 -94889 90609 208486 33284 -19481 18853 -189617 -98453 97746
1574 97746 21793 -42435 -122545 -62801 -69866 38266 87216 -1241 132004 3943 118829
1563 118829 185713 -167591 -46589 53238 -180933 -122910 -69899 -9020 180237 27014 -65372
1552 -65372 120434 -82466 106881 37272 -72062 67583 -192657 42724 -56224 -155524
$$ packed form
1625a50840J02731J65932O5681k14583K13137p2636o8574j33502K48498j11661
1615D4183K60015j66259j57290J60459L5921P2178j17440L0001j85971j54313
1605a78516k8299L73571M0803k90347L094J21770k47731j14055J73480j54568
1595c00798L3930J14098J36467J54031k93244K74402J81195J49936m13196M9413
1585H6234J84929l3356l32696J85498J17877j75202n2765L8334k08470R1164J96199
1574I7746p5953o4228q0110N9744p065J08132M8950q8457J33245j28061J14886
1563A18829O6884l53304J21002R9827k34171N8023N3011O0879J89257j53223r2386
1552f5372J85806k02900J89347o9609j09334J39645k60240K35381r8948r9300
$$ plain form
1542 -155524 -104463 -333215 -481541 -157970 -138293 -78860 -115437 -96036 -35790 -31098 -75182
1531 -75182 -275094 -464266 -281781 -157190 -326479 -344126 -231584 16524 120760 169799
1521 169799 384725 207392 -210475 -167116 -220881 -192085 128222 125702 -3547 -203409 -40822
1510 -40822 233956 153764 244670 377757 111007 256703 231474 -301587 -200552 -153222 -283955
1499 -283955 -72412 -295353 -259144 -232430 -85891 142169 206973 61447 -101371 -136460
1489 -136460 -217568 -118707 -51778 -28745 -25435 94213 89406 -52874 124113 -55434 -7277
1478 -7277 73239 -33420 -8016 -184633 -248961 -46269 -58149 -253328 -3436 50650 938
1467 938 -59386 66725 73987 -111972 -62327 -87390 -225821 -132946 -267150 -185233 -57626
$$ packed form
1542a55524N1061k28752j48326L23571J9677N9433l6577J9401O0246M692m4084
1531g5182j99912j89172J82485J24591j69289j7647J12542K48108J04236M9039
1521A69799K14926j77333m17867M3359n3765K8796L20307k520j29249j99862J62587
1510d0822K74778q0192R0906J33087k66750J45696k5229n33061J01035M7330j30733
1499b83955K11543k22941L6209K6714J46539K28060O4804j45526j62818l5089
1489a36460q1108R8861O6929K3033L310J19648m807j42280J76987j79547M8157
1478g277Q0516j06659K5404j76617o4328K02692j1880j95179K49892N4086m9712
1467I38o0324J26111P262j85959M9645k5063j38431R2875j34204Q1917J27607
$$ plain form
1456 -57626 -41986 189253 206268 101231 2033 85152 344423 180458 67999 -73583 -161452
1445 -161452 -170205 -72648 15851 -191919 -118595 -91345 -252658 -274980 -109357 167566 246313
1434 246313 -226689 -116802 -58983 -313248 -407958 -144773 -43010 -98155 -207172 -273421
1424 -273421 -220115 101120 -144557 -444681 -229774 -383862 -22564 54441 12992 1605
1414 1605 -197248 -79127 83236 -21872 -154782 132442 210692 93263 300156 450893
1404 450893 221649 250186 273038 435695 368568 221684 -73291 -312957 382044 335770
1394 335770 169133 165896 80329 -39866 -93777 -385620 -225254 -115092 -113559 34463 83833
1383 83833 116931 -90291 -192762 -78274 -96445 -238673 -232193 -70836 12812 -66412 -51522
$$ packed form
1456e7626J5640K31239J7015j05037r9198Q3119K59271j63965j12459j41582q7869
1445a61452q753R7557Q8499k07770P3324K7250j61313k2322J65623K76923P8747
1434B46313m73002J09887N7819k54265r4710K63185J01763n5145j09017o6249
1424b73421N3306L21235k45677l00124K14907j54088L61298P7005m1449j1387
1414A605j98853J18121J62363j05108j32910K87224P8250j17429K06893J50737
1404D50893k29244K8537K2852J62657o7127j46884k94975k39666O95001m6274
1394C35770j66637l237q5567j20195n3911k91843J60366J10162J533J48022M9370
1383H3833L3098k07222j02471J14488j8171j42228O480J61357Q3648p9224J4890
$$ plain form
1372 -51522 23805 69325 171064 68321 -104722 -120766 62283 -98796 -304372 -120260
1362 -120260 -3058 57812 -55222 -280307 -91781 144443 92695 92425 59541 33023 23844
1351 23844 -95942 -85202 -119738 -324005 -87387 -1545 36160 76507 264740 351247 286796
1340 286796 231762 35975 251367 160504 243223 -30360 -110401 -129840 61267 -33031 -69029
1329 -69029 214432 97151 52366 391944 352042 201159 134742 -144679 -126810 -46361 7425
1318 7425 -56063 17091 -230151 -319561 -361785 -314747 -226563 -209701 -260764 -197705 -62894 8780
1306 8780 134444 -66081 -229618 -185748 -84165 177258 -217190 -235022 42351 27397 -137156
1295 -137156 -222375 -209349 -226967 -484507 -355219 -299521 -369792 -199362 -223239 -106613 -420942
$$ packed form
1372e1522P5327M5520J01739j02743j73043j6044J83049j61079k05576J84112
1362a20260J17202O0870j13034k25085J88526K36224n1748k70l2884k6518r179
1351B3844j19786J0740l4536k04267K36618Q5842L7705M0347J88233Q6507o4451
1340B86796n5034j95787K15392r0863Q2719k73583q0041j9439J91107r4298l5998
1329f9029K83461j17281m4785L39578l9902j50883o6417k79421J7869Q0449N3786
1318G425o3488P3154k47242q9410m2224M7038Q8184J6862n1063O3059J34811P1674
1306H780J25664k00525j63537M3870J01583K61423l94448j7832K77373j4954j64553
1295a37156q5219J3026j7618k57540J29288N5698p0271J70430k3877J16626l14329
$$ plain form
1284 -420942 -276036 -126698 -146824 -45052 -100253 42193 118381 349899 11179 -160490
1274 -160490 -63770 -194881 -1665 93757 -80143 -146847 -189676 96987 -6656 100811
1264 100811 86167 -99602 90799 126460 30744 165652 60313 53167 62425 66238 -140309
1253 -140309 -381613 -213679 16607 281732 284413 -18273 18614 155562 132134 258476
1243 258476 61120 -364051 16157 116506 65091 -53210 -28253 -15012 -107654 82152
1233 82152 -126963 -176683 -143591 -228064 -168205 -126568 -388862 -343383 -174288 -169316 23929
1222 23929 16366 -65635 6824 26677 203875 63022 -224360 -374529 -98604 1287 113502
1211 113502 77862 36701 -89711 -183210 -373821 -262114 -231313 -306140 69886 207699 -83299
$$ packed form
1284d20942J44906J49338k0126J01772n5201J42446P6188K31518l38720j71669
1274a60490R6720j31111J93216R5422j73900o6704m2829K86663j03643J07467
1264A00811j4644j85769J90401L5661r5716J34908j05339p146R258L813k06547
1253a40309k41304J67934K30286K65125K681l02686L6887J36948k3428J26342
1243B58476j97356m25171L80208J00349n1415j18301K4957J3241r2642J89806
1233H2152k09115m9720L3092q4473N9859M1637k62294M5479J69095M972J93245
1222B3929p563q2001P2459J9853J77198j40853k87382j50169K75925R9891J12215
1211A13502l5640m1161j26412r3499j90611J11707L0801p4827L76026J37813k90998
$$ plain form
1200 -83299 -60040 -28781 2113 -338150 -226152 -12699 -152389 26998 119788 -166990 -117461
1189 -117461 151931 94820 -272185 -443650 -303665 -185363 -354926 -298556 -533015 -279898
1179 -279898 -354301 -150075 223214 237431 67123 -23651 -147398 -336260 -122721 79194
1169 79194 162560 -312458 -240190 -95648 -31030 -63178 -45 -91276 6528 166385 110694
1158 110694 13742 -213167 -121640 130679 -224203 -164337 106634 36314 42869 278781 95344
1147 95344 -21417 -86466 -79344 -268212 -190652 -141359 -212396 -380645 -456159 -570141 -448694
1136 -448694 -248889 -220762 -8639 -185555 -22687 -101878 -315903 -13968 -92344 -7265
1126 -7265 -112742 -277499 -147027 -42382 -200003 -47228 -2223 -12345 33154 -127553 -243915
$$ packed form
1200h3299K3259L1259L0894l40263J11998K13453j39690J79387R2790k86778M9529
1189a17461K69392n7111l67005j71465J39985J18302j69563N6370k34459K53117
1179b79898p4403K04226L73289J4217j70308r0774j23747j88862K13539K01915
1169G9194Q3366m75018P2268J44542O4618l2148O3133r1231R7804J59857n5691
1158A10694r6952k26909R1527K52319l54882N9866K70971p0320O555K35912j83437
1147I5344j16761o5049P122j88868P7560M9293p1037j68249p5514j13982J21447
1136d48694J99805K8127K12123j76916J62868p9191k14025L01935p8376Q5079
1126g265j05477j64757J30472J04645j57621J52775M5005j0122M5499j60707j16362
$$ plain form
1115 -243915 -398638 -64716 48748 163441 279971 -203978 -312524 -66095 36486 -75842
1105 -75842 -252247 -166351 14804 67543 280801 212284 -95669 87585 81001 110404 -46921
1094 -46921 199969 207648 -11552 -183323 -107287 150178 85066 108030 -103486 -47429 -125793
1083 -125793 -293938 4664 -190554 -230940 -391951 -340127 -427434 -474902 -212856 -254160 -443908
1072 -443908 -377134 -67680 -350324 -592024 -61703 19746 -103195 -68565 -98199 -211061
1062 -211061 -22464 -94537 24628 135088 7408 -24353 -74265 -89065 -14484 1755 -148892
1051 -148892 -102269 -224084 -178071 50129 -26502 -56227 96972 110368 20813 56267 120344
1040 120344 46599 218765 244826 135317 -178191 218842 170740 59746 143883 27178
$$ packed form
1115b43915j54723L33922J13464J14693J16530m83949j08546K46429J02581j12328
1105g5842j76405Q5896J81155N2739K13258o8517l07953J83254o584K9403j57325
1094d6921K46890P679k19200j71771P6036K57465o5112K2964k11516N6057p8364
1083a25793j68145K98602j95218m0386j61011N1824q7307m7468K62046m1304j89748
1072d43908O6774L09454k82644k41700N30321Q1449j22941L4630k9634j12862
1062b11061J88597p2073J19165J10460j27680l1761m9912j4800P4581J6239j50647
1051a48892M6623j21815M6013K28200p6631k9725J53199J3396q9555L5454O4077
1040A20344p3745J72166K6061j09509l13508L97033m8102j10994Q4137j16705
$$ plain form
1030 27178 -128910 -109198 126680 104955 -28165 -58265 -111760 38988 -112391 -284506 -236097
1019 -236097 -25318 53973 175372 104830 27667 -139890 -54121 -224735 -309017 -120118 -243886
1008 -243886 -167224 117243 -115990 -104435 -102443 -76597 102523 -244464 -139946 -159448 -428
997 -428 104197 28600 -99147 -92248 -22580 -29006 -42019 108950 -147130 -178580 68896 -44527
985 -44527 -115465 50764 -109875 -254087 -83926 -150495 -39216 -118871 10008 33964 184833
974 184833 174268 -41429 101926 117138 155508 108919 -3458 125625 170677 -58714 -185411
963 -185411 -34112 86830 50077 153479 19692 -205705 -328413 -14314 -145162 -41046
953 -41046 230410 250 -88806 -49445 50278 -96941 -328361 -484948 -191408 173443 220262
$$ packed form
1030B7178j56088J9712K35878k1725j33120l0100n3495J50748j51379j72115M8409
1019b36097K10779P9291J21399p0542p7163j67557Q5769j70614q4282J88899j23768
1008b43886P6662K84467k33233J1555J992K5846J79120l46987J04518j9502J59020
997d28J04625p5597j27747O899O9668o426j3013J50969k56080l1450K47476j13423
985d4527p0938J66229j60639j44212J70161o6569J11279p9655J28879K3956J50869
974A84833j0565k15697J43355J5212L8370m6589j12377J29083M5052k29391j26697
963a85411J51299J20942l6753J03402j33787k25397j22708L14099j30848J04116
953d1046K71456k30160q9056L9361R9723j47219k31420j56587K93540L64851M6819
$$ plain form
942 220262 -129623 -79369 338628 126585 13840 -106000 166311 203918 383159 136470
932 136470 -35222 64983 -92492 -60633 -160663 -331558 -260600 -77350 195387 144171
922 144171 -117537 -52313 144661 32419 153143 123626 -57941 -30983 -113180 -112181 107011
911 107011 102371 124773 219070 33719 174012 282008 108116 27168 165620 195699 129415
900 129415 200745 -25546 152305 385539 36700 -19700 1398 59960 252023 80665 -44463
889 -44463 -21184 -119014 43458 -14310 37588 -103956 -164312 -204905 -141092 -50501 34342 -28626
877 -28626 64962 141567 -82157 -187319 -19519 325440 271469 93250 67714 252756 309899
866 309899 283954 147560 70052 113173 257803 85084 -300466 -218271 -167994 -77041 -86078
$$ packed form
942B20262l49885N0254M17997k12043j12745j19840K72311L7607J79241k46689
932A36470j71692J00205j57475L1859j00030j70895P0958J83250K72737n1216
922A44171k61708O5224J96974j12242J20724k9517j81567K6958q2197R99K19192
911A07011m640K2402R4297j85351J40293J07996j73892q0948J38452L0079o6284
900A29415P1330k26291J77851K33234l48839n6400K1098N8562J92063j71358j25128
889d4463K3279r7830J62472n7768N1898j41544o0356m0593O3813R0591Q4843o2968
877b8626R3588P6605k23724j05162J67800L44959n3971j78219k5536J85042N7143
866C09899k5945j36394p7508M3121J44630j72719l85550Q2195N0277R0953r037
$$ plain form
855 -86078 -119184 -110524 92521 223925 129973 -84619 -31497 -65403 30653 -127218 -200844
844 -200844 13082 -42394 -169804 -244194 83454 -121848 -330481 -275847 -417264 -302488
834 -302488 -207515 19603 49953 222844 48328 23858 241828 15846 56336 -245007 -103601
823 -103601 29493 -107255 -146023 16908 -103583 37509 343920 -107745 -138575 -25274
813 -25274 48861 -107138 23838 284233 167583 256712 86146 158184 127080 57100 17387
802 17387 -75143 -205659 -102173 204813 204110 259345 179883 -186826 24217 -114023 -419808
791 -419808 -414246 -362253 225683 31323 -73948 -261047 -15618 201576 110726 178121 230778
780 230778 339613 320429 236705 196129 14527 30971 65525 169009 95310 -290533 -396652
$$ packed form
855h6078l3106Q660K03045J31404r3952k14592N3122l3906R6056j57871p3626
844b00844K13926n5476j27410p4390L27648k05302k08633N4634j41417J14776
834c02488R4973K27118L0350J72891j74516k4470K17970k25982M0490l01343J41406
823a03601J33094j36748l8768J62931j20491J41092L06411m51665l0830J13301
813b5274P4135j55999J30976K60395j16650Q9129j70566P2038l1104o9980l9713
802A7387r2530j30516J03486L06986p03N5235p9462l66709K11043j38240l05785
791d19808N562N1993N87936j94360j05271j87099K45429K17194r0850O7395N2657
780B30778J08835j9184q3724m0576j81602J6444L4554J03484p3699l85843j06119
$$ plain form
769 -396652 -207244 10833 -73956 -229885 -303224 -57453 134133 374087 258084 -110350
759 -110350 135720 45928 -248435 -128683 -77733 -153888 -138478 -132021 -99378 138415 85750
748 85750 175574 351692 87416 -126390 -65844 -92167 281784 78505 -176794 18582 -140113
737 -140113 -135528 -239366 -60214 61117 33467 54221 -262591 -294043 -67415 -179971 -43599
726 -43599 230229 -83961 -100632 -27394 4081 249586 174116 -67053 -344839 -436143 -235298
715 -235298 -90460 -308468 -452566 -69026 -268915 -351782 -142587 209643 -10661 30391
705 30391 214665 152333 23934 61532 241755 -59266 20175 -73949 4363 -21444 36874
694 36874 40740 -95566 -9849 -141023 -198876 -212168 38319 84189 -67891 -232317 28190
$$ packed form
769c96652J89408K18077q4789j55929p3339K45771J91586K39954j16003l68434
759a10350K46070q9792k94363J19752N0950p6155J5410O457L2643K37793n2665
748H5750Q9824J76118k64276k13806O0546k6323L73951k03279k55299J95376j58695
737a40113M585j03838J79152J21331k7650K0754l16812l1452K26628j12556J36372
726d3599K73828l14190j6671P3238L1475K45505p5470k41169k77786r1304K00845
715b35298J44838k18008j44098L83540j99889q2867K09195L52230k20304M1052
705C0391J84274o2332j28399L7598J80223l01021P9441r4124P8312k5807N8318
694C6874L866j36306Q5717j31174n7853j3292K50487M5870j52080j64426K60507
$$ plain form
683 28190 231996 -47621 90719 -51761 -112389 104440 -89925 132567 175188 66336
673 66336 -267311 -399055 -72115 -112819 -125679 -137713 -119196 254289 115182 196037 292251
662 292251 106966 87074 82341 -12319 -73241 -15788 149298 49834 132823 -49985 -106630
651 -106630 79951 116008 65164 -230414 -266543 -82623 -33000 -55693 72738 120489 112620
640 112620 -149399 -129690 -100594 -86948 150947 106370 180871 153464 -1757 162597 -65856
629 -65856 83798 2612 -57418 141476 -176162 46033 -37977 -252140 -150166 -81136 14114
618 14114 88499 276192 144002 464919 137716 93782 -143142 8654 174949 230350 303729
607 303729 72120 -55504 -178947 15856 148854 320858 277572 70641 19191 -102456
$$ packed form
683B8190K03806k79617J38340j42480o0628K16829j94365K22492M2621j08852
673F6336l33647j31744L26940m0704j2860j2034J8517L73485j39107Q0855R6214
662B92251j85285j9892m733r4660o0922N7453J65086r9464Q2989j82808n6645
651a06630J86581L6057n0844k95578l6129J83920M9623k2693J28431M7751p869
640A12620k62019J9709K9096J3646K37895m4577P4501k7407j55221J64354k28453
629f5856J49654q1186o0030J98894l17638K22195q4010k14163J01974O9030R5250
618A4114P4385J87693j32190L20917l27203m3934k36924J51796J66295N5401P3379
607C03729k31609j27624j23443J94803J32998J72004m3286k06931n1450j21647
$$ plain form
597 -102456 -64404 71063 -21404 -397213 -250130 -130947 -24559 54877 154744 114053 -216001
586 -216001 -98439 -296919 -222621 60784 -131615 -180935 -253090 -157586 -149964 -1322 -161406
575 -161406 -16139 169597 -145441 -73359 -260140 -253492 -389936 -135864 299289 65112
565 65112 -221387 -260484 76913 -16886 125144 97900 7631 -176876 -110145 -189883 -212634
554 -212634 -202815 -150617 6845 -470049 -231587 72313 -55070 -277502 8894 10159 14960
543 14960 -72065 -176302 -122934 2835 -79588 -161831 -68090 -196511 -197497 113114 7042
532 7042 31088 95847 -123439 -8548 51437 104622 -11076 -337098 -63748 169418 253465
521 253465 182001 359232 419930 104477 46747 228692 99510 157050 126450 280016 124390
$$ packed form
597a02456L8052J35467r2467l75809J47083J19183J06388P9436R9867m0691l30054
586b16001J17562j98480P4298K83405j92399m9320p2155R5504P622J48642j60084
575a61406J45267J85736l15038P2082j86781O648j36444K54072M35153k34177
565F5112k86499l9097L37397r3799J42030k7244r0269j84507O6731p9738k2751
554b12634R819N2198J57462m76894K38462L03900j27383k22432K86396J265M801
543A4960q7025j04237N3368J25769q2423q2243R3741j28421r86L10611j06072
532G042K4046O4759k19286J14891N9985N3185j15698l26022K73350K33166Q4047
521B53465p1464J77231O0698l15453n7730J81945j29182N7540l0600J53566j55626
$$ plain form
510 124390 52231 200714 177309 -147413 112949 23211 -121775 155713 162681 79322 9334
499 9334 145492 9286 -166460 -426500 -121328 188419 10986 77708 214652 -252231
489 -252231 -80869 56629 -33289 141512 168829 -124511 -50272 305345 315415 172037 71382
478 71382 -187069 -251309 -7334 -28226 17275 232695 299444 131745 74561 64226 52121
467 52121 -85162 23812 129303 295969 149931 4038 231588 161214 -177755 -120352
457 -120352 22261 -118587 -108517 -213626 -391728 -128001 -42881 -80149 -96419 92117 67388
446 67388 24432 -162630 -216231 -4767 333446 266173 34585 -128708 -69175 -16600 68391
435 68391 255115 364676 464195 125390 7398 -50922 42386 -175116 242690 256528 17029
$$ packed form
510A24390p2159J48483k3405l24722K60362q9738j44986K77488O968q3359o9988
499I334J36158j36206j75746k60040L05172L09747j77433O6722J36944m66883
489b52231J71362J37498q9918J74801K7317k93340P4239L55617J0070j43378j00655
478G1382k58451o4240K43975k0892M5501K15420O6749j67699n7184j0335j2105
467E2121j37283J08974J05491J66666j46038j45893K27550p0374l38969N7403
457a20352J42613j40848J0070j05109j78102K63727Q5120l7268j6270J88536k4729
446F7388m2956j87062n3601K11464L38213o7273k31588j63293N9533N2575Q4991
435F8391J86724J09561R9519l38805j17992n8320R3308k17502M17806J3838k39499
$$ plain form
424 17029 -131927 -165747 -99126 -76913 -81302 64749 426844 425160 8069 -170060 11881
413 11881 160972 -14516 114088 83464 -220769 -142234 -114105 89062 193245 66584 -28014
402 -28014 -77708 38648 -180075 3104 -207802 -222424 -272296 -201912 -25417 -62174 119814
391 119814 24178 -301930 -373006 -132287 -48450 86411 50386 -87745 -239310 -221306 14999
380 14999 63251 -119912 -169033 -280974 -285134 112188 -105399 -253858 -219759 124740 -62393
369 -62393 -306543 -224830 -122152 -116026 -309359 -195712 -231610 -324068 -267340 -169135 -181524
358 -181524 -66796 272078 366625 161334 76961 -44263 -141661 10407 3480 -149229 -100599
347 -100599 73283 16538 -154604 40994 -63870 -94517 -449914 -384300 -50363 -12722 27309
$$ packed form
424A7029j48956l3820O6621K2213m389J46051L62095j684m17091j78129J81941
413A1881J49091j75488J28604l0624l04233P8535K8129K03167J04183j26661r4598
402b8014m9694J16356k18723J83179k10906j4622m9872P0384J76495l6757J81988
391A19814r5636l26108p1076K40719Q3837J34861l6025j38131j51565J8004K36305
380A4999M8252j83163m9121j11941m160L97322k17587j48459L4099L44499j87133
369f2393k44150Q1713J02678O126j93333J13647l5898r2458N6728R8205j2389
358a81524J14728L38874R4547k05291q4373j21224r7398J52068o927j52709M8630
347a00599J73882n6745j71142J95598j04864l0647l55397O5614L33937L7641M0031
$$ plain form
336 27309 -47193 -163416 -50223 12611 2338 107151 146979 -79154 -4383 -29011 -3796
325 -3796 -145706 -205757 -99651 -277124 -167990 -145813 90756 68622 -39105 -62997 1034
314 1034 -60197 -199798 -251565 -265529 -97329 -62339 153585 76465 -175361 -250451 -93069
303 -93069 20159 -120002 -220452 -87247 -102249 125271 115274 146200 -100176 -385705 -269391
292 -269391 -268100 -528874 -381085 -215986 -166670 -72899 -164746 21695 -274933 -342693 -261830
281 -261830 -473311 -242322 43404 -49285 21035 117563 -3876 19582 -228071 -269905 -178807
270 -178807 -117985 -41912 -41192 -104738 121153 344603 346072 259086 290148 68686 -27898 134636
258 134636 93618 -37634 -205493 -228918 -151905 -36145 194865 -129647 -101657 -53596 -154261
$$ packed form
336B7309p4502j16223J13193O2834j0273J04813L9828k26133P4771k4628K5215
325c796j41910o0051J06106j77473J09134K2177K36569k2134j07727k3892O4031
314A034o1231j39601n1767j3964J68200L4990K15924p7120k51826p5090J57382
303i3069J13228j40161j00450J33205j5002K27520r997L0926k46376k85529J16314
292b69391J291k60774J47789J65099M9316R3771r1847J86441k96628o7760Q0863
281b61830k11481K30989K85726r2689P0320R6528j21439K3458k47653m1834R1098
270a78807O0822P6073P20o3546K25891K23450J469q6986L1062k21462r6584J62534
258A34636m1018j31252j67859k3425P7013J15760K31010l24512K7990M8061j00665
$$ plain form
247 -154261 -109943 -47669 -210348 -331632 -332661 -34954 28952 -122218 -105315 -284121 -302733
236 -302733 -193077 26509 903 228857 262370 236687 133087 88175 -5817 25147 -196712
225 -196712 -306656 -193835 57920 -12102 -6851 -186132 -97586 -1017 -255040 -150627 -6659
214 -6659 -75077 -85690 -161084 -13397 -142434 -171900 -206873 -242650 -74464 -103211 -125347 -34515
202 -34515 -85539 71776 64266 -12778 -245831 -492718 -538163 -533772 -244082 -223615 -443934
191 -443934 -313514 -138134 -13910 -11478 52060 -348046 -447285 -304693 -185965 -186818 -280369
180 -280369 -54657 156980 221834 137896 -75760 89935 327853 195365 268068 184048 261050
169 261050 34113 44629 -195936 -98853 -74221 61223 -168732 -184588 -27133 -63015 -309890
$$ packed form
247a54261M4318O2274j62679j21284j029K97707O3906j51170J6903j78806j8612
236c02733J09656K19586k5606K27954L3513k5683j03600m4912r3992L0964k21859
225a96712j09944J12821K51755p0022N251j79281Q8546R6569k54023J04413J43968
214f659o8418j0613p5394J47687j29037k9466l4973l5777J68186k8747k2136R0832
202c4515n1024J57315p510p7044k33053k46887m5445M391K89690K0467k20319
191d43934J30420J75380J24224K432O3538m00106r9239J42592J18728q53r3551
180b80369K25712K11637O4854q3938k13656J65695K37918j32488P2703q4020P7002
169B61050k26937J0516k40565R7083K4632J35444k29955j5856J57455l5882k46875
$$ plain form
158 -309890 -192841 134705 -150698 -122839 -88647 -43287 -187652 14513 -136685 -219509 -225430
147 -225430 -218148 -220982 -216377 -12279 6415 20850 110109 73707 -147418 -89986 -175864 -197371
135 -197371 -70071 -34123 -125602 -121478 64489 -10480 190016 170257 -24730 -355634 -276938
124 -276938 -85502 -178720 -165013 -82460 -33441 -63452 -82656 -175423 -90737 -127083 15908
113 15908 31096 -107637 -299773 -224469 -204058 -229698 10213 60858 -33479 -116897 98757
102 98757 152738 3 72231 -17287 -166886 -238931 -85316 45384 -2127 -39786 132571
91 132571 -47875 -289858 -342831 -352917 -318484 -121063 -199711 -97277 -125838 -83815 -16127
80 -16127 49614 -59939 -174096 -170473 -31089 91369 -51868 106419 20580 -15124 -6237
$$ packed form
158c09890J17049L27546k85403K7859L4192M5360j44365K02165j51198q2824n921
147b25430P282k834M605K04098J8694J4435Q9259l6402k21125N7432q5878k1507
135a97371J27300L5948r1479M124J85967p4969K00496j9759j94987l30904P8696
124b76938J91436r3218J3707Q2553M9019l0011j9204r2767Q4686l6346J42991
113A5908J5188j38733j92136P5304K0411k5640K39911N0645r4337q3418K15654
102I8757N3981j52735P2228q9518j49599p2045J53615J30700m7511l7659J72357
91A32571j80446k41983n2973j0086L4433J97421p8648J02434k8561M2023O7688
80a6127O5741j09553j14157L623J39384J22458j43237J58287q5839l5704Q887
$$ plain form
69 -6237 -182880 -128273 -66834 -67668 -6453 30957 398 -75686 -97557 39430 -133402 -125423
57 -125423 2706 -65689 -70472 -165891 -22663 -18959 14322 -23193 -10109 -2577 132725 53361
45 53361 -14388 -68044 -149223 -185110 -237203 -228055 -72964 104006 -87553 -172395 -190536 -209675
33 -209675 -185499 -104577 -47988 -85543 198810 277535 94786 20165 -145851 -200459 -47679
22 -47679 -177206 -205275 -148953 -384425 -318889 -202029 -217328 -116813 -136367 42955 78315
11 78315 -9037 17926 89025 39352 -162823 -286636 -122380 33441 -4662 36071 -57102
0 -57102
$$ packed form
69f237j76643N4607O1439q34O1215L7410l0559p6084k1871J36987j72832P979
57a25423J28129o8395m783r5419J43228L704L3281l7515J3084P532J35302p9364
45E3361o7749n3656q1179l5887n2093R148J55091J76970j91559q4842j8141j9139
33b09675K4176Q0922N6589l7555K84353P8725j82749p4621j66016n4608J52780
22d7679j29527k8069N6322k35472O5536J16860j5299J00515j9554J79322L5360
11G8315q7352K6963P1099m9673k02175j23813J64256J55821l8103M0733r3173
0e7102
$$ Imaginary data points
##PAGE= N=2
##DATA TABLE= (X++(I..I)), XYDATA
$$ plain form
16383 -3467641 -3410538 -3087883 -2949142 -2929924 -3088678 -3130723 -3065744 -3051801 -2933857 -2696596
16373 -2696596 -2929484 -2850144 -2636448 -2525949 -2577961 -2339160 -2156582 -2290285 -2263974 -2125060
16363 -2125060 -2130949 -2255467 -2341777 -2331386 -2172731 -2141826 -2009545 -1856658 -1737007 -1598971
16353 -1598971 -1635731 -1624862 -1512946 -1431880 -1311784 -1357787 -1321322 -1061451 -1184260 -1091357
16343 -1091357 -1030119 -1181541 -1188671 -961740 -820896 -825782 -932751 -994658 -803536 -878626 -820620
16332 -820620 -777174 -800050 -784833 -594686 -293611 -350716 -399736 -44370 -113083 -42312 -45146
16321 -45146 32132 -23495 -218603 68037 23936 48524 321532 278328 301058 398706 520889
16310 520889 428964 509285 274937 433598 560306 500187 528202 664185 640996 533217
$$ packed form
16383c467641N7103L22655J38741J9218j58754m2045O4979J3943J17944K37261
16373b696596k32888P9340K13696J10499n2012K38801J82578j33703K6311J38914
16363b125060n889j24518q6310J0391J58655L0905J32281J52887J19651J38036
16353a598971l6760J0869J11916Q1066J20096m6003L6465K59871j22809R2903
16343a091357O1238j51422p130K26931J40844m886j06969o1907J91122p5090N8006
16332h20620M3446k2876J5217J90147L01075n7105m9020L55366o8713P0771k834
16321d5146P7278n5627j95108K86640m4101K4588K73008m3204K2730R7648J22183
16310E20889r1925Q0321k34348J58661J26708o0119K8015J35983k3189j07779
$$ plain form
16300 533217 669625 681216 741494 750177 521311 738701 1042548 875055 890099 893952 1169227
16289 1169227 1117281 1140810 1237611 1351174 1498766 1419360 1455569 1337784 1397958 1376749 1535488
16278 1535488 1549439 1564460 1756518 1726519 1604725 1804713 1915324 1909580 2008449 1866874
16268 1866874 1654909 1741937 1903190 2143183 1966293 2026202 2094156 2111547 2403807 2400797
16258 2400797 2506696 2358828 2466249 2465345 2411469 2267698 2398146 2687898 2827750 2592895
16248 2592895 2298257 2388528 2767480 2715063 2502908 2480126 2633043 2953847 2992056 2785721
16238 2785721 2823158 3081505 3203954 2921782 2753708 2760105 2884572 3269200 3384923 3074081
16228 3074081 2878552 3269549 3448970 3309407 3432650 3375310 3465985 3338940 3329665 3265315
$$ packed form
16300E33217J36408J1591O0278Q683k28866K17390L03847j67493J5044L853K75275
16289A169227n1946K3529R6801J13563J47592p9406L6209j17785O0174k1209J58739
16278A535488J3951J5021J92058k9999j21794J99988J10611n744R8869j41575
16268A866874k11965Q7028J61253K39993j76890N9909O7954J7391K92260l010
16258B400797J05899j47868J07421r04n3876j43771J30448K89752J39852k34855
16248B592895k94638R0271L78952n2417k12155k2782J52917L20804L8209k06335
16238B785721L7437K58347J22449k82172j68074O397J24467L84628J15723l10842
16228C074081j95529L90997J79421j39563J23243n7340R0675j27045r275o4350
$$ plain form
16218 3265315 3392382 3397267 3469830 3397388 3394770 3294050 3370849 3422986 3373536 3484236 3454104
16207 3454104 3360505 3443474 3685377 3640617 3643389 3900704 4019519 3985143 3990469 3869189 3925450
$$ packed form
16218C265315J27067M885P2563p2442k618j00720P6799N2137m9450J10700l0132
16207C454104r3599Q2969K41903m4760K772K57315J18815l4376N326j21280N6261
$$ [...]
##END NTUPLES=NMR SPECTRUM
##END=
