##TITLE=1H_CG-1150-I4
 CDCl3
 8 sc, 
 31.7.2023
##JCAMPDX= 6.0         $$ Bruker NMR JCAMP-DX V2.0
##DATA TYPE= NMR SPECTRUM
##DATA CLASS= NTUPLES
##ORIGIN= UXNMR, Bruker Analytische Messtechnik GmbH
##OWNER= root
$$ XWIN-NMR		Version 3.5
$$ Mon Jul 31 13:59:57 2023 Russian Standard Time (UT+4h)  she@DPX200
##.OBSERVE FREQUENCY= 200.13135
##.OBSERVE NUCLEUS= ^1H
##.ACQUISITION MODE= SIMULTANEOUS
##.ACQUISITION SCHEME= undefined
##.AVERAGES= 8
##.DIGITISER RES= 18
##SPECTROMETER/DATA SYSTEM= spect
##.PULSE SEQUENCE= zg30
##.SOLVENT NAME= D2O
##.SHIFT REFERENCE= (INTERNAL, D2O, 0, 15.7491)
##AUDIT TRAIL= $$ (NUMBER, WHEN, WHO, WHERE, WHAT)
$$ ##TITLE= Audit trail, XWIN-NMR		Version 3.5
$$ ##JCAMPDX= 5.01
$$ ##ORIGIN= Bruker BioSpin GmbH
$$ ##OWNER= she
$$ F:/spectra/data/she/nmr/H-F/1/pdata/1/auditp.txt
$$ ##AUDIT TRAIL=  $$ (NUMBER, WHEN, WHO, WHERE, WHAT)
(   1,<2023-07-31 13:58:18.40 +0400>,<she>,<DPX200>,
      <created by zg, POWCHK disabled, PULCHK disabled
       configuration hash MD5:
       00 E9 B6 7A A2 85 ED C7 34 08 36 98 17 FE 4E 26
       data hash MD5: 16K
       B7 86 90 DE 1C 2C AE D8 74 69 67 DB 94 0C 9A 27>)
(   2,<2023-07-31 13:58:20.78 +0400>,<she>,<DPX200>,
      <Start of raw data processing
       efp BC_mod = 2 LB = 0.24 FT_mod = 6 PKNL = 1 PHC0 = -21040.08 PHC1 = 8.852719 SI = 16K 
       data hash MD5: 16K
       67 5D 51 B5 6F F9 D2 BC E0 DD 56 69 9B 49 0A E5>)
(   3,<2023-07-31 13:58:38.40 +0400>,<she>,<DPX200>,
      <pk PHC0 = -7.379887 PHC1 = 9.4 
       data hash MD5: 16K
       0E C4 56 BE A9 35 DE A9 AE C4 ED 12 9A 0B 92 A8>)
(   4,<2023-07-31 13:58:42.06 +0400>,<she>,<DPX200>,
      <abs ABSG = 5 
       data hash MD5: 16K
       B3 0D E3 75 8F C2 D2 3C 08 0B B1 45 45 9B 9C 87>)
(   5,<2023-07-31 13:59:33.01 +0400>,<she>,<DPX200>,
      <pk PHC0 = 11.49459 PHC1 = -14.4 
       data hash MD5: 16K
       71 28 B6 4A 4D 56 CE E6 6E 14 14 D6 E2 3E CE 85>)
(   6,<2023-07-31 13:59:36.45 +0400>,<she>,<DPX200>,
      <abs ABSG = 5 
       data hash MD5: 16K
       7B B8 45 1A 96 1E 42 44 08 8C A1 92 31 E1 E8 75>)
$$ ##END=
$$ 
$$ hash MD5
$$ 3C BE 89 F7 B1 C1 66 B6 F6 7A 90 E1 F7 D4 6C E3
##$RELAX= 
##$RELAX= 
##$RELAX= 
##$RELAX= 
##$RELAX= 
##$RELAX= 
$$ Bruker specific parameters
$$ --------------------------
##$DU= <F:/spectra>
##$EXPNO= 1
##$NAME= <H-F>
##$PROCNO= 1
##$TYPE= <nmr>
##$USER= <she>
##$AMP= (0..31)
100 100 100 100 100 100 100 100 100 100 100 100 100 100 100 100 100 100 
100 100 100 100 100 100 100 100 100 100 100 100 100 100 
##$AQSEQ= 0
##$AQ_mod= 1
##$AUNM= <au_zg>
##$AUTOPOS= <>
##$BF1= 200.13
##$BF2= 200.13
##$BF3= 200.13
##$BF4= 200.13
##$BF5= 200.13
##$BF6= 200.13
##$BF7= 200.13
##$BF8= 200.13
##$BYTORDA= 1
##$CFDGTYP= 0
##$CFRGTYP= 5
##$CHEMSTR= <none>
##$CNST= (0..31)
1 1 145 1 1 1 1 1 1 1 1 1 1 1 1 1 1 1 1 1 1 1 1 1 1 1 1 1 1 1 1 1 
##$CPDPRG= <>
##$CPDPRG1= <>
##$CPDPRG2= <>
##$CPDPRG3= <>
##$CPDPRG4= <mlev>
##$CPDPRG5= <mlev>
##$CPDPRG6= <mlev>
##$CPDPRG7= <mlev>
##$CPDPRG8= <mlev>
$$ [...]
##$SUBNAM3= <"">
##$SUBNAM4= <"">
##$SUBNAM5= <"">
##$SUBNAM6= <"">
##$SUBNAM7= <"">
##$SUBNAM8= <"">
##$SUBNAM9= <"">
##$SW= 18.05172834244
##$SWIBOX= (0..15)
0 0 2 0 0 0 0 0 0 0 0 0 0 0 0 0 
##$SW_h= 3612.71676300578
##$TD= 16384
##$TD0= 1
##$TE= 0
##$TE2= 300
##$TE3= 300
##$TEG= 300
##$TL= (0..7)
0 120 120 120 120 120 120 120 
##$TP= (0..7)
150 150 150 150 150 150 150 150 
##$TP07= 0
##$TPNAME0= <>
##$TPNAME1= <>
##$TPNAME2= <>
##$TPNAME3= <>
##$TPNAME4= <>
##$TPNAME5= <>
##$TPNAME6= <>
##$TPNAME7= <>
##$TPOAL= (0..7)
0.5 0.5 0.5 0.5 0.5 0.5 0.5 0.5 
##$TPOFFS= (0..7)
0 0 0 0 0 0 0 0 
##$TUNHIN= 0
##$TUNHOUT= 0
##$TUNXOUT= 0
##$USERA1= <user>
##$USERA2= <user>
##$USERA3= <user>
##$USERA4= <user>
##$USERA5= <user>
##$V9= 5
##$VALIST= <valist>
##$VCLIST= <CCCCCCCCCCCCCCC>
##$VD= 0
##$VDLIST= <DDDDDDDDDDDDDDD>
##$VPLIST= <PPPPPPPPPPPPPPP>
##$VTLIST= <TTTTTTTTTTTTTTT>
##$WBST= 1024
##$WBSW= 4
##$XGAIN= (0..3)
0 0 0 0 
##$XL= 0
##$YL= 0
##$YMAX_a= 340899
##$YMIN_a= -378575
##$ZGOPTNS= <>
##$ZL1= 120
##$ZL2= 120
##$ZL3= 120
##$ZL4= 120
##$ABSF1= 15.74909
##$ABSF2= -2.302759
##$ABSG= 5
##$ABSL= 3
##$ALPHA= 0
##$AQORDER= 0
##$ASSFAC= 0
##$ASSFACI= 0
##$ASSFACX= 0
##$ASSWID= 0
##$AUNMP= <proc_1d>
##$AZFE= 0.1
##$AZFW= 0.1
##$BCFW= 0
##$BC_mod= 2
##$BYTORDP= 0
##$COROFFS= 0
##$CY= -3
##$DATMOD= 1
##$DC= 0
##$DFILT= <>
##$DTYPP= 0
##$F1P= 0
##$F2P= 0
##$FCOR= 1
##$FTSIZE= 16384
##$FT_mod= 6
##$GAMMA= 0
##$GB= 0
##$INTBC= 1
##$INTSCL= 3.70164e-10
##$ISEN= 128
##$LB= 0.24
##$LEV0= 0
##$LPBIN= 0
##$MAXI= 10000
##$MC2= 0
##$MEAN= 0
##$ME_mod= 0
##$MI= 1.114404
##$NCOEF= 0
##$NC_proc= -5
##$NLEV= 6
##$NOISF1= 3.799351
##$NOISF2= 2.8
##$NSP= 0
##$NTH_PI= 0
##$NZP= 0
##$OFFSET= 15.74909
##$PC= 1
##$PHC0= -21035.97
##$PHC1= 3.85272
##$PH_mod= 1
##$PKNL= yes
##$PPARMOD= 0
##$PSCAL= 0
##$PSIGN= 0
##$REVERSE= no
##$SF= 200.130004491883
##$SI= 16384
##$SIGF1= 3
##$SIGF2= 2
##$SINO= 5.538805
##$SIOLD= 16384
##$SREGLST= <1H.CDCl3>
##$SSB= 0
##$STSI= 16384
##$STSR= 0
##$SW_p= 3612.71676300578
##$SYMM= 0
##$S_DEV= 0
##$TDeff= 16384
##$TDoff= 0
##$TI= <>
##$TILT= no
##$TM1= 0
##$TM2= 0
##$TOPLEV= 0
##$USERP1= <user>
##$USERP2= <user>
##$USERP3= <user>
##$USERP4= <user>
##$USERP5= <user>
##$WDW= 1
##$XDIM= 16384
##$YMAX_p= 280810867
##$YMIN_p= -249607
$$ End of Bruker specific parameters
$$ ---------------------------------
##NTUPLES= NMR SPECTRUM
##VAR_NAME=  FREQUENCY,     SPECTRUM/REAL,   SPECTRUM/IMAG
##SYMBOL=    X,             R,               I
##VAR_TYPE=  INDEPENDENT,   DEPENDENT,       DEPENDENT
##VAR_FORM=  AFFN,          ASDF,            ASDF
##VAR_DIM=   16384,         16384,           16384
##UNITS=     HZ,            ARBITRARY UNITS, ARBITRARY UNITS
##FACTOR=    0.220516191357247, 1,           1
##FIRST=     3151.86549140881, 0,            0
##LAST=      -460.851271596969, 0,           0
##MIN=       -460.851271596969, -249607,     0
##MAX=       3151.86549140881, 280810867,    0
$$ Real data points
##PAGE= N=1
##DATA TABLE= (X++(R..R)), XYDATA
$$ [...]
6017g4211k9214L2602n8441k8054J2391j8985K1805K0049N4241n368k7734K8394
6005g2525j5019o812L8827K480P136o074l1501L2371K8856k4208L5908j1663O74
5992b1550r9093K0428M4306j9194Q877J4336K0797j3317k3204J9955l8170l7549
5980a23378N0447n17k8341P568k7254M4821J6775k8315k4378N4465j9057j0273
5968h7437j1438l8817L9574K0696l409j0530j114L5304M90M912K392M833L2438
5955a2106R849j6619n1533j9223J4691J2427N8303J6226k2207j4279J0601o145
5943b0015j9310N599k9993K8734J6458l1218K6613n166k6293L255M2330K0259
5931A1253p6134P875M0877q937k7125L5680K1439k0376m533P574m8933L3491J2433
$$ plain form
6017 -74211 -103425 -70823 -129264 -157318 -144927 -163912 -142107 -122058 -67817 -73185 -100919 -72525
6005 -72525 -87544 -94356 -55529 -53049 -45913 -51987 -83488 -51117 -22261 -46469 -10561 -22224 -21550
5992 -21550 -120643 -100215 -55909 -75103 -66226 -51890 -31093 -44410 -67614 -47659 -85829 -123378
5980 -123378 -72931 -73448 -101789 -94221 -121475 -76654 -59879 -88194 -112572 -58107 -77164 -87437
5968 -87437 -98875 -137692 -98118 -77422 -80831 -91361 -92475 -57171 -56681 -51769 -49377 -44544 -12106
5955 -12106 -2257 -18876 -70409 -89632 -74941 -62514 -4211 12015 -10192 -24471 -13870 -20015
5943 -20015 -39325 -33726 -63719 -34985 -18527 -49745 -23132 -28298 -54591 -51336 -9006 11253
5931 11253 -64881 -57006 -16129 -25066 -52191 -16511 4928 -15448 -19981 -12407 -61340 -27849 -15416
5918a5416l8001M307m617k823R861j315k2001J2788J8449L380N2511q896l9965
5905c1738k1968J2260R161m071j4717j0851J3796m823j9927M6084J5120Q251j8452
5892b1875p005m505K440p995j3222N094J2418J6616K8191k888L2141P752K8906
5879G6068o517O2694j0604l2920k201Q842K3754j8799r4317m0367o002J7034K7555
5866D220j2003L7767J0536k1360m8679j5428N1113N7929k843m0503J2771Q0518
5854A14038n030l1795m0146K7286K7956J4588N4850M3200N5196M0474O4333O2916
5842D27866K5802m3581j15133r2322n2776m1218m4715j4006j2041l2239j2556
5831f919N8974J7825j5256m3867l0262J9005M0193m9803O0231J7264p4167L0343
$$ plain form
5918 -15416 -53417 -49110 -53727 -56550 -46689 -48004 -70005 -57217 -38768 -35388 17123 8227 -31738
5905 -31738 -53706 -41446 -32285 -36356 -51073 -61924 -48128 -52951 -72878 -26794 -11674 -3423 -21875
5892 -21875 -28880 -33385 -30945 -38940 -52162 -47068 -34650 -18034 10157 7269 39410 47162 76068
5879 76068 69551 132245 121641 88721 86520 95362 119116 100317 6000 -34367 -40369 -23335 4220
5866 4220 -7783 29984 40520 19160 -29519 -44947 6166 64095 61252 20749 33520 114038
5854 114038 109008 77213 37067 64353 92309 106897 161747 204947 260143 300617 364950 427866
5842 427866 453668 410087 294954 202632 149856 108638 63923 49917 37876 5637 -6919
5831 -6919 52055 69880 54624 10757 -19505 -500 39693 -10110 50121 67385 -6782 23561
5819B3561J4981J6883L0872M0205O9024M2474P5692L6060P1698K3756L4435q7974
5807C91667j67840q0315m8743m4747k3995m4395k1788P0327K221j5524L6388k5160
5795B8096K5054K2614o1371q114p189J2789K8409k5897J7647r333J5367N7046
5783I5118K504k5606P3929L2160m8550j0204J4007p5808o7680n76J3516J3811
5771A6621m004J9398q5078j6798K7821k6698k8344L7696J8372j6141l6763O2110
5759c1808L3967j03664M1455Q657J6186J4585K4298p208O894k3288j9850J3758
5747b6018m2202o2061j2627L3834Q0312K124j6851j34n4239L4566R291M857M995
5734d4153M2194k0062q198m4258j0922l8929L311p042L2513J5344k0247j5142
$$ plain form
5819 23561 38542 55425 86297 126502 195526 238000 313692 349752 421450 445206 479641 391667
5807 391667 223827 143512 94769 50022 26027 -18368 -40156 30171 32392 16868 53256 28096
5795 28096 53150 75764 14393 6279 -910 11879 40288 14391 32038 22705 38072 95118
5783 95118 97622 72016 145945 178105 129555 119351 133358 57550 -10130 -10706 2810 16621
5771 16621 12617 32015 -53063 -69861 -42040 -68738 -97082 -59386 -41014 -57155 -93918 -31808
5759 -31808 2159 -101505 -60050 -51393 -35207 -20622 3676 -3532 3362 -19926 -39776 -26018
5747 -26018 -68220 -130281 -142908 -109074 -28762 -26638 -43489 -43623 -97862 -63296 -54005 -49148 -44153
5734 -44153 -1959 -22021 -30219 -74477 -85399 -124328 -121017 -128059 -95546 -80202 -100449 -115591
5722a15591l80K4790k1710j96N610M110M8569L2074m8488j3912N0614n0648O190
5709g8968k961k4100k700l2622j2999N8666n466K2849L5634l942J8031l4668R958
5696e3288L6311n5732J8912m3360n3740K1674L7233k142K372N9507l4265j9995
5684h6513J2512K9550n4675j2264L2444M3201R934l8418J6908O326q8528q86J3777
5671a16632n993K141N2420J3421q376j3720p7764Q356N7724J428M815J5630m2149
5658a08699m3361Q4345k9669j3006J6340P2241K6726J0224k0649k7257J868J8230
5646a2667m3469l5142L5299O264R164Q775j9797j1267K8188J3466n658R7k6853
5633e3600k5312J3593L5049k9790l4566n480J8533P5950n6034J5215J5805J8492
$$ plain form
5722 -115591 -115971 -91181 -112891 -113087 -107477 -103367 -54798 -22724 -71212 -85124 -34510 -85158 -78968
5709 -78968 -81929 -106029 -108729 -141351 -154350 -95684 -101150 -78301 -42667 -46609 -28578 -63246 -53288
5696 -53288 -16977 -72709 -53797 -97157 -150897 -129223 -91990 -94132 -91760 -32253 -66518 -86513
5684 -86513 -74001 -44451 -99126 -111390 -78946 -35745 -25811 -64229 -47321 -40995 -129523 -130409 -116632
5671 -116632 -122625 -120484 -68064 -54643 -63019 -76739 -154503 -146147 -88423 -86995 -82180 -66550 -108699
5658 -108699 -152060 -67715 -97384 -110390 -94050 -21809 4917 15141 -5508 -32765 -30897 -12667
5646 -12667 -56136 -91278 -55979 -49715 -40551 -31776 -51573 -62840 -34652 -21186 -26844 -26747 -53600
5633 -53600 -78912 -65319 -30270 -60060 -94626 -100106 -81573 -5623 -61657 -46442 -30637 -12145
5621a2145j07640K9238Q7039o5392l1769M9639O516q359n6265L4371M3076j8877
5609e0568j7756J0570R36p042K3622J2385N57O240l156K8862l7356K0269k1239
5596c3676j557q899l922j1263K031M254J7558l2773j8096p400K8328Q2236k0496
5583c675r277J2155M46k9191K0163p985L4968O622M449j9945j1214J0543K8766
5570C6825m8803J3894l4548l3077m0128j7636l6775P992L4713N8807M4069M6632
5558C1965j2806o8219l8741m4123L9949J6919O0321O895l143l783m4141L5351
5546b3556J8257J560N0963K8861j05444q692k9624K7889k5316m0174M5407k212
5534f2081P94o782K0770k937J7962L4824K1152K1613o0862l005m694n085K2511
$$ plain form
5621 -12145 -119785 -90547 -3508 -68900 -100669 -51030 -44514 -52873 -109138 -74767 -31691 -50568
5609 -50568 -68324 -57754 -56818 -63860 -40238 -27853 -27296 -21056 -24212 4650 -32706 -12437 -33676
5596 -33676 -35233 -44132 -48054 -59317 -57286 -53032 -35474 -68247 -86343 -93743 -65415 16821 -3675
5583 -3675 -12952 -797 -351 -29542 -9379 -17364 17604 24226 28675 8730 -2484 8059 36825
5570 36825 -11978 1916 -32632 -65709 -105837 -123473 -160248 -152256 -117543 -58736 -14667 31965
5558 31965 19159 -49060 -87801 -131924 -91975 -75056 -14735 -7840 -10983 -14766 -58907 -23556
5546 -23556 -5299 -3739 47224 76085 -29359 -38051 -67675 -39786 -65102 -105276 -59869 -62081
5534 -62081 -61287 -68069 -47299 -50236 -32274 2550 23702 45315 -15547 -18552 -23246 -28331 -5820
5521e820J9515n3826J2730L036l4299N164J2471O6187o727l1369j084N0097k2454
5508A3621L4596K9794k6989N4047M306J5152q423L089j1028j6983k810o2471J505
5495B7406M2404j3411m859N6353l8306o0147q809L6313k7069n1934J7138M73l472
5482b7920M7090O454M324L3230k3337k3924l6243J8467K8270l2303K6616m254
5470A6470K5636J320L6330K0413K340J9855m0461k53k4724J2268K5134J711K9066
5457A25105N362k7098L8095m4890j9466Q862m6099K8282j0250P3394k8880J5320
5445A17737j494J0319n6122l2540N7147N8485q3523L7283O894j9153L9711k3220
5433A11524J1864o4171q501K2668J5198J2194K868r212q745J1167K7490k4499
$$ plain form
5521 -5820 13695 -40131 -27401 -24365 -58664 -53500 -41029 25158 18431 -12938 -14022 36075 13621
5508 13621 48217 78011 51022 105069 109375 124527 116104 119193 108165 91182 88372 25901 27406
5495 27406 69810 56399 51540 107893 69587 9440 631 36944 9875 -42059 -24921 -24448 -27920
5482 -27920 19170 25624 29948 63178 39841 15917 -20326 -1859 26411 -5892 20724 16470
5470 16470 42106 43426 79756 100169 102509 122364 81903 81650 56926 69194 94328 96039 125105
5457 125105 130467 103369 141464 96574 77108 85970 39871 68153 57903 131297 102417 117737
5445 117737 116243 126562 70440 37900 95047 153532 70009 107292 114186 95033 134744 111524
5433 111524 123388 59217 50716 73384 88582 100776 103644 94432 85687 96854 124344 99845
5421I9845m6161K494P0083l373m0524k7664J3644N8369o063N174j186N2348K2318
5408A99304j7038n0425j4300L5482L4045l6259J492J0722m1809q895O0047J6505
5396A88871J215l2544j4201K921j8622M7038O290K0293p6550M7376K280M702l202
5383A75867m2890J7993N1060M389n2946K4790K2235k5030M5086l738p676k7284
5371A81856j4262o643M7353j4202k8957o983L2394K7236l4197k2058O2858K9305
5359B53700l3596k7058M1652J0608J8633k1514J7815R150p6950l44j7640P548
5347A82004M5765L2882Q82k2285L235M9609r000r394k9761k6475k1114R0697J6130
5334C03175R206j3431l5897M4900o3773j6467K8173J084k8662O396M4488J7702
$$ plain form
5421 99845 53684 56178 126261 122888 82364 54700 68344 126713 120650 125824 124638 176986 199304
5408 199304 182266 131841 117541 153023 187068 150809 152301 163023 121214 112319 172366 188871
5396 188871 190086 157542 143341 146262 127640 174678 180968 201261 124711 172087 174367 179069 175867
5383 175867 132977 150970 202030 206419 153473 178263 200498 175468 220554 216816 209140 181856
5371 181856 167594 160951 208304 194102 165145 158162 190556 217792 183595 161537 224395 253700
5359 253700 220104 193046 234698 245306 263939 242425 260240 269390 192440 192096 174456 182004
5347 182004 227769 260651 261533 239248 242483 292092 283092 273698 243937 217462 196348 287045 303175
5334 303175 312381 298950 263053 307953 244180 227713 255886 256970 228308 234704 279192 296894
5322B96894J6628J9904j7675L4468L1985l5230m0661L1778k3762j7779Q38N7848
5310C55236O025L809r96j7712N9034M7650j5040N187K3973m3466R798K4959K2008
5297D80465j8624j6053p651L6757k9996r722N3327L2576Q619K0277k6655M6666
5285E69986K6658J676N1179j6111K1421M2892p669L053J2646N1901L5360K0201
5273H13193L1323n997M4438r879P553O3774q452k585j6671K826L742r08J7397
5260I39754M0569J5301O1528M6450j93R269N6607N9099k5633k1775O2375L7840
5248A281191K2432k459L5310Q2452O7841l007O3739O1606L3504L2371L7378R0201
5236A802559P9206J06245N5289L0314M9592O5450O1251P6315O4775L7473N2317
$$ plain form
5322 296894 313522 333426 315751 350219 382204 346974 306313 338091 314329 296550 297388 355236
5310 355236 361261 365070 364074 346362 405396 453046 438006 443193 467166 423700 433498 458457 480465
5297 480465 461841 445788 438137 474894 444898 435176 488503 521079 529698 549975 523320 569986
5285 569986 596644 598320 649499 633388 654809 697701 690032 693085 705731 757632 792992 813193
5273 813193 844516 838519 882957 873078 880631 944405 935953 933368 916697 919523 923265 922357 939754
5260 939754 980323 995624 1057152 1103602 1103409 1112678 1169285 1228384 1202751 1180976 1243351 1281191
5248 1281191 1303623 1301164 1336474 1418926 1486767 1483760 1547499 1609105 1642609 1674980 1712358 1802559
5236 1802559 1881765 1988010 2043299 2073613 2123205 2188655 2249906 2326221 2390996 2428469 2480786
5225B480786J40652J43506J01874J57715J19861J45163K29953K40431K83544L03260
5215D346745M79295N35232O35258Q21382J030739J152166J409808J665307J739367
5206A3815299J786758J800982J599480J218952O94486j53384q19727j122715j636086
5197A7184045k127317k153925j906765j763117j477404j140999r34097p25705
5189D954716n52276m96743l64921l37645l07641k27220k21095j68202j62311r2915
5179B023747k03100r7620j31364q2942o5755p2726p1535p8238o4859l4905m1353
5168A079350r8399j03379n2072q736j8049m3291l9268o9823j5379P960k742m0765
5156E95407K0425J3365n7694L977L897p5148J0059l4544k6464J8252m923l2727
$$ plain form
5225 2480786 2621438 2764944 2866818 3024533 3144394 3289557 3519510 3759941 4043485 4346745
5215 4346745 4826040 5361272 5996530 6817912 7848651 9000817 10410625 12075932 13815299
5206 13815299 15602057 17403039 19002519 20221471 20915957 20762573 19942846 18820131 17184045
5197 17184045 15056728 12902803 10996038 9232921 7755517 6614518 5680421 4954716
5189 4954716 4402440 3905697 3540776 3203131 2895490 2668270 2447175 2278973 2116662 2023747
5179 2023747 1820647 1723027 1591663 1508721 1442966 1370240 1298705 1220467 1155608 1120703 1079350
5168 1079350 980951 877572 825500 816764 798715 755424 716156 646333 630954 638914 636172 595407
5156 595407 615832 629197 571503 575480 579377 504229 514288 479744 453280 471532 466609 433882
5144D33882k2596Q986p604j2360l5877J2189j4704J91k3455N4566N4113n1802
5132C95529n2320j4972k2643M4269n4089j969k9195J7937l0614j3135J1177K5550
5120B75525j0244p108J7803K712k8800m1869M8105n269l1795K3157R404J9076
5108B70697l1434M882J2538k7559j5116M340l6034M5341J7497k2981l4947P04
5096A87928M5521L574k7243m6531k0635K234N7178q637k8834L4581k0268l9922
5084A38946o958J0706M0724n4849l8715Q390j4562p964K1151Q0268K362J5686
5072A95185j802n0089Q50o1230L1176P4293M4526p4056k7746l2572m014j1639
5060H2882o393P596M1372N7445k3762j9133k1307K9984q274P438M0103K6123m9708
$$ plain form
5144 433882 411286 420272 412668 400308 364431 376620 361916 362107 338652 393218 447331 395529
5132 395529 343209 328237 305594 349863 295774 293805 264610 282547 251933 238798 249975 275525
5120 275525 265281 258173 275976 278688 249888 208019 256124 250855 219060 242217 251621 270697
5108 270697 239263 244145 256683 229124 214008 218348 182314 227655 245152 222171 187224 187928
5096 187928 233449 237023 209780 163249 142614 144848 202026 193389 164555 199136 178868 138946
5084 138946 131988 142694 183418 128569 89854 98244 83682 75718 96869 177137 179499 195185
5072 195185 193383 143294 144144 82914 114090 188383 232909 158853 131107 98535 94521 82882
5060 82882 76489 84085 125457 182902 159140 140007 118700 148684 140410 147848 187951 214074 164366
5047A64366l6658N5506m4345m1403L0889L3565m372K2159o411n819p686L847m3856
5034A19782n101J7435L5285m1546p598J2125J9636k9984n8476L2440M0688J6847
5022A51533m7614L7249J2557o440q19j8185l2285M4570M3623k3714N433N278k167
5009A69019K409k3098k4454O582L8843M95n0248o4240N942J8258M2163l6467K2953
4996A08157K9831j7454l6684J7940L9389M3632n811l087J1982m2195k496K2605
4984A65809M1740m9125k5924J0702L3113K5336N235o3713L7151l1801K5105j7858
4972A55770M5652J7475L6476m0156j0848l0J521J6160K8502K9902M604K3588r0101
4959B18515O096k002j6627L7415n376l8481N6976L620K6113l8123l7886L5167
$$ plain form
5047 164366 127708 183214 138869 97466 128355 161920 157548 179707 173296 167477 159791 163638 119782
5034 119782 114681 132116 167401 125855 118257 130382 150018 120034 61558 93998 134686 151533
5022 151533 103919 141168 153725 147285 146466 128281 95996 140566 184189 160475 165908 171186 169019
5009 169019 171428 148330 123876 130458 169301 169796 119548 55308 61250 79508 121671 85204 108157
4996 108157 137988 120534 83850 101790 141179 184811 179000 175913 187895 145700 143204 165809
4984 165809 207549 158424 132500 143202 176315 201651 206886 143173 180324 148523 173628 155770
4972 155770 201422 218897 255373 215217 204369 204339 205860 222020 250522 280424 285028 308616 218515
4959 218515 224611 222609 205982 243397 238021 199540 256516 260136 286249 248126 210240 245407
4947B45407j2145J1130K9179o3626j0381L9913K8166j0253k9421o3382M1298k7686
4935A78199K3301L545M572r331R441p419r528q906L0364j645o887p980j4417P7191
4921B60500K930k8939n3902j8106N4603M8623J0702p0929J1866J3032j3751l4498
4909A82131p056Q0215L4304J158l574q215j4991L2126j2230L8106J2341m0011
4897B94304L3032n875j8317J5984k4270K667N9136J9112k7238L953n9220p4867
4885B18401l1352R539M5396M4443K9829j5895p1490K0619L0721P673l9903J1718
4873B59699k5534M511j9781k3315K6142m0248J7483M780L0290K9662R206L2222
4861C05117m586k9372J5703K0584M642O2651o799n8360m2912O926L2807K0597
$$ plain form
4947 245407 233262 244392 273571 209945 199564 239477 267643 257390 227969 164587 205885 178199
4935 178199 201500 205045 209617 200286 209727 202308 192780 183874 214238 212593 205706 197726 183309 260500
4921 260500 263430 234491 180589 162483 217086 265709 276411 205482 217348 230380 216629 182131
4909 182131 175075 255290 289594 290752 287178 278963 263972 296098 283868 321974 334315 294304
4897 294304 327336 321461 303144 319128 294858 297525 356661 375773 348535 352488 293268 218401
4885 218401 187049 196588 241984 286427 316256 300361 228871 249490 280211 287884 247981 259699
4873 259699 234165 238676 218895 195580 221722 181474 198957 203737 234027 263689 272895 305117
4861 305117 300531 271159 286862 307446 312088 374739 367940 309580 266668 273594 306401 326998
4849C26998l9332r873M7862K3563K14m9629J7484M6325m3719R965n022j8784K7456
4836C33508k5358l4154k3102O3487j9302k8970k1007L4935M5150n734n1442K973
4824B70984L6103j1278J5695k223N540Q147k5486k9628J7336M7719L9183P023
4812C79115q4874k7730M362l6635K3692r383J0248N8379m2K4384K5463q7050K7467
4799C07396J1809K7652L8109L3870k8654l2224j3159k2513L2260k8828l4060K6312
4787C17970m0113O3790j5003J5382O7896k2550M3638k87l0795n0578K3483L2112
4775D04945k6019L207P950l7421j2809M280j3248N2174L7999q680k7870r966J5643
4762C90185l7531N5201l6119L4712l2608J4496M558k6528M8388M5632J3329j10868
$$ plain form
4849 326998 287666 277793 325655 349218 349432 299803 317287 363612 319893 329858 324836 306052 333508
4836 333508 308150 273996 250894 314381 295079 266109 245102 280037 325187 319453 268011 270984
4824 270984 307087 295809 311504 309281 314821 322968 297482 267854 285190 332909 372092 379115
4812 379115 294241 266511 270873 234238 257930 248547 258795 317174 317132 341516 366979 279929 307396
4799 307396 319205 346857 384966 418836 390182 357958 344799 322286 354546 325718 291658 317970
4787 317970 277857 341647 326644 342026 409922 387372 431010 430723 399928 349350 372833 404945
4775 404945 378926 382133 390083 352662 339853 344133 330885 383059 421058 412378 384508 374542 390185
4762 390185 352654 407855 371736 406448 373840 388336 392894 366366 414754 460386 473715 362847
4750C62847K2436J4213M5675K351n3045J8113j5299L0188j1202P626n632j012
4738D17259L5792j5402j286j1080J4003m9266K0689J8701k2697Q075j5281K0096
4726D19603J4926m5731P468N5116K6751L351P30K5604k8332m9831k0629L937N5080
4713D68043N2m6350J6927J4925J9926o961K8012n9248q327J2689M6460K4490n6850
4700D53788J9522J0853j1371M775l7574O1025M8521j8344j3970j1653l3803J5945
4688D87714k324K0447j4581L9325m0694l1183M3436L1654O7807L473q074j689
4676E95311Q3029p3480k498M1992O0630j6608M9087m711m4330q7475L0216m0275
4664E90888L2583m2836m4740P4495J7322j7544m9436K0905J4324k0029p9608l6672
$$ plain form
4750 362847 385283 399496 445171 447522 394477 412590 397291 427479 416277 423903 418271 417259
4738 417259 453051 437649 436363 425283 439286 390020 410709 429410 406713 414788 399507 419603
4726 419603 434529 388798 396266 451382 478133 481484 482214 507818 479486 429655 409026 412963 468043
4713 468043 468095 421745 438672 453597 473523 466562 494574 435326 426999 439688 486148 510638 453788
4700 453788 473310 484163 472792 477567 439993 501018 549539 531195 517225 505572 471769 487714
4688 487714 485390 505837 491256 530581 489887 458704 502140 533794 601601 605074 597000 595311
4676 595311 678340 604860 602362 644354 704984 688376 737463 732752 688422 600947 631163 590888
4664 590888 623471 580635 535895 610390 627712 610168 560732 581637 595961 575932 496324 459652
4652D59652j607L4523p294J4844M4720J687L286j1188K4752N8856J6382l467j9727
4639F15419M0817k6743p2637J0522M2991j3588k2690L2796M4265R763k2694J247
4627F39468K5566m2906L5921J5296j6398M3812l0896k5786K5520j4617K0756M0346
4615G16082L1545k0342m616n671j3292n281L3133O7043L5755o531l7618m862L6974
4602H22319q7073k4705K4097j4931J3140L6491j5586k4566M3967P560M398L7062
4590H22173j3189k4605J163L6129l1573l641K2148M5407r350l501M3816j03218
4578G81759n1942N5850P7615k4868n691k5438k3484O8319O379j3024Q92k9589
4566H16778k334p127L4425L2690q967m5510j0269J1678J3846l3118K2011L2200
$$ plain form
4652 459652 458045 492568 485274 500118 544838 546525 549811 538623 563375 622231 638613 635146 615419
4639 615419 656236 629493 556856 567378 610369 596781 574091 606887 651152 660915 638221 639468
4627 639468 665034 622128 658049 673345 656947 700759 669863 644077 669597 654980 675736 716082
4615 716082 747627 727285 722669 716998 703706 698425 731558 798601 834356 827825 790207 785345 822319
4602 822319 735246 710541 734638 719707 732847 769338 753752 729186 773153 780713 785111 822173
4590 822173 808984 784379 785542 821671 790098 786457 808605 854012 844662 841161 884977 781759
4578 781759 729817 785667 863282 838414 832723 807285 783801 852120 858499 845475 846367 816778
4566 816778 814444 807317 841742 874432 865465 819955 809686 821364 835210 802092 824103 856303
4554H56303k0448m528M5732L206K2123L6716j0382J1902l1756L5038n461m7022
4542H91423K8651N8737j8919K5993J4273M339K6527k0227l9815L764O4226K4153
4530A063125N343L967l2783l3012J752K1157N679M8619L3296l9794j0686L1445
4518A098108m758m0498L4292m9144k3365N8699M368K500L9127M7585o494j9261
4506A141159k7018J93N3978J0992k1359L0099N8171J7201k212J9726l7899L536
4494A246567N1416M5537n0159q309O4243K9789k8959l4339J9905N8454K9167j4762
4482A408550J0172J6456L6814M8711N495L0893R3574K5151O7613O2692Q8441J01887
4470A996449J68715J64184K46499K44384K86329L54122L35466L27192L35528P2147
$$ plain form
4554 856303 835855 831327 877059 880265 902388 939104 928722 940624 908868 943906 938445 891423
4542 891423 920074 978811 959892 985885 1000158 1004497 1031024 1010797 970982 974746 1038972 1063125
4530 1063125 1068468 1072435 1039652 1006640 1008392 1029549 1035228 1083847 1117143 1077349 1066663 1098108
4518 1098108 1093350 1052852 1087144 1038000 1014635 1073334 1077702 1080202 1119329 1166914 1160420 1141159
4506 1141159 1114141 1114334 1168312 1179304 1157945 1188044 1246215 1263416 1261204 1280930 1243031 1246567
4494 1246567 1297983 1343520 1293361 1285052 1349295 1379084 1350125 1315786 1335691 1394145 1423312 1408550
4482 1408550 1418722 1435178 1471992 1520703 1526198 1557091 1650665 1675816 1743429 1806121 1894562 1996449
4470 1996449 2165164 2329348 2575847 2820231 3106560 3460682 3796148 4123340 4458868 4531015
4460D531015j66202m45150o64155n18938k82977k42761r6663j02389j35596q7329
4450A788855m9377m0573q174L27p9740o972q685J5159j03421L0712K1666l428
4438A556349K5218m3642R832n4071k1312O2592k9431o8135K1174N3287k4118K7591
4426A515334K5883l1480j8391K7250p657K8842O588O46L564M3031n534J4386l8020
4413A564442P95J8712J6795L5190N6891K0711k0016k358k4036N5613R379J7943
4401A750061N7293l0777k4258N573m8492j259N3726K3028p627J7665R659O2449
4389A867041L5848J07186N7162N3994K02097J23036O1096J30695J84745K03059
4379C025959K12643N8887k37724l72980k61812j44347n1879p3317o799m2208p820
$$ plain form
4460 4531015 4364813 3919663 3255508 2736570 2453593 2210832 2114169 2011780 1876184 1788855
4450 1788855 1739478 1698905 1690731 1691058 1611318 1604346 1595661 1610820 1507399 1538111 1559777 1556349
4438 1556349 1581567 1537925 1547757 1493686 1472374 1534966 1505535 1437400 1458574 1511861 1487743 1515334
4426 1515334 1541217 1509737 1491346 1518596 1510939 1539781 1546369 1547015 1550579 1593610 1588076 1602462 1564442
4413 1564442 1565237 1583949 1600744 1635934 1692825 1713536 1693520 1691162 1667126 1722739 1732118 1750061
4401 1750061 1807354 1776577 1752319 1757892 1709400 1708141 1761867 1784895 1777268 1794933 1804592 1867041
4389 1867041 1902889 2010075 2067237 2121231 2323328 2446364 2507460 2638155 2822900 3025959
4379 3025959 3238602 3297489 3059765 2686785 2424973 2280626 2228747 2155430 2148631 2106423 2098603
4368B098603j8960L935k4904o1873m9929j5699m849J4910O4231k9266l0851q750
4356A936598K5128J7050q097R209M2221j5109L8006m2877j1062K9610k0133L5766
4344B036310J427L4652M2632l9895M2800P5707l7277P837M2530N3158k6405l0812
4332B202664m0670P266P8987M0678K516m2091J9634L1335K5339M5506N2889j5996
4320B408057O7104K4074k3914N7102K2444N9424L7261l7582P0147N2360O4371
4309B800848R1289j77N8570R4556R6776J03048J37793K03124J85462J39773P1610
4298C982672j1828p7338N4875N8982J0822k3776m4583r0603M4695P5629J66338
4287D145885L00180L16828L10543K92154K42441L67779N23535K83196q708l88089
$$ plain form
4368 2098603 2079643 2083578 2058674 1996801 1946872 1931173 1926324 1941234 2005465 1976199 1945348 1936598
4356 1936598 1961726 1978776 1970679 1979888 2022109 2007000 2045006 2002129 1991067 2020677 2000544 2036310
4344 2036310 2037737 2072389 2115021 2075126 2117926 2193633 2156356 2164193 2206723 2259881 2233476 2202664
4332 2202664 2161994 2169260 2248247 2288925 2291441 2249350 2268984 2300319 2325658 2371164 2424053 2408057
4320 2408057 2475161 2499235 2475321 2532423 2554867 2614291 2651552 2613970 2684117 2736477 2800848
4309 2800848 2892137 2891960 2950530 3045086 3141862 3244910 3382703 3585827 3771289 3911062 3982672
4298 3982672 3970844 3893506 3948381 4007363 4018185 3994409 3949826 3859223 3903918 3979547 4145885
4287 4145885 4446065 4762893 5073436 5365590 5608031 5975810 6499345 6782541 6773833 6385744
4277F385744o03308m81044l23533j84570j60646j20120r6756m7068r9784o0818
4267D208097J5062J1711J6701L0377P4798M7823Q9572P9447R1912R0003J75353
4256D930856J36467J64693K78806L10448L61657N17652O89819Q83777J138141
4247I412316J355885J415334J072163J403512J997822K167971J688486L25123
4239B0838612k116102l392792k540503j536310q31572n14504k64469k50637m72443
4230H919280p42312q38100p96376o80748m18354l06587k96903k11512k17357j42318
4220D268713j48732j09844o5784l8048j29732j04408o0333r933o3627M576j3731
4209C529117j3934m495P6173j9405M7302K7196K4650J08965J13812P2193M1982
$$ plain form
4277 6385744 5782436 5301392 4977859 4793289 4632643 4512523 4415767 4368699 4268915 4208097
4267 4208097 4223159 4234870 4251571 4281948 4356746 4404569 4494141 4573588 4665500 4755503 4930856
4256 4930856 5067323 5232016 5510822 5821270 6182927 6700579 7390398 8274175 9412316
4247 9412316 10768201 12183535 13255698 14659210 16657032 18825003 20513489 20838612
4239 20838612 18722510 15329718 12789215 11252905 10421333 9906829 9642360 9391723 8919280
4230 8919280 8176968 7338868 6542492 5861744 5443390 5136803 4839900 4628388 4411031 4268713
4220 4268713 4119981 4010137 3944353 3906305 3776573 3672165 3611832 3601899 3538272 3542848 3529117
4209 3529117 3515183 3510688 3586861 3567456 3614758 3641954 3666604 3775569 3889381 3961574 4003556
4198D003556N9322O4769M0209K8049j4887k3901p1998j24340l6219q1209n1799
4187C791552l0533j1417j2575k3085n9215m0191j8446J6310J0196M0301K3380
4176C686277M2306M1503J0602M6725n1086L2567M8592N1462R6565L4163N4344
4165D094020M3379Q1554N3144N0922Q2605J13629J09123J70591J31980J95913
4155E126860K00414K07626K20301K66146K40432J29997O1915k3321j07348j25627
4145F197395q6551L0789J8338R6261K21230J95541k8960k65221l92677k28179
4135E757966r7556k9283o0314J1356M5338N5880O6143J08731J97908J81734J26940
4124F364843K20480K30027J49870p3266j93449p9538p2614M5424R5849J13123
$$ plain form
4198 4003556 4062878 4127647 4167856 4195905 4181018 4157117 4085119 3960779 3924560 3843351 3791552
4187 3791552 3761019 3749602 3737027 3713942 3654727 3614536 3596090 3612400 3622596 3662897 3686277
4176 3686277 3728583 3770086 3780688 3827413 3776327 3808894 3857486 3908948 4005513 4039676 4094020
4165 4094020 4137399 4218953 4272097 4323019 4405624 4519253 4628376 4798967 4930947 5126860
4155 5126860 5327274 5534900 5755201 6021347 6261779 6391776 6453691 6430370 6323022 6197395
4145 6197395 6110844 6141633 6159971 6256232 6477462 6673003 6644043 6378822 5986145 5757966
4135 5757966 5660410 5631127 5570813 5582169 5627507 5683387 5749530 5858261 6056169 6237903 6364843
4124 6364843 6585323 6815350 6965220 6891954 6698505 6618967 6546353 6591777 6687626 6800749
4114F800749J53109R3035L0145P8807J48188J49054Q4980J04781J36045J34811
4104G913704J58860K63520J85371J85210K02178L19357L39338K96019L59725M34809
4094A0658091M66449O05542P27690R74629J218903J576296K057746K286781K626391
4085B3198518L286929L645441L437647L337933K711261J414874M44973r76559
4077D0501017l443103m164893l552357l558821l454284k538552j553784j042058
4069A7193165p50865n84058m02300m15577m23142l71234j24862J6089K72223M20432
4059A4829871N82313O77324P92373M54484J4898J47843P132l37163n66270o62687
4049A5940118o13688m42332j72247J78440L50136N39788P46363Q21086P70108
$$ plain form
4114 6800749 6953858 7046893 7077038 7155845 7304033 7453087 7538067 7642848 7778893 7913704
4104 7913704 8072564 8336084 8521455 8706665 8908843 9228200 9567538 9863557 10223282 10658091
4094 10658091 11124540 11730082 12457772 13432401 14651304 16227600 18285346 20572127 23198518
4085 23198518 26485447 30130888 33568535 36906468 39617729 41032603 41477576 40501017
4077 40501017 37057914 32893021 29340664 25781843 22327559 19789007 18235223 17193165
4069 17193165 16442300 15858242 15455942 15040365 14617223 14245989 14121127 14137216 14409439 14829871
4059 14829871 15412184 16089508 16881881 17336365 17351263 17499106 17506238 17169075 16602805 15940118
4049 15940118 15326430 14884098 14711851 14890291 15240427 15780215 16526578 17347664 18117772
4040A8117772O66013L90077r3358n95965j014824j189314j012667o32454l86822
4031A4248458j88831R2637L32821M33808M27945L69893K08750j08033n24428r79583
4021A4313437j105815j087438r09491n97960m28352l27949j89073k1450P869L3214
4011I686992m091j24161l25810m54756n71216n85150m44066m13843l72920k45778
4001F145201k31596j31113j47434j29025j10562r3439q9044j51516j61179j93530
3991D706763j09189j27199j05601r2337n5747o0588p7285q4368o1404m1298p1649
3980C820098n0391J6746l4820k2723l4179m6211j7723L2384K9509N1474j7691
3969C726473j0701J4480l5400l8731p4675n9341Q4934R9965o4994K3948L934K6197
$$ plain form
4040 18117772 18783785 19173862 19080504 18484539 17469715 16280401 15267734 14635280 14248458
4031 14248458 14059627 14152264 14485085 14918893 15346838 15716731 15925481 15817448 15293020 14313437
4021 14313437 13207622 12120184 11210693 10612733 10184381 9856432 9667359 9645909 9653778 9686992
4011 9686992 9682901 9558740 9232930 8778174 8206958 7621808 7177742 6763899 6390979 6145201
4001 6145201 5913605 5782492 5635058 5506033 5395471 5302032 5212988 5061472 4900293 4706763
3991 4706763 4597574 4470375 4364774 4272437 4216690 4156102 4078817 3994449 3933045 3891747 3820098
3980 3820098 3769707 3786453 3751633 3728910 3694731 3648520 3630797 3663181 3692690 3744164 3726473
3969 3726473 3715772 3730252 3694852 3656121 3581446 3522105 3607039 3707004 3642010 3665958 3669892 3696089
3957C696089k9598L5490L9766L0107M5322O2095J16216J58275K59654K19796J75196
3946D808408K38497K37287K20376p031l81136m87997l20338j75194j00294j30784
3936C901794r1035k6825J2097j6220m0401K006k6312l6134N865L9750M9922K4353
3924C798860K0406L8730l0172J1118J06242M8368K4735L7942j906Q8099N3321
3913D195743K5286K3420R6114K5886q159J2236M8548L8939r70L6226O790k1188
3901D478871j9258m84m0055j2241k9616k6500n1880P7167R749K0414K4968Q7722
3889D518857N3209n503Q2749K9584J02259K9438K3860Q7501P7593J57041J12244
3878E268832M8436M8098l2802p889J7973q197m1700J3155J7204k4061l050L4761
$$ plain form
3957 3696089 3666491 3701981 3741747 3771854 3817176 3879271 3995487 4153762 4413416 4633212 4808408
3946 4808408 5046905 5284192 5504568 5497537 5116401 4628404 4308066 4132872 4032578 3901794
3936 3901794 3810759 3783934 3796031 3779811 3739410 3741416 3715104 3678970 3684835 3724585 3774507 3798860
3924 3798860 3819266 3857996 3827824 3838942 3945184 3993552 4018287 4056229 4054323 4142422 4195743
3913 4195743 4221029 4244449 4340563 4366449 4358290 4370526 4419074 4458013 4457043 4493269 4500059 4478871
3901 4478871 4459613 4459129 4419074 4406833 4377217 4350717 4298837 4376004 4385753 4406167 4431135 4518857
3889 4518857 4572066 4566563 4649312 4678896 4781155 4810593 4834453 4921954 4999547 5156588 5268832
3878 5268832 5317268 5365366 5332564 5324675 5342648 5334451 5292751 5305906 5323110 5299049 5295999 5330760
3866E330760j3862M7731M5702O4555Q9833L6802M8443L7877j6464P5208J23431
3855E870016P6401N7146Q9552O1126P5493P3802K2847J04497P4596J2741Q4367
3844F602584O9076O1307M7809R5545Q6914Q5671P9263N9690J92526J23953O1016
3833G565354J54252J30305J78872J48562J22691J86426R9537J37624J53933K06370
3823I083926J36037J49525J53690J46110J68275J98210K43727K26581K90069K33846
3813A1029996K48601L84076M26355M10334M36433O20808O94353P16760R09776
3804A5877492J073678J279043J574025J833486K137000K410038K605309K699349
3796C1489420K741843K697132K399998J893604J374451Q59547K86356k31292m83159
$$ plain form
3866 5330760 5316898 5364629 5410331 5474886 5564719 5601521 5649964 5687841 5671377 5746585 5870016
3855 5870016 5946417 6003563 6093115 6154241 6229734 6303536 6326383 6430880 6505476 6518217 6602584
3844 6602584 6671660 6732967 6780776 6876321 6963235 7048906 7128169 7187859 7380385 7504338 7565354
3833 7565354 7719606 7849911 8028783 8177345 8300036 8486462 8585999 8723623 8877556 9083926
3823 9083926 9219963 9369488 9523178 9669288 9837563 10035773 10279500 10506081 10796150 11029996
3813 11029996 11278597 11662673 12089028 12499362 12935795 13556603 14250956 14967716 15877492
3804 15877492 16951170 18230213 19804238 21637724 23774724 26184762 28790071 31489420
3796 31489420 34231263 36928395 39328393 41221997 42596448 43455995 43742351 43511059 43027900
3787D3027900p74807q42752p67544m76393k07850N0560L23931K29085J18889j72078
3777D0508941m98898q95211j377045j862678k135648k367146k581525k525423
3769B6265367k440896k242356j957652j792846j531715j341257j097297r10049
3761A2951299p47486o21926n61221m54984m04442l69336l10022k68520k41120
3752H972242k02447j33126j62407j44137q0062j13576q5640p6105r2534n9044
3742G823164m3374r176j8926M724l8183l4242J0695m9798l3390k1993R968l2983
3730G566486k0844J3924J839K2247P700O967j9189j160m698M4610j8525l6499
3718G562858K0142k1903j3573j1611m3964O163J6601J5981M7090M5593M4893N5426
$$ plain form
3787 43027900 42253093 41410341 40642797 40166404 39958554 40009114 40333045 40562130 40681019 40508941
3777 40508941 40010043 39114832 37737787 35875109 33739461 31372315 28790790 26265367
3769 26265367 23824471 21582115 19624463 17831617 16299902 14958645 13861348 12951299
3761 12951299 12203813 11581887 11020666 10565682 10161240 9791904 9481882 9213362 8972242
3752 8972242 8769795 8636669 8474262 8330125 8250063 8136487 8050847 7974742 7882208 7823164
3742 7823164 7779790 7770614 7751688 7756412 7718229 7683987 7694682 7644884 7611494 7589501 7599469 7566486
3730 7566486 7545642 7559566 7561405 7583652 7591352 7598319 7579130 7577970 7573272 7617882 7599357 7562858
3718 7562858 7583000 7561097 7547524 7535913 7491949 7498112 7514713 7530694 7577784 7623377 7668270 7723696
3706G723696L7347O5231J19194J01877J50504Q1675Q8866Q7294R0264J30927J77547
3695H854422J42088J31851J49706J48665J24739J08550J48593J37053R4027J40660
3685A0180354J71101J36987J76902K04225J25965K12009K26577K13295K79033
3676A1926448K35326K15339K32845K31454J64984J66482J22373J21019O7642N6224
3666A3540136J29512N7246R3826J26837R4257R5086J64228J84762K25603K49094
3656A4960587K27119K46023L22742L29070L28027L71911L90563K77562L68754
3647A7822358L91164M45013M23033N06564N45492O04960P04990P65329R13868
3638B3122771J019216J213668J429304J686311J956796K361668K802090L351308
$$ plain form
3706 7723696 7761043 7826274 7945468 8047345 8197849 8279524 8368390 8455684 8545948 8676875 8854422
3695 8854422 8996510 9128361 9278067 9426732 9551471 9660021 9808614 9945667 10039694 10180354
3685 10180354 10351455 10488442 10665344 10869569 10995534 11207543 11434120 11647415 11926448
3676 11926448 12161774 12377113 12609958 12841412 13006396 13172878 13295251 13416270 13483912 13540136
3666 13540136 13669648 13726894 13820720 13947557 14041814 14136900 14301128 14485890 14711493 14960587
3656 14960587 15187706 15433729 15756471 16085541 16413568 16785479 17176042 17453604 17822358
3647 17822358 18213522 18658535 19081568 19588132 20133624 20738584 21443574 22208903 23122771
3638 23122771 24141987 25355655 26784959 28471270 30428066 32789734 35591824 38943132
3630C8943132L996599M756066N635503O563060P554552Q448218R029258R235458
3622I4161846Q859659P942788O319245M271564J819221q20794l394706n612569
3614A13546254p462179q781661r333089r267683q802921p953306p088287o224197
3606D8632931n470012m725092l994483l391073k928777k490646k069109j792108
3598B1771631j524415j341878j125695j010478r73002p61618p01576o80879o28735
3589A3023355n77122m70234m25791l87887l70779k93466k27073k41107k07607
3580I822289j12876j64493j85305q7531o5500m6753j42853q0661n6993m4124R561
3569H844761k1345m0508k9713o215J7252j212k8268n1453k6886r0169j27862q4599
$$ plain form
3630 38943132 42939731 47695797 53331300 59894360 67448912 75897130 84926388 94161846
3622 94161846 103021505 110964293 117283538 121555102 123374323 122553529 119158823 113546254
3614 113546254 106084075 97302414 87969325 78701642 69898721 61945415 54857128 48632931
3606 48632931 43162919 38437827 34443344 31052271 28123494 25632848 23563739 21771631
3598 21771631 20247216 18905338 17779643 16769165 15796163 15034545 14332969 13652090 13023355
3589 13023355 12446233 11975999 11550208 11162321 10791542 10498076 10271003 10029896 9822289
3580 9822289 9709413 9544920 9359615 9272084 9206584 9159831 9016978 8936317 8879324 8835200 8844761
3569 8844761 8823416 8782908 8753195 8746980 8764232 8763020 8734752 8683299 8656413 8566244 8438382 8353783
3557H353783j37411j39490j80758j77604j45751j61108j96259j38532j12334r3981
3547F870555j13107q2627r1078q3257p5811q4182p6524n1376j9804p248l3480
3536F152061k5766l6271J4790n8272l5480N1059n2669j257P373O9617j3112l3013
3524F039060J5703p7115m5528k3751j4330m6824K3245m0730j5274L3390l1702
3513E816144J2963m968N960K4751K5494L7376k794n2088N0420P267M9094N6826
3501F026445M1605L8657L3197O0995j3683Q0559L5213P2120N1476j0685J0353
3490F426252J6590K4958J7184j0602J2604p1430K1540L7504n7354J8109R293l0035
3478F414613o3212k1869Q472j3024O309k5072J4978k4217n8751j6242R378J140
$$ plain form
3557 8353783 8216372 8076882 7896124 7718520 7572769 7411661 7215402 7076870 6964536 6870555
3547 6870555 6757448 6674821 6583743 6500486 6424675 6340493 6263969 6212593 6192789 6185541 6152061
3536 6152061 6126295 6090024 6104814 6046542 6011062 6062121 6009452 6008195 6015568 6085185 6072073 6039060
3524 6039060 6054763 5977648 5932120 5908369 5894039 5847215 5870460 5829730 5814456 5847846 5816144
3513 5816144 5829107 5824139 5830099 5854850 5880344 5917720 5914926 5862838 5913258 5920525 5969619 6026445
3501 6026445 6068050 6106707 6139904 6200899 6187216 6267775 6302988 6375108 6426584 6415899 6426252
3490 6426252 6442842 6467800 6484984 6474382 6486986 6415556 6437096 6474600 6417246 6435355 6444648 6414613
3478 6414613 6351401 6329532 6338004 6324980 6331289 6306217 6321195 6296978 6238227 6221985 6231363 6232503
3466F232503j010N1544N844K3679k077o292J9039M1505N7067R950P7248M0865
3454F549865M2348K9627K7267K4516N2221L5804N1255r500Q706N1610J8961L9101
3442F921781M5078K4865j4212P9046Q2806J5148M4980R6133K4959R3061Q7717
3431G501362M4709N9331P5738K7854L2935O8390J02494P8468R5627P0994L7155
3420H195057Q2217P0315M7931J32399J02762J34578M8297J12677J20674J21000
3410I167907J25771J34972J41261J68758K82744K44568K95006K84709L56620M28919
3400A1631235M61396M76737N22728N27269N66215O10995N50633M85634M57953
3391A6290795L87590K55866K39815K18981J86884J79699J84943K07502K2015L802
$$ plain form
3466 6232503 6231493 6283037 6288881 6312560 6310483 6304191 6323230 6364735 6421802 6431752 6509000 6549865
3454 6549865 6592213 6621840 6649107 6673623 6725844 6761648 6812903 6803403 6812109 6863719 6882680 6921781
3442 6921781 6966859 6991724 6977512 7056558 7139364 7154512 7199492 7295625 7320584 7413645 7501362
3431 7501362 7546071 7605402 7681140 7708994 7741929 7810319 7912813 7991281 8086908 8157902 8195057
3420 8195057 8277274 8347589 8395520 8527919 8630681 8765259 8813556 8926233 9046907 9167907
3410 9167907 9293678 9428650 9569911 9738669 10021413 10265981 10560987 10845696 11202316 11631235
3400 11631235 12092631 12569368 13092096 13619365 14185580 14796575 15347208 15832842 16290795
3391 16290795 16678385 16934251 17174066 17393047 17579931 17759630 17944573 18152075 18174090 18177892
3381A8177892K3689q79k4390J90J1801L8693o2059j11877j05062j33702j19020
3370A7695276k58006k71144l21313l63060k24423j36977j75550k3398N3669R7810
3360A6072884J20016J27822J02115J71114J51966K02184K56146K01326K87460
3351A7693033M50894N41733O18400P51737R42507J089212J213920J434201J628278
3342B6363915J703331J803284J822291J667426J475139J406170J135374R99928
3334C8376858J017361J018888Q95859P84751O37574L34573J31128o3804j69547
3325D2963641k06786k10133l03315m96681n67255m98632m53210m88071n50555
3316C9189003p52634j112156j404595j613120j695726j551548j222807j055067
$$ plain form
3381 18177892 18201581 18200702 18176312 18176502 18188303 18226996 18164937 18053060 17947998 17814296 17695276
3370 17695276 17437270 17166126 16844813 16481753 16257330 16120353 15944803 15921405 15975074 16072884
3360 16072884 16192900 16320722 16422837 16593951 16745917 16948101 17204247 17405573 17693033
3351 17693033 18143927 18685660 19304060 20055797 20998304 22087516 23301436 24735637 26363915
3342 26363915 28067246 29870530 31692821 33360247 34835386 36241556 37376930 38376858
3334 38376858 39394219 40413107 41308966 42093717 42731291 43065864 43196992 43133188 42963641
3325 42963641 42756855 42546722 42243407 41746726 41179471 40680839 40227629 39739558 39189003
3316 39189003 38436369 37324213 35919618 34306498 32610772 31059224 29836417 28781350
3308B8781350q57025n89826l29457p9480K45056N40280P71742R38513J169022
3299C0590175J255537J400791J444028J485488J399483J219505J052220Q11689
3291D0658916O28371M54388K14869P1798l6093n6154m1956n8394p2234r2820j64005
3280D1506686j45496l05609n57076p83395j005672j235066j350401j508511j686981
3271C2928479j724461j636547j592063j498559j354235j191033j004637q47056
3263B2079888o89231n56239n90670n18565l74914l59193k43343p6907r1729o4488
3253A8514609M9142J02840K10584J54640K27654L78687M70254N41930N92349P59215
3243B2001904P58220Q82341R85175J085495J111409J058720J065261J068659J113979
$$ plain form
3308 28781350 27924325 27334499 27005042 26925562 27170618 27710898 28482640 29421153 30590175
3299 30590175 31845712 33246503 34690531 36176019 37575502 38795007 39847227 40658916
3291 40658916 41287287 41741675 41956544 42028342 41992249 41936095 41894139 41835745 41763511 41670691 41506686
3280 41506686 41361190 41055581 40498505 39715110 38709438 37474372 36123971 34615460 32928479
3271 32928479 31204018 29567471 27975408 26476849 25122614 23931581 22926944 22079888
3263 22079888 21390657 20834418 20243748 19725183 19350269 18991076 18747733 18670826 18579097 18514609
3253 18514609 18563751 18666591 18877175 19031815 19259469 19638156 20108410 20650340 21242689 22001904
3243 22001904 22760124 23642465 24627640 25713135 26824544 27883264 28948525 30017184 31131163
3234C1131163J026442Q94881O65325N57657K58683j13219o04745r85545j204797
3225C1625845j235535j207189j045421q93855q67241p87589p19709p53119p46969
3216B3369218o76301n56093n85059n53017n52488n65606n74407n23706m10664
3207A8371877l76142k12380j86311k53250k27715l24498k64328k91021j78130
3198A6058102j37233o6737k01736k53193j64144j18208n6988L3319J24757R449
3188A5227388J08136p212j01308j13643j19735k35767j98260j27514p3159l8445
3178A4320481j6228J5434P0487J18129J27966J43232J91908K31217L09824L76256
3168A5888706L74140N10745O77282P71803R23874J053867J228544J475998J601728
$$ plain form
3234 31131163 32157605 33052486 33717811 34275468 34534151 34420932 33816187 32830642 31625845
3225 31625845 30390310 29183121 28137700 27243845 26376604 25589015 24869306 24116187 23369218
3216 23369218 22692917 22136824 21551765 20998748 20446260 19880654 19306247 18782541 18371877
3207 18371877 17995735 17783355 17597044 17343794 17116079 16791581 16527253 16236232 16058102
3198 16058102 15920869 15854132 15652396 15399203 15235059 15116851 15059863 15093182 15217939 15227388
3188 15227388 15335524 15328312 15227004 15113361 14993626 14757859 14559599 14432085 14358926 14320481
3178 14320481 14304253 14319687 14390174 14508303 14636269 14779501 14971409 15202626 15512450 15888706
3168 15888706 16262846 16773591 17450873 18222676 19146550 20200417 21428961 22904959 24506687
3159B4506687J752480J742266J724915J505264J104054R96551J159056J419423
3151C5910696J796189K000912J920901J553166R51586L97701K61625M28434O61653
3142D5882863P34376O86982J87250l59304j039865j533562j887695k151756k421677
3133C8097612k608135k764173k831931k624279k519961k268049j951669j708350
3125A8821065j471832j244428j132700q76999p99470o55803o06992m87047m19239
3116A1126555l83093l45245l10044l05290k77213k11640j87378k13803j79693
3107H713156j48683j79910j02516j07037j48820n4228o5860p6531n7153j2996
3097G759422l9560p515l0833L1107Q4462k159L2744J34919Q0894J14346J21742
$$ plain form
3159 24506687 26259167 28001433 29726348 31231612 32335666 33332217 34491273 35910696
3151 35910696 37706885 39707797 41628698 43181864 44133450 44531151 44792776 45221210 45882863
3142 45882863 46617239 47304221 47491471 47132167 46092302 44558740 42671045 40519289 38097612
3133 38097612 35489477 32725304 29893373 27269094 24749133 22481084 20529415 18821065
3125 18821065 17349233 16104805 14972105 14095106 13295636 12639833 12032841 11545794 11126555
3116 11126555 10743462 10398217 10088173 9782883 9505670 9294030 9106652 8892849 8713156
3107 8713156 8564473 8384563 8282047 8175010 8026190 7971962 7906102 7829571 7772418 7759422
3097 7759422 7719862 7712347 7681514 7712621 7797083 7794924 7827668 7962587 8043481 8157827 8279569
3086H279569J56717J50206J49609P5182P3118n674n2480j01335j23491j90440
3076H410981k21069j94099k25929k17154k50703j74275j24962j30859j31096m8174
3066F692661p4717n9623l1397n0197m2798p149j9883l3132l884q2138j6797L0405
3054F301351n3772k3956j85Q500J966N6948O7932K403J0841n9044M304r121n6417
3041F251750m4352l2263k3956j3636k5631l1192q606J0483m345J7305J6113l9691
3029F071979O726K4866j5038o2109O4324J1213k9600k0372R766L0122O3488P0595
3017F225960J05842Q8085R0240M8466n8741q98P062J919K7766L7043L5316K001
3005F610061J31372J7725Q3051N8083n771M0115J1425O7612Q6918J5800J5719
$$ plain form
3086 8279569 8436286 8586492 8736101 8811283 8884401 8878727 8826247 8724912 8601421 8410981
3076 8410981 8189912 7995813 7769884 7552730 7302027 7127752 7002790 6871931 6740835 6692661
3066 6692661 6617944 6558321 6526924 6476727 6433929 6426780 6406897 6373765 6369881 6287743 6270946 6301351
3054 6301351 6247579 6223623 6223438 6231938 6233904 6290852 6358784 6361187 6372028 6312984 6317288 6308167 6251750
3041 6251750 6207398 6175135 6151179 6137543 6111912 6080720 6072114 6082597 6078252 6095557 6111670 6071979
3029 6071979 6078705 6103571 6088533 6026424 6090748 6101961 6072361 6051989 6061755 6091877 6155365 6225960
3017 6225960 6331802 6419887 6510127 6558593 6499852 6498954 6506016 6507935 6535701 6572744 6608060 6610061
3005 6610061 6741433 6759158 6842209 6900292 6894521 6934636 6946061 7013673 7100591 7116391 7132110
2994G132110P0698J10005O0352Q4150M9982Q9253O4993Q8626M7599J17396Q7710
2983H002874P9239L2309O9591K6821K4515J4450l1884P5324M6632M3772J7512
2972H401155Q4335J3042J08656R3417J05548Q6928J78607J71889J13109J53939
2962I510625J27178J31131J12725J41145R1178J28706J44044R6721J17994P5298
2952A0676745J76967J50578J58886Q3645J16278K37748K71152J93771K24187K50955
2942A2540912K49125K47336K18427K95530K91140K97334K74401L28385L08634
2933A5051224M22181M05415L18276M41804K85420J49897P347j09972J5379P4632
2923A7061603J02035J74331K65038L00880K99504K22243K33392K67931K12874
$$ plain form
2994 7132110 7202808 7312813 7373165 7457315 7507297 7596550 7661543 7750169 7797768 7915164 8002874
2983 8002874 8082113 8114422 8184013 8210834 8235349 8249799 8217915 8293239 8339871 8383643 8401155
2972 8401155 8485490 8498532 8607188 8700605 8806153 8893081 9071688 9243577 9356686 9510625
2962 9510625 9637803 9768934 9881659 10022804 10113982 10242688 10386732 10483453 10601447 10676745
2952 10676745 10853712 11004290 11163176 11246821 11363099 11600847 11871999 12065770 12289957 12540912
2942 12540912 12790037 13037373 13255800 13551330 13842470 14139804 14414205 14742590 15051224
2933 15051224 15473405 15878820 16197096 16638900 16924320 17074217 17081564 16971592 16986971 17061603
2923 17061603 17163638 17337969 17603007 17903887 18203391 18425634 18659026 18926957 19139831
2914A9139831K13218J56159J93763K47400K27558L19365L66602L74374M30867
2905B1669137M30541L70965M32101N36655N99532P50463P69420Q84816Q69104
2896B7312734R13126R25160Q50323Q69535R14585Q12823P78629O52181M08284
2887C4437380M43513N07024N34733P22955Q51769J065636J266800J380403J602120
2878D2812333J825645K192798K613321L153348L733507M591515N621003O687383
2870G3230853P966295R840819J2535377J5987037K0101801K3740647K5440979
2863A88843808K6512607K8041111K5384395J2028946j3031252l7455754m4930910
2856A85392951l7422777k6991573j9167717j3995482j0530723q272846o770719
$$ plain form
2914 19139831 19353049 19509208 19702971 19950371 20177929 20497294 20863896 21238270 21669137
2905 21669137 22099678 22470643 22902744 23439399 24038931 24789394 25558814 26443630 27312734
2896 27312734 28225860 29151020 30001343 30870878 31785463 32598286 33376915 34029096 34437380
2887 34437380 34880893 35387917 35922650 36645605 37497374 38563010 39829810 41210213 42812333
2878 42812333 44637978 46830776 49444097 52597445 56330952 60922467 66543470 73230853
2870 73230853 81197148 91037967 103573344 119560381 139662182 163402829 188843808
2863 188843808 215356415 243397526 268781921 280810867 267779615 230323861 185392951
2856 185392951 147970174 120978601 101810884 87815402 77284679 69011833 62241114
2849F2241114n903191n350837m838270m096314l446175k841041k320640j990181
2841C1454465j758924j586533j349807j288836j307585j272881j247383j236895
2833B0405621j188764j106095j031796r00522q47977p34772n57986n16569n35297
2824A2985843m14158l56264l17679l51075l04748k93984l50650k99733l06454
2815I991098l54455l48949j53294j70518j48149j84311k27452k80382l07410k12538
2805G603640j54130k33999j68474j23276j27848j39366r1399p5710j53420r3053
2795F242965r8253k01884j54240j01873j14736j40512j56839j34783j05625j13625
2785D920595j34286j26851j05859r6657n4630j23850q8973r0146p6015n6205q0862
$$ plain form
2849 62241114 56337923 50987086 46148816 42052502 38606327 35765286 33444646 31454465
2841 31454465 29695541 28109008 26759201 25470365 24162780 22889899 21642516 20405621
2833 20405621 19216857 18110762 17078966 16178444 15330467 14595695 14037709 13521140 12985843
2824 12985843 12571685 12215421 11897742 11546667 11241919 10947935 10597285 10297552 9991098
2815 9991098 9636643 9287694 9134400 8963882 8815733 8631422 8403970 8123588 7816178 7603640
2805 7603640 7449510 7215511 7047037 6923761 6795913 6656547 6565148 6489438 6336018 6242965
2795 6242965 6144712 5942828 5788588 5686715 5571979 5431467 5274628 5139845 5034220 4920595
2785 4920595 4786309 4659458 4553599 4456942 4402312 4278462 4189489 4099343 4023328 3967123 3886261
2774C886261n7712p4278L0700m9287p7673l1698j12198q8443r2877q6302p5759
2763C170734r8170r4793q7110r9528j553m0405r1348m3029o59k9596o7244N330
2751B522629p5228M37l3378j9036j41040j37159n5384r129R37k9878k3032N570
2739B006309k189n2562M6R59J246j932Q157M086l9480q2378o5271j6904q2680
2726A677407N078o6433n5923j3947k6281n454j8281o455o1879j1564j2738j7922
2714A385608k6294j9837m3543M2722J7647k9729J2658j2548m3313M2509K980J6490
2702A345350k0806m3666L0707J1709q375r3351k2154j653r2422o4379J0700Q221
2690A059881J7784q471j4977J4238m0322j092j7791j5640k8260l9103K7151q134
$$ plain form
2774 3886261 3828549 3754271 3784971 3735684 3658011 3626313 3514115 3425672 3332795 3246493 3170734
2763 3170734 3072564 2977771 2890661 2791133 2789580 2749175 2657827 2614798 2614139 2584543 2517299 2522629
2751 2522629 2447401 2447838 2414460 2395424 2254384 2117225 2061841 2052712 2053649 2023771 2000739 2006309
2739 2006309 2004120 1951558 1951604 1952563 1953809 1951877 1960034 1964120 1924640 1842262 1776991 1760087 1677407
2726 1677407 1682485 1616052 1560129 1546182 1519901 1514447 1496166 1489711 1427832 1416268 1403530 1385608
2714 1385608 1359314 1339477 1295934 1338656 1356303 1326574 1339232 1326684 1283371 1325880 1328860 1345350
2702 1345350 1324544 1280878 1311585 1323294 1314919 1221568 1199414 1197761 1105339 1040960 1051660 1059881
2690 1059881 1077665 1069194 1054217 1068455 1028133 1027041 1009250 993610 965350 926247 953398 945264
2678I45264n8811m5601J1919O0214o029N0268j2406K7727k4337m7264r5747K4734
2666H29931k9380Q56j0323m5169J1632J2734K6453j2759j0638L0666K8448m6326
2654G86125M0653j3173P5243K4341j6348o8411M4261L0177Q867k9442K9204j452
2642I10045K2951J2238K0867l3098k814j8817m4894l4123O289M2246m626M4202
2630I20466j7457p2578m6035L2103L6483J8378M810Q272K4002r6470j0122P7038
2618H78890O0841q081K3538J7411l095j8978j372L2325n5487J985L1963j467j9637
2605I38836l052l4312J5747K5565l8957M5533J5076m2330m956m978M9868K0700
2593I82740j7178M1493O0336o388K0659J1636N8129P9636M8882R6220J25118J23652
$$ plain form
2678 945264 886453 840852 852771 912985 906956 957224 944818 972545 948208 900944 805197 829931
2666 829931 800551 801407 791084 745915 757547 770281 796734 783975 773337 804003 832451 786125
2654 786125 826778 813605 888848 913189 896841 828430 872691 902868 911735 882293 911497 910045
2642 910045 932996 945234 966101 933003 930189 911372 866478 832355 838644 880890 876264 920466
2630 920466 903009 830431 784396 816499 852982 871360 876170 884442 908444 811974 801852 878890
2618 878890 939731 931650 955188 972599 969504 950526 949154 981479 925992 927977 959940 958473 938836
2605 938836 935784 901472 917219 942784 903827 949360 964436 922106 917150 912172 962040 982740
2593 982740 965562 1007055 1067391 1061003 1081662 1093298 1151427 1231063 1279945 1376165 1501283 1624935
2581A624935R5681J31424K00070R3889P5502k0817k2304j77461k02660j79741
2571A618518j59914j58208q2326o1157n6536r0363o2563k7484m1287n0210l6645
2560G91825Q444k5255p910j1804l0872l8742N0772J1415R277L1465o524j5617
2548G66474l7960j9933l6210n0507L241L0069j4412K566k5324j629J0695j08030
2536E19040J5170l467j7432j8594m534J5337R449p8185q219J2504l7174K4089
2524D27984O156n9403K0642K0625k9497J0439K7415O118k6134p112m093l4474
2512C58666j0893K6213o4637L5435K8228K6375n3827Q58k8463j6918J4247l6846
2500B78438K3032k4465k0159l2792j1247l956r241l2166N4230P2580M4918o5858
$$ plain form
2581 1624935 1720616 1852040 2052110 2145999 2221501 2200684 2178380 2000919 1798259 1618518
2571 1618518 1458604 1300396 1218070 1156913 1100377 1010014 947451 919967 878680 828470 791825
2560 791825 800269 775014 767104 755300 724428 685686 736458 747873 757150 788615 782091 766474
2548 766474 728514 708581 672371 621864 625105 655174 640762 643328 618004 616375 627070 519040
2536 519040 534210 530743 513311 494717 490183 505520 514969 436784 428565 441069 403895 427984
2524 427984 434140 374737 395379 416004 386507 396946 424361 430479 404345 397233 393140 358666
2512 358666 347773 373986 309349 344784 373012 399387 345560 346418 317955 301037 315284 278438
2500 278438 301470 277005 256846 224054 212807 208851 199610 167444 221674 294254 339172 273314
2488B73314k6403J7348K116l1504l732j3419m519k7420k1043J9763J0157p1653
2476A23005M9794K7998K6836K6506l9554J3585k4966m696m3700j8538K1578M5619
2464B03467Q184j9047k0147Q518R667M4600o95R906k9464N843l442m5043l7281
2451A35066J5380m7706M445J4055L3986o688n0849k4054L9600K7985r738l2195
2439I9287M2591M0860m5468n158K3023q837o4365L3038J3942m451K9116j4722
2427A38856K0965L7720j1925m6588o3495P4006j5978K9634l8591p9418L7986J2856
2415I6028J01189l0732m4987Q483n709j2488m2273J8296j8002r87P11L2012N2218
2402A53759j7825l2771M010n608j0209K1022L5019q620r8470n040N7632k3224
$$ plain form
2488 273314 246911 264259 266375 234871 231139 217720 213201 185781 164738 184501 194658 123005
2476 123005 172799 200797 227633 254139 214585 228170 203204 198508 154808 136270 157848 203467
2464 203467 211651 192604 172457 180975 190642 235242 234547 244453 214989 220832 217390 172347 135066
2451 135066 150446 102740 107185 121240 155226 148538 97689 73635 113235 141220 131482 99287
2439 99287 141878 182738 137270 132112 155135 146298 81933 114971 128913 124462 153578 138856
2427 138856 159821 197541 185616 139028 75533 149539 133561 163195 124604 45186 83172 96028
2415 96028 197217 166485 121498 129981 124272 111784 69511 87807 69805 68818 69529 101541 153759
2402 153759 135934 103163 107173 101565 91356 112378 147397 138777 40307 35267 92899 69675
2390F9675K2200j4380m804l442j0048o807L907j2715J9981J6866k6076N0984j4637
2377I0704K2440J2704j6559L4590m5157L695n583j2763m547P8553j9495l2225
2365A06357k0000l296K4355o619n98K1280J6328k0910K2195O440l7115j4680L8988
2352A32725l3747Q989j8178K557j987j974o418l3317K533M103l572m4105k9002
2339b1393L1778O800j451K5486m2416K0659k4299J3366O181K96N4486N5096m478
2326A20111k3699K9874l5015o3794J4176L0379n6512J3594l365M489k8119K7347
2314B9466O2568k6439l0292J2601K8198M099l5834P147j5442K8039L068m3558
2302B3621O0648L1847L073k8955M033M992p803K2420k2836j166k9656J0970L7245
$$ plain form
2390 69675 91875 77495 72691 69249 59201 52394 56301 43586 63567 80433 54357 105341 90704
2377 90704 113144 125848 109289 143879 98722 102417 96834 84071 79524 158077 138582 106357
2365 106357 86357 83061 107416 100797 100199 121479 137807 116897 139092 145532 108417 93737 132725
2352 132725 98978 107967 89789 92346 90359 88385 81967 48650 51183 55286 51714 7609 -21393
2339 -21393 10385 17185 15734 41220 -1196 19463 -4836 8530 14711 15007 69493 124589 120111
2326 120111 96412 126286 91271 27477 41653 72032 15520 29114 25749 30238 2119 29466
2314 29466 92034 65595 35303 47904 76102 80201 44367 51514 36072 64111 67179 23621
2302 23621 84269 116116 119189 90234 94267 99259 91456 113876 91040 89874 60218 71188 108433
2289A08433m8725l9806N5754O582k0709l8O3410L6483m3130l6337k2334J1672
2277G1255j0369j4227J159M3844N194n3295K8120J9691j1762K2943L7033n0729
2265H8857p2637L4989J7973J827J4766j0324L932K9977J3942k8919m6527l8742
2253I114L1963K0037k7560k2050K3752K4643k4386J9789J2007K6977n1361L5520
2241G8445K1259o6845L7606j0692J4736L8135K4371l243n2966n9635M9606M6878
2229A17655k281Q145K5010l6304K90l2108l6477K1133K2418j1471M0332R923Q822
2216A35087O982k8529j4005j5580N2886l937p606J6631N662k0115K7870r742k9013
2203A16591K6590j0889m1406O1303K6735l2396j1729M566k2459L3250L8209l0277
$$ plain form
2289 108433 59708 19902 75656 82238 61529 61491 124901 161384 118254 81917 59583 71255
2277 71255 60886 46659 47818 91662 96856 43561 71681 91372 79610 102553 139586 88857
2265 88857 16220 51209 69182 71009 85775 75451 79383 109360 123302 94383 47856 9114
2253 9114 41077 61114 33554 11504 35256 59899 35513 55302 67309 94286 42925 78445
2241 78445 99704 32859 70465 59773 74509 112644 137015 133772 80806 21171 70777 117655
2229 117655 115374 123519 148529 112225 112515 80407 43930 65063 87481 76010 116342 126265 135087
2216 135087 142069 113540 99535 83955 136841 132904 125298 141929 147591 127476 155346 145604 116591
2203 116591 143181 132292 90886 152189 178924 146528 134799 139365 116906 150156 188365 158088
2191A58088n7761m108K0896L5788n3417q844R3251n0322j7971K2475N8555l2374
2179A64256J7347K0237L285j4468K1273K0809L094J1482j4838P7126l4582j9474
2167B55547K3490k6327M3581N5883p5051L031P048J9087j6125j0948O6998j3583
2155C32631l2399K0560J5092K8593R48Q710j8425J9430n212L2370J8728m7366
2143C73660k2942N1947L46R146k8991M6247L3722L3772R37N7304l5985n7834L5396
2130D96725N9203K0964J8912R0816P4938L588m647K2962k0812J0722L6389M6101
2118H55861K8537m8503O1710N7442n107M9066R5656J09527L0703O7501J17891
2107A420284Q2207R6970J25214J36891J3552M5961J43284K14012L02360M56332
$$ plain form
2191 158088 100327 96219 117115 152903 99486 90642 183893 133571 115600 138075 196630 164256
2179 164256 181603 201840 205125 190657 211930 232739 235833 247315 232477 309603 275021 255547
2167 255547 279037 252710 296291 352174 277123 280154 287202 306289 290164 279216 346214 332631
2155 332631 300232 320792 335884 364477 365425 374135 355710 375140 369928 402298 421026 373660
2143 373660 350718 402665 403011 412157 383166 429413 463135 496907 497844 555148 519163 461329 496725
2130 496725 555928 576892 595804 686620 761558 765146 760499 783461 762649 773371 809760 855861
2118 855861 884398 835895 897605 955047 949940 999006 1094662 1204189 1234892 1302393 1420284
2107 1420284 1502491 1599461 1724675 1861566 1875118 1921079 2064363 2278375 2580735 3037067
2097C037067N83841P98460J091694J637105J559271J279162J929593K097838N47943
2088A4561974l756211l846494j827407j055978o99985n48275m04869l45085k17106
2079A860564j92867j21835j35287n6151j1523m2172j68843j45960j48510k8122
2069H09294j19043l5017j7441l1178m3428l4116j0702q5968n2085r992o2248k6569
2057B81507l1900N5124p882m6191L3573J2680m8752m554M103o5500l540K0209
2045A98877J5671l1276k082l2294M9715P768n0208L274j3415k3730J17J3067M6847
2032A82331K7614l8352k4453q2806Q561M8797P8605k9727o0978n9825K3178L3851
2020A06796k976l1871J1069O133l4445J1003K8424j0542k7823j4173K5537l9682
$$ plain form
2097 3037067 3620908 4419368 5511062 7148167 8707438 9986600 11916193 14014031 14561974
2088 14561974 10805763 6959269 5131862 4075884 3375899 2827624 2422755 2077670 1860564
2079 1860564 1667697 1545862 1410575 1354424 1342901 1300729 1131886 985926 837416 809294
2069 809294 690251 655234 637793 606615 563187 529071 518369 432401 380316 370324 308076 281507
2057 281507 249607 304731 296849 250658 284231 296911 248159 243605 247708 182208 178668 198877
2045 198877 214548 183272 181190 148896 198611 206379 156171 159445 146030 122300 122417 135484 182331
2032 182331 209945 171593 147140 64334 72895 121692 200297 170570 109592 49767 72945 106796
2020 106796 103820 71949 83018 89151 54706 65709 94133 83591 55768 41595 67132 27450
2008B7450l9265J5509M7331O333m8291K7297L8292L799N237J821j5000k8305j6336
1995B5872j743j8654m923N7910j2374k0759J8125j9745O131L2607R365l2505l6726
1982B581n2534K8996M2370j0211K8855m8602q6215J2961M9093J0422L2515k5794
1970a5563J836l3495M0262N6370Q353n0785l1345j4464q107K9949j4082K0363
1958a0708j7249J486N8923L722k4668n70K6621m3910o345m923p391K0954m4850
1945d8908j3558K9702K9639k5990k2448j4670O976J6832J4210k1046j6631M5220
1933b0672Q157J2153J2891N31M243N047k7821k1124k0594N1178M721n7494J9733
1920b9051k791l3995j6170O6591L9874o4940R226K2297k4174J4395n4547J6566
$$ plain form
2008 27450 -11815 3694 51025 57358 9067 36364 74656 78455 83692 85513 70513 42208 25872
1995 25872 24129 5475 552 58462 46088 25329 43454 23709 29840 62447 71812 39307 2581
1982 2581 -49953 -20957 21413 11202 40057 -8545 -94760 -81799 -32706 -22284 10231 -15563
1970 -15563 -13727 -47222 -6960 49410 57763 6978 -24367 -38831 -46938 -16989 -31071 -10708
1958 -10708 -27957 -26471 32452 36174 11506 10936 37557 -6353 -12698 -17621 -25012 -4058 -48908
1945 -48908 -62466 -32764 -3125 -29115 -51563 -66233 -59257 -42425 -28215 -49261 -65892 -20672
1933 -20672 -12515 -362 12529 13060 17303 22350 -5471 -26595 -47189 3989 8710 -48784 -29051
1920 -29051 -31842 -65837 -82007 -15416 24458 -40482 -31256 -8959 -33133 -18738 -73285 -56719
1908e6719J4855J3045m3223R785k3534K4047N6584j4970n2935N9171k1272l1277
1896f6443k2484L0107L0385j2984L889o483j5503n747L6389K5150l0905k766l6424
1883g3819m4185Q9933J4364q3189j0940L5616n413n538k0878K3364O5816L0342
1871A5473o2712K984j6809j7730J7715J8498K6604L7201k7655j3229l14k719J5587
1858g106n1336k3181J5480l3498K9416M5235j8650l719j3915l2342M4441N9727
1846A0552j9092l0973k4304R83K4115L1700j9629k0019k1285R907r063j1801N1441
1833b7468K0790K4140L8419n6880n8571J9520j8081K505J2879M5086K5228k3606
1821C961M614j9822l4825N2561l144K1093j6299m2344o5351R546N077O0369J5040
$$ plain form
1908 -56719 -41864 -28819 -72042 -62257 -85791 -61744 -5160 -20130 -73065 -13894 -35166 -66443
1896 -66443 -88927 -58820 -28435 -41419 -37530 -44013 -59516 -65263 -28874 -3724 -34629 -37395 -73819
1883 -73819 -118004 -28071 -13707 -96896 -107836 -72220 -77633 -83171 -104049 -80685 -14869 15473
1871 15473 -47239 -44255 -61064 -78794 -61079 -42581 -15977 21224 -6431 -19660 -19974 -22693 -7106
1858 -7106 -58442 -81623 -66143 -99641 -70225 -24990 -43640 -47359 -61274 -93616 -49175 10552
1846 10552 -8540 -39513 -63817 -62834 -38719 -7019 -26648 -46667 -67952 -58045 -67108 -78909 -27468
1833 -27468 -6678 17462 55881 -999 -59570 -40050 -58131 -55626 -42747 2339 27567 3961
1821 3961 8575 -11247 -46072 6489 3345 24438 8139 -34205 -99556 -90010 -84933 -24564 -9524
1808i524j4876p436k4052L4481k6330P4945k1733k7409K6268k5646m8094N5763
1796a3643K3896k7450k4537m800Q73K7322k9375K7375j3845o3397N2754O068j960
1783d0719J8203L7131o4065l6080j2461K4362N1198K754N781n5126l6688J6625
1771h9085K8382J2395n747M274M0266J5600N812q5183M2071k2556k0138k6863
1759a00772o460J0829K7742K5302l4419L0096k6344k5613l8602M8457N6495L6922
1747C633l9630k0798P5535K256k004m5380m3860J8043J5501K2113o3108L2441
1735d5258K111j3873J2843r943k7057j1201O084J1011j3902R290k8394L8391N3325
1722a6573j2902j9968J9026k5122l6764K9290j6384j4535J7964P3341K924p5356
$$ plain form
1808 -9524 -24400 -31836 -55888 -21407 -47737 27208 5475 -21934 4334 -21312 -69406 -13643
1796 -13643 10253 -17197 -41734 -46534 -45661 -18339 -47714 -20339 -34184 -97581 -44827 -38759 -40719
1783 -40719 -22516 14615 -49450 -85530 -97991 -73629 -22431 -19677 -13896 -69022 -105710 -89085
1771 -89085 -60703 -48308 -54055 -49781 -9515 6085 11897 -73286 -31215 -53771 -73909 -100772
1759 -100772 -107232 -96403 -68661 -43359 -77778 -47682 -74026 -99639 -138241 -89784 -33289 3633
1747 3633 -35997 -56795 18740 20996 18992 -26388 -70248 -52205 -36704 -14591 -77699 -45258
1735 -45258 -43147 -57020 -44177 -54120 -81177 -92378 -86294 -75283 -89185 -79895 -108289 -69898 -16573
1722 -16573 -29475 -49443 -30417 -55539 -92303 -63013 -79397 -93932 -75968 -2627 297 -75059
1710g5059J3076Q107j5627K333j5075L9550J1050R426l5218m0997M3330Q230q515
1697e5389l9376J8621N9179j2342m8981j1323K668N1633J0324r333L0170m0802
1685d4951m2116P616O5239j610k1183K2832n3006l971O6652j5127n7737j0271
1673h7633N8176L3492o9584j4087J2589k27l1847N7015p448k0973k4822N3922
1661d1427p790q0260K8497L5111l7385M9260O5969n1528l3757n874M4656l1054
1649f5582Q261j1729K8298K852j5456N0644l5584k4672P2537l3161N205j7931
1637c6318j0219J5504m6271J2424K2584j0030J9814l4305M59M5536J3215k4109
1625c1716r401J822q17j5367k6350L084K9181J2040M0220k9939Q587O169j9954
$$ plain form
1710 -75059 -61983 -53876 -69503 -67170 -82245 -42695 -31645 -22219 -57437 -98434 -55104 -46874 -55389
1697 -55389 -94765 -76144 -16965 -29307 -78288 -89611 -86943 -35310 -24986 -34319 -4149 -44951
1685 -44951 -87067 -79451 -14212 -15822 -37005 -14173 -67179 -71150 -4498 -19625 -77362 -87633
1673 -87633 -29457 4035 -65549 -79636 -67047 -67274 -99121 -42106 -49554 -70527 -95349 -41427
1661 -41427 -49217 -129477 -100980 -65869 -103254 -53994 11975 -39553 -73310 -79184 -34528 -65582
1649 -65582 -57321 -69050 -40752 -37900 -53356 -2712 -38296 -62968 9569 -23592 -18387 -36318
1637 -36318 -46537 -31033 -77304 -64880 -42296 -52326 -32512 -66817 -66358 -20822 -7607 -31716
1625 -31716 -41117 -39295 -40112 -55479 -81829 -78745 -49564 -37524 2696 -27243 -18656 -12487 -32441
1612c2441K2017K8216p3224M4490k6678n4962K7174j4516l986r361M8541l8704
1600h3434J1657J8283k2286P5168J1486J5726n9823j959q121K3314M8429q1216
1588e2776n3963N7405N129m1372n610K9441J0440o3697L8981j2195J9213J0058
1576e8946N537M4690k5901O431m29R06j3873J015M1727K0330n0815j6646j8567
1563f4541j2707M5984o968K7829l0412J2063O8n916k2431M1847M4629o4436k1900
1550e6891j8978L802K2918K0810L253J0345J6136k3054j5448m0010P043R465J4539
1537d6070J9523L4917j397J0152M4893j0838p8609l6453J4437j677j2554K3013
1525d0663J5860l1218k0262J0076p104L2237k6748K9232R7159o7349k3273N7437
$$ plain form
1612 -32441 -10424 17792 -55432 -10942 -37620 -92582 -65408 -79924 -83910 -93271 -44730 -83434
1600 -83434 -71777 -53494 -75780 -612 10874 26600 -33223 -35182 -43303 -19989 28440 -52776
1588 -52776 -106739 -49334 -44205 -85577 -91187 -61746 -51306 -115003 -76022 -88217 -69004 -58946
1576 -58946 -53409 -8719 -34620 -28189 -28618 -27712 -41585 -40570 1157 21487 -29328 -45974 -64541
1563 -64541 -77248 -31264 -38232 -10403 -40815 -28752 -28684 -34600 -57031 -15184 29445 -34991 -56891
1550 -56891 -75869 -72067 -49149 -28339 -25086 -14741 1395 -21659 -37107 -77117 -70074 -60609 -46070
1537 -46070 -26547 8370 6973 17125 62018 51180 -27429 -63882 -49445 -51122 -63676 -40663
1525 -40663 -24803 -56021 -76283 -66207 -73311 -41074 -67822 -38590 58569 -8780 -32053 25384
1513B5384n4642L240k0269K2019n0387O516K5173M7445l9961r081k1841M5653
1501b0751j7704Q366M0480k1837j8143K202l7278j5491J183J9728K4301l9822
1489g4766j5209J3002P8043o9187K031j6949L2735M2960N1391o2294q1726L1372
1477f8597K7838M617k4978j8328j1143rL0024m1034J9924M8520m3095N0091O7542
1464D1372j00480P85j255L5977m764j8674n3234l0576R4006N8136k4491k0681
1452b3879K062L5361l0882k3967L7276O256J3738J9646l9788l7064j665N0326
1440G420j356j2834k9140j7487M1388l551K6054r877j1365k0990K0723M3802K537
1427C5324m6256k572L4174j0374N146l5153Q744o026J2543J4934k8160k089k333
$$ plain form
1513 25384 -29258 -26018 -46287 -24268 -74655 -68139 -42966 4479 -35482 -44563 -66404 -20751
1501 -20751 -38455 -30089 10391 -11446 -29589 -27387 -64665 -80156 -78973 -59245 -34944 -74766
1489 -74766 -89975 -76973 1070 -68117 -66086 -83035 -50300 -7340 44051 -18243 -99969 -68597
1477 -68597 -40759 -36142 -61120 -79448 -90591 -90600 -60576 -101610 -81686 -33166 -76261 -26170 41372
1464 41372 -59108 -58323 -59578 -23601 -28365 -47039 -100273 -130849 -36843 21293 -3198 -23879
1452 -23879 -21817 13544 -17338 -41305 -4029 2227 15965 35611 -4177 -41241 -42906 7420
1440 7420 6064 -6770 -35910 -53397 -12009 -15560 10494 617 -10748 -31738 -11015 32787 35324
1427 35324 -10932 -13504 20670 10296 15442 -19711 -10967 -16993 -4450 10484 -17676 -19765 -22098
1414b2098n8114J3611L7174N189j6964K492K142Q513M7592K227k1663k5899m2691
1401f8489R161j6484K9086L2581M279J7976k5865j4077N224P638N54q940L4551
1388G195j0761k8799J9137m3863J0272K6373O048M5188p9161o8J297J5527J9598
1375a2017j3627r13k8438n569K87J4929Q662m922o430N5963l9447l9569K3382
1362d7709M7185l4920J6377M3850K2938o8342j0980j2639O2393M630k7412m0464
1350d5093r815J9388K531j2750q582K827j0756N941j0008J3659N507o030J9602
1337c3579Q594K8444k0067j9699J2380k3406k9440N1632m273j7290J819L3684
1325a1201J5012l4501q059M7392n9250j1811M3497K1192k3686k7986j8443j5634
$$ plain form
1414 -22098 -80212 -66601 -29427 -24238 -41202 -38710 -36568 -28055 19537 21764 101 -25798 -68489
1401 -68489 -59328 -75812 -46726 -14145 -9866 8110 -17755 -31832 -26608 -18970 -18416 -27356 7195
1388 7195 -3566 -32365 -13228 -57091 -46819 -20446 -14398 30790 -48371 -48439 -47142 -31615 -12017
1375 -12017 -25644 -26557 -54995 -60564 -60277 -45348 -36686 -41608 -48038 7925 -31522 -71091 -47709
1362 -47709 -524 -35444 -19067 24783 47721 -20621 -31601 -44240 18153 22783 -4629 -45093
1350 -45093 -54908 -35520 -32989 -45739 -54321 -51494 -62250 -56309 -66317 -52658 -47151 -53181 -33579
1337 -33579 -24985 3459 -16608 -36307 -23927 -47333 -76773 -25141 -29414 -46704 -44885 -11201
1325 -11201 3811 -30690 -38749 8643 -50607 -62418 -18921 2271 -21415 -49401 -67844 -83478
1313h3478M5796J5326J737L292L411l8793R299r184M315l4668M0862L4394L4300
1300B6609j544n1951n0625J0333N863P0115p961n9219k0306l829J7055J3322J0872
1287d1266K7165k0607l5166J2921N864M17j1633J869L6329k9436K0243j084J3083
1274b1301K1483j9376J6315k3482q013n4867j2731M8417K7039j9186l5208N3R323
1261g1534M8672P611j3830j9467K0215J2160M6979p792m2337p808J1489j9894
1249c5536L2570j8519k9603P2807j1988m6441k2875p1120J3894N6329l4464j7416
1237a12362K3694M3250l8204K8281p475L3070M1378l4328m611Q536k3491j6490
1225e8752j3560M8617M0812n577o3628K1716J0287p91q509J5079p268J5931q934
$$ plain form
1313 -83478 -37682 -22356 -20619 -17327 -13916 -52709 -43410 -52594 -48279 -82947 -42085 -7691 26609
1300 26609 25065 -26886 -77511 -67178 -61315 8800 839 -58380 -78686 -82515 -65460 -52138 -41266
1287 -41266 -14101 -34708 -69874 -56953 -51089 -50672 -62305 -60436 -24107 -53543 -33300 -34384 -21301
1274 -21301 182 -19194 -2879 -26361 -34374 -89241 -101972 -53555 -26516 -45702 -80910 -80857 -71534
1261 -71534 -22862 -15251 -29081 -48548 -28333 -16173 30806 23014 -19323 -27131 -15642 -35536
1249 -35536 -2966 -21485 -51088 21719 9731 -36710 -59585 -130705 -116811 -60482 -94946 -112362
1237 -112362 -88668 -45418 -83622 -55341 -62816 -29746 11632 -22696 -27307 -18771 -42262 -58752
1225 -58752 -72312 -23695 17117 11540 -52088 -30372 -20085 -20876 -29385 -14306 -21574 -5643 -14577
1212a4577J6483n4756q140M5895j1082K8452p847j1720j5854M2737J7117L4512
1200F1220n9847k8959J031K4498K8043o4014j3814j9481L8068L9785K4559j9347
1188A1742o8496L5411N0394l3312j0483J7241n2976j418Q1757p841l7504r602
1176b5087q889O985L147M913J0014l0605j4337L7508m420N4851j9221m6611J8551
1163a3201K3717r0708M4625L4716m288m2164l0056J9890L110M2882J6361k6052
1151b1168k0580J3644N629M803K8169l9176R157K0046J4355o5249j3988k1107
1139h5465J1676l0783N524N9857P329L2509l1988J3382k7371K4170k3207J6302
1127b8065Q508K298k2341J9151k948k4369k0973K1762m5406k4209O6173M7325
$$ plain form
1212 -14577 1906 -52850 -60990 -15095 -26177 2275 -5572 -17292 -33146 9591 26708 61220
1200 61220 1373 -27586 -26555 -2057 25986 -38028 -51842 -71323 -33255 6530 31089 11742
1188 11742 -56754 -21343 29051 -4261 -14744 2497 -50479 -51897 29860 22019 -15485 -25087
1176 -25087 -33976 -26991 -23844 -18931 -8917 -39522 -53859 -16351 -20771 34080 14859 -31752 -13201
1163 -13201 10516 -80192 -35567 -851 -5139 -47303 -77359 -57469 -54359 -11477 4884 -21168
1151 -21168 -41748 -28104 -22475 -17672 10497 -28679 -19522 524 14879 -50370 -64358 -85465
1139 -85465 -73789 -104572 -99048 -39191 -31862 647 -31341 -17959 -45330 -21160 -44367 -28065
1127 -28065 -19557 -17259 -39600 -20449 -23397 -47766 -68739 -46977 -92383 -116592 -50419 -3094
1115c094J7003j9579K4161m931m6503n496N993K9327k8404k114L1394o209p569
1102a6021M2271l3574n7231N0950k5399n271P274J7423O286l6754L4756M2969
1090B7679l6316k5969L1766K2540r573l1835k0439l5125L9690j24K7027J1546
1078H67j9671O805k2922k707p1805L1007Q272O3629Q217L598l2200j5865N7061
1065A4286j7518n5195l6782O764K5609M7622M3313K674j2371m262n7429k5823
1053f9112K2027K8666K2255J3516j8230Q01j5921l9869L3667l6179j2425K972
1041f7832n2157L1262L9046N812k810P2858O863q769j6875k6256N493J4063m7009
1028d6311J3570k0664L7355J1150j9087K538p238K3581m395j4561K5897o115r888
$$ plain form
1115 -3094 13909 -5670 18491 13560 -32943 -38439 -32446 -3119 -31523 -33637 -2243 -8452 -16021
1102 -16021 26250 -7324 -64555 -13605 -39004 -44275 -37001 -19578 -13292 -50046 -15290 27679
1090 27679 -8637 -34606 -2840 19700 10127 -21708 -42147 -77272 -37582 -37706 -10679 867
1078 867 -18804 -11999 -34921 -37628 -109433 -78426 -70154 -6525 1692 5290 -26910 -42775 14286
1065 14286 -3232 -58427 -95209 -88445 -62836 -15214 28099 30773 18402 14140 -43289 -69112
1053 -69112 -47085 -18419 3836 17352 -878 -77 -15998 -55867 -22200 -58379 -70804 -67832
1041 -67832 -119989 -88727 -49681 -43869 -46679 26179 33042 24273 7398 -18858 -13365 698 -46311
1028 -46311 -32741 -53405 -16050 -4900 -23987 -21449 -28687 -5106 -9501 -24062 1835 -4280 -14168
1015a4168K4844M501r81J2894l0737j2902J1214J8175L057o2296K3729K9670l3141
1002b6141m9439M4857N3140k7372l3395k6134J9328k5768N711j1O719P5456m6718
989b9767k5012M8694l6434j6219M9808k5157M9734M6005k7990n0611k0843m941
977d2733J0839J014K1817N535M6161j8639q756l1554m8207J3666n8697P7168N9467
964B7081L410j8247m4389J7921L7181M2954n6063n706k4781M2614k8930L6200
952B9245j5448j7459k6131R511L7161l6958L2999o423J3339J449Q767K870L9972
939G2894p0364J3193o8238l030N6371l3249j8826N3492m412m2398L2604K3210
927A1247l1583K005k0181M2589L7076j7227k3396j0512M9174n7193M4473J0411
$$ plain form
1015 -14168 10676 15177 14196 27090 -3647 -16549 -5335 12840 15897 -46399 -22670 7000 -26141
1002 -26141 -75580 -30723 22417 -4955 -38350 -64484 -45156 -70924 -65213 -65224 -58505 16951 -29767
989 -29767 -54779 -6085 -42519 -58738 -8930 -34087 15647 61652 33662 -16949 -37792 -42733
977 -42733 -31894 -30880 -9063 -3528 42633 23994 15238 -16316 -64523 -50857 -109554 -32386 27081
964 27081 30491 12244 -32145 -14224 22957 65911 9848 4142 -20639 21975 -6955 29245
952 29245 13797 -3662 -29793 -20282 16879 -20079 12920 6497 19836 21285 30052 32922 72894
939 72894 2530 15723 -52515 -55545 826 -32423 -51249 2243 -2169 -44567 -11963 11247
927 11247 -20336 -18331 -38512 4077 41153 23926 530 -9982 39192 -18001 26472 36883
915C6883n4372N137J5228L4986r560J130k6058l2314J5470k8638M0996j1179J7285
902D994p7239K39M9900M873J1842L9986L5771m5261n6347J778J8187j2428k3480
889d7185N5678j0369K8674r82l6804q28J0950K2728k4804O930l8531k3325j4518
876g2386O0599l7027J5528K4171j3864j9934J3590Q487J0797K1270J1724k4811
864a856J9096L0318k7497N35l5359J7221K3067k8136J0936L2213M475j3501J5619
851D7131L153M6997o4761j5872M3220o8741j6616N771L459j3538R812J6171L1559
838B7745J1522K467j499l3807N6876K5433k2351o0616j2024l584K8648J7861J6706
825E3377m3988O42M6789L7258p831k7660R043j6437m6308P62M6846l289L8074
$$ plain form
915 36883 -17489 -12352 2876 37862 28302 29432 3374 -28940 -13470 -42108 -1112 -12291 4994
902 4994 -72245 -72006 -22106 -17233 -5391 34595 70366 25105 -31242 -29464 -11277 -23705 -47185
889 -47185 8493 -1876 26798 25816 -10988 -11816 -866 21862 -2942 3988 -34543 -57868 -72386
876 -72386 -11787 -48814 -33286 -9115 -22979 -42913 -29323 -20836 -10039 11231 22955 -1856
864 -1856 17240 47558 20061 20596 -14763 2458 25525 -2611 8325 40538 45013 31512 47131
851 47131 50284 97281 32520 16648 59868 -8873 -25489 -19718 -16259 -29797 -19985 -3814 27745
838 27745 39267 41734 40235 6428 63304 88737 66386 5770 -6254 -9838 18810 36671 53377
825 53377 9389 10031 56820 94078 86247 58587 67630 51193 4885 5647 52493 49204 87278
812H7278m8363l7741j077m1001L481l7911J1025N2639K8793k3125K1967K9125
800D5090l4739l0021J9587J8827l7978L0351k0236m1973j6410P6880K3284j183
788C1479J0404J4781J533p436L0531m8190n822l8915p289L7172K7198l8850l359
775C237M6962M287L5880k9384j7523l1608m2609k7326L2231N4488J0005j8116
763B0524l1353J4563J3099J0724j760o0181K4208P1887J7145j9075j6003l2903
751A0875L1269M0188J3519o3339q336M2886m1433O180P396l480M7284j188l0648
738E1173l7953m285J6926O975J5138l6407n837P839n0093L9949Q657N3859n1373
725A4568J3800L5929K7206n6659m1546j6837K9712M1433k1501l0612l2556m052
$$ plain form
812 87278 38915 1174 97 -40904 -37423 -75334 -64309 -11670 17123 -6002 15965 45090
800 45090 10351 -19670 -83 18744 -19234 11117 -9119 -51092 -67502 9378 32662 31479
788 31479 41883 56664 58197 50761 81292 33102 27280 -11635 -18924 18248 45446 6596 3237
775 3237 50199 54486 90366 60982 43459 11851 -30758 -58084 -25853 28635 38640 20524
763 20524 -10829 3734 16833 27557 25797 -34384 -10176 61711 78856 59781 43778 10875
751 10875 42144 82332 95851 32512 24176 67062 25629 31809 39205 35725 83009 81821 51173
738 51173 13220 8935 25861 32836 47974 11567 5730 13569 -36524 3425 12082 65941 14568
725 14568 28368 64297 91503 34844 -6702 -23539 6173 47606 26105 -4507 -37063 -41115
713d1115K0650M4707J4981N2353o5308L8075J2178o9171p313j3559k9948K9754
701a3716l8243K2381O5386K8014k4577o4876J0767N1808K8564l3254p4522L7326
689d942J2052L397K6529m1835L3826J5236J3757l5239l830j9237M361K1573n736
676A9912L6182J62P190l5200J0332l8181K778N05l8700j0575O4123M6718l7617
663B7629j446J182j798L2259k6403M4554K3919j2974m3275L969K9777k7251L0237
650H0379K1340K4601m4793n5369M1610r392Q196q018K1956l3283l1052K9360j0508
637C5027J3412R668j3336k7247O566L4211j1273Q034n7802n211N1156n4055O539
624d311O585J1185K5161O372m1621M063K0040j9198j2195M5127L7485l6254k6427
$$ plain form
713 -41115 -20465 24242 39223 91576 26268 64343 76521 7350 37 -13522 -43470 -13716
701 -13716 -51959 -29578 35808 63822 39245 -25631 -14864 36944 65508 32254 -42268 -4942
689 -4942 7110 10507 37036 -4799 29027 44263 58020 22781 18951 -286 4075 25648 19912
676 19912 56094 56256 63446 28246 38578 397 3175 3680 -35020 -45595 18528 65246 27629
663 27629 26183 27365 25567 57826 31423 75977 99896 86922 43647 47616 77393 50142 80379
650 80379 101719 126320 81527 26158 67768 58376 66572 58554 80510 47227 16175 45535 35027
637 35027 48439 58107 44771 17524 24090 58301 47028 55062 -2740 -7951 43205 -10850 -4311
624 -4311 2274 13459 38620 44992 3371 7434 27474 8276 -3919 41208 78693 42439 16012
611A6012L0236r771j5906R906k254j2902j8143J6451j7585M1685K6666m7779m0451
598b3835l6642P024N5034L11j5930k300J9184L3824p808j4799M0114P731o855
585E5053q062j2456o970k0903K4301M28k9267l797P942O889K8179p918j4122J3372
571C2669M034N823J1105l8662L7385r42o789O913j0551l3486j5191J9258N0179
558F1745J7529n7389j6139j4299J4304N1924l1979m6726J4431P8719j4859k2608
546C4653K2131L2029j4143k3184m3783l5560N094K2346Q888K3629k9557m7696
534d5153P6694j8994r209J9902j8639N6030j4568o4643L2247j455j0287M4810
522D6735K3318o211j3371P3750j5334k5010o1316o0022O4435L3631K44j2845K0501
$$ plain form
611 16012 46248 36477 20571 30477 28223 15321 -2822 13629 -3956 37729 64395 16616 -23835
598 -23835 -60477 -53453 1581 1892 -14038 -16338 2846 36670 28862 14063 54177 61908 55053
585 55053 46991 34535 27565 6662 30963 31391 2124 -1673 6269 13158 41337 33419 19297 32669
571 32669 36703 42526 53631 14969 52354 51412 44623 51536 40985 7499 -7692 11566 61745
558 61745 79274 21885 5746 -8553 5751 57675 25696 -21030 -6599 72120 57261 34653
546 34653 56784 88813 74670 51486 7703 -27857 -22763 -417 8471 32100 2543 -45153
534 -45153 31541 12547 3338 23240 4601 60631 46063 -18580 13667 12212 1925 46735
522 46735 70053 63842 50471 124221 108887 83877 22561 -37461 26974 60605 60849 48004 68505
509F8505k7687n5484N6505J9068l4641J7168J0228N9990N185j5117j8310m8089
497C7321m147Q847m1371m653R3511j2941p6336P1121L8839K4577j8103n5031l7254
484B4380M9267J4917l9471N673J5583j231o2966j551R887j9115J2009J0221Q3967
471A01570J7289l9372M911m5894j1249K0119J4378K7503J7872n3452m4354j6553
459g232j0301J7760j0905L6010j6992L8038K558j4615j8368j351k2383l8489M0182
446f088J9195j3393L6393L5122k5009O2880j9836P242J2895p0373j2789L3464
434E9703k7614K5718k7340J3970N9760l1713l956l8536K5077L922j8798j9401
422B0792j0493L0105M2030L0000k7920j7857L1773l9052n4509N047L1921M597
$$ plain form
509 68505 40818 -14666 41839 60907 26266 43434 53662 113652 118837 103720 85410 37321
497 37321 33174 42021 650 -4003 89508 76567 231 71352 110191 134768 116665 61634 24380
484 24380 73647 88564 49093 54766 70349 69118 6152 4601 14488 -4627 7382 17603 101570
471 101570 118859 79487 84398 38504 27255 47374 61752 89255 107127 53675 9321 -7232
459 -7232 -17533 227 -10678 25332 8340 46378 48936 34321 15953 14602 -7781 -46270 -6088
446 -6088 13107 -286 36107 71229 46220 109100 89264 96506 109401 39028 26239 59703
434 59703 32089 57807 30467 44437 104197 72484 68528 29992 55069 58991 40193 20792
422 20792 10299 40404 82434 112434 84514 66657 98430 59378 4869 9916 41837 46434
410D6434O259K7267m067l4k2459n603L0070j4320j5051m4290L7756K6577J5533
397H4072j5380k6450q417P831M799j271P783M4652L976m9322J2519k3295L419
384D4916L6395p077j3756K7412n1834K1581k1001r993J2178N4035l2417j8912
372D1527K2056L9730j9188r563Q546J502k8710K3781j5817k9805j71Q079J0823
359E2790N415J8712l017L3987k897J029M858M170m8982r387k5315K7962m5416
346A3909M154O3282R673k9369j8683K0398j1327L0214k267m3272O5751K7812k3619
333A06656n8729L7j5272K7815k2731l4N8400J3091l5704m7441J0127l04L2367
320F8278L3377j9983k8762k6892L2423R774l3949j0754O579L1035m0509M4043
$$ plain form
410 46434 52693 79960 75893 75859 53400 47797 77867 63547 48496 4206 41962 68539 84072
397 84072 68692 42242 33825 41656 46455 45184 52967 97619 101595 52273 64792 41497 44916
384 44916 81311 74234 60478 87890 36056 57637 36636 26643 38821 92856 60439 41527
372 41527 63583 103313 84125 74562 83108 84610 55900 79681 63864 34059 33888 41967 52790
359 52790 58205 76917 73900 107887 104990 106019 110877 115047 66065 56678 31363 59325 13909
346 13909 18063 81345 91018 61649 42966 63364 52037 82251 79984 36712 102463 130275 106656
333 106656 47927 47964 32692 60507 37776 37742 96142 109233 73529 26088 36215 35911 68278
320 68278 101655 81672 52910 26018 58441 68215 34266 23512 30091 61126 20617 64660
308F4660l0102N454l3208M1872l5403J9262j5169L3535O4966n6363L3061P658
296A00223l4240j2297J0615K5687p05n1938M7238K0318q09n4751r399M4576m1538
283D2980K7682K5795l8271N6556j5300J0496J9526o1798k5766J7162o830l32O54
270E2554j0529P495J5349M849K4837o9484K2950M3912J2614k4310J0093k7829
258F2501k5820Q0081L761m2671k1662P896j7974k6785L8798J3077J2986l0431
246E3757M690j5715k6002Q0672p786m7226J216M5370J4634K1446m3262j6240k1078
233D4476L074J8212q839J1468K0190P913k0789J9887J1768j5941l6521k9197J5672
220D1373o755K2813M8070Q752o28j4019K2935m8044p467L851L70L668k4436K3636
$$ plain form
308 64660 34558 40012 6804 48676 13273 32535 17366 50901 115867 59504 92565 100223
296 100223 65983 53686 64301 89988 89283 37345 84583 104901 104092 49341 39942 84518 42980
283 42980 70662 96457 58186 114742 99442 109938 129464 67666 41900 59062 52232 51900 52554
270 52554 42025 49520 64869 69718 94555 25071 48021 91933 104547 80237 90330 62501
258 62501 36681 116762 120523 77852 56190 64086 46112 19327 58125 71202 84188 53757
246 53757 58447 42732 16730 97402 89616 42390 43606 88976 103610 125056 81794 65554 44476
233 44476 47550 65762 56923 68391 88581 96494 75705 95592 107360 91419 54898 25701 41373
220 41373 34618 57431 105501 114253 113625 99606 122541 74497 67030 70881 71251 74919 50483 74119
206G4119m042J2312J4966j8521k8859l568P624J485O131n735m0888J0686L0531
193E6241J9264j6438l3136n752O2478K1111k1901m2225K7264L3515j39j9128m7595
180C3559J2050O3955k8883j3102K4789l5396K2294L6793j607m5160o7669K7681
168B9304L750K2185J8906O165J6955j5635k2892k0898J8245L6095J7024l6427
156G2777k3417L606K5544j063L3200m053j9543m1738J3331P3527l2772j1884K8030
143A15545J711K722p979m1757n5867J2301J0850K4294k2009j5799j5387J1683
131B0308L9053j4113Q747k0682K6965K961J5925K2297m6665L0706K0286J0608
119A16396J735j9725l7236R729L0047o539N078j1270l0322J2174L0374n418l9165
$$ plain form
206 74119 70077 82389 97355 78834 49975 46407 54031 55516 61647 55912 15024 25710 56241
193 56241 75505 59067 25931 20179 82657 103768 81867 39642 66906 100421 100282 81154 33559
180 33559 45609 109564 80681 67579 92368 56972 79266 116059 114452 69292 1623 29304
168 29304 33054 55239 74145 80310 97265 81630 58738 37840 56085 92180 109204 72777
156 72777 49360 52966 78510 77447 110647 106594 87051 45313 58644 132171 99399 87515 115545
143 115545 117256 119978 111999 70242 14375 26676 37526 61820 39811 24012 8625 20308
131 20308 59361 45248 53995 33313 60278 63239 79164 101461 54796 85502 105788 116396
119 116396 118131 98406 61170 70899 100946 94407 99485 88215 57893 70067 100441 95023 55858
106E5858j1777N3970n8872M9932L4942k7283n522l3092j3731J697K77K1418K6433
93I4250j096K3406o0795k6851J3255j4847J2968M1413m011j447l4816J7028K129
80F0586K4821k1428k4120J6930j0628R283L9629J0659J1099j0258O820J4889k1625
67A06657m146r669J9333k3799p152Q568j1230r259K1936j5960O997k3854R394
54F7816L3001l818r635k7064Q147J4655l5116M0629j5430k8390M326L1228j9426
41F0923J9568k577k1940J2078O866Q361l575k1801k4967L9542q25L6666J6085
28A24404o2890P196L2590n6258J9544j9031K5490O622J1321m296J4736N565K3643
15A28636k1387j4998J4777j3035k4088p145K4397O273J3664l7041n842o844p073
$$ plain form
106 55858 44081 98051 39179 89111 124053 96770 91248 58156 44425 46122 46399 67817 94250
93 94250 93154 116560 55765 28914 42169 27322 40290 81703 77692 76245 41429 58457 60586
80 60586 85407 63979 39859 56789 46161 55444 95073 105732 116831 106573 113393 128282 106657
67 106657 102511 92842 112175 88376 81224 89792 78562 69303 91239 75279 82276 58422 67816
54 67816 100817 96999 87364 60300 68447 83102 47986 88615 73185 44795 49121 80349 60923
41 60923 80491 77914 55974 68052 74918 83279 79704 57903 32936 72478 71653 108319 124404
28 124404 61514 68710 101300 45042 64586 45555 71045 77667 88988 84692 99428 104993 128636
15 128636 107249 92251 107028 93993 69905 62760 87157 93430 107094 70053 64211 57367 50294
2E0294M415P657
0F2366
$$ plain form
2 50294 54709 62366
0 62366
$$ Imaginary data points
##PAGE= N=2
##DATA TABLE= (X++(I..I)), XYDATA
16383h51874m839K7753o895K9335R664j3133L0591K0069J0190J0364j2950M6705
16371g05020J2724k112l406R534J2674M1672J7386m7241K0637l1814K3070K7530
16359f24366L3971j7675K1316L2779k069J2613j1717L1418M4682o0K7298J6178
16347d35632l598P569l753K6157L1323K0472K9062K079p447O141K5178N2036M786
16334b45627j4845J0352o288r756j48K4963N5206j2373j7390K695P154m3511Q3101
16321a66467M634L522L7009o432L8516l1976K0051M870m326J7520L9446l1856
16309g5489L4694L0143J6182L6610K7581l5076j1879L2502J9548J7711j2786J7032
16297I6773p027L1974L0907p471j2922p759K6746J2726L588k4493L2815L0623
$$ plain form
16383 -851874 -856713 -828960 -835855 -806520 -796856 -809989 -779398 -759329 -749139 -738775 -751725 -705020
16371 -705020 -692296 -694408 -697814 -688280 -675606 -633934 -616548 -663789 -643152 -674966 -651896 -624366
16359 -624366 -590395 -608070 -586754 -553975 -556044 -543431 -555148 -523730 -479048 -479108 -451810 -435632
16347 -435632 -439230 -431661 -435414 -409257 -377934 -357462 -328400 -326321 -333768 -327627 -302449 -250413 -245627
16334 -245627 -260472 -250120 -256408 -266164 -266312 -241349 -186143 -198516 -215906 -213211 -206057 -249568 -166467
16321 -166467 -161833 -158311 -121302 -127734 -89218 -121194 -101143 -96273 -100599 -83079 -43633 -75489
16309 -75489 -40795 -10652 5530 42140 69721 34645 22766 55268 74816 92527 79741 96773
16297 96773 89746 121720 152627 145156 132234 124475 151221 163947 167535 143042 175857 206480
16285B06480L534r881J8156K5585N716n691N422K4703n903O657L2373O908j3685
16272C00374J5272O5898j8337k0557M4177l6097j0187J3538k4756M1738K1489
16261C92552L008M2465O696J4218j9033m9065j8667q991O6016M4377l2262N7648
16249D98962j1657m6448K2613J2404j7093m443N5903Q795o371L8261j7494j4247
16237E19185J5522K0122J0493M0387J5500k2813m0607J7095P5153J4281k2808
16226F41510l1094p493L9340j1844N014n559O324P822J3116L7232J6709r468K8338
16213G29947j093k275j6176q410M4693k31k8660o245j8694R879L6148K2289O582
16200G67754n255M5403l617j2430k0324R304k0249J2384j5542J8460j0006j9541
$$ plain form
16285 206480 210014 200133 218289 243874 249590 243899 249321 274024 268121 274778 307151 314059 300374
16272 300374 315646 381544 363207 342650 386827 350730 340543 354081 329325 371063 392552
16261 392552 395560 438025 444721 458939 439906 390841 372174 363183 429199 473576 441314 498962
16249 498962 487305 440857 463470 475874 458781 454338 510241 519036 512665 550926 533432 519185
16237 519185 534707 554829 565322 605709 621209 598396 557789 574884 650037 664318 641510
16226 641510 610416 602923 642263 630419 635433 629874 636198 644020 657136 694368 711077 701609 729947
16213 729947 728854 726579 710403 701993 746686 746455 717795 711550 692856 702735 738883 761172 767754
16200 767754 762499 807902 804285 791855 771531 780835 760586 772970 757428 775888 765882 746341
16188G46341K8809j4461J6869L152P3052M104k6604J0559P654k2463k382K3778
16176H48408L8860J9963n9644K5961N2957k0188r2542J2294O4120R712O137r256
16164H96782l9409k0064q936j1634O1613K0938L7163k6210l5086L4717K2101m9352
16152H82623l6445K2737K8954N006R296o296j1855J0791M4929p267Q37J3713l32
16139I56691j4191o8042L7907p655N0551J1631m0588j8847L006L2271l243J8904
16127I58395M6411j490j4801j7836J0693M30p662r479M0970J15l9178N1173Q08
16114A018549R558O570J1973k3179k6010M930l6811L5011j2601n3927j4160J3182
16102I33085J6478M4056j7436l9524N1763p349O869M2896P125J4055K0454k2583
$$ plain form
16188 746341 775150 760689 777558 780710 853762 857866 831262 841821 849475 827012 824630 848408
16176 848408 887268 907231 847587 873548 926505 906317 813775 826069 890189 899901 906038 896782
16164 896782 857373 837309 828373 816739 878352 899290 936453 910243 875157 909874 931975 882623
16152 882623 846178 868915 897869 902875 912171 905875 894020 904811 949740 942473 943310 957023 956691
16139 956691 942500 874458 912365 904710 955261 966892 926304 907457 910463 942734 939491 958395
16127 958395 1004806 1003316 988515 970679 981372 981802 974140 964661 1005631 1005746 966568 1017741 1018549
16114 1018549 1028107 1034677 1046650 1023471 997461 1002391 965580 1000591 987990 934063 919903 933085
16102 933085 949563 993619 976183 936659 988422 981073 987942 1030838 1037963 1052018 1072472 1049889
16090A049889r1030Q06J9834j5396M181L1996J4514l404k3045M4361l722k4047
16078A004937J6443j9493M254l026m5259m959L114j4531M7871M1264O546m8147
16066I89014J3558M1959P685j6549j5485R739j9510k3462N0859m8889m9405J1502
16054I51016N0582J8780j5804j5608M1133m1028l1155N4159L1152L7002N793L333
16042A089355n0597j6858N556k4846J3886m2006K9103K5743l1496O0648J733l4739
16030A025482K66j985M4657k0568l043n0894R889k1698M5104K6764R328J0585
16018A073887m0089O254j9774k8508J9574R490J0384L8197n0914K3986K005n965
16006A038527j4714j3027j2073m614K7225J0080K3306L2148n514J8431n2815K2728
$$ plain form
16090 1049889 958859 959665 979499 964103 968284 1000280 1014794 1011390 988345 1032706 1028984 1004937
16078 1004937 1021380 1001887 1006141 1003115 957856 952897 956011 941480 989351 1030615 1037161 989014
16066 989014 1002572 1044531 1052216 1035667 1020182 1029921 1010411 986949 1037808 988919 939514 951016
16054 951016 1001598 1020378 1004574 988966 1030099 989071 957916 1012075 1043227 1080229 1086022 1089355
16042 1089355 1038758 1021900 1027456 1002610 1016496 974490 1003593 1029336 997840 1058488 1060221 1025482
16030 1025482 1025748 1023763 1068420 1047852 1044809 993915 1003804 982106 1027210 1053974 1063302 1073887
16018 1073887 1033798 1040052 1020278 991770 1011344 1020834 1031218 1069415 1018501 1042487 1044492 1038527
16006 1038527 1023813 1010786 998713 994099 1021324 1031404 1054710 1086858 1081344 1099775 1046960 1069688
15994A069688M302m4711q661N3169n902m9372j6407K8757J0078K0856j2816p698
15982A041283k395L398k5229M552N0962J0290Q341n8460P07O264o685o975j7405
15969A008648L6882k5862K1897K3077n9045K1954M9340l5211J5386J8486Q529
15958A084081p7378j0890j8139j2541j3893k023L9291r258m775O0521K0198k7
15946A055167o458Q156O916l1239L5607o2289L0171J268L4468n514J4692n2244
15934A028701m0746N208J3952J4441k6085L4076R680K0391l338m351K8186J7772
15922A097887m803q2226M016n108M5842N8237k1350l307O10m0830L5270j5394
15910A068844L0832J6903l2949n7309j3150O948j5630N1101m6049J0798p678N498
$$ plain form
15994 1069688 1073990 1029279 1020618 1073787 1067885 1018513 1002106 1030863 1040941 1061797 1048981 1041283
15982 1041283 1038888 1042286 1017057 1021609 1072571 1082861 1091202 1032742 1033449 1039713 1033028 1026053 1008648
15969 1008648 1045530 1019668 1041565 1064642 1005597 1027551 1076891 1041680 1057066 1075552 1084081
15958 1084081 1006703 995813 977674 965133 951240 949217 988508 979250 974475 1034996 1055194 1055167
15946 1055167 1048709 1056865 1063781 1032542 1068149 1005860 1036031 1037299 1071767 1066253 1080945 1028701
15934 1028701 987955 993163 1007115 1021556 995471 1029547 1039227 1059618 1056280 1051929 1080115 1097887
15922 1097887 1093084 1010858 1014874 1009766 1055608 1113845 1092495 1089188 1089798 1048968 1084238 1068844
15910 1068844 1099676 1116579 1083630 1026321 1013171 1020119 1004489 1055590 1009541 1020339 1012661 1018159
15898A018159L0466p155r925N9489J7537n1781K475l1929L1979M2529o8621j050
15886A032173L9886l7625j3240j8937Q2271L3075r41k1318n6728m0272k7978O7164
15874A037530J458P389j2331M2481j1871j5572n829L0279N1389n899r4292j2290
15862A012442N7502J8179l7380n8692K6405J952J7431M3873l1759l0203N2046
15851A071796M5763P27p1286o1912K7908M1482m2058j229P623l5412P4438M1832
15839A099672j3884m6244j2072P9808l2146k8554l836J0172j2910O951k737K089
15827A046309L6533k1657J6068j7181n292l102M8164J0681j6438K6668j0275k8039
15815A082439K8333r341l2391k2978N4100l132k6006Q182j4232n9232j0405O8275
$$ plain form
15898 1018159 1048625 1041470 1031545 1091034 1108571 1056790 1059265 1027336 1059315 1101844 1033223 1032173
15886 1032173 1072059 1034434 1021194 1002257 1084528 1117603 1116662 1095344 1038616 998344 970366 1037530
15874 1037530 1038988 1046377 1034046 1076527 1064656 1049084 1043255 1073534 1124923 1119024 1024732 1012442
15862 1012442 1069944 1088123 1050743 992051 1018456 1020408 1037839 1081712 1049953 1019750 1071796
15851 1071796 1117559 1118286 1047000 985088 1012996 1054478 1012420 1011191 1018814 983402 1057840 1099672
15839 1099672 1085788 1039544 1027472 1107280 1075134 1046580 1042744 1052916 1040006 1046957 1044220 1046309
15827 1046309 1082842 1061185 1077253 1060072 1054780 1051678 1099842 1110523 1094085 1120753 1110478 1082439
15815 1082439 1110772 1101431 1069040 1046062 1100162 1097030 1071024 1079206 1064974 1005742 995337 1063612
15803A063612m466r644k5187O0507l2733P362l588p089l872l210J6029k5215J4824
$$ plain form
15803 1063612 1059146 1049502 1024315 1084822 1052089 1059451 1055863 1048774 1044902 1041692 1057721 1032506 1047330
$$ [...]
##END NTUPLES=NMR SPECTRUM
##END=
