##TITLE=1H_CG-1150-F3
 CDCl3
 8 sc, 
 15.3.2023
##JCAMPDX= 6.0         $$ Bruker NMR JCAMP-DX V2.0
##DATA TYPE= NMR SPECTRUM
##DATA CLASS= NTUPLES
##ORIGIN= UXNMR, Bruker Analytische Messtechnik GmbH
##OWNER= root
$$ XWIN-NMR		Version 3.5
$$ Wed Mar 15 14:37:33 2023 Russian Standard Time (UT+4h)  she@DPX200
##.OBSERVE FREQUENCY= 200.13135
##.OBSERVE NUCLEUS= ^1H
##.ACQUISITION MODE= SIMULTANEOUS
##.ACQUISITION SCHEME= undefined
##.AVERAGES= 8
##.DIGITISER RES= 18
##SPECTROMETER/DATA SYSTEM= spect
##.PULSE SEQUENCE= zg30
##.SOLVENT NAME= DMSO
##.SHIFT REFERENCE= (INTERNAL, DMSO, 0, 15.7337)
##AUDIT TRAIL= $$ (NUMBER, WHEN, WHO, WHERE, WHAT)
$$ ##TITLE= Audit trail, XWIN-NMR		Version 3.5
$$ ##JCAMPDX= 5.01
$$ ##ORIGIN= Bruker BioSpin GmbH
$$ ##OWNER= she
$$ F:/spectra/data/she/nmr/H-F/1/pdata/1/auditp.txt
$$ ##AUDIT TRAIL=  $$ (NUMBER, WHEN, WHO, WHERE, WHAT)
(   1,<2023-03-15 14:36:17.28 +0400>,<she>,<DPX200>,
      <created by zg, POWCHK disabled, PULCHK disabled
       configuration hash MD5:
       00 E9 B6 7A A2 85 ED C7 34 08 36 98 17 FE 4E 26
       data hash MD5: 16K
       3D 9F C4 A8 10 5F 8D A5 AA 79 F1 DC D7 7B F2 13>)
(   2,<2023-03-15 14:36:19.68 +0400>,<she>,<DPX200>,
      <Start of raw data processing
       efp BC_mod = 2 LB = 0.24 FT_mod = 6 PKNL = 1 PHC0 = -19106.82 PHC1 = 13.80074 SI = 16K 
       data hash MD5: 16K
       76 9B 2D CD DE 77 E2 74 E1 63 DB D6 CB EA 47 65>)
(   3,<2023-03-15 14:36:41.04 +0400>,<she>,<DPX200>,
      <pk PHC0 = -3.43654 PHC1 = 5 
       data hash MD5: 16K
       1D 78 3F 32 0F A9 4A 3A C4 72 D8 0F A1 56 54 6D>)
(   4,<2023-03-15 14:36:44.06 +0400>,<she>,<DPX200>,
      <abs ABSG = 5 
       data hash MD5: 16K
       D1 A1 5F 37 0F EA 0F DB 2C BD BD 14 7A E1 28 CA>)
$$ ##END=
$$ 
$$ hash MD5
$$ E2 BD DE 0B 1E 1E 34 FD 04 C3 D7 25 FB 33 1A 61
##$RELAX= 
##$RELAX= 
##$RELAX= 
##$RELAX= 
##$RELAX= 
##$RELAX= 
$$ Bruker specific parameters
$$ --------------------------
##$DU= <F:/spectra>
##$EXPNO= 1
##$NAME= <H-F>
##$PROCNO= 1
##$TYPE= <nmr>
##$USER= <she>
##$AMP= (0..31)
100 100 100 100 100 100 100 100 100 100 100 100 100 100 100 100 100 100 
100 100 100 100 100 100 100 100 100 100 100 100 100 100 
##$AQSEQ= 0
##$AQ_mod= 1
##$AUNM= <au_zg>
##$AUTOPOS= <>
##$BF1= 200.13
##$BF2= 200.13
##$BF3= 200.13
##$BF4= 200.13
##$BF5= 200.13
##$BF6= 200.13
##$BF7= 200.13
##$BF8= 200.13
##$BYTORDA= 1
##$CFDGTYP= 0
##$CFRGTYP= 5
##$CHEMSTR= <none>
##$CNST= (0..31)
1 1 145 1 1 1 1 1 1 1 1 1 1 1 1 1 1 1 1 1 1 1 1 1 1 1 1 1 1 1 1 1 
##$CPDPRG= <>
##$CPDPRG1= <>
##$CPDPRG2= <>
##$CPDPRG3= <>
##$CPDPRG4= <mlev>
##$CPDPRG5= <mlev>
##$CPDPRG6= <mlev>
##$CPDPRG7= <mlev>
##$CPDPRG8= <mlev>
##$CPDPRGB= <>
##$CPDPRGT= <>
##$D= (0..31)
0 1.2 0 0 0 0 0 0 0 0.06 0 0.03 0 0 0 0 0.0002 0 0 0 0 0 0 0 0 0 0 0 0 
0 0 0 
##$DATE= 1678876576
##$DBL= (0..7)
120 120 120 120 120 120 120 120 
##$DBP= (0..7)
150 150 150 150 150 150 150 150 
##$DBP07= 0
##$DBPNAM0= <>
##$DBPNAM1= <>
##$DBPNAM2= <>
##$DBPNAM3= <>
##$DBPNAM4= <>
##$DBPNAM5= <>
$$ [...]
##$SUBNAM3= <"">
##$SUBNAM4= <"">
##$SUBNAM5= <"">
##$SUBNAM6= <"">
##$SUBNAM7= <"">
##$SUBNAM8= <"">
##$SUBNAM9= <"">
##$SW= 18.05172834244
##$SWIBOX= (0..15)
0 0 2 0 0 0 0 0 0 0 0 0 0 0 0 0 
##$SW_h= 3612.71676300578
##$TD= 16384
##$TD0= 1
##$TE= 0
##$TE2= 300
##$TE3= 300
##$TEG= 300
##$TL= (0..7)
0 120 120 120 120 120 120 120 
##$TP= (0..7)
150 150 150 150 150 150 150 150 
##$TP07= 0
##$TPNAME0= <>
##$TPNAME1= <>
##$TPNAME2= <>
##$TPNAME3= <>
##$TPNAME4= <>
##$TPNAME5= <>
##$TPNAME6= <>
##$TPNAME7= <>
##$TPOAL= (0..7)
0.5 0.5 0.5 0.5 0.5 0.5 0.5 0.5 
##$TPOFFS= (0..7)
0 0 0 0 0 0 0 0 
##$TUNHIN= 0
##$TUNHOUT= 0
##$TUNXOUT= 0
##$USERA1= <user>
##$USERA2= <user>
##$USERA3= <user>
##$USERA4= <user>
##$USERA5= <user>
##$V9= 5
##$VALIST= <valist>
##$VCLIST= <CCCCCCCCCCCCCCC>
##$VD= 0
##$VDLIST= <DDDDDDDDDDDDDDD>
##$VPLIST= <PPPPPPPPPPPPPPP>
##$VTLIST= <TTTTTTTTTTTTTTT>
##$WBST= 1024
##$WBSW= 4
##$XGAIN= (0..3)
0 0 0 0 
##$XL= 0
##$YL= 0
##$YMAX_a= 132136
##$YMIN_a= -151829
##$ZGOPTNS= <>
##$ZL1= 120
##$ZL2= 120
##$ZL3= 120
##$ZL4= 120
##$ABSF1= 15.7535
##$ABSF2= -2.298349
##$ABSG= 5
##$ABSL= 3
##$ALPHA= 0
##$AQORDER= 0
##$ASSFAC= 0
##$ASSFACI= 0
##$ASSFACX= 0
##$ASSWID= 0
##$AUNMP= <proc_1d>
##$AZFE= 0.1
##$AZFW= 0.1
##$BCFW= 0
##$BC_mod= 2
##$BYTORDP= 0
##$COROFFS= 0
##$CY= -3
##$DATMOD= 1
##$DC= 0
##$DFILT= <>
##$DTYPP= 0
##$F1P= 0
##$F2P= 0
##$FCOR= 1
##$FTSIZE= 16384
##$FT_mod= 6
##$GAMMA= 0
##$GB= 0
##$INTBC= 1
##$INTSCL= 3.70164e-10
##$ISEN= 128
##$LB= 0.24
##$LEV0= 0
##$LPBIN= 0
##$MAXI= 10000
##$MC2= 0
##$MEAN= 0
##$ME_mod= 0
##$MI= 1.114404
##$NCOEF= 0
##$NC_proc= -8
##$NLEV= 6
##$NOISF1= 3.799351
##$NOISF2= 2.8
##$NSP= 0
##$NTH_PI= 0
##$NZP= 0
##$OFFSET= 15.73367
##$PC= 1
##$PHC0= -19110.26
##$PHC1= 18.80074
##$PH_mod= 1
##$PKNL= yes
##$PPARMOD= 0
##$PSCAL= 0
##$PSIGN= 0
##$REVERSE= no
##$SF= 200.130007579001
##$SI= 16384
##$SIGF1= 3
##$SIGF2= 2
##$SINO= 5.538805
##$SIOLD= 16384
##$SREGLST= <1H.CDCl3>
##$SSB= 0
##$STSI= 16384
##$STSR= 0
##$SW_p= 3612.71676300578
##$SYMM= 0
##$S_DEV= 0
##$TDeff= 16384
##$TDoff= 0
##$TI= <>
##$TILT= no
##$TM1= 0
##$TM2= 0
##$TOPLEV= 0
##$USERP1= <user>
##$USERP2= <user>
##$USERP3= <user>
##$USERP4= <user>
##$USERP5= <user>
##$WDW= 1
##$XDIM= 16384
##$YMAX_p= 309785607
##$YMIN_p= -1034187
$$ End of Bruker specific parameters
$$ ---------------------------------
##NTUPLES= NMR SPECTRUM
##VAR_NAME=  FREQUENCY,     SPECTRUM/REAL,   SPECTRUM/IMAG
##SYMBOL=    X,             R,               I
##VAR_TYPE=  INDEPENDENT,   DEPENDENT,       DEPENDENT
##VAR_FORM=  AFFN,          ASDF,            ASDF
##VAR_DIM=   16384,         16384,           16384
##UNITS=     HZ,            ARBITRARY UNITS, ARBITRARY UNITS
##FACTOR=    0.220516191357247, 1,           1
##FIRST=     3148.77954331205, 0,            0
##LAST=      -463.937219693734, 0,           0
##MIN=       -463.937219693734, -1034187,    0
##MAX=       3148.77954331205, 309785607,    0
$$ Real data points
##PAGE= N=1
##DATA TABLE= (X++(R..R)), XYDATA
$$ [...]
7898 -40550 -4874 33269 -52462 -402821 -265055 -155092 -380061 -480807 -430277 -194685 -256492
7887 -256492 -338634 -122894 -30254 -224490 -261078 10151 -122732 -42351 -496843 -694639
7877 -694639 -414408 -682697 -298655 -370082 -534844 -446555 -401597 -289528 -455024 -115060
7867 -115060 -19327 -1472 -206132 -290764 -573806 -854330 -57854 153881 272444 -84478
7857 -84478 6208 60726 -257236 -208963 -272103 -58129 30794 20393 4438 -149656 -245630
7846 -245630 -517125 -569173 -460252 -511052 -603356 -852099 -453613 -414613 -537739 -580414 -375950
7835 -375950 -82581 -380876 -268951 -526331 -266416 -110294 14861 -182352 -206614 -410035
7825 -410035 -686983 -670145 -79192 -122350 -374811 24387 -103455 -25027 -195511 -207544
7815 -207544 282014 -140560 -509826 -575641 -189468 -253352 -363130 17718 721110 -165148
7805 -165148 -710987 -237795 -30045 -327396 -544696 -451489 -428043 -307207 -60517 337317
7795 337317 -55340 -356987 -625180 -115059 -207640 -36339 -89285 -537812 -279394 -570445
7785 -570445 -475168 64207 208873 307518 307653 392581 9445 -4794 -36668 -130991 -313491
7774 -313491 -842830 -723960 -543244 -627749 -227418 -110988 -217246 -368443 -108789 -139735
7764 -139735 -412832 -673215 -435257 -36663 -11725 -165005 -241356 -275527 -299532 -453963
7754 -453963 -536188 -349843 -141887 -465265 -14791 152495 156997 -269210 -168649 274317
7744 274317 92729 145976 -54982 -408788 -124920 202806 193602 -25868 160386 -98479
7734 -98479 -195045 202058 538472 254063 -111701 348258 732093 742909 161180 1938
7724 1938 2442 113391 58602 -288244 -603742 -551273 -15016 200231 345493 112170 17066
7713 17066 -132552 -545422 -542848 -528206 -49081 252746 468613 -227626 -408314 -292238
7703 -292238 -342883 -118923 3067 -345709 -192129 -658720 -549791 -181704 -244739 -43105
7693 -43105 -287775 -3432 -132150 13440 -6333 -386768 -491396 -334244 -39614 -299979
7683 -299979 -56584 -298315 -528949 -323357 5413 -126770 -379763 -516053 -247792 17742
7673 17742 -173561 -357411 -288211 -73261 -334687 -345353 -512121 -442972 -385595 -593856 -261170
7662 -261170 -641195 -448678 -284985 -168056 -81101 -135410 -184307 -17755 -304624 -142658
7652 -142658 92756 -292117 -183587 -489984 -303602 -262786 305090 128970 -198688 -31100
7642 -31100 128125 188604 -461358 -547965 -200203 -114735 -119777 -289530 -342696 -306391 -156301
7631 -156301 -340647 -714666 -747881 -637618 -234209 -169889 -359489 221523 354020 25733
7621 25733 -346411 -435809 239323 322592 419620 -155270 -250693 72794 53954 288825 241839
7610 241839 -130380 -198254 -575801 -600496 -319323 -448396 -366922 -386174 -365484 -486314 -324704
7599 -324704 -289024 -373335 -323000 -56013 232626 -241745 -499140 -34060 55764 93768 41161
7588 41161 188817 6460 195249 140101 11010 -28389 -185707 21236 -115633 -243766
7578 -243766 -356866 -538768 -562280 -700225 -583074 -296144 -411060 -257789 46201 34982
7568 34982 221942 -75855 428254 246639 -306486 -464917 -173662 -606278 -617685 -671264
7558 -671264 -826063 -624977 -294042 -171494 -349961 -224366 -474703 -645887 -129615 -148278
7548 -148278 -364836 -335114 -728241 -184543 -317168 -71993 426826 383077 166951 73134
7538 73134 82210 -68184 21274 118567 384800 512917 158066 -12715 -174645 -81476 56363
7527 56363 152150 2241 28557 186947 192759 -77921 -237117 -238506 -104177 -471503 -257107
7516 -257107 -134656 -258614 -112802 -470833 -799847 -592227 -540205 -82768 -115217 -723544
7506 -723544 -119394 181634 -67584 134391 -86362 -310150 -284593 -106291 20541 91758
7496 91758 -19721 -230066 -613581 -353585 -167964 -76994 69796 -67026 207810 320739
7486 320739 298086 -345820 -597728 -215766 -230026 -207635 47842 323881 16178 -27541
7476 -27541 -252469 439847 249397 -173811 26339 -73741 -368620 -381289 182922 110458
7466 110458 153867 75372 490656 641905 175302 238480 288416 305482 112928 161781 219556
7455 219556 -133076 -519477 -243926 184791 157565 294050 128417 176414 140744 401491
7445 401491 546354 545876 67963 157410 319790 275749 40101 169476 339111 -33262 -387936
7434 -387936 293789 406095 630067 313315 100554 192141 40070 -6806 173579 -182935
7424 -182935 -382415 -366784 -318633 417875 59329 -257756 -31375 -162306 223266 102457
7414 102457 -297605 -135576 -89777 84685 -95593 246693 -85715 220713 635419 300890
7404 300890 198299 -121272 -123087 -93724 118649 75813 187137 80367 115779 347696 161970
7393 161970 441705 534957 -67915 -88404 147700 -278420 -46415 523489 496546 566085
7383 566085 890372 501777 45841 55371 188945 524452 577661 146973 200944 59137
7373 59137 361124 461297 188743 -249247 6336 440197 293360 -108864 -212237 -165979
7363 -165979 -52201 252038 -3042 119811 593377 568850 423652 190617 277577 160342
7353 160342 95190 63635 237278 530315 677152 453906 234154 170801 162940 -52832 -2667
7342 -2667 -141489 14146 474719 216877 217536 403394 495612 336609 518025 281002 156278
7331 156278 372245 754243 754090 832085 662597 915282 791229 648314 496879 572788 559970
7320 559970 735027 473209 266107 360103 533028 683643 960280 1319628 1094353 684476
7310 684476 514231 1055983 963104 719241 362692 579171 990547 1126360 1247544 1207068
7300 1207068 1025689 987299 831531 1092454 1076255 951204 955374 1018511 1064918 1353778 1064858
7289 1064858 987312 1089356 1180379 1382572 1469542 1256666 1236198 879296 635722 1165548
7279 1165548 1046655 1301010 1242375 1140532 1193555 1765773 1973910 2188900 1945385 1779352
7269 1779352 1544049 1850008 2319998 2598526 2666251 2567403 2829899 2773840 2629510 2771756
7259 2771756 3015233 3050316 3361831 3466072 3759018 3448346 4135747 4255914 4065338 4103228
7249 4103228 4116050 4015982 4186752 4192568 4127897 4228166 4292737 4462127 4295254 4185304
7239 4185304 3940453 3834650 3417681 3073631 2827467 2884448 3023283 3054480 3061363 2823850
7229 2823850 2780477 2440888 2183031 2184169 2641610 2594898 1951363 2207919 2139397 1697685
7219 1697685 1558849 1462298 2167971 2169848 2035653 2033894 1699954 1492684 1449133 1632875 1442769
7208 1442769 1378871 1600316 1230571 978219 1160040 1137554 1006105 1177711 1425844 1608389
7198 1608389 1598127 1662213 1296437 1001013 920977 1071796 1659336 1609012 1609614 1417642 1262129
7187 1262129 1399105 1239144 1020933 1038817 1369682 1412923 1317223 2013159 1460975 1230029
7177 1230029 1097939 1344451 1541916 1848566 1715060 1615554 1577617 1422961 1436506 1547566
7167 1547566 1401558 1637245 1748900 1603298 1760867 1486024 1262649 1258012 1149168 1200761
7157 1200761 1409062 1804989 1684754 1272241 1138904 1596392 1556404 1769825 1819074 1700294
7147 1700294 1882909 2047292 2174928 1945150 2053360 2078799 2129196 1836762 2002411 2423001
7137 2423001 2709280 2662556 2266125 2272398 2171628 2174048 2235622 2359858 2798944 2545741 2425809
7126 2425809 2332936 2460215 2852047 2754798 2982879 2726394 2829307 2783204 3021877 3170498
7116 3170498 3304147 3304509 3317028 3391796 3398852 3522672 3643425 3979963 3862902 3950738 3762582
7105 3762582 3940150 3490465 3659807 3943762 4158091 3998742 4196737 3874669 4294631 4677153
7095 4677153 4805930 4490270 4551369 4860090 5157900 5392378 5341661 4895021 4679861 4682572
7085 4682572 4888535 4957932 5263941 5505612 5731391 5985938 6111685 6064947 6322193 6631353
7075 6631353 6724142 6475064 6389922 6557946 7262571 7657881 7348111 7694867 7860271 7968471
7065 7968471 8217976 9014039 9468870 9425740 9975480 10478941 10780246 10934733 11226927 11754833
7055 11754833 11945350 11974004 12531564 12770489 12910270 13542508 13822195 14069825 14291055 14560271
7045 14560271 14475167 14657443 14865059 14548713 14346795 14466866 15016702 15133109 14899974 15233626
7035 15233626 14710727 14374311 14179964 14356934 14179502 13669281 13147065 12992581 12701348
7026 12701348 12409328 11789306 11376163 11311059 10841272 10357628 10166324 10003298 9705988 9499298
7016 9499298 9118546 8766391 8891016 8627352 8121761 7602515 7879466 7678236 7145536 6647376
7006 6647376 6106049 5621789 5946267 6089058 5613517 5330105 5329293 4966495 5037872 5043179 4637042
6995 4637042 4253468 4218561 4310918 4695208 4510562 3822743 4092471 4202434 4027424 4115637
6985 4115637 3748124 3726638 3475941 3462531 3310374 3267383 3431385 3277764 3164429 2753104
6975 2753104 2812176 2745764 2491298 2515096 2593676 2554900 2738381 2488836 2555858 2417826 2370357
6964 2370357 1862371 1715488 1961087 2215394 1544245 1331686 1614960 1606904 1849376 1984670
6954 1984670 2008523 1750238 1748567 1392269 1348829 1914264 1611680 1805775 1480973 1412142
6944 1412142 1692433 1671398 1601883 1321683 1273435 1243495 1160180 823348 1391006 1376904 1174805
6933 1174805 1252215 1327172 1078566 979387 870913 1234006 1235657 1351544 1572434 1358561
6923 1358561 1211155 1063683 1158500 939328 1440475 1490163 1167112 1320115 1229479 669723
6913 669723 1116075 882155 728856 739367 778479 793000 1040590 768740 707349 722510 958239
6902 958239 1224066 857064 966005 1311116 1431906 1165983 1105184 830624 683261 554798
6892 554798 651925 861885 583201 681486 756246 1119981 1006002 688942 803110 1256399
6882 1256399 921327 643562 999238 933284 911774 478559 309642 552290 933666 355925
6872 355925 201336 374862 324068 434492 184662 287719 566346 425590 161510 593814
6862 593814 489385 437291 245026 431838 389034 317521 789006 928119 681105 530679
6852 530679 665631 -2723 407438 1039514 803476 144115 168268 408869 830101 723166
6842 723166 866361 521155 532511 448057 493168 644079 420319 664054 482045 140749
6832 140749 -151762 144431 281855 -298083 430594 455222 394379 557264 422747 604996
6822 604996 817398 682927 472218 160722 14044 547563 569787 923156 402106 -155479
6812 -155479 -47275 193545 -99624 -67714 527969 684791 257419 445022 751618 1001379
6802 1001379 603064 378790 529995 621645 459695 248498 270502 119476 650265 733800
6792 733800 976516 819209 747991 597567 717642 765549 975483 984745 773287 900328
6782 900328 212028 746031 561357 639747 1060207 1227272 829093 361217 486274 543898
6772 543898 431714 63985 226495 495635 618178 544189 751129 707439 540691 469615
6762 469615 558400 837218 695375 526234 640432 364206 442111 -25250 378583 656949
6752 656949 793600 646158 470479 344547 708407 872170 691574 614575 557273 644976
6742 644976 279454 465287 525542 301583 246764 353984 4378 95718 707348 1073173
6732 1073173 721544 866091 966391 766689 446513 480314 147016 384918 537704 889456
6722 889456 734933 344865 831452 842621 1188642 792108 769047 785935 386603 587576
6712 587576 547355 611080 823817 847961 796102 700979 866554 956027 1130596 873856 976908
6701 976908 949469 536264 1030417 974450 757158 861203 1027458 1273323 1590038 1766027
6691 1766027 1274738 974855 1491627 1130731 1072999 1277715 1016714 942504 1026155 1052241
6681 1052241 980363 1180810 1199045 1329343 826256 591671 295760 113635 247926 773276
6671 773276 576433 183192 761476 979527 863281 681493 285704 306464 995915 859740
6661 859740 501780 167994 158228 501600 316468 82072 11642 261994 297205 -999
6651 -999 124040 325779 459541 181320 195315 -197891 -36805 48365 456968 84258 -36778
6640 -36778 11760 -165890 -298698 150960 303587 -88717 -353078 -43714 462723 313015
6630 313015 633425 66978 106977 178811 105656 420993 328845 127903 428379 372953 257401
6619 257401 494157 443288 697190 846620 307616 441092 158054 -3846 236915 429352
6609 429352 78824 8932 314891 696296 627401 492973 501688 802289 436350 231454
6599 231454 475905 413796 333515 -35177 153284 145413 162690 -126694 13299 35859 64523
6588 64523 85605 -18785 -155363 -317917 -155362 -89619 46902 -93978 -237992 45359
6578 45359 402852 1454 -104414 247950 418352 232171 73404 -177755 -265086 -167468
6568 -167468 5128 391539 315333 258135 235633 208887 209573 68282 451275 5405 -294764
6557 -294764 315990 78701 -73670 -319439 282311 245441 25395 -317 -237588 -288210
6547 -288210 -476434 -392313 -225597 -130591 -121557 185839 -457696 -251135 1476 -363594
6537 -363594 -698870 -102159 226971 -112418 -354537 -89099 -45348 -291774 -118461 -316898
6527 -316898 -10695 69969 -99579 192645 57234 -321873 -628260 -444987 -522920 -390634
6517 -390634 -235473 -215746 -38501 -321577 -189002 -505095 -648742 -780615 -509231 -54164
6507 -54164 -642092 -797540 -565789 -588670 -49152 -470697 -463999 -211232 -404224 -388279 -237956
6496 -237956 -219269 -523316 -332691 -286631 -17193 22480 -8441 316928 293323 102614 -130146
6485 -130146 44833 134656 -419835 -214994 -287769 -544235 -258200 -82697 148513 -118520
6475 -118520 -335749 -122288 80315 -13819 -305874 -321483 -129844 212298 205108 -133942
6465 -133942 -266282 -69463 -365696 -565846 -216301 -140324 -133325 -160302 17049 254500
6455 254500 256934 377171 148237 -402915 -441972 -354105 -129340 -373452 -329532 -456222 -209585
6444 -209585 -528269 -693730 -546828 -417827 286182 -104469 -250739 -153302 -313359 -124982
6434 -124982 -50789 -104460 -301546 -306800 -184694 141956 -301792 -485554 -450535 -155341 68719
6423 68719 -117253 -372714 -375259 -103036 -314642 98380 332547 66739 -160689 -706065
6413 -706065 -409634 -384283 -403746 -154756 -100510 -132124 -10402 313894 235037 -170262 -561429
6402 -561429 -449432 -334052 149455 119559 -59152 -312375 47260 327234 -105326 -67499
6392 -67499 -42736 210944 236336 94502 -98509 -290270 -201094 -352427 -248634 -95240
6382 -95240 53599 170052 -62193 -354990 29332 -24669 -73616 -27882 185979 292375
6372 292375 4399 -654053 -222588 -228935 54020 -24236 148176 299335 -349071 -55851
6362 -55851 -351386 -220037 -103860 -165925 -186558 -248680 -511967 -318588 168341 -118379
6352 -118379 105061 -252100 -111034 -1988 -64414 78334 -248372 -205651 65557 -101337
6342 -101337 -224742 -81333 459810 117002 -247548 -239764 -487791 -137310 241143 -54937
6332 -54937 -539951 -410895 -420345 -285459 103678 39955 142964 347394 198744 1756
6322 1756 -526349 -136743 -215733 174603 -2270 71659 286461 20309 3963 -153124 -243994
6311 -243994 99603 415696 21756 116468 -419825 -539809 -39750 -216240 -135925 92025
6301 92025 174744 -306993 -110843 -215683 -238419 -60984 184614 35226 -51034 -74156 218113
6290 218113 562364 208814 -238402 -375591 37160 -404350 -481030 -251975 -232356 -327112
6280 -327112 -488865 -273575 -105669 -4054 168218 -93681 -387278 -538177 -246714 -58015
6270 -58015 125095 92027 -48954 -318014 -335964 -105547 -213101 -383202 -682907 -792164
6260 -792164 -313045 136679 70345 45292 -393601 -236448 -455219 -583199 -60051 301355
6250 301355 66826 215661 453968 259769 -57227 -155660 181156 -115822 211433 301479
6240 301479 378343 331174 298502 463894 297687 352257 -163699 -265236 -298487 162020 460711
6229 460711 200557 190748 110544 13158 -228046 -569833 -720474 -509268 -476769 -160588 -303257
6218 -303257 -311051 -155213 82707 36985 -63064 -514392 -13758 -58699 -356326 -44267
6208 -44267 -69190 -166249 -174127 -157805 -378849 -325244 92204 415740 330798 -89652 -207603
6197 -207603 195438 147138 -78196 -246639 -146924 -212368 -182579 116557 387686 342933 316214
6186 316214 -22146 -235782 -194601 -308615 -102951 -21441 -59584 -80142 -339273 198378
6176 198378 194320 449112 514481 337036 358789 148112 180523 -136268 331256 469396 407372
6165 407372 -37818 -690576 -395701 -131554 -68939 -40166 283278 146559 198472 101991
6155 101991 251889 137006 -119568 240210 39361 -347854 -340283 12603 102608 -94213
6145 -94213 -6231 101954 168892 98268 -241058 -477322 -533480 -328415 33403 -171233 -75308
6134 -75308 26469 -194223 -47252 1198 302793 316729 -73164 -388464 -314550 -17174
6124 -17174 -186148 -245840 252863 47781 9302 -235793 -32958 486742 359324 182234
6114 182234 323840 40287 -226494 -418003 -352705 -421855 -50680 14976 310570 349349
6104 349349 90438 -299613 -328513 -182874 94539 134045 -267813 41838 245740 246603 477514
6093 477514 400005 53404 309288 -33241 -314152 -52548 -142027 126155 504207 -47387
6083 -47387 -20309 -573344 -185203 -84625 128276 483242 360559 238304 32924 79740
6073 79740 293837 531309 321104 292693 278850 -308066 -507617 -175119 206572 152024
6063 152024 166258 325219 234696 22524 328906 147374 354992 277434 -231735 20851
6053 20851 224376 -45497 159081 92926 40065 247112 326730 596119 119926 275294
6043 275294 338459 62150 -96800 -61488 -395876 -298789 210196 442965 384693 339872 75818
6032 75818 -54795 147275 608481 751222 772493 657573 121714 -184358 -59733 -578052
6022 -578052 -326097 80756 188102 -256565 -421733 -207291 427093 176210 213221 -55097
6012 -55097 71394 224332 122093 576363 534134 452959 91615 359006 310231 325639 190760
6001 190760 316329 551518 608469 411997 162475 78395 113036 -164387 -74534 -23176 452542
5990 452542 658271 369128 167733 270216 184794 462238 315923 242771 59315 356702
5980 356702 793188 563824 489586 110356 82241 -7683 291418 478463 656699 668034
5970 668034 655944 642298 532233 423062 316249 178463 -101589 372907 138949 121988
5960 121988 -107728 -51378 393135 500901 549603 950279 825591 541215 158319 405759
5950 405759 519281 327825 340589 361033 184102 346421 729438 394537 592001 786618
5940 786618 551939 359485 553231 292211 518808 516603 407784 826922 1055124 837354
5930 837354 330799 303615 373392 298156 269710 68209 315767 383227 637804 478590 645454
5919 645454 836432 512053 585950 583580 535520 810359 765190 741950 874930 527183 667749
5908 667749 811124 455889 586522 501154 328822 548322 515142 187953 507500 577673
5898 577673 608174 402386 359425 234215 372883 555995 500478 465897 750536 388687
5888 388687 182285 705929 749064 607562 431204 -48641 232595 576406 633613 474247
5878 474247 184805 564597 587073 617492 842214 599610 581131 561113 683800 581933
5868 581933 557033 584330 466090 356038 371571 465215 501757 560179 788109 834015 464010
5857 464010 385572 87605 266375 522184 805645 683183 657922 504543 753161 770598
5847 770598 654843 601515 800783 655299 731404 730465 1023700 951576 463268 526175 749291
5836 749291 312095 344775 693035 813791 822902 531075 514248 467946 364788 477908 776852
5825 776852 634180 681852 605641 596638 729356 525369 554352 926974 800593 479503 631622
5814 631622 794015 1033628 578884 850940 723021 360902 653282 720569 711745 749514
5804 749514 1140995 994365 691570 588116 899704 943600 838727 1078336 549111 546304
5794 546304 467223 459914 1023718 750761 1100447 1316688 818980 917909 1255726 1312157 1191028
5783 1191028 1177295 1060241 687712 788971 930222 1181847 1041723 1008164 1438475 1815939
5773 1815939 1624183 1584379 899317 431903 369436 674082 1075977 1202523 918374 734547
5763 734547 758060 549952 602202 487976 817823 1058403 1151951 1023644 1082669 948541
5753 948541 1023001 1310495 1218181 757114 1262812 1016434 814858 1257622 1797890 1804237
5743 1804237 1278901 1381197 1653463 1599190 1504171 1609314 1097613 1269777 1315559 1199567
5733 1199567 1035854 1008181 891227 1184488 1730341 1447337 1084228 953669 968044 1520959
5723 1520959 1278782 1182942 968088 1160350 997965 1103169 1133762 1081886 1358476 1652374
5713 1652374 1379058 1160153 1012149 1228417 1165962 1106659 1303077 1468916 1600906 1315407
5703 1315407 1323439 1259164 1191751 1095212 1606361 1706316 1379642 1271793 1343812 1458651 1159190
5692 1159190 1054280 1556222 1570467 1243459 1389513 1587502 1503766 1730198 955604 938955
5682 938955 1278080 1604811 1846100 1807600 1570526 1367257 1351382 1338024 1376205 1808411
5672 1808411 1570709 1226618 1211563 1796653 1668676 1746621 1779813 1738153 1627218 1959352
5662 1959352 2013399 1834612 1721494 1398599 1682450 1823949 1990852 1971487 1932754 1835498
5652 1835498 1819250 1751073 1872041 1982031 1924725 1799397 1584612 1582463 2080283 1921560
5642 1921560 1747886 1920288 2098105 2060403 2228230 2455049 2723905 2601053 2550665 2634730
5632 2634730 2577886 2591899 2422827 2168543 2662404 2589706 2662669 2940373 2970407 3247137
5622 3247137 3307195 3389002 3628542 3740914 3452439 3601992 3900072 3889696 4012186 4368948
5612 4368948 4437762 4756402 5079699 5055618 4971948 5444826 5566949 4936261 5074459 5254299
5602 5254299 5315423 5354188 5400672 6038374 6234260 6159286 6320465 6155964 5810589 5649815
5592 5649815 5980296 6484408 6447179 6195148 6090244 6339072 6155164 6354599 6985917 6824860
5582 6824860 6763875 6986335 6938352 6522899 6402344 6405155 6289869 6392983 6643021 6832779
5572 6832779 6706780 6176189 6044188 6238800 6265995 6133195 5933659 5891536 6008642 5625726
5562 5625726 6098018 6300863 6135621 6179305 6005983 5926195 5491530 4991005 5035694 4768124
5552 4768124 4465450 4917703 4734620 4480695 4550215 4449389 4408420 3730928 3707473 3854189
5542 3854189 3629119 3785831 3395680 3709723 3779919 3752457 3606583 3696760 3609839 3490357
5532 3490357 3283481 3527078 3653638 3307619 3294724 2890127 2995509 3185007 2648794 2468404
5522 2468404 2357096 2300387 2462958 3119984 2910328 2319492 2683489 2738995 2806285 2360864
5512 2360864 2531353 2314117 2091947 2111694 1986406 1841392 2074161 2018902 2033799 2308475
5502 2308475 2347139 2012857 2035721 2170142 2504651 2447420 2223363 2163837 1978301 2207279
5492 2207279 2388195 2336292 1991534 2005052 1996227 2046084 2396174 2603365 2412274 2506729 2383258
5481 2383258 1839253 1794451 1836908 1653463 1822766 1836137 2286912 2527878 2095255 1515775
5471 1515775 1445778 2105310 1949238 1832009 2126272 1628968 2246252 2734517 2542743 2191764
5461 2191764 2160289 1990466 1479127 1695232 1625616 1648484 2014339 1704656 1868506 1863040
5451 1863040 2385019 2183357 2062054 2139071 2261504 2187025 1992735 2545378 2272704 2115096
5441 2115096 2278718 2417828 2390195 2577073 2494742 2055158 1887040 2290364 2285957 2008906
5431 2008906 1858556 1833750 1910677 2276690 2180891 1918910 2115486 2360866 1941478 2044918
5421 2044918 2043316 1880777 1931452 1691357 1867241 2586999 2742191 2428408 1993580 2140335
5411 2140335 2425600 2377710 2046764 2276850 2498927 2517457 2017659 2106945 2191990 1924342
5401 1924342 2652593 2761557 2857914 2556316 2514465 2256905 2009209 2065250 2171526 2042155
5391 2042155 1877896 2068667 2299492 2403634 2294334 2161940 1791961 2133711 2676927 2432715
5381 2432715 2024428 2143691 2517769 1962924 1753907 2048168 2411839 2421812 2279267 2132220
5371 2132220 1906515 2085628 1974773 2078036 2804538 2824382 2432983 2518932 2350855 2790817
5361 2790817 2816952 2496620 2486065 2602765 2479367 2825592 2238562 2393280 2719516 2335585
5351 2335585 2159763 2029331 2221772 2618155 2511682 2121019 2643193 2268121 2491695 2529999
5341 2529999 2697368 2788417 2659282 2708199 2524286 2475493 2514810 2542686 2525648 2456330 2509362
5330 2509362 2631828 3202549 2955566 2777543 2790443 2736531 2289070 2607273 2977777 3174986
5320 3174986 3389441 2640478 2513229 2457334 2608015 2749612 2659874 2918150 2753770 2520127
5310 2520127 2816948 2638494 2750927 2704659 2748531 2720043 2822785 2684343 3010217 3149747
5300 3149747 2894400 3208672 2904061 2884563 2775169 2420550 2544174 2677677 2601644 2333544
5290 2333544 2629013 2769600 2649958 2514750 2578503 2783339 3191787 3288912 3035903 2923092
5280 2923092 2810414 3128995 3018422 2811622 2837330 2780804 3305427 3215173 3122025 3256346
5270 3256346 3172980 3223561 2994393 3035894 3318807 2999182 2719380 2906063 2904958 3060215
5260 3060215 3139390 2930845 3017044 3095608 2984790 2720168 2625237 2585989 2361831 2434095 2541730
5249 2541730 2731109 2737395 2675900 2968534 2890491 2602250 2981170 3019523 3046215 2963853 2830042
5238 2830042 2865966 3083944 3053724 2678875 2502081 2602757 2758951 2611433 2713764 2341760
5228 2341760 2104499 2646112 2635147 2611368 2742094 2609346 2681586 2770897 2599667 2438389
5218 2438389 2658062 2745173 2532518 2906327 2286913 2385262 2937199 3025356 3235820 3236252 3033499
5207 3033499 2676921 2514109 2911700 2464424 2297140 2342075 2422683 2723403 2174188 1507048
5197 1507048 1971414 2531435 2389875 2423649 2264991 2158330 2335433 2573247 2716330 2963520
5187 2963520 2344037 2661274 2853578 2815685 2675377 2656757 2559959 2413702 2326774 2357636
5177 2357636 2524346 2518203 2558027 2901317 2959863 2926318 2690983 2775074 2483024 2359618 2463111
5166 2463111 2553159 2830774 2756202 2679555 2518256 2805601 2658581 2666773 2997706 2870168
5156 2870168 2662394 2654377 2846400 3052735 3135164 3283150 2976602 2809303 3048986 3018995
5146 3018995 2841528 3685102 3733872 3635640 3527654 3340800 3671945 3359466 3865654 4457904
5136 4457904 4510103 4383431 4359124 4402286 4430612 4531565 4603149 4275568 4511682 5089751
5126 5089751 4930032 4941478 4976841 4606115 4901953 5222684 5010709 4508221 4672548 4879797
5116 4879797 5368602 5242577 5421514 5757610 5782859 5852641 5516286 5374660 5603955 5684414
5106 5684414 5479946 5135225 4694875 5137513 4382123 4612696 4814827 4713623 4806349 4966301
5096 4966301 4793112 4500075 5037001 5258193 4885094 5248407 5603467 5566975 5503217 5472540
5086 5472540 5673287 5352446 5383601 5314184 4811440 5019122 5253849 5230670 5028592 5388901
5076 5388901 5552657 5205530 4857995 4815681 4820825 4657491 4842060 4909730 5025663 4642165
5066 4642165 3707019 3998350 4343610 4264653 4202568 3704914 3520823 3611002 3398431 3231597
5056 3231597 3542076 3444367 3255088 3418690 3579659 3509434 3115742 3252143 2972434 3038383
5046 3038383 3336407 2965084 3168248 3323620 3360229 3085684 3133860 3424420 3545251 3558139
5036 3558139 3775024 3565299 3423174 3187918 3111031 3266492 3566641 3586590 3465453 3019512
5026 3019512 2883781 3061390 2918180 3114070 3390964 3392320 3489901 3338912 3688313 3873181
5016 3873181 3528754 3442347 3260183 3429551 3462778 3332311 3325154 3209370 3052381 2606688
5006 2606688 2967107 3152171 2682612 2724402 2806645 2942978 2966096 3087353 3118069 3072267
4996 3072267 3116566 3043501 3182090 3367943 3409873 3170757 3104361 2915572 2809992 3341309
4986 3341309 3451829 3241322 3076563 3040904 2974935 3202795 3070441 3167498 3198579 3147328
4976 3147328 2842177 3170584 3558188 3317806 3061289 2820917 2751647 3070858 3170662 2965477
4966 2965477 2925350 3058896 3308669 3260180 2823205 3035444 3083647 3083851 3143878 3348693 2861846
4955 2861846 2833149 3209826 2660264 2992967 3299452 2953174 2817022 2930798 2905668 3054236
4945 3054236 3173733 3490902 3552612 3578647 3369797 3274920 3131571 3464886 3385352 3426716
4935 3426716 3626007 3656679 3354745 3258849 2693501 2831943 2944397 2860212 3051971 2856546
4925 2856546 3045696 3026483 3575200 3380808 2976602 3048435 3530723 3814034 3500067 3233369
4915 3233369 3471690 3253810 3113665 3280535 3427440 4058819 3880362 3620143 3566497 3639647
4905 3639647 3527559 3351949 3347418 3598336 3625875 3430823 3460183 3145494 3066350 2963518
4895 2963518 2755993 3381358 3670013 3623953 3693143 3938295 3905807 4137502 4371757 3912431
4885 3912431 3754870 3421351 3543412 3432810 3654037 3517122 3651922 3482406 3308099 3622528
4875 3622528 4132455 3999854 3884151 4294232 4174842 4011538 4083469 3886912 3820172 4351268
4865 4351268 4165269 4089518 3896690 3846368 4234082 4234335 4162688 4265611 4294650 4275981 4577621
4854 4577621 4537207 4616339 4386928 4393099 4458262 4653580 5128406 4834657 4949065 4776274
4844 4776274 4862539 4870431 5249529 5140912 5490422 5275697 4946463 5291326 5460806 5533561
4834 5533561 5240785 5585117 5364624 5954149 5815048 5359575 5525097 5766361 5738091 5893678
4824 5893678 6103816 5659546 5756011 6021202 6029692 6152094 6471165 6241607 6637812 6990766
4814 6990766 6894435 6940996 7080389 7407595 7234568 7201423 7363978 7585237 7858497 8074855
4804 8074855 8551688 8317522 8289084 8543845 8843542 9291366 9841582 10864799 11102343 11474788
4794 11474788 11926190 12530229 13637916 14586209 15758846 17244631 18837901 20546789 22802574
4785 22802574 25239343 27792273 30235042 31100055 30593258 29742239 28454105 25834391 23408580
4776 23408580 20847172 18929266 17493693 15841457 14416336 13440049 12493915 11741155 11296663
4767 11296663 10919569 10364659 10010074 9668506 9357217 9575168 9331426 8555167 8314370
4758 8314370 8080080 8238509 8190491 7935465 8212514 8024004 8358416 7919287 7933820 8322073
4748 8322073 8096083 7791302 7794755 8072087 8290195 7937489 8341843 8857635 8476464 8369677
4738 8369677 8678801 8562734 9100096 9253830 9070060 9084304 9892216 10242528 10238457 10871833
4728 10871833 11648253 12224668 12429907 12909956 13619368 14659740 15747423 16475262 18040902
4719 18040902 19903251 21878393 24558672 26589171 28021440 29465261 29741976 28798210
4711 28798210 27440361 25789333 23207201 21230485 19498321 17801001 16442066 15038082
4703 15038082 13622122 12771679 12055948 11224178 10552203 9799099 9617932 9598096 9352652
4694 9352652 9071549 8655708 8385037 8154840 7695760 7572838 7231617 7195283 7037958 6894847
4684 6894847 6739889 6723653 6869387 6465171 6294603 6334280 6082283 6058967 6142618 6176514
4674 6176514 6107184 5750081 5701654 5875842 5784519 5853812 5852008 5815080 5211833 5615436 5305445
4663 5305445 5409824 5863907 6049561 5746026 5879890 5702562 5502930 5343558 5659017 5904492
4653 5904492 5634450 5565533 5619685 5303527 5365113 5483656 5304688 5535151 5857802 5728605
4643 5728605 5988453 5709063 5440223 5410344 5176692 5578433 5468999 5464623 5557880 5399298
4633 5399298 5458372 5508925 5114641 5296490 5497842 5625834 5195559 5265446 5136426 5022421
4623 5022421 5395713 5572648 5709134 6013762 5884992 5981984 6013836 5717481 5640975 5730033
4613 5730033 5578322 5748709 5795837 5717336 5765370 5626134 5558894 5624636 5644717 5765394 6013275
4602 6013275 5754956 5294034 5219480 5557578 5276559 5271896 5351509 5430214 5250390 4586487
4592 4586487 5043301 5515985 5329104 5170956 5432624 5343118 4928382 4620651 4832554 4838896
4582 4838896 4572255 4521485 4893087 4972168 5103495 5234844 5151933 5499426 5625732 5732513
4572 5732513 5807122 5499704 5605818 5528044 5186618 5035423 5313620 5464968 5548745 5591485
4562 5591485 5263537 5450167 6097262 5922609 5780523 5870230 5971256 5745518 5593784 6054553
4552 6054553 6512633 6340504 5951602 5855561 6084776 6323175 6357681 5946158 5934540 6283121
4542 6283121 6669800 6799053 6238858 6271055 6803287 6729700 6832199 7087946 7588094 7166542
4532 7166542 6520605 6700906 6715320 6828227 7053935 7369099 7280836 7442460 7607942 7558743
4522 7558743 7422934 7293066 7610601 7944398 8003991 8002213 8110238 8362882 8050591 8400088
4512 8400088 8637483 8410276 8848605 8990693 8921589 9253210 9754022 9480218 9427973 9717629
4502 9717629 10218571 10359789 10215291 10523049 10778611 11100259 10989715 11316448 11571418 11965251
4492 11965251 12355548 13123632 13208566 13467576 13700157 14071666 14848595 14991767 15476576 16201684
4482 16201684 17115052 17374842 17946746 18472242 19150308 20642167 21681006 22823861 24414229
4473 24414229 26024255 27292311 28932885 30674689 32262070 33745787 35098652 35967620
4465 35967620 36870576 36633757 36054801 35119887 34558099 33852197 33620023 32644354 32174100
4456 32174100 31827996 31200708 31180624 31072097 31291492 31234757 31098060 31058172 31119237 31077370
4446 31077370 31197569 31634237 31425838 30766903 30984401 30926233 30648535 30390024 30577536 30247201
4436 30247201 30136849 30379296 30363093 30350992 30132994 30176878 30615221 31055208 31410989 31525921
4426 31525921 31738609 31793146 32122824 32554995 32944542 33021083 32845853 33072735 33143704 33183905
4416 33183905 33308647 32769310 32451926 31752895 31188577 31327064 30866620 29911921 29048795
4407 29048795 28434535 27814710 27120187 26211410 25509120 24663826 23806768 23175733 22071191
4398 22071191 21529542 20786120 20467452 20165223 19518469 19226188 19020022 18365926 17920805
4389 17920805 17003029 16471377 16808610 16982713 16834866 16145866 15857097 16082396 15877817
4380 15877817 15718817 15975428 16024803 15810944 15532711 15612794 15473685 15713936 15606690 15772704
4370 15772704 15818220 15818632 16121052 15445337 15855580 16077835 16104266 15859790 15985544 16247291
4360 16247291 16411777 16474510 16528442 16656383 16889760 17215929 16995431 17028741 17135916 17418625
4350 17418625 18385925 18468116 18493485 18660564 19207617 19984594 20514646 21409691 22329130 22653667
4340 22653667 23447898 24080337 24677023 25569973 26081088 27223382 28261078 29380027 30349375
4331 30349375 30739118 31851558 33080953 33937612 34534345 35128757 35760955 35936074 36158381
4322 36158381 36169324 36510662 36569584 36270797 36324531 36085297 35923647 35993944 35575603 34939179
4312 34939179 34507397 34395767 33897043 33385043 33514318 33602510 33563072 33469908 32716085 32325154
4302 32325154 32440079 32523573 32105632 32390243 32510848 32881306 32668301 32500977 32230281 32520996
4292 32520996 32124681 31591961 31539429 31994032 31830577 31053090 30989519 31112232 30847992 30673103
4282 30673103 29895532 29339596 28913223 28929479 29047236 28834102 28551287 28460172 28289977 27645610
4272 27645610 27248757 26844888 26373036 25812348 25784622 25147050 24309925 24073240 23681188 23248521
4262 23248521 22527197 22171761 22080098 21781168 21694470 21329215 20864822 20917751 20869054 20895929
4252 20895929 21056888 21049397 21198158 20943740 20804965 20668257 20720641 20796467 20857783 20532410
4242 20532410 20409122 20602314 20870156 20611247 20195048 19807765 19777820 19677534 20034726 20124673
4232 20124673 20494673 20084738 20008756 20444587 20394151 20588493 20878055 20881321 20793694 20545765
4222 20545765 20801680 20804079 20671785 20107951 19583829 19762247 19775075 19961571 19980653 20080967
4212 20080967 20198666 20032864 19969993 19809667 19850317 19511594 19438166 19453902 19552229 19568612
4202 19568612 19192018 18834347 18891529 19077052 19547886 19674760 19513425 19509562 19519916 20026736
4192 20026736 20488757 20513426 20246831 20391821 20413503 20456549 20424629 20432045 20435943 20257440 20185394
4181 20185394 20195798 20472100 20660915 20587075 20776841 21020408 21210864 20501975 20143047 20410689
4171 20410689 20869760 20782176 20700431 20621822 20979594 20923115 21169807 21111964 21068589 20988701 20919525
4160 20919525 21284516 21634282 21713458 21758905 21956694 21822273 22253955 22524021 22677384 22864250
4150 22864250 22938514 22716718 22541620 22697710 22698128 22507602 22656589 22919658 23079908 23016394
4140 23016394 23188048 23046095 23129656 23307217 24131506 24363592 24458888 24606750 25010927 25695847
4130 25695847 25951919 26166957 26076063 25987522 26584552 27507139 28029809 28319764 28301074 28891241
4120 28891241 29287824 29546864 29631521 30007098 30294664 30843976 31522778 31735010 31806108 32482623
4110 32482623 33221668 34023100 34864658 35421965 36183249 37377892 38681471 39339382 40485164
4101 40485164 41172978 42263359 43553234 44103388 44564888 46047947 47506187 48474352 49997898
4092 49997898 51224082 52674355 54152921 56034446 58036238 60212622 62910752 65735981
4084 65735981 69378459 73356936 77952646 83343860 89229826 96153449 103465299 111955018
4076 111955018 120128400 127056088 133594181 139265586 143347236 145568569 145719031 143188941
4068 143188941 139035642 133733328 127295981 120546188 113643220 106730856 100225322 94000038
4060 94000038 88635979 84255149 80197235 76336138 73341686 70956252 68455557 66625278
4052 66625278 65255180 63658831 62366380 61680525 60854253 60110533 59637132 59289532 58992299
4043 58992299 58480062 57935061 57700127 56960996 57148661 56996349 56738174 56573180 56720479
4034 56720479 56405790 56091784 56538168 56500201 56670816 56408899 56182163 56150580 55688325 55543760
4024 55543760 55528221 54673146 54517321 53462193 52560452 52008288 51240972 50513337 49687964
4015 49687964 49065828 48501658 48119547 47793977 47011446 46243940 45312079 44514932 44009456
4006 44009456 42827050 41608302 40627598 39645187 39241450 38695729 37897407 37364624 36860941
3997 36860941 36313689 36160571 35570360 34876932 34079721 33518483 33025597 32624513 32040407
3988 32040407 31822334 30894386 29632514 29255892 28637959 28664252 28167264 28211372 27889856 27490351
3978 27490351 27119109 26775380 26314919 26162942 26442329 26016835 25696884 25327856 25164938
3969 25164938 25130369 25031872 24682858 24216486 24041366 23774275 23792464 23661153 23419401 23332379
3959 23332379 23029867 22656842 22730695 22476785 22263892 22063468 22145091 22028387 21714932 21518007
3949 21518007 21333498 21331622 21223879 21541038 20962698 21261155 21283854 20717708 20842538 21128986
3939 21128986 21222981 21089430 20867816 21295026 21023807 20816101 20894290 21001762 20779026 20648498
3929 20648498 20656769 20965271 20715158 20766073 21032901 20954857 21032667 20822354 21328507 22164026
3919 22164026 22521451 22254325 22253955 21898812 21946666 21855213 21329765 20840033 20689933 20481859
3909 20481859 19894374 19675693 19606610 19537416 19812027 19356779 19341085 19115459 18834165 18677064
3899 18677064 18596330 18821686 18627989 18975787 19152378 18689149 18703926 18737701 19030638 18973998
3889 18973998 19269882 19527712 19468980 19084400 18910177 18958071 18897779 19237341 19229147 19152942
3879 19152942 18952943 19000865 18898130 18809618 18827366 18496159 18544417 18069917 18416282 18367490
3869 18367490 18208992 18318598 18076683 18107607 17930506 18053165 18658213 18751972 18473168 18365008
3859 18365008 18139280 18560537 18300488 18365056 18532331 18577938 18311076 18483954 18643974 18474875
3849 18474875 18529656 18598811 18093246 18472488 18570349 18417925 18998109 19144025 19141977 18991040
3839 18991040 18913426 18809184 18879801 18884253 19414679 19266746 19493389 19308264 19609417 19800745
3829 19800745 19695054 19377720 19375059 19266041 19517841 19879457 19728767 19860497 20263780 20785111
3819 20785111 20829334 20861128 20765412 20624541 20493283 20622313 20897607 21381651 21341407 21415085
3809 21415085 21343100 21684336 21735429 21806381 22054751 22065788 21997110 21989924 21828506 22366831 22614562
3798 22614562 22796325 23336245 23579631 23903265 23723616 24241916 24704897 24339503 24828744
3789 24828744 25296396 25687834 25869584 25981525 26351298 26948596 27139403 27839174 28455474
3780 28455474 28961584 28998576 29757383 30176644 30583717 31514465 32006023 32755616 33441957 34303903
3770 34303903 34836149 35112888 36412026 37211479 38294115 38893295 39255002 40435923 41163317
3761 41163317 42104374 42608860 43443700 44619815 45665088 46355247 46839842 47819276 48738560
3752 48738560 49966981 51029841 51887355 52529069 52898458 53528206 54089885 55045948 55531707
3743 55531707 56555691 57243621 57813660 59028850 60647104 61652428 63042487 64482582
3735 64482582 66042011 67226675 68334155 69198758 70026700 70653881 71354908 71400676 70543787
3726 70543787 69967921 70016521 69362425 68898411 68110506 67336446 66381332 65542718 65221424 64422692
3716 64422692 63659098 62893184 61718813 60595463 59214737 57581535 55562790 53707666
3708 53707666 52084095 50653792 48626083 46846836 45333701 44007222 42640113 41120691
3700 41120691 40234400 39391750 38512310 37528804 36706198 35811011 35249443 34954016 34723704
3691 34723704 34551391 34475196 33697285 33349323 32899623 32573086 32312060 32447571 32264169 32029463
3681 32029463 31941630 31982923 31862789 31656614 31362668 31116019 31202054 31125413 30773126 30319414
3671 30319414 30483172 30614105 30453817 30034766 29634872 29878709 29262525 29404187 29312331 29552082
3661 29552082 29436393 29075651 28666302 28722610 28759653 28660201 28381157 28396252 28154981 28036453
3651 28036453 27964968 28202322 28525083 28365430 28567666 28541751 28809398 29013165 28798039 28847474
3641 28847474 28933369 29508845 29879986 29590886 29511077 29776057 29805488 29935009 30160432 30413392
3631 30413392 31158671 31144309 31605992 31952802 32108918 32457886 32890492 33100273 33690110 33753910
3621 33753910 34094129 34655817 35363171 35581179 35844810 36186106 36514090 37179908 38166975
3612 38166975 39259372 40019465 40829922 41604970 42581367 44063368 45382852 46962693 48097508
3603 48097508 49421628 50983564 52465350 53743552 55190048 56465170 58190760 59524607
3595 59524607 60778095 62120242 63409687 64837992 66695831 67609474 68218029 69175444 69651413
3586 69651413 70121759 70669760 71535603 71821549 72259906 72519004 73122729 73636403 74217347
3577 74217347 74929757 75681756 76442941 77697786 78627294 79440182 80375388 81146623 81498303
3568 81498303 81748309 82310857 82400160 82620022 83087359 83222684 82992552 82874563 83516090 84634994
3558 84634994 86111365 87621134 89183192 91070076 93118557 95489698 97522253 99339409
3550 99339409 101619804 103653945 104872349 105994005 106579962 107083384 107066693 106555910 105877875
3541 105877875 104667437 103655468 102090195 100475442 98728379 97039953 94789671 92691350
3533 92691350 90641034 88754927 86166229 83232096 80420000 77717338 75272534 72527471
3525 72527471 69538776 66925154 64674482 62318604 60068743 58139653 56865972 55056212
3517 55056212 53253683 52078252 51008428 49907748 49000146 48589061 47619761 46921611 46280694
3508 46280694 45353458 44937602 44527996 43786528 42850374 42505870 41810426 40955178 40549133
3499 40549133 39775280 39301454 38779837 37536354 36362373 35526349 35270734 34913947 34284500
3490 34284500 33765127 33336471 33462167 33262420 32834970 32845746 32546801 32542222 32181656 31429193
3480 31429193 30783065 30369370 30259301 30168291 29633832 28990150 28571242 28325051 27808654 27204669
3470 27204669 26672891 26527150 26571794 25859867 25110000 25378723 25183110 24759673 24167709 23795435
3460 23795435 23523062 23353355 23421176 23239010 22905401 22542062 22127957 21902353 21564798 21492925
3450 21492925 21525840 21365836 21352876 21347741 21432599 21039613 20817845 20891408 20892413 20787505 20622439
3439 20622439 20667007 20977856 20978282 20557005 20354609 20546828 20593566 20344888 20120700 20148344
3429 20148344 20590522 20867367 20818796 20562915 20594095 20718823 20793433 21537193 21218681 21122926
3419 21122926 21379637 21644808 21861933 21875122 21933033 21783868 22082339 22109687 22162833 22473863
3409 22473863 22552737 22914013 22890380 23165807 23402294 23777416 24022049 24119734 24094985 24157729
3399 24157729 24377892 24634622 25091292 25034569 25393088 25902630 26566450 26943835 27010765 27446430
3389 27446430 27478036 28167970 28425126 28408924 28863901 29538263 29887999 30583766 31278573 31631873
3379 31631873 32044112 32425303 32606999 33052902 33361226 34203818 35065532 35742363 36577766
3370 36577766 36488081 36528911 37163025 37911451 38056186 38334718 38711430 39271316 39398347 39450585
3360 39450585 39997059 40358228 40490463 40703232 40835463 41672140 42248094 42994146 43130239
3351 43130239 43399036 43629105 43832183 44107166 44528427 45243867 45566794 46070422 47042516
3342 47042516 47649720 48595098 49848687 50357652 50881320 51968520 52891719 53934122 55315894
3333 55315894 56577421 57854883 59349741 60655621 61522619 62977565 64424853 65683742
3325 65683742 67044033 68177365 69737189 71468318 72848447 73934015 76024408 78165142
3317 78165142 80169999 82144993 84345784 86594511 88131563 90269247 92240606 93721510
3309 93721510 95047693 96533487 97917663 98352058 98893578 100373565 101087769 101524490 102188302
3300 102188302 103269790 104076074 104863863 105566133 106881488 107850280 108243771 108926151 109001354
3291 109001354 108971015 109241921 109591419 110166635 109480561 108521079 107915347 107354489 106719193
3282 106719193 105717793 105070212 104391324 103775259 102258539 100701855 99528478 98683159 97174813
3273 97174813 95942921 94356658 92792354 91243348 89223032 87644615 85822858 83431011
3265 83431011 81508421 79480064 77315037 75242340 73433122 72024877 69887324 67821144
3257 67821144 66184885 65052717 64009189 62854640 62355846 61736673 61159910 60932157 60242573
3248 60242573 59907768 60223598 60141349 59993549 59994051 59534174 59395162 59058154 58673712 57803104
3238 57803104 57125696 56548297 55673806 54545064 53650245 53074836 52028067 51231099 51110065
3229 51110065 50301575 50009336 49569517 48711418 48050800 47754301 47088688 46610600 46250429
3220 46250429 45403590 45149371 45021148 44655326 44438992 43859131 43440260 42852462 42457620
3211 42457620 41982464 41376319 41169087 40235775 39097584 39041635 38958427 38749132 38626501 38198457
3201 38198457 37788329 37242287 36993059 36215896 36015875 35843367 35551197 35333480 35296606 35184482
3191 35184482 35237079 35255559 35319160 35453361 35136278 34917555 35161198 35185327 35024684 35016487
3181 35016487 34975112 35177183 35589782 35325479 35367773 35749897 36214572 36820230 36926032 36922736
3171 36922736 37072834 38024673 38893759 39287033 39652355 40525251 41606087 42414394 43454012
3162 43454012 44490278 45559994 46867430 47783578 48910755 50259247 51449958 52951538
3154 52951538 54586141 55500658 56850655 58692349 59724239 60884594 62194703 64064695
3146 64064695 65479619 67195270 69225329 71024978 72951594 74934717 76873861 79215143
3138 79215143 81642965 84231283 86304151 88271209 90618688 92952773 94019537 94977557
3130 94977557 95754624 95328433 94979492 93588760 91708528 89356587 86150754 82827242 79529845
3121 79529845 75767117 72558464 69216989 65626482 62401305 59604137 57148209 54553088
3113 54553088 52422015 51004191 48733135 46801875 45098932 43469201 42423960 41069526
3105 41069526 39272000 37882108 36784578 35764401 35037782 34113866 32985363 31994260 31491381
3096 31491381 30720918 30083676 29086751 28569219 28269859 27815526 27082031 26671873 26267504
3087 26267504 25752314 25431459 25327450 24227388 23863199 23840863 23534280 23340688 23085341
3078 23085341 23199485 22803643 21951274 21510829 21699840 21379926 21102157 20927770 20681133
3069 20681133 20291989 20408340 20028896 20016390 19871598 19320996 19340619 19367155 19050849 18840932
3059 18840932 18611728 18063443 17634716 17305707 17073093 16981174 16894698 16972475 17033825 16766440
3049 16766440 16332583 16210766 16258859 16159264 15725322 15974998 15785299 15459696 15363129 15549717
3039 15549717 15639318 15828302 15620804 15735260 15828288 15665225 15933049 16082893 15759949 15508509
3029 15508509 16212329 16141039 15959169 15853300 15681386 16175949 16210740 16186302 16379778 16011713
3019 16011713 16055301 16482089 16781569 16785322 16498809 16443077 16413825 16308637 16320072 16218508
3009 16218508 16242978 16420139 16024389 15797771 15906579 15958533 15957651 15944838 15921326 15857131 15970384
2998 15970384 15693406 15465798 16058636 16052751 16319867 16349574 16084356 16372301 16673826 17019211
2988 17019211 16794276 16737815 16594409 16576173 16946597 16979842 16715797 16792265 17030286 17059829
2978 17059829 17409625 17632657 17341462 17759676 18207487 18149492 17747596 17612632 17951860 18014213
2968 18014213 17828384 18263441 18662294 18856298 19438452 19852288 19761681 20125553 20544249 20836704
2958 20836704 21322170 21991149 21641115 21632058 21765200 22405775 22615454 22507617 22774377 23040492
2948 23040492 23436497 23419638 23996131 24668874 24844081 25324604 25780610 26266151 27092901 27207609
2938 27207609 27581324 28331725 29066009 29015713 29276575 30130684 30853772 31746811 31720742 31941884
2928 31941884 32708175 33595392 34177685 34292556 34988003 35656168 36391975 36908576 37803786
2919 37803786 38670334 39229834 39811486 40678034 41202097 41939924 43568847 44452960 45376483
2910 45376483 46640311 47374929 47978602 49136170 50384267 51621114 52760126 54316001
2902 54316001 55622950 57330378 59134436 60443264 61863499 63398131 65271040 67360807
2894 67360807 69924866 72243269 74636247 77254958 80235096 83773126 87340573 91562115
2886 91562115 95755241 100374926 105116291 109524508 113917729 117810757 121380532 125244403
2878 125244403 129777148 135112897 140859592 147223689 154508444 162324364 170577146 178236823
2870 178236823 185645317 192359573 199464877 206670240 214695075 224319909 235056143 245492706
2862 245492706 255659118 265602760 275085423 284443120 292847787 300932616 307373776 309785607
2854 309785607 307196173 299314774 285951457 269760487 252394307 234676097 217982119
2847 217982119 202781566 189151222 177408468 167324330 158189911 149554355 141232358
2840 141232358 133430258 125988266 119234069 112777760 107415931 101851146 97044859 92682036
2832 92682036 88964566 84933155 81217090 78379306 76051676 72773629 70045572 68228059
2824 68228059 65522009 63307341 61548670 59967938 58421167 56231921 54222601 52976911
2816 52976911 51392652 49834941 48149556 46842536 46120729 44564710 43798820 43373318 41981228
2807 41981228 40642744 39803523 39268376 38217367 37716577 36348501 35861614 35302121 34619643
2798 34619643 33727268 33182253 32034888 31691638 31682029 30744544 30391449 29815530 29078359 28746418
2788 28746418 28004692 27631577 27056647 26537352 26816831 26218947 25748297 25787296 25934867 26198192
2778 26198192 25790003 25509846 25448231 25371163 25040118 24785245 25201392 25036693 25042172 25244667
2768 25244667 25166961 24994192 25292425 24682332 24715631 24486058 23472037 22658814 22398099 22032584
2758 22032584 21363827 20904358 20455707 20065127 19446341 19240109 18819736 18197351 17710940
2749 17710940 17501967 17171368 16646081 16484584 16596540 15927996 15651268 15846197 15780307 15839107
2739 15839107 15502358 14874112 14637643 14430426 14331893 13798914 14049127 13747715 14068563 13535698
2729 13535698 13162945 12976254 12953278 12806076 12627806 12510143 11975214 12587702 12364557 12069401
2719 12069401 12047929 12087410 11636900 11461062 11446505 11775603 11320947 11197218 11150741 10830286
2709 10830286 10332460 10430431 10507796 10461827 10199041 10123980 10316210 10390588 10266553 10358255
2699 10358255 9932457 9984874 10143725 9954736 10146221 9796474 9136687 9212720 9322170 9330624
2689 9330624 9481085 9536691 9607825 9361366 9501359 9414924 9383094 9357672 9609342 9237416
2679 9237416 9033187 8876185 8780469 8955491 9114272 8714633 8487049 8462741 8004940 8526226
2669 8526226 8614328 8365328 8227851 8082461 8174976 7933003 7360936 7730964 8048792 8061733
2659 8061733 8202267 7623497 7283512 7290424 7036583 6784840 6798012 7059602 6892764 6894716
2649 6894716 7281145 6958458 6859521 6930702 6609737 6383075 6536047 6487386 6472439 6826123
2639 6826123 6799887 6683320 6905074 6757236 6513504 6355834 6683101 6591923 6444125 6611873
2629 6611873 6202648 6104514 5976047 6307833 6317355 6258241 6099191 6057039 5993859 5965051 5599939
2618 5599939 5653104 5996902 5880283 5667753 5326614 5213960 5557625 5630815 5844077 5853387
2608 5853387 5685110 5248786 5498481 5702249 5585388 5824780 5358618 5464115 5346680 5673890
2598 5673890 6001053 5762468 5633221 5831345 5828927 5905228 6202707 5920953 5973495 5696130
2588 5696130 5431086 5641432 5757348 5873113 6032259 6025021 6193216 6253821 6084650 6361246
2578 6361246 6329736 6574032 6347367 5989877 6017807 6522230 6259191 6449362 6836556 6665133
2568 6665133 6382554 6166665 6265306 6200685 6012002 5727368 5424931 5694735 5945030 6110422
2558 6110422 5613620 5352923 5448595 5291229 4837613 5243768 4745448 4590589 5099254 5051204
2548 5051204 4892556 4619858 4512080 4958693 4834502 4999460 4742975 4632209 4406297 4394799
2538 4394799 4651967 4659052 5005247 4716560 4378189 4529748 4629645 4277834 4352831 4138678
2528 4138678 4302246 4194456 4197570 4431065 4422078 4089525 4181317 4209195 4203374 4070915 4193030
2517 4193030 3888254 4097050 4151448 4250424 4149269 3900692 3936252 3973213 3724713 3294021
2507 3294021 3406605 3723712 3630214 3594567 3412725 3241815 3361382 3054525 3045909 3528289
2497 3528289 3752469 3697213 3617975 3377901 3176600 3308400 3258819 3422247 2943006 3035648
2487 3035648 3128795 3180452 2897870 3198673 2926488 3002011 2960492 3088361 3214513 2894528
2477 2894528 3270474 3537208 3129120 2872843 3036091 3047384 3331759 2766061 2863754 3166268
2467 3166268 2853669 2848558 2996504 2908211 3024990 3347227 3595185 3095030 2886880 3126344
2457 3126344 3084641 3153225 2649518 2421943 2687681 2531259 2599597 3044778 3010824 2758647
2447 2758647 2490286 2336258 2270606 1999393 2276372 2161833 1887272 1607255 2160724 2586574
2437 2586574 2494822 2367402 2602435 2390222 2065585 2223967 2171942 1995697 2143548 1849675
2427 1849675 1818459 1812964 1829396 1930967 1835828 2096905 2137863 2069167 1940152 1792898 1869816
2416 1869816 2420382 2660001 2108502 2293887 2058888 1976810 2240794 1795765 1933966 2101916
2406 2101916 2172463 1875419 1550854 1453582 1215231 1525242 1754851 2010945 1782883 2348546
2396 2348546 2310660 1727585 1955874 1655894 1337973 1518298 1287144 1050334 1356723 1530887
2386 1530887 1657199 1761584 1863601 1975281 2108704 1626757 1730028 1735692 1961629 2356620
2376 2356620 2095820 2024605 1957457 1911757 2185562 2547697 2187747 2006484 1762269 2006362
2366 2006362 2229219 2247244 2038791 2128087 2263311 1866718 1457838 1457203 1792778 1730673 1446227
2355 1446227 1528993 1377997 1579002 1718876 1466962 1520460 1443956 1886640 1742284 1547535
2345 1547535 1146273 959209 815316 824577 1298649 1491898 1566111 1536552 1920646 1630556
2335 1630556 1231223 1350324 1469987 1451689 1109241 1115799 1478730 1428029 1134155 961448
2325 961448 1227859 1312125 876215 986449 1229884 1163538 1203475 1149089 1331491 1383616 1077438
2314 1077438 902550 1196170 1610521 1300396 1342965 1206375 1257804 1027891 936757 1332139
2304 1332139 1316856 853669 701459 759052 1105915 1190119 1277934 1242388 1153036 1140107 1045774
2293 1045774 1096940 1058782 594687 1315122 1439938 1365089 1122330 1399528 1406103 875609
2283 875609 1329660 1140335 1352007 1492499 688385 880612 1013730 706855 719484 706124
2273 706124 583446 744269 1021227 843567 844379 1048830 1308101 1277217 1523784 1495416 1518981
2262 1518981 1403410 1209210 1090234 1479046 1478488 1563589 1458674 1295087 1047203 1329768
2252 1329768 1532342 1173933 922145 609927 1574209 1772312 1643986 1586047 1375982 1171196
2242 1171196 639985 711367 1038681 980011 1149149 1272560 1234263 1189561 1228811 1049373
2232 1049373 1145021 1825665 1485932 1588874 1387414 1329596 1508960 1520702 1503227 1422031
2222 1422031 1354403 1473456 1543758 1550038 1476127 1293371 1500303 1500455 1575775 1591459 1472670
2211 1472670 1386726 1403165 1235376 1195975 1345271 1987013 1988689 1988758 2093505 2173881 2355142
2200 2355142 2345970 1962284 1713972 1578702 1926018 2195415 2261482 2465361 2296795 2403137
2190 2403137 2123376 2550662 2740601 2542631 2718302 2826716 2847295 3164774 3167944 3209117
2180 3209117 2859511 3177055 3149525 3081594 3165356 3133671 3014195 3453425 4004179 3738742
2170 3738742 3443062 3924460 4007493 3917396 4253183 3853530 3385444 4011840 4488643 4509362
2160 4509362 4192966 4138684 4524649 4356948 4385339 4431779 4895536 5109834 5248902 5906285
2150 5906285 6050104 6084424 6041454 5833502 6192452 6286159 6751991 7397635 7568619 8013349
2140 8013349 8099543 8357712 8667446 9248767 9929411 10552453 11187327 11542852 11788183 12301472
2130 12301472 12832065 13261764 14070143 14838962 15792451 17105412 18082536 19085787 20107679
2121 20107679 21856167 23684270 25374166 27041532 28756546 31084331 34844473 38759081
2113 38759081 43506215 49010726 55981508 65462910 79239845 97443695 118610633 139001437
2105 139001437 150243262 146834271 131008623 113425448 94457866 77309894 62807905
2098 62807905 52109129 44799275 39141901 34719312 31876113 29056473 27164196 25550317
2090 25550317 24062626 22736339 21233363 19658563 18055225 16557043 15172264 14572153
2082 14572153 13873074 12846561 12048569 11181512 10547593 10136297 9695129 8888040 9041378
2073 9041378 8448183 7994905 7378121 7092149 6844214 6517170 6873274 6557900 5853214 5401699
2063 5401699 5339924 5124976 5234747 5361844 5044888 5064816 5057806 4602767 5017188 4730580
2053 4730580 4477860 4290871 4191807 3915533 3907464 3547204 4196482 4128124 3682522 3243218
2043 3243218 3469575 3106450 3059415 3478488 3618546 3237665 2892073 3047067 3162468 3020116
2033 3020116 2848091 2694827 2309757 2443231 2120965 2241549 2047311 1983541 2071865 1759811
2023 1759811 1981547 1928374 1633238 1742878 1235443 1149258 1558688 1382987 1594832 1414124
2013 1414124 1149414 1047494 1361738 1233828 969499 897426 1307897 1090383 1252772 1372036
2003 1372036 1395313 1065740 722331 847943 1181033 1080839 1150984 894323 1104872 1458819
1993 1458819 1124547 1445740 1468181 955924 989912 1363114 1506276 1471285 1108663 1207824
1983 1207824 1204966 1131661 637760 346369 460948 748543 929714 787127 729507 1059613
1973 1059613 829913 699835 823921 794297 817245 716603 862740 706132 513802 469722
1963 469722 485298 466069 734774 838777 580910 714342 621195 1200108 1303583 693114
1953 693114 783815 1293798 1024142 781633 807299 758884 671670 789596 185031 461106
1943 461106 924372 1032308 861148 674814 926159 825393 848495 1130401 1261120 1205271
1933 1205271 806244 403933 760429 684390 739213 937503 606315 468540 710881 939380
1923 939380 630854 506630 892354 1078166 857555 778134 869039 681606 523658 553885
1913 553885 354923 363121 659503 756272 240908 452392 620889 837247 1034654 1005080
1903 1005080 903778 377730 843014 549410 454678 642140 486862 645843 592685 673521
1893 673521 838999 729515 614849 744156 226654 410286 1118790 802554 597747 917545
1883 917545 941107 443885 504739 542032 347421 722805 805697 607472 21867 -124653
1873 -124653 284466 274514 -146573 -475623 101727 99572 -31179 -23935 194319 -37559 -176604
1862 -176604 547489 740145 585014 357773 150904 357734 788695 518684 358401 327383
1852 327383 258990 459234 450020 814243 919711 577341 295132 -326174 -6432 24798
1842 24798 181573 358207 217688 429810 583126 1076883 1232437 1100361 1418542 1520778
1832 1520778 975212 509001 78388 237686 1010253 1028281 409818 355494 460256 153771
1822 153771 -117071 220464 376030 368974 -108507 302934 524945 107882 26548 177430
1812 177430 668233 420202 219700 60395 -139813 -203657 -39786 366968 189583 357239
1802 357239 728599 143343 -55517 305278 449793 320727 429309 469192 410578 312312
1792 312312 65510 109930 144960 404430 386517 395631 431661 260896 49466 129695 -257350
1781 -257350 -273704 -65124 -353753 -316070 394049 342001 -74619 247836 702320 764502
1771 764502 361196 49154 2565 457183 638449 231843 134659 321726 138734 143295
1761 143295 -86900 231725 21315 146140 254959 218451 -37143 -678388 -177366 -44344
1751 -44344 -202915 -271861 -104505 271961 -61018 -173401 173929 346454 30307 -158051
1741 -158051 192731 244741 -19670 362329 20705 -113659 197914 46239 19948 180855
1731 180855 99611 38682 417109 414423 410304 280332 -147340 -241286 197070 80622 94466
1720 94466 336508 416605 233258 278894 389718 273959 -148222 -316161 -394623 -126726
1710 -126726 -263679 -124411 -208454 -77390 84278 -234370 -299254 51012 60697 266095
1700 266095 203376 -74805 -48428 -118946 -155990 -110911 104034 80123 -94168 234320 514414
1689 514414 166954 203065 223777 319039 -36205 41151 279438 265701 141000 117322 88231
1678 88231 463751 556130 432906 854180 731516 41420 42699 270331 642712 456337
1668 456337 643775 267408 162147 131028 213432 111500 179735 87899 -12789 79114 -79691
1657 -79691 53347 26632 163279 149442 234256 164477 414118 119456 -48193 55088 319162
1646 319162 496112 472759 326430 170705 513842 68970 -160432 9694 -167316 218173
1636 218173 208633 -316194 -258471 257135 -40550 -258592 -332680 -368761 -450166 -71263 128344
1625 128344 -48897 -276823 -64183 -79755 288473 325631 362335 702415 361095 510114
1615 510114 586027 345027 49094 -330149 -578325 -69148 37030 -98869 -275721 -47758
1605 -47758 129113 148891 228492 284684 475855 435838 276649 284835 130068 30443 566225
1594 566225 467164 198437 516240 296326 28230 299292 336738 96564 276354 514322
1584 514322 -53295 12892 240266 190645 497170 227617 172985 140462 -78191 56909
1574 56909 111696 -164716 227079 139462 183233 123246 -154318 -27247 -70613 -50372 78286
1563 78286 60840 23217 241924 232918 276470 36653 46246 -90744 -254216 -105361 -132737
1552 -132737 -267188 -296331 -75570 131279 289868 162737 -120057 -52981 80848 25584
1542 25584 141756 197855 -104727 203813 277512 -95877 -277942 -351613 -25739 -67049 -251057
1531 -251057 -43311 86256 251065 31198 -259966 -239029 -169504 1608 26601 -22423
1521 -22423 204486 -108901 -331188 -109090 185883 10768 -170506 270957 406397 396256
1511 396256 51926 194839 118593 151189 119519 -86059 325056 351019 187320 -22363
1501 -22363 378732 342479 65067 419411 177353 -315476 -201636 129309 -35657 -19400
1491 -19400 76075 230716 -66531 -146577 115318 354635 80999 -96008 -59806 149457
1481 149457 85695 128492 -5189 500172 394901 17818 -80211 -413393 50269 -314622
1471 -314622 -346231 55742 374880 140804 41168 -25404 492051 279610 702874 632084
1461 632084 387406 220485 -14162 -208299 -213835 105633 248110 356367 312859 352675
1451 352675 397125 67714 -262558 -135573 -955 -284749 127894 184238 78033 -138688
1441 -138688 47137 2671 -173156 162639 11759 -645905 -839379 -335083 -153454 12144
1431 12144 99876 26131 -380143 11831 391858 451643 486246 520024 -20882 -267609 -283265
1420 -283265 -335313 -529524 -305195 -1205 -12048 -264341 -314940 -391806 -417164 -515905 -75741
1409 -75741 509903 421454 35412 347999 483279 557945 270898 -119340 -103268 -106267 98369
1398 98369 88503 -37475 -51827 -162373 321505 266059 277250 107815 -35188 337148 347295
1387 347295 53233 -21237 -290500 -469526 -294423 -179047 190963 480472 412850 297762
1377 297762 311994 181260 151279 34131 -19691 -125327 240764 523899 760699 518212
1367 518212 641675 465693 45584 178122 69456 -167131 60006 118828 -306213 -79525
1357 -79525 -129288 -54455 -180539 -664081 -738790 18367 33490 -352189 4717 222370 -396794
1346 -396794 -363892 53810 180593 -181780 -177230 263854 126050 193131 564268 601253 -51721
1335 -51721 -126327 -11259 46645 -64872 -308185 -216007 -101002 -39465 -135115 -214016 22533
1324 22533 137813 -338678 -457690 -180487 -178849 -418598 -250740 -201906 -197395 70406 -76459
1313 -76459 52928 115638 -140371 -176587 -317213 -574863 -222452 -209634 -363805 -125983
1303 -125983 26466 -80263 16647 -177785 -189755 -28662 64157 -109326 384756 442776
1293 442776 354891 371977 822657 260075 181321 97848 120975 -331049 -292153 317892 217483
1282 217483 478232 218210 -199154 -458528 -594294 -487032 -278175 64953 351834 121656
1272 121656 -63563 59312 475215 193732 -51201 -28907 -39992 172729 329333 805126
1262 805126 728153 158581 200786 475718 -8437 -187386 -196476 91952 349637 162993
1252 162993 402818 232259 153155 -233754 312531 208013 -158921 104011 623400 588008
1242 588008 331529 162009 -264084 -38698 186100 -198854 39461 312216 -150953 -81325
1232 -81325 174601 -468448 -328079 -95927 54774 139876 100304 -224576 -270614 -310951 -226031
1221 -226031 56215 12166 50430 -281668 412823 315651 13063 45199 8646 -107268 -148224
1210 -148224 -555096 -475810 -452311 -212325 285365 -38785 -350103 -561417 -357045 -462798
1200 -462798 -592556 -606235 -159151 14163 -360103 -282594 -252768 191646 279871 -249751
1190 -249751 343477 325078 -40744 54527 351319 8872 333269 320638 -179358 279856
1180 279856 133898 79842 -245340 91502 282159 194729 207613 -121340 261969 -33870
1170 -33870 -487653 -473418 -71778 -26985 -336960 -649626 -293437 -363671 -344364 18078 189544
1159 189544 367858 40069 -131999 132387 108876 -26017 -391326 -352 213091 -329846
1149 -329846 -123738 -397247 -444220 -254032 -32326 10294 -197126 -28254 -183769 126046
1139 126046 51820 63179 -29034 6741 -32322 -80051 -224920 -214902 -324579 14422 322938
1128 322938 100088 -318762 -366567 -105416 147318 489733 467109 250762 165347 -38509
1118 -38509 63718 164986 -160986 335237 -43239 -71757 41540 191992 -35562 268505
1108 268505 43948 22012 -202571 -288360 -246912 -347041 59699 -145665 -100494 -109231 -286929
1097 -286929 -408409 -243476 69993 24247 -56043 -15381 5931 245641 211268 -58140 -35763
1086 -35763 -254974 84919 140702 205276 148520 -86414 -35019 393865 219230 -37065 50713
1075 50713 16833 102539 14477 138222 -174095 -331283 93231 -420716 -330642 -317483 -464561
1064 -464561 -55638 150481 -24449 115825 189095 301277 -119214 164501 217067 105971
1054 105971 187079 -283575 -132995 -4923 -224837 -74364 -466826 -541483 -287192 -387282
1044 -387282 -352601 -566891 -535739 -373512 -172092 196327 294791 -130878 -71584 242712
1034 242712 8833 -176576 -231182 45620 246785 -323164 -292481 -42919 31612 -72590
1024 -72590 -184088 -48539 86359 -109937 -178926 -2882 174819 132496 29061 -591027
1014 -591027 -399579 45359 382740 137189 138640 165904 -405585 -725942 -518840 -549577
1004 -549577 44218 217987 216050 295193 -94478 -506864 -401073 -371310 -266943 481267
994 481267 557071 401011 337342 297280 360692 -16290 64588 -362612 -120827 -276947 -363296
983 -363296 -71058 -259668 -144309 -41760 -349460 -280238 -138233 -656488 -824843 -263650
973 -263650 -95133 181028 255355 90779 -55991 -38492 132172 -322880 -102214 6163
963 6163 85649 -243007 40075 -21578 43285 436767 204891 247486 258627 177083 83153
952 83153 205117 37415 -181486 -350477 -324056 -162054 -335737 -476722 -84435 321992
942 321992 299352 327199 187950 168204 182021 411330 -31768 -163923 -121217 22433 162393
931 162393 91488 -251413 -225358 -183118 -237873 173969 9733 -49558 -27441 -110639 -36302
920 -36302 132238 134786 247125 263443 113933 -27849 187438 376829 302310 116673 -221178
909 -221178 -129634 67578 -16649 200343 -246269 72131 7606 -14537 -29261 -116732 201580
898 201580 -135069 -352400 -81291 -63173 -227921 -97446 117251 37609 -384600 -255034
888 -255034 846 15684 48335 -122993 -367954 127254 206436 -410867 -510609 269996 114868
877 114868 351133 336553 241767 151979 188162 -27083 175415 111434 -63563 -102169 9868
866 9868 412627 501288 226755 -50608 -111511 -99260 38476 105254 241731 293524 -36802
855 -36802 -9118 -1989 -216883 -329740 -39414 20212 91801 -33906 211136 146116 128376
844 128376 91461 -134020 -190014 -138544 -71004 90720 62275 277347 226121 389019 116157
833 116157 -226069 -47772 -164707 -233844 -398986 -116029 -230616 116985 315339 387954
823 387954 19601 49792 -30662 -202747 -188079 65781 148516 277287 257015 36482 -229056
812 -229056 -33459 -10293 -68888 -110164 29218 1669 -166406 -115166 -152451 -118508 272806
801 272806 13592 148773 -107713 -119331 26847 -167958 11445 -88364 -423757 -402919
791 -402919 -350264 -374955 -227335 216067 350261 252627 336392 -189586 -194661 85110 -206391
780 -206391 -390241 -606951 -289899 -113751 51753 139161 -319035 -131774 -146610 103854
770 103854 10493 -238527 -73125 107591 -193408 -483412 -75993 -65176 61 13345 58988
759 58988 23008 -530974 -756628 -874492 -753339 -161473 -203460 -323169 -604054 -551797 -373264
748 -373264 360057 -10646 -259589 -151995 -366903 -295466 -30511 -34607 -156868 -386607
738 -386607 -276353 -463228 -777594 -628345 -370772 -470257 -517960 -358360 -368342 -97341 -159561
727 -159561 -115511 -445982 -110537 -89300 -35260 -155155 308304 172123 -76016 -339830
717 -339830 42870 224016 234735 119867 59233 249792 -75861 371898 263642 225069
707 225069 189772 -14370 -182551 -230887 -16909 -110759 -273456 -342588 -66536 -145569 -113835
696 -113835 -515677 -146688 -415833 -57141 198523 168508 66561 -225313 -173953 -348652
686 -348652 -262105 -28255 -7118 -160604 6808 37398 274513 -19912 -75968 75489 337222
675 337222 150296 78237 -74009 -400820 -44481 -111127 -149796 81209 -23193 6806 184224
664 184224 235210 172292 -23569 66028 340359 362144 225413 64001 -294633 -213664 178081
653 178081 239949 -67026 -50204 26983 -222248 11762 -205048 -527102 -343802 52784
643 52784 32212 -64227 11486 94188 93292 -115973 -17533 -74788 -321162 -321451 -163241 -161996
631 -161996 -162316 69853 -175239 311772 33303 -170639 269948 222477 47936 84957 92518
620 92518 101462 273458 -2600 -445950 -363949 -267927 122371 499640 392945 390430 342602
609 342602 152268 245995 142037 214832 -42087 152393 275218 -17444 -176352 -63944
599 -63944 25622 -84810 -84791 -115925 -341911 -295025 -228514 -528929 -552378 -239003 54050 -495426
587 -495426 -365619 -138748 -156780 -231051 -55825 -211269 -179223 -191505 158041 193182 129251
576 129251 96342 -49679 -110996 -36908 -173414 -558746 -483076 -581444 -400083 -134466 -23034
565 -23034 -105167 -207471 -461560 -694014 -276009 398466 324134 146650 330513 118248
555 118248 35566 321347 13095 24519 365664 -83470 -162148 25702 41512 -233233 -296374
544 -296374 -7604 286664 267288 113617 -142502 -423518 -165787 32957 295290 275506
534 275506 347611 476188 502311 460498 320377 676099 -20919 2454 59551 -32980 234136
523 234136 419336 793 50281 155588 124591 182807 -10156 -122680 -618980 -823730
513 -823730 -808741 -375070 -315671 -325048 302772 308439 -492405 -561831 -347726 46054 -74601
502 -74601 -213360 -304803 156310 -179605 -111383 -119842 -8178 32230 -56527 -170131 -168166
491 -168166 -46506 -132407 -211854 -245961 -290135 -96859 -349777 -523304 -122385 359922 98225
480 98225 -83451 460582 453608 206547 -91763 -86997 62708 62027 -42794 159986 194150
469 194150 -50927 105407 -191264 -4070 185601 -93352 17964 -230653 104841 -95466
459 -95466 -374200 -451194 -383978 -293398 -209031 -272107 -176396 289433 489716 97621 -211218
448 -211218 4526 241491 225061 531463 400329 121252 -68013 -102445 -380823 -450169
438 -450169 -523358 -255989 225709 94621 -24024 -99649 -329908 -93230 266184 530612
428 530612 370436 274641 343563 31505 -137458 495191 489131 -27342 -90935 -255024 -298797
417 -298797 17134 -41522 -194375 -90589 -63912 31514 73723 201144 -131649 -328101 -196852
406 -196852 -280999 -154594 215720 219105 55656 124916 235592 441709 -138569 -592063 -485032
395 -485032 -176812 14936 -78310 -40389 -355658 -92937 -290025 -192041 -376529 -155599
385 -155599 297882 -5120 -3965 161639 -142143 -472090 -371142 -146199 27569 -62022
375 -62022 -252229 -473925 -797416 -38121 314777 106077 -312466 -628307 -571797 -313904
365 -313904 3082 158510 270593 -36656 412971 197421 56390 123808 42158 156320
355 156320 6587 37250 299407 369727 395126 557314 229869 -5409 -235101 49012
345 49012 277596 -80333 -21097 39460 278568 -94230 104079 -44823 -69997 -57431 -424965
334 -424965 27030 -324100 -334899 -667506 -811699 -378577 -392219 -316330 -301555 -426884 -568999
323 -568999 -186613 -99118 -46151 -98597 -295606 -339670 -646690 -147498 -82531 -366149 -131666
312 -131666 362012 593396 -184432 -286305 -26950 -32517 -96699 125943 451610 325895
302 325895 77432 -171171 -222067 -328187 -191898 -407153 -275549 -228156 -193227 362262
292 362262 317950 228267 308347 261893 -198823 356369 350200 471387 45741 -355011 -2702
281 -2702 -318925 -610529 -485993 -716513 -301874 158351 25589 16542 45397 -110383 -466354
270 -466354 -9752 -251218 -249332 -353707 -104171 99617 -173627 -426531 -107296 2223
260 2223 61081 -75055 383407 512851 237035 34909 153327 194347 -53397 127489 -49906
249 -49906 157749 578863 196697 290937 148093 -72062 -4150 -42883 -277640 -127966 -73652
238 -73652 -157644 24926 25400 607279 572399 573562 263334 351039 135799 65898 84403 -291063
226 -291063 -274498 -148873 96951 -427340 -250612 -355936 -228993 -141653 -274798 -980
216 -980 -185154 -249922 -395891 -392841 -57697 -13574 -313278 -329726 110649 210869 107566
205 107566 126372 -94215 -347281 40003 102965 -150474 29306 178648 72497 63578 -8800
194 -8800 47154 -55341 -339450 -385733 -70934 176974 -521301 -400152 -654690 -305297 -425259
183 -425259 -254347 -131091 217172 71910 -77186 -145066 -246516 157513 164345 202651 375232
172 375232 68180 -152373 -211834 -85040 -14141 -53112 240273 184146 -268209 -294830 43454
161 43454 -103727 -91484 46182 -51973 14690 -166294 -297171 145053 34315 -315222 -82477
150 -82477 -78003 -61467 277962 122913 -90674 30670 218526 84160 64539 -33334 -64561
139 -64561 149758 460075 215063 225646 37823 -273626 -29666 -1856 -260243 -254698 -350078
128 -350078 -168011 21853 120242 -91565 -4901 33595 185600 484753 548578 354882 300917
117 300917 442461 11763 -98834 -14722 -117 -138168 15187 200864 115040 339992
107 339992 276338 -4151 -301435 44734 118571 -95910 253965 -31365 8663 20609 75927
96 75927 -46813 -77040 -69355 -263887 239699 60575 -96957 -350946 -178927 -7084 -162196
85 -162196 -98074 12327 -228204 -36579 123211 -113028 55171 -262147 102198 260966
75 260966 217706 74960 -224635 -241672 -167335 -182063 -94849 153513 330499 93329 92028
64 92028 84680 -1092 185053 125888 32692 114995 -10215 -366320 -122742 -174226 -276704
53 -276704 -402127 -322934 330403 232278 93895 69767 93757 238877 -22187 -108532 -133075
42 -133075 -5271 -26634 -190279 -58928 -180386 -266778 34063 182280 37529 -182724
32 -182724 55151 -15138 88801 -108005 -90528 -120786 58768 5214 233082 170074 51548
21 51548 316496 269590 -76337 169376 222630 201437 191827 99202 44165 -96126 -118965 -55337
9 -55337 49840 -120826 194680 130095 159235 76280 -112318 -162149 -2608
0 -2608
$$ Imaginary data points
##PAGE= N=2
##DATA TABLE= (X++(I..I)), XYDATA
16383 -2764793 -2822151 -2705417 -2744248 -2753888 -2624589 -2359796 -2543521 -2585604 -2721517 -2633722
16373 -2633722 -2656656 -2477616 -2359581 -2249262 -1717853 -2033125 -2292081 -2231047 -1933044 -1907270
16363 -1907270 -1783741 -1915943 -2254652 -2032047 -1880141 -1749952 -1673403 -1867073 -1839585 -1552009
16353 -1552009 -1676837 -1433689 -1256722 -1410433 -1207717 -1366975 -1384062 -1292821 -1423552 -1409559
16343 -1409559 -1159727 -922265 -1034475 -1089012 -694498 -898857 -1132706 -1302313 -1215775 -1134466
16333 -1134466 -1049400 -932506 -743139 -529082 -475538 -646615 -860741 -839028 -828017 -736880
16323 -736880 -447343 -364932 -521841 -382734 -469350 -631844 -646694 -742495 -483447 -153191
16313 -153191 -209972 -92203 -50540 -164205 -294843 -418652 -96038 158688 637901 523557
16303 523557 292813 357887 110221 35459 17361 94315 628829 294426 484737 574102
16293 574102 328105 559515 597127 577010 417239 271558 477318 413348 719311 831423
16283 831423 790677 801966 567143 748402 673383 821571 917780 605816 553672 614466 728184
16272 728184 734777 680816 765621 880067 818990 951919 1085349 1185095 1075352 1242231 1266999
16261 1266999 1394351 1496318 1433018 1280453 1592052 1594695 1434284 1282996 1191632 1446187
16251 1446187 1330682 1443717 1429311 1724794 1527199 1803569 1913284 1837999 1554702 1964884
16241 1964884 2134608 1806343 1737174 1804173 1803313 1870673 1894788 1877384 2004870 2076235 2081680
16230 2081680 1893946 1858124 2117963 1935759 1866298 1905332 1886261 1990709 2148982 1912760
16220 1912760 2077688 2250066 2205782 2246140 1908367 1661741 1709931 1870429 2023876 2001624
16210 2001624 1700660 1872625 2245633 2448940 2280919 2702509 2532067 2170465 2275574
16201 2275574 2324836 2513449 2327028 2398871 2661478 2374290 2722064 2462447 2403138 2964340
16191 2964340 3328833 2969313 2650297 2271213 2288031 2539502 2437667 2501075 2450562 2648660
16181 2648660 2585764 2343069 2669951 2870689 2678511 2474975 2280252 2449705 2500254 2878195
16171 2878195 3019326 2823774 2973835 2851434 2722028 2949000 3014762 2636427 2476966 2530199
16161 2530199 2576080 2893183 2829786 2945209 2844835 3088842 3026766 2753927 2400695 2788034
16151 2788034 2418513 2473771 2662107 2607294 2652765 2698231 3261374 3074061 2698069 2425509
16141 2425509 2593167 3025744 3416436 3526495 3472241 3169601 3286575 3417063 3274445 3313502
16131 3313502 3088791 2928580 3324981 3423465 3286419 3400433 2657604 2831070 2959946 3268830
16121 3268830 3345109 2717373 2761379 2723786 2931393 2828064 3181893 3403605 3248264 3074914
16111 3074914 2983030 3054200 3353550 3062116 3001208 3215254 3439505 3559839 3365345 3482240
16101 3482240 3296168 2971472 2739770 3168802 3586572 3531465 3172103 3142401 3091207 3234757
16091 3234757 3190593 3048262 3533606 3328673 3198383 3439354 3742478 3704826 3730926 3679274
16081 3679274 3552631 3199367 3261543 3209997 2976909 3278739 2978488 3060792 3332211 3275928
16071 3275928 3490707 3350122 3465262 3132472 3297042 3283788 3258365 3096665 2975393 2622499
16061 2622499 2810218 3063887 3542998 3706282 3456635 3258156 3393339 3295629 3256005 3118345
16051 3118345 3024034 2928031 2916101 3589637 3376860 3282103 2483176 2863159 3078097 2791129
16041 2791129 3022861 3038927 3315025 3236061 3262441 3672671 3329602 3397040 3254962 3349018
16031 3349018 3566689 3398313 3155714 3385132 3566860 3402296 3275138 3262831 3184295 3411056
16021 3411056 3522984 3188327 3051823 3293567 3657920 3791572 3532709 3225469 3552184
16012 3552184 3433950 3428980 3853319 4039354 3697473 3447098 3343301 3088891 3186073 3192180
16002 3192180 3429009 3342694 3241627 3250812 3505634 3669225 3632655 2994359 2907392 3284358
15992 3284358 3490624 3507232 3213775 3414851 3598329 3529696 3520482 3674360 3258766 3200600
15982 3200600 3114290 3231268 3635872 3662360 3420410 3286861 3120582 2957763 3004512 3255318
15972 3255318 3372419 3558346 3304255 3380740 3673232 3119357 3108799 3393626 3269173 3377934
15962 3377934 3396722 3206982 3194647 3428002 3548451 3648069 3415720 3322933 3282879 3483582
15952 3483582 3455647 3359593 3328079 3240507 3173174 3316934 3458809 3187193 3295157 3605549
15942 3605549 3902984 3618622 3247816 3070801 3100870 3106287 3182988 3232620 3527788 3473133
15932 3473133 3426750 3480139 3362251 3392001 3367724 3748316 3917072 3441787 3477631 3291177
15922 3291177 3307869 3674998 3492351 3139592 2984926 3224906 3326800 3329991 3428993 3533174
15912 3533174 3986479 3655143 3551224 3595408 3315356 3317421 3269913 3184410 3318071 3326416 3510153
15901 3510153 3691709 3591253 3219210 2855892 3539467 3792186 3462824 3037450 2882314
15892 2882314 3180977 2804938 2828393 3155015 3069440 3044419 3342965 3037825 2660335 2817039
15882 2817039 3171344 3482154 3487807 3397366 3080733 3084269 3303020 3524633 3566082 3497019 3526629
15871 3526629 3551190 3661476 3246427 3274890 3281728 2839503 3140915 3030573 3262131 3406118
15861 3406118 3338356 3365306 3511248 3196652 2945804 2716613 3122533 3418211 3168775 3263525
15851 3263525 3295591 3526333 3574381 2885981 2828598 3067567 3090205 3341814 2911212 2974019
15841 2974019 3312715 3469366 3156047 3244154 3772860 3822594 3795502 3929905 3825637 3554637
15831 3554637 3272079 3131904 3219569 3459094 3414824 3157056 3499185 3285846 3554446 3630868
15821 3630868 3583080 3669138 3462682 3207946 3586142 3680476 3508494 3111841 3368081 3287856
15811 3287856 3248088 3396126 3430355 3367309 2628489 2669263 3035499 3033412 3085060 3329514 3110533
15800 3110533 3541610 3293716 3213621 2827367 2748069 3025236 3189798 3120976 3359318 3571099
15790 3571099 3129880 3452420 3741111 3359186 3716418 3943465 3265851 3204327 3182649 3022707
15780 3022707 3040348 3411258 3683031 3587386 3583346 3538332 3291667 3213588 3260748 3417807 3131850
15769 3131850 3276589 3265257 2676942 3098935 3293120 3013798 3201239 3314749 3237703 3335496
15759 3335496 3289749 3509794 3557456 3379574 3070633 3381438 3423883 3503328 3806914 3343830
15749 3343830 3280056 3346299 3411549 3664422 3939314 3633398 3333821 3029186 3214196 3414655
15739 3414655 3393649 3749917 3736368 3794321 3731985 3429475 3108823 3495243 3443797 3518215
15729 3518215 3470611 3320317 3698434 3561958 3561740 3414506 2960659 2931941 3043537 3476729
15719 3476729 3699970 3469682 3463139 3133280 3310165 3776071 3614059 3561792 3471432 3331163
15709 3331163 3771892 3271099 3063169 3392504 3686104 3398665 3565375 3587114 3493081 3820194
15699 3820194 3616694 3780294 4274814 4206507 3671205 3318711 2824657 3357386 3242687 3169824
15689 3169824 3412822 3373007 3336386 3371073 3513676 3335124 3617415 3720226 3425937 3036151
15679 3036151 2923602 3229782 3340379 3677670 4098952 3508312 3247628 3421455 3670742
15670 3670742 3800263 3579908 3334140 3464368 3281473 3191005 3674105 3344281 3240161 3131613
15660 3131613 3388368 3502770 3469994 3603985 3206164 2866360 2801445 2886600 3514192 3488078
15650 3488078 3531074 3627656 3722320 3804886 3543723 3575448 3360051 3157772 3112689 3086070 3343887
15639 3343887 3583988 3300941 2769073 3134711 3336681 3069403 3204178 3698994 3761860 3030460
15629 3030460 2981018 3256230 3285187 3538892 3394838 3367864 3271126 3402884 3815316 3572257
15619 3572257 3541623 3396820 3313141 3118497 3370056 3525794 3013499 3124679 3168752 3115078
15609 3115078 3351625 3333102 3351941 3322842 3546574 3539456 3494830 3549643 3636781 3795317 3983666
15598 3983666 3254838 3550032 4084134 3356882 3645844 3531031 3059767 3429321 3601683
15589 3601683 3387327 3404014 3619585 3231691 3384980 3162420 3190766 3133083 3253605 3260115
15579 3260115 3217364 3265086 3537278 3883198 3755476 3108322 3220658 3601964 3393621 3005421
15569 3005421 2830421 3245393 3519572 3376742 3372996 3903397 4062040 3853822 3583195 3745648
15559 3745648 3777963 3883031 3437624 3336522 3406309 3294863 3247110 3446552 3695361 3995374
15549 3995374 3909429 3793797 3676812 3460847 3847622 3967005 3885594 3848191 3788042 3475566
15539 3475566 3848167 3800437 3550586 3421791 3855936 3723640 3312437 3470812 3046836 3463965
15529 3463965 3688800 3569926 3577629 3817999 3856879 3642662 3582168 3709969 3533591 3514018
15519 3514018 3359555 3083311 3193473 3685630 3918898 3898519 3472157 3386937 3475053 3661928
15509 3661928 3359271 3434706 3991976 3534187 3196916 3352309 3401630 3494532 3350127 3197313
15499 3197313 2934554 3453304 3417633 3462942 3485247 3424862 3851239 3679714 3345234 3149898
15489 3149898 3221571 3398366 3401697 3533412 3711984 3963739 3779540 3354509 3329377 3642443
15479 3642443 3688185 3392377 3852718 3720175 3575941 3550378 3529605 3501480 2999844 3206742
15469 3206742 3204129 3060175 3135514 3352542 3590136 3369202 3506441 3734717 4060669 3956201
15459 3956201 3463448 3471281 3142515 3448064 3773802 3332622 2917299 3349839 3761305 3640468
15449 3640468 3642316 3254059 3382884 3276660 3267830 2995406 3070895 3894294 3801513 3595760
15439 3595760 3525029 3119338 3351797 3780268 3801471 3564097 3502947 3551083 3732259 3483893
15429 3483893 3781568 3451733 3177977 2966632 3239061 3113123 3215063 3556727 3461041 3214863
15419 3214863 3393701 3409702 3252795 3446403 3442450 3742378 3855567 3921391 3724415 3384858
15409 3384858 3249612 3155414 3134286 3499085 3801028 3802627 3568371 3449774 3472654 3595961
15399 3595961 3763187 3894909 3878271 4080376 3912086 3872635 3713349 3528787 3637539 3256293
15389 3256293 2802747 3067716 3615609 3587610 3515631 3482199 3666024 3614383 3485740 3690417
15379 3690417 3972034 3820561 3550221 3388466 3333777 3502768 3501558 3780281 3578406 3513139
15369 3513139 3227602 3246894 3296740 3335900 3546427 3492813 3620526 3606785 3674240 3861854
15359 3861854 3922855 3678609 3623781 3929889 3507934 3595379 3671534 3545800 3651286 3521041
15349 3521041 3417359 3502668 3628474 3552121 3706868 3415658 3167655 3280978 3187722 3118257
15339 3118257 3477557 3765055 3373994 3561375 3766322 3322643 3577614 3817448 3918094
15330 3918094 3760365 3608180 3564354 3662531 3628157 3674544 3377472 3467092 4275982 4472175
15320 4472175 4605802 4042894 3638047 3745701 3744678 3528123 3591589 3472911 3622018 3768585
15310 3768585 3563212 3369963 3090082 3156058 3519270 3649894 3260135 3311703 3278931 3204531
15300 3204531 3667931 3672291 3553013 3501522 3499072 2971287 3118833 3908354 4098265 4229090
15290 4229090 4083576 3406432 3435987 3479606 3742998 3658096 3852365 3772433 3404565 3602210
15280 3602210 3837164 3791555 3522064 3488734 3134721 3239500 3443071 3725737 4107301 4210278
15270 4210278 3810004 4061519 3940517 3442262 3243372 3463967 3681956 3759317 3670760 3637310
15260 3637310 3038203 3284771 3161496 3315787 3557349 3260779 3324156 3661340 3719330 3759383
15250 3759383 4413643 3875307 3585749 3509760 3550902 3502728 3644630 3396919 3484783 3883633
15240 3883633 3759761 3706429 3764917 3617628 3520587 3515705 3260721 3139310 3053775 3164298
15230 3164298 3574368 3723010 3704425 3892663 3531626 3587602 3377071 3063615 2975473 2732816
15220 2732816 3161438 3353988 3559741 3839879 3424165 2936194 3144263 3052292 3200394 3446638
15210 3446638 3701709 3706337 3576840 4073804 4078523 3960988 4018055 3911887 3485945 3457821
15200 3457821 3560077 3705507 3404040 3322295 3338161 3552879 3766180 3507310 3303608 3256965
15190 3256965 3311726 3421621 3702922 3683374 3691023 3740774 3548889 3347336 3320699 2996680
15180 2996680 2892703 3331095 3726818 3578911 3175110 3196893 3512341 3892982 3934068 3989284
15170 3989284 4111620 3825743 4009714 4131774 3745276 3994814 4174321 3538505 3309641
15161 3309641 3366308 3443671 3586999 3270287 3459892 3160506 3482086 3738337 3658173 4037891
15151 4037891 3710398 3669642 3977013 3747942 3859456 4168102 4192064 3659699 3403739 3283938
15141 3283938 3562851 3670633 3591434 3615327 3403865 3750903 3286182 3211830 3401896 3345530
15131 3345530 3755135 3884300 3721125 3453438 3177772 3539570 3552191 3887829 3910566 3689367
15121 3689367 3483023 3663465 3786882 3693240 3628496 3919640 3555981 3429144 3603705 3655159
15111 3655159 3405884 3413733 3596067 3199442 3291880 3663400 3332971 3421370 3703165 3657488
15101 3657488 3441864 3636069 3434910 3533126 3566352 3862299 3811846 3531601 3696870 3807304
15091 3807304 3806640 3658461 3443765 3392618 3252265 3526336 3652452 3622826 3952183 3773077
15081 3773077 3479362 3387186 3318846 3155892 3723557 3449006 3616962 3465490 3485296 3333152
15071 3333152 3751819 3700628 3493165 3731639 4355730 4148629 4045693 3813363 3742436 3730659
15061 3730659 3705879 3364334 3072205 3237736 3384642 3557973 3725435 4113584 4083849 3537425
15051 3537425 3249466 3429453 3435863 3788331 3531568 3232998 3438490 3489778 3494108 3428511
15041 3428511 3657543 3789863 3706472 3903643 3985241 3705453 3754070 3794889 3918291 3801859
15031 3801859 3744760 4090095 4019468 3998982 4106932 3923907 3502344 3844124 3937700 3915745
15021 3915745 3794194 3792049 3726558 3673211 3729755 3218502 3207512 3488945 3607515 3572687 3673709
15010 3673709 3822645 3595272 3797385 3986835 3578613 3489722 3825224 3787071 3342014 3688293
15000 3688293 3827577 3419910 3266026 3243234 3592496 3627770 4062351 3609871 3661199 3990894
14990 3990894 4211093 4003301 3659277 3429493 3368818 3595767 3462127 2972456 3120236 3362222
14980 3362222 3292290 3480572 3546914 3942935 3610970 3525506 3576304 3590962 3602350 3628894 3681110
14969 3681110 3983252 3871198 3704285 3892558 3749405 3582413 3837601 3590205 2997677
14960 2997677 3172726 3500983 3610362 3610752 3540351 3697503 3977745 3870147 3606516 3663370
14950 3663370 3334022 3074858 3322087 3230475 3277186 3490130 3911270 4032075 3960970 3559486
14940 3559486 4101721 4319214 4227087 3910196 3681609 3752285 3880415 3900377 3459489 3623769
14930 3623769 3737225 3914984 3451094 3432844 3569611 3646299 3874842 3718075 3692051 3610156
14920 3610156 3233051 3431006 3544306 3571810 3567405 3404262 3238280 3395488 3676450 3722380
14910 3722380 4013205 3677176 3686021 3274723 3335702 3442309 3429881 3632405 3584665 3580456 3886278
14899 3886278 4035835 3963814 3679328 3574267 3484406 3682726 3416201 3364027 3280091 3554087
14889 3554087 3685227 3337646 3763232 3812695 4030201 3773863 3720680 3517236 3803577 3557807
14879 3557807 2939239 3193640 3518012 3646122 3890744 3645483 4008347 3852634 3943002 3980977
14869 3980977 3642615 3826930 3735362 3890011 4065178 4072546 4353294 4327333 3945004 3774601
14859 3774601 3710991 3530176 3856442 3717114 3600452 3307959 3496384 3490456 3683822 3866386
14849 3866386 3601535 3721583 3733270 3572350 3815572 4123166 3817517 3587527 3531707 3708256
14839 3708256 3834104 3718802 3833646 3942136 3778698 3797673 3713674 3526218 3647187 3929576
14829 3929576 3714362 3680401 3585396 3945102 3682137 3581037 3690685 3748916 3604996 3371518
14819 3371518 3417981 3618282 3967353 3788514 3499962 3140774 3340328 3791584 4326840 4207647
14809 4207647 3973128 4111334 4252180 3689980 3560911 3448063 3736151 3819348 3314895 3423115
14799 3423115 3317359 3987996 3909822 3620898 3400526 3685265 3930470 3717219 3679292 3968155
14789 3968155 4009758 4057313 3716635 3986263 4117927 3933529 3753616 3404425 3772160 3835899
14779 3835899 3660058 3629039 3470842 3262698 3378554 3707561 3875800 3809144 3812138 3960800
14769 3960800 4015519 4207856 4226754 4671065 4312857 4134674 4330467 4335384 4127160 3761437
14759 3761437 3917534 3611367 3629305 3684986 3820942 3858399 3749929 4017970 3663888 3921841
14749 3921841 3902743 3888594 4078675 3993833 3735059 3787205 3824494 3503623 3833294 3294878
14739 3294878 3267157 3614457 3807298 4180801 3801589 3586040 3548105 3860908 4023136 3608177
14729 3608177 3663821 3754683 4250292 4173839 4044637 3827731 3453097 3572875 4153172 4071209
14719 4071209 3968022 3732609 3947258 4150970 4161204 3902106 3894414 3794655 4041988 4333749
14709 4333749 3958972 3808018 3794615 3960879 3563021 3658977 3946664 3956790 3760166 4079641
14699 4079641 4414989 4159773 3875626 3813452 3528739 3504938 3780259 3675977 3580967 3781323
14689 3781323 4000770 4308802 3906099 3746175 4168251 4159851 3978172 3342821 3695025 4093998
14679 4093998 3813560 3550643 3544335 4079514 4065703 4036545 4390018 4564899 4391245 3917586
14669 3917586 3778471 3449690 3433168 4051744 3944466 3762730 3885171 3907545 3875355 3783734
14659 3783734 4036579 4054144 4044103 3699984 3770933 4195752 4186048 3894149 3806762 3821743 4051531
14648 4051531 4189496 3896305 3739870 3647699 3424568 3717196 4211553 3787605 3616870 3712353
14638 3712353 3916672 3941012 3687877 3414481 3650152 3652192 4218623 4087328 4082963 4005265
14628 4005265 3428759 3691864 3525970 3858675 3791310 3889513 4119717 3897257 3811381 3484802
14618 3484802 3573856 3876326 3438185 3760074 4331463 4077394 3713265 3837528 4140296 4144754
14608 4144754 4280734 4049571 3746277 3673556 3553189 3768371 3847769 3884990 4066479 3769080
14598 3769080 3549768 3966975 3984441 4063439 4020324 3892505 4163664 4061759 4032027 4291173
14588 4291173 4088157 4117359 4231338 3966322 3622015 3973507 4262053 4068371 4407360 4412953
14578 4412953 4254185 4024251 3970425 3689215 3768712 3940919 4131540 3804488 4053486 3923173
14568 3923173 3572578 3761269 3595148 4114280 4004782 4003876 3887587 3501643 3581771 3678729
14558 3678729 3825175 4413416 4300931 3935180 4083463 4121322 4054304 3694846 3811195 4087233
14548 4087233 4185267 4211961 3930237 3823768 4117448 4049973 4032535 3678041 3433285 3097455
14538 3097455 3105009 3349568 3665785 3656797 3590904 3817750 3868752 3536208 3543062 3756261 4073685
14527 4073685 3719940 3628454 3726867 3609715 3727171 3602335 4280241 4569141 4320020 3914744
14517 3914744 3997011 3973119 3862592 3938225 4069574 3868836 3934458 3928334 3347946 3446376 3605320
14506 3605320 3702227 3872517 3959114 3768941 3814249 3643147 3718850 4093570 4135412 4014949
14496 4014949 3430811 3520037 3524644 3600336 3582139 3744510 3910407 3695455 3755166 4203374
14486 4203374 3826871 3523138 3646387 3676759 3937678 4201950 4147857 4278332 4140635 3789160
14476 3789160 4151980 4131644 4214625 3596653 3381276 3727816 3678635 4009499 4023860 4022067
14466 4022067 3782949 4319158 3797338 3668874 3516386 3479679 4097543 4266991 4026874 3363608
14456 3363608 3494235 3942856 3754129 3490864 3699333 3996755 4341810 4264559 3999962 4581375
14446 4581375 4344723 3883622 3826897 3631718 4121999 3681460 3770091 3704032 3871026 3947756
14436 3947756 3224594 3079484 3294257 4029956 4211294 4127943 3793038 3701333 3995468 3926433
14426 3926433 3908415 3742118 3732491 3648442 3756934 3546528 4081836 4018460 4049004 4014424 3876307
14415 3876307 4279379 4118312 4152506 4147063 3910287 3683147 3539608 3755719 4327196 4570018
14405 4570018 4287598 3906567 3538621 3478831 4046247 3889936 3886159 3962641 3986921 4123122
14395 4123122 4138051 4101385 3736405 3931860 3960920 3763473 3708585 3496258 3929871 4019526
14385 4019526 3998126 3668432 3836885 4128767 3978298 3831516 3838340 3799474 4171006 4403063
14375 4403063 3981688 4342271 4163774 3900974 4176196 4190816 4285954 4017201 3906057 4126686
14365 4126686 4037645 3978045 3878140 4206108 4037044 4093502 4369512 4036750 3928349 4352814
14355 4352814 3947659 3964483 4081405 4144565 3983421 3371935 3403546 3795876 3986951 3621815
14345 3621815 3741416 4204762 3950625 3851609 3853603 3799528 3915239 4121484 4062163 3800430
14335 3800430 4097670 4180629 4066805 4158034 4130718 4474033 4428330 3969513 3819259 3944460
14325 3944460 4013056 4324113 4055461 4022700 4046653 4085596 4138440 3924422 3726081 3677332
14315 3677332 3689968 3483266 3742931 3954476 3601413 3647762 3724712 4136654 3799511 3632735
14305 3632735 3765748 4184011 4339354 4274625 4101970 3547118 4120757 4206477 3852095 3614905
14295 3614905 4259753 4140734 4132714 3944223 3924567 4064632 3892388 3856913 3869217 3606011
14285 3606011 4232105 4248357 4526490 4649157 4658335 4198244 3866392 4224004 4667509 4303551
14275 4303551 3902823 3901941 3996762 3937635 3777599 4265712 4353166 4152090 4113447 4051978 3914263
14264 3914263 3871752 4007226 4212057 4170890 4380373 4366625 4077396 3900500 3668317 3945351
14254 3945351 3920165 3679335 3657061 3486079 3597685 4087656 3933967 3976084 4020671 3938650
14244 3938650 4129837 4165212 4143855 3801916 3987588 4055366 4161640 4197753 4067553 3653117
14234 3653117 3922454 4272087 4345162 4261826 4322764 4098216 4475376 4608925 4551452 4006529
14224 4006529 4105645 4305417 4337929 4088186 3757137 4073856 4032718 3930529 3901667 3796705
14214 3796705 3930919 4124991 3907787 4189165 3879210 3805701 3897009 3977323 3735695 3612875
14204 3612875 3459478 3883544 4156138 4316069 4226643 3910617 4026964 3733186 3738860 3895230
14194 3895230 3868729 4062374 3908051 3910946 4140412 4126247 4174166 4245586 4015809 4134992
14184 4134992 4339142 4062782 4144456 3675556 3619611 4055739 4210989 4463575 4171651 3624452
14174 3624452 4110099 4593519 4774140 4357472 4712484 4621098 4390241 4286829 4694406 4365770
14164 4365770 4132182 4372084 3752144 3999037 4548488 4183555 4408758 4332748 4150563 4291621
14154 4291621 4382127 4373019 4313280 4428578 3932856 3959697 3940213 4157054 4119687 4390535 4171018
14143 4171018 4259067 4487043 4320165 4380488 4147333 3988961 3789890 3964941 4237078 4681188
14133 4681188 4726395 4485979 4173584 4087726 4470370 4154462 4040061 3573843 3531687 3319400
14123 3319400 3825856 3965780 3828671 3737043 3617170 3871411 3925069 3869249 3815347 4092590
14113 4092590 4097352 4271059 4137229 3995644 3844721 4188242 4050953 3904464 3889604 3867740
14103 3867740 3856595 4311050 4441716 4422685 4341165 4600183 4461316 4109192 3837384 3960171
14093 3960171 4280433 4390596 4207699 4017221 4263842 4242860 4651044 4322109 4207992 3971762
14083 3971762 3940784 4136772 4235928 4192482 4045822 3728098 3985668 4464718 4450146 3984678
$$ [...]
##END NTUPLES=NMR SPECTRUM
##END=
