##TITLE=1H_CG-1150-F2
 CDCl3
 8 sc, 
 15.3.2023
##JCAMPDX= 6.0         $$ Bruker NMR JCAMP-DX V2.0
##DATA TYPE= NMR SPECTRUM
##DATA CLASS= NTUPLES
##ORIGIN= UXNMR, Bruker Analytische Messtechnik GmbH
##OWNER= root
$$ XWIN-NMR		Version 3.5
$$ Wed Mar 15 14:54:37 2023 Russian Standard Time (UT+4h)  she@DPX200
##.OBSERVE FREQUENCY= 200.13135
##.OBSERVE NUCLEUS= ^1H
##.ACQUISITION MODE= SIMULTANEOUS
##.ACQUISITION SCHEME= undefined
##.AVERAGES= 8
##.DIGITISER RES= 18
##SPECTROMETER/DATA SYSTEM= spect
##.PULSE SEQUENCE= zg30
##.SOLVENT NAME= DMSO
##.SHIFT REFERENCE= (INTERNAL, DMSO, 0, 15.7315)
##AUDIT TRAIL= $$ (NUMBER, WHEN, WHO, WHERE, WHAT)
$$ ##TITLE= Audit trail, XWIN-NMR		Version 3.5
$$ ##JCAMPDX= 5.01
$$ ##ORIGIN= Bruker BioSpin GmbH
$$ ##OWNER= she
$$ F:/spectra/data/she/nmr/H-F/1/pdata/1/auditp.txt
$$ ##AUDIT TRAIL=  $$ (NUMBER, WHEN, WHO, WHERE, WHAT)
(   1,<2023-03-15 14:53:35.45 +0400>,<she>,<DPX200>,
      <created by zg, POWCHK disabled, PULCHK disabled
       configuration hash MD5:
       00 E9 B6 7A A2 85 ED C7 34 08 36 98 17 FE 4E 26
       data hash MD5: 16K
       3B 21 76 1D EF 02 1E 47 E8 85 C4 D2 EB 65 6D 2A>)
(   2,<2023-03-15 14:53:37.81 +0400>,<she>,<DPX200>,
      <Start of raw data processing
       efp BC_mod = 2 LB = 0.24 FT_mod = 6 PKNL = 1 PHC0 = -19104.28 PHC1 = 12.00074 SI = 16K 
       data hash MD5: 16K
       6F B8 B3 ED 76 87 75 8E 62 23 14 9E A0 9C DF 6A>)
(   3,<2023-03-15 14:53:54.09 +0400>,<she>,<DPX200>,
      <pk PHC0 = -3.929273 PHC1 = 4.6 
       data hash MD5: 16K
       3A 79 8E 59 79 67 EF 03 F9 67 8C 83 E0 DA BC CC>)
(   4,<2023-03-15 14:53:57.28 +0400>,<she>,<DPX200>,
      <abs ABSG = 5 
       data hash MD5: 16K
       72 4E B9 6D 72 BE 40 42 43 20 71 5F C8 21 38 4A>)
$$ ##END=
$$ 
$$ hash MD5
$$ 1E 86 D1 40 92 01 1A B5 0D ED A9 8C 5E 59 2F 46
##$RELAX= 
##$RELAX= 
##$RELAX= 
##$RELAX= 
##$RELAX= 
##$RELAX= 
$$ Bruker specific parameters
$$ --------------------------
##$DU= <F:/spectra>
##$EXPNO= 1
##$NAME= <H-F>
##$PROCNO= 1
##$TYPE= <nmr>
##$USER= <she>
##$AMP= (0..31)
100 100 100 100 100 100 100 100 100 100 100 100 100 100 100 100 100 100 
100 100 100 100 100 100 100 100 100 100 100 100 100 100 
##$AQSEQ= 0
##$AQ_mod= 1
##$AUNM= <au_zg>
##$AUTOPOS= <>
##$BF1= 200.13
##$BF2= 200.13
##$BF3= 200.13
##$BF4= 200.13
##$BF5= 200.13
##$BF6= 200.13
##$BF7= 200.13
##$BF8= 200.13
##$BYTORDA= 1
##$CFDGTYP= 0
##$CFRGTYP= 5
##$CHEMSTR= <none>
##$CNST= (0..31)
1 1 145 1 1 1 1 1 1 1 1 1 1 1 1 1 1 1 1 1 1 1 1 1 1 1 1 1 1 1 1 1 
##$CPDPRG= <>
##$CPDPRG1= <>
##$CPDPRG2= <>
##$CPDPRG3= <>
##$CPDPRG4= <mlev>
##$CPDPRG5= <mlev>
##$CPDPRG6= <mlev>
##$CPDPRG7= <mlev>
##$CPDPRG8= <mlev>
##$CPDPRGB= <>
##$CPDPRGT= <>
##$D= (0..31)
0 1.2 0 0 0 0 0 0 0 0.06 0 0.03 0 0 0 0 0.0002 0 0 0 0 0 0 0 0 0 0 0 0 
0 0 0 
##$DATE= 1678877614
##$DBL= (0..7)
120 120 120 120 120 120 120 120 
##$DBP= (0..7)
150 150 150 150 150 150 150 150 
##$DBP07= 0
##$DBPNAM0= <>
##$DBPNAM1= <>
##$DBPNAM2= <>
##$DBPNAM3= <>
##$DBPNAM4= <>
$$ [...]
##$SUBNAM3= <"">
##$SUBNAM4= <"">
##$SUBNAM5= <"">
##$SUBNAM6= <"">
##$SUBNAM7= <"">
##$SUBNAM8= <"">
##$SUBNAM9= <"">
##$SW= 18.05172834244
##$SWIBOX= (0..15)
0 0 2 0 0 0 0 0 0 0 0 0 0 0 0 0 
##$SW_h= 3612.71676300578
##$TD= 16384
##$TD0= 1
##$TE= 0
##$TE2= 300
##$TE3= 300
##$TEG= 300
##$TL= (0..7)
0 120 120 120 120 120 120 120 
##$TP= (0..7)
150 150 150 150 150 150 150 150 
##$TP07= 0
##$TPNAME0= <>
##$TPNAME1= <>
##$TPNAME2= <>
##$TPNAME3= <>
##$TPNAME4= <>
##$TPNAME5= <>
##$TPNAME6= <>
##$TPNAME7= <>
##$TPOAL= (0..7)
0.5 0.5 0.5 0.5 0.5 0.5 0.5 0.5 
##$TPOFFS= (0..7)
0 0 0 0 0 0 0 0 
##$TUNHIN= 0
##$TUNHOUT= 0
##$TUNXOUT= 0
##$USERA1= <user>
##$USERA2= <user>
##$USERA3= <user>
##$USERA4= <user>
##$USERA5= <user>
##$V9= 5
##$VALIST= <valist>
##$VCLIST= <CCCCCCCCCCCCCCC>
##$VD= 0
##$VDLIST= <DDDDDDDDDDDDDDD>
##$VPLIST= <PPPPPPPPPPPPPPP>
##$VTLIST= <TTTTTTTTTTTTTTT>
##$WBST= 1024
##$WBSW= 4
##$XGAIN= (0..3)
0 0 0 0 
##$XL= 0
##$YL= 0
##$YMAX_a= 64462
##$YMIN_a= -73534
##$ZGOPTNS= <>
##$ZL1= 120
##$ZL2= 120
##$ZL3= 120
##$ZL4= 120
##$ABSF1= 15.73367
##$ABSF2= -2.318179
##$ABSG= 5
##$ABSL= 3
##$ALPHA= 0
##$AQORDER= 0
##$ASSFAC= 0
##$ASSFACI= 0
##$ASSFACX= 0
##$ASSWID= 0
##$AUNMP= <proc_1d>
##$AZFE= 0.1
##$AZFW= 0.1
##$BCFW= 0
##$BC_mod= 2
##$BYTORDP= 0
##$COROFFS= 0
##$CY= -3
##$DATMOD= 1
##$DC= 0
##$DFILT= <>
##$DTYPP= 0
##$F1P= 0
##$F2P= 0
##$FCOR= 1
##$FTSIZE= 16384
##$FT_mod= 6
##$GAMMA= 0
##$GB= 0
##$INTBC= 1
##$INTSCL= 3.70164e-10
##$ISEN= 128
##$LB= 0.24
##$LEV0= 0
##$LPBIN= 0
##$MAXI= 10000
##$MC2= 0
##$MEAN= 0
##$ME_mod= 0
##$MI= 1.114404
##$NCOEF= 0
##$NC_proc= -9
##$NLEV= 6
##$NOISF1= 3.799351
##$NOISF2= 2.8
##$NSP= 0
##$NTH_PI= 0
##$NZP= 0
##$OFFSET= 15.73146
##$PC= 1
##$PHC0= -19108.21
##$PHC1= 16.60074
##$PH_mod= 1
##$PKNL= yes
##$PPARMOD= 0
##$PSCAL= 0
##$PSIGN= 0
##$REVERSE= no
##$SF= 200.130008021064
##$SI= 16384
##$SIGF1= 3
##$SIGF2= 2
##$SINO= 5.538805
##$SIOLD= 16384
##$SREGLST= <1H.CDCl3>
##$SSB= 0
##$STSI= 16384
##$STSR= 0
##$SW_p= 3612.71676300578
##$SYMM= 0
##$S_DEV= 0
##$TDeff= 16384
##$TDoff= 0
##$TI= <>
##$TILT= no
##$TM1= 0
##$TM2= 0
##$TOPLEV= 0
##$USERP1= <user>
##$USERP2= <user>
##$USERP3= <user>
##$USERP4= <user>
##$USERP5= <user>
##$WDW= 1
##$XDIM= 16384
##$YMAX_p= 423968790
##$YMIN_p= -2332781
$$ End of Bruker specific parameters
$$ ---------------------------------
##NTUPLES= NMR SPECTRUM
##VAR_NAME=  FREQUENCY,     SPECTRUM/REAL,   SPECTRUM/IMAG
##SYMBOL=    X,             R,               I
##VAR_TYPE=  INDEPENDENT,   DEPENDENT,       DEPENDENT
##VAR_FORM=  AFFN,          ASDF,            ASDF
##VAR_DIM=   16384,         16384,           16384
##UNITS=     HZ,            ARBITRARY UNITS, ARBITRARY UNITS
##FACTOR=    0.220516191357247, 1,           1
##FIRST=     3148.33713945628, 0,            0
##LAST=      -464.379623549497, 0,           0
##MIN=       -464.379623549497, -2332781,    0
##MAX=       3148.33713945628, 423968790,    0
$$ Real data points
##PAGE= N=1
##DATA TABLE= (X++(R..R)), XYDATA
$$ [...]
7872 -751585 -129133 -91016 -327280 -947220 -127453 -787862 -1025322 -357672 -210025 -544248
7862 -544248 -747505 -967041 -448318 -942283 -517057 -656503 -52212 -353599 -889602 -851530
7852 -851530 -177404 -297751 -629580 -834611 -237921 -716978 -915480 -614404 -800742 -184535
7842 -184535 -802373 -270707 -361135 434232 627098 21529 -306443 -165253 359714 -363281
7832 -363281 -1001210 -1259942 -859149 82902 -238596 -1076321 -1084587 -648980 -223098 -408212
7822 -408212 -1138410 -1317709 -1473528 -1870849 -2020319 -1601460 -995413 -764713 -1390917 -910451
7812 -910451 -540580 -808717 -267357 27491 -463692 -22591 -242970 277380 -1998227 -1122585
7802 -1122585 -321956 -169839 95887 -1122568 -1005377 -1239240 -1565158 -1219219 -465054
7793 -465054 571250 51 -605484 -78324 -163089 -158127 -753295 -969478 -711205 -1153221
7783 -1153221 -1137598 -208061 -547393 -432256 -1001844 -1618476 -1247165 -789728 -208585 -539811
7773 -539811 -835457 375889 -70220 -424624 -966505 190334 -20490 -120032 522534 777525
7763 777525 634834 -127470 -517686 -642026 -1455486 -648537 431212 -691653 -1417486
7754 -1417486 -601341 272742 -181299 367349 771901 53805 -1068955 -425372 -135538
7745 -135538 238991 -262831 -296907 -373023 -384435 -100835 69848 203938 -306672 -457492
7735 -457492 -717295 -884751 -1632263 -1692585 -1410968 -877904 -647364 -982584 -969964 -366697
7725 -366697 -321241 -630410 -264469 -189886 -978413 -1017045 -254005 -790807 -847567 -999266
7715 -999266 42300 -244651 -1051556 -440565 -624060 -876610 -774009 -412218 -47170 -93923
7705 -93923 -505626 -525428 -1340677 -1465674 -1889700 -977449 -299275 -984206 -241838 472177
7695 472177 -168352 -912750 -803562 -747136 -302363 -829152 -1223055 -1086062 -448949 -338339
7685 -338339 341786 -323958 -597095 -467344 -579605 -353391 -350998 -255909 -17856 -176026
7675 -176026 -7742 268949 -491926 -326103 -688147 -1192007 -1794070 -1576822 -166860 199970
7665 199970 425726 -438144 -1861368 -1717816 -265458 -84169 -423042 23411 -519338
7656 -519338 -841109 -444411 -375687 -173131 204755 91159 3433 339253 -401402 291948
7646 291948 392559 -69132 610877 561701 246083 228704 1513255 1059781 1381016 1115691
7636 1115691 926329 605219 274665 646344 -15649 -751972 -518763 129803 873799 -24360
7626 -24360 -818264 -898673 -433746 -167685 250182 39084 -469159 -538960 -14218 346241
7616 346241 237087 -590630 -723920 -644633 -522731 -481511 -618427 -1117732 324935 839116
7606 839116 3578 -424533 -846292 -668211 -1116070 -1267415 -1091387 -202472 -73600 -738886
7596 -738886 -1099657 -1141402 -1958523 -1461953 -30636 518756 -201687 -885472 -1139556 17450
7586 17450 -134451 -659305 74803 194178 -632498 -146144 -16098 -557560 -528702 -713224
7576 -713224 -1180718 -1015854 -1279526 -1495690 -277202 8862 399826 281709 -564832 -481991
7566 -481991 -901772 -734658 -45647 820716 275272 -16311 276350 353420 -679543 -381769
7556 -381769 -1038719 -1072445 -1118579 -839216 -981624 -1200856 -116971 -795700 -645127 -669996
7546 -669996 -47681 -315431 -385947 -47614 -1402177 -880069 -246426 -498758 119644 -121131
7536 -121131 -334035 -851421 -1348000 -1688979 -1758735 -843489 7987 -601701 -787649 -1027617
7526 -1027617 -453491 157536 156297 -665162 -599800 -108286 -434534 184893 100437 -1207474
7516 -1207474 -896369 -996419 -524911 -327822 -332939 -938407 -1106800 -289834 -367235 -11217
7506 -11217 541502 447483 -77991 -113659 -676333 -1082012 -941830 -587512 95790 113334
7496 113334 34043 140237 -11701 304650 133693 -15855 18192 -5745 -194151 -28468
7486 -28468 125973 659266 278107 158210 607188 676618 384300 291694 846625 760595
7476 760595 147975 -271887 -395440 215899 -228789 -206430 -694130 -936675 -684470 -354210
7466 -354210 -275698 -747869 -1389967 -1310431 158171 -546143 -274952 -423381 -558128 -448172
7456 -448172 -852064 -274768 287639 116973 -472377 -199468 581943 631517 778993 794466
7446 794466 259340 -290445 513102 692560 1193018 517513 -557606 -559399 -438703 483340
7436 483340 49944 -888438 130726 37279 -137706 213989 -27827 178229 -587225 -168601
7426 -168601 596385 769027 100197 -3650 -412660 381619 -67931 -701928 -76032 123174
7416 123174 -106801 52715 -590012 -1733737 -1191249 -14926 322799 827103 422558
7407 422558 -328926 -583428 -597795 -1102920 -177497 -554015 -432795 342065 -400023 -395630
7397 -395630 -1101931 -582652 -129082 -588036 -116521 -371864 -523095 14571 53998 204339
7387 204339 -232040 419985 38866 -721213 -267948 615087 356964 387003 289730 129874
7377 129874 135941 334308 -411017 -458780 -444755 -893638 -1052136 -1483556 -1185557 -682516
7367 -682516 -518327 374480 1075993 607789 531265 391575 -203419 390797 152240 622599
7357 622599 1071544 595093 -188455 207693 257557 172734 429849 455238 345777 -761903
7347 -761903 -1209774 -519183 -377142 -100624 519268 -602564 -191255 637989 166035 -808314
7337 -808314 237854 507753 363207 -225163 -853070 -858807 -31002 425539 669080 875725
7327 875725 1054983 644985 694289 720413 153905 372446 69396 -34511 -84608 221240
7317 221240 152688 -251311 -153094 372051 -99516 -19511 5562 -257673 -26336 437304
7307 437304 -193529 -460985 326868 637955 -98325 32731 206358 92555 224758 515060
7297 515060 419987 -52953 216755 -199802 -453924 530268 920384 912415 147408 162666
7287 162666 705231 1062734 1404736 1259748 970149 717937 -35986 621476 1202535 722662
7277 722662 771322 521209 995518 724561 294420 1383520 1675903 1413751 1793613 1770662
7267 1770662 1575732 2215591 2182864 1805331 1781691 1543960 1746186 1200094 1575939 1000033
7257 1000033 1018207 1615734 1481230 1800189 1953287 2034572 2106303 1982548 2563714 2310445
7247 2310445 2980416 3043939 4280943 4485854 4170750 4483710 3510739 3402942 4665596
7238 4665596 4695131 4666990 4352631 5132884 5440021 5297978 5746404 5874078 6559471 6829561
7228 6829561 6730947 6012183 6727419 6787782 5711816 5603530 4888732 4732741 5425369 5310190
7218 5310190 5192859 4652904 4877774 4599222 4941735 4424053 3894316 3526784 3416213 4284493
7208 4284493 3048400 3138229 3185228 2489914 2891908 2210789 2451832 2388397 2245675 1814645
7198 1814645 1882470 1322300 1601943 1166449 968663 1214460 1372961 1741184 1594544 1148096
7188 1148096 941419 1404051 1115218 2136621 2024118 1509632 958241 1624545 1822898
7179 1822898 1253231 1127533 1271709 1316164 837191 727775 1141392 1687493 1101075 997794
7169 997794 1577002 897696 721249 302768 648991 800058 1288919 671719 621650 695639
7159 695639 1017022 1059373 1428037 1878041 940867 783549 1138622 1402411 1085774 822073
7149 822073 1387248 1652460 999105 1057614 1241282 1957596 1743430 1817811 1103416 1518349
7139 1518349 676798 1218224 936733 155118 370865 1052757 806327 806666 860186 719648
7129 719648 998487 1658501 1476327 1338967 593078 868177 916194 808070 1003308 1846668
7119 1846668 1573671 1193070 1073306 905960 865170 1801430 1648890 1078274 839143 422157
7109 422157 427227 789877 1430616 330743 -71865 652633 790281 616300 457319 105583
7099 105583 1861520 1809858 1644149 1427515 1318991 953492 1710368 2320581 2114558 1706440
7089 1706440 1830034 1647240 1348544 1368736 2107684 2802093 2459367 2998653 3226200 2165218
7079 2165218 2119303 2394153 2216563 2349674 3080722 2562228 2375415 2112274 2889774 3336905
7069 3336905 3396461 3282172 2940011 2226553 2837611 3497604 3532613 2988391 3427302 3517957
7059 3517957 3094796 3425451 3539305 2536203 2374823 3168252 3075527 2995259 4357633 4740267
7049 4740267 4476307 4063669 4030027 4517321 4305079 4465829 4632243 4392159 3821955 4648819
7039 4648819 4731865 4860902 4401483 4479588 5284494 4065602 4702619 5904231 6253380 5848034
7029 5848034 6465986 6256507 5462603 5980655 6743718 6697148 6553385 6923368 6563117 6441302
7019 6441302 6426203 6583717 6977807 8234274 7844593 7408443 7965168 9156208 9189452 9401080
7009 9401080 8572220 9048824 9289470 9684568 10538666 11024462 11041154 11526689 11848830 12220676
6999 12220676 13516260 13602989 13467125 13225407 13530714 14976187 15977464 16693285 17663814
6990 17663814 17564435 18654032 18596789 18990117 19295597 18970747 18998361 19612313 20257186 20103200
6980 20103200 20107599 20149203 20328693 21133036 20732108 20671405 20796082 19299189 19064311 19318849
6970 19318849 18647916 17439338 16917382 15864399 15829394 15064957 14127783 13435376 13344329
6961 13344329 13319850 12627209 11728718 11459178 11466044 11168681 10549859 9304779 8496245 7857518
6951 7857518 8155950 8667270 7045079 7450533 7413711 6542755 6404771 6172460 5245479 5164060
6941 5164060 5494368 5171367 4708058 5261074 4726298 4832547 4319757 4096527 4137424 4107581
6931 4107581 3974709 3531840 3847169 3717620 3756371 3338114 3375647 3302165 3111618 2469986
6921 2469986 2088993 2884146 3455731 3389963 2808860 2022080 2057429 2207680 2527334 1671167
6911 1671167 1031009 1829764 2820015 2788083 2948380 2880733 3394159 2092511 2043532 2456098
6901 2456098 2361750 2696312 2574598 1413794 1392527 1266679 1067535 489282 255616 561583
6891 561583 446185 689807 720702 474587 1676270 1856197 2001861 1402259 2082108 1463622
6881 1463622 73217 398446 392365 140470 1122282 1686621 1205136 808592 530751 1255189
6871 1255189 788563 419622 936108 1047384 150295 629579 435549 973971 948603 860541
6861 860541 1084894 1214553 1732959 1096718 -147319 545295 740235 538828 234644 1120856
6851 1120856 1160810 696320 368973 501209 615517 691122 119956 559929 271372 -346024
6841 -346024 839188 336914 221802 332810 -208467 -101680 739507 9397 452631 893963
6831 893963 526939 846833 479811 86186 -333767 -386883 173413 -65654 -240750 -108080
6821 -108080 216678 262572 587524 228961 713458 556391 14379 -575567 -646766 955011
6811 955011 1193948 860475 838271 238257 112653 -772026 -652858 -215122 -421996 271671
6801 271671 1116453 522227 647428 1340738 1648117 1629645 775394 836023 991600 518742
6791 518742 687352 904728 71447 -27802 257045 350185 90251 -321460 -334378 -74140
6781 -74140 -287102 -519004 -570037 277291 722658 328906 -209184 353844 477642 31394
6771 31394 -519521 105015 -704794 -714284 -394732 -284044 -198254 -35044 528733 -81226
6761 -81226 594802 379004 852729 -80359 -331547 -229554 -241611 -66432 403646 625183
6751 625183 -351515 -470243 478207 851699 -353689 -587511 -339174 315729 318208 -46357
6741 -46357 -120498 -228791 -431775 -1009457 -1176357 -662387 16240 303343 29196 175684
6731 175684 420388 -68014 728 924580 423505 -27624 252369 -189815 -769490 -275705
6721 -275705 163801 685860 997341 911160 909987 1023655 654205 203585 652730 335046
6711 335046 499436 981826 264083 72807 684979 570631 283315 -6828 -902065 279929
6701 279929 284276 -175992 104826 47911 -230975 -113910 36625 -632184 -1081045 -67545
6691 -67545 744948 -202989 -223673 -44532 277437 265606 195691 81826 760355 1209950
6681 1209950 1255535 1889267 1273551 626851 873613 1011602 1382859 1205271 1047888 1189574
6671 1189574 719530 983519 472539 692946 1021591 1336457 1545830 1036086 402456 1342482
6661 1342482 1433059 2063210 1867478 1280684 703354 916011 1043795 1298336 583864 -100638
6651 -100638 120355 -451217 -210010 -63821 405857 -463573 242792 -114439 -70047 -34732
6641 -34732 -113714 -750720 -686208 -808156 -974810 -1371958 -180431 197133 844908 648712
6631 648712 30352 -423739 -149967 -210768 -194997 -261286 -432989 167552 89495 -421193
6621 -421193 -760976 -143677 -363395 -217117 33569 -70551 -278751 -455361 -874171 -564479
6611 -564479 -157584 -292333 -275316 448666 961054 1308698 734638 156528 -145254 -177397
6601 -177397 -283606 169812 424221 153707 -34874 -580595 -689674 -529496 -731714 -1244316
6591 -1244316 -815785 -552467 655851 766891 342812 -655635 -1253585 -1394071 -492334
6582 -492334 -477108 -87799 305754 40985 344557 -173101 -607311 202666 62089 -518200
6572 -518200 -605030 -1098598 -553475 -996296 -894936 -402912 -267630 -777483 131180 -18439
6562 -18439 -364865 -1344788 -1192441 -507228 -885988 -676149 60369 -315281 -788663 -954344
6552 -954344 -804241 -236728 -151926 -511689 17752 166489 114581 777531 238585 232593
6542 232593 681610 -119411 -236721 -830411 -977053 -149826 -245916 -501252 -1065852 -646714
6532 -646714 -719844 -304964 86371 118818 -117910 -60235 454822 240188 -1044018 -528880
6522 -528880 419365 -469404 -157862 -650491 -250864 -301700 -249864 -186657 20034 -478427
6512 -478427 -1240596 -1358116 -1125535 -328643 -266826 -1122472 -1032940 -110120 -131559 -198324
6502 -198324 -143636 -656884 348533 243474 572533 496118 454903 -526495 -1370804 -1088401
6492 -1088401 -665976 -561070 338874 416880 -107013 -98648 -307706 -602931 -66586 19174
6482 19174 -1316080 -583826 -618949 -457536 -938209 -1450055 -1571505 -1406261 -1354254 -1108926
6472 -1108926 -678171 -728050 -1020986 -1121761 -1803294 -1638413 -1159223 -738324 463244 600195
6462 600195 446358 -92564 -661557 -286711 176171 -195822 -912935 -1168616 -1643553 -761642
6452 -761642 -1157805 -1260474 -697522 -540410 451309 252708 54609 -318279 -418133 -737287
6442 -737287 -1439687 -609955 -389555 448504 -196530 -394152 -1012996 -389818 -66035 -35481
6432 -35481 228338 28009 -223359 -801487 -923201 -444527 -751874 -960128 -666727 -472839
6422 -472839 -401337 -118047 -356649 -867099 -1597805 -940491 -694956 -660855 -495581 -1075626
6412 -1075626 -240900 -8431 -775118 551935 406248 -381363 46732 -470605 -869858
6403 -869858 -869056 -548151 -1134418 -973228 143906 -255655 -355435 -955982 -648040 -709878
6393 -709878 -1016993 -670652 -1466421 -1257874 -1058242 -813961 -1276826 -435851 83278 -546760
6383 -546760 -299122 -221997 221195 728891 -1036137 -1262541 -885180 -441857 -1201734 -1080150
6373 -1080150 -990611 -683362 -524008 -470793 -304072 -295367 -240662 -173904 -189295 -395804 -1003189
6362 -1003189 -1631751 -563657 499621 488720 -536505 -336255 -15536 -552484 -138794
6353 -138794 -489461 -1003191 -808164 -377538 -936205 -1286456 -1304970 -996668 -750274 -920870
6343 -920870 -740132 -120352 197130 -63550 -512361 65531 114977 -282114 -395858 -289968
6333 -289968 -328980 -762637 -347029 -103748 -482194 -340451 -446829 -930983 -629117 220749
6323 220749 149734 -791838 -1543773 -627123 -537538 -1252394 -883965 -160946 73793 -483232
6313 -483232 -545527 -1056614 -446398 -670485 -1128616 -849844 -1045258 -544013 -96208 -263132
6303 -263132 -389555 -406795 -428457 -476579 -405385 -188701 -682780 -1735497 -1260925 -693015
6293 -693015 -395355 247189 150577 -644078 -1387820 -1561906 -499162 -501478 -1399981 -1266349
6283 -1266349 -522319 -724212 -708436 -114316 -325956 -416521 -306564 -296818 -1243560 -1169335
6273 -1169335 -1018682 -684820 -1147107 -546176 187319 -549061 -787856 -483341 -932356 -439760
6263 -439760 60672 -1052828 -825548 -896402 -899341 -571005 -1399213 -1902933 -1844126 -1297774
6253 -1297774 -1283169 -1122856 -968994 -723442 -139789 84602 243997 -461065 -150427 -611584
6243 -611584 -524537 -536320 278479 592408 -94908 -955514 -753548 47913 -230110 -886982
6233 -886982 -1104743 -1214005 -1368059 -416307 -272136 750580 394701 -1122481 -234359
6224 -234359 -593559 -401051 257689 241857 25560 -198838 -562534 -970018 -1024093 304308
6214 304308 239376 -88775 -151131 121236 332637 -525016 -539228 -1095724 -1109509 -407614
6204 -407614 -580928 102726 591768 -349467 -988746 -119798 450641 124751 -231765 -973455
6194 -973455 -931391 -1141793 -1641020 -1737583 -874191 -645013 -590560 -291189 -517630 -524937 -225638
6183 -225638 -256310 -1295142 -1173326 -1569127 -1214164 -1465798 -515027 343364 -697728 -58453
6173 -58453 -368664 -594726 -627639 -309085 -154652 -478653 -868662 -607932 -286065 -446956
6163 -446956 -951306 -1062323 -754028 -721274 -169134 -394935 -79176 303999 -757886 -532453
6153 -532453 -599506 -215840 873152 239694 -127334 -140122 -622056 -566138 74164 -169445
6143 -169445 -1283908 -1254820 -836620 -721731 -998461 -994291 -769251 -35096 -253479 -1051389
6133 -1051389 -1469684 -681406 -113564 -182275 -1315830 -811399 -674847 -1435102 -1153355 -245266
6123 -245266 -387383 221160 938910 659652 -289038 -755135 -756176 -491380 754021 927270
6113 927270 926232 -339283 -573026 -317891 -345932 -147071 -1056359 -790463 -1147574 -1294482
6103 -1294482 -534964 -348236 -167789 -1117407 -345933 277312 -550128 -1025430 -650259 393563
6093 393563 56302 -43440 823234 830276 -103265 -1034494 -647094 26853 -1022733 -1267264
6083 -1267264 -695256 -151805 262608 -696750 -1413550 -1490716 -1921634 -1654029 -948452 -1637110
6073 -1637110 -1653201 -772140 -522572 -558044 -713179 -1710979 -1310805 -360303 -653468 -1083648
6063 -1083648 -952571 -92804 604632 127698 -643235 72379 273708 -508042 -628291 -1042350
6053 -1042350 -1260739 -353516 -459416 -1450172 -965822 -437799 -804253 -1143005 -614238 -820134
6043 -820134 -931148 -214487 -276416 -472682 -704115 -579282 -150220 174654 475668 -355706
6033 -355706 -770147 -880026 222887 -345163 -991047 -312132 -591627 -460074 -642639 -744017
6023 -744017 -648781 -545202 -634331 -596300 -873148 -791990 -566554 -1192174 -818395 -803657 -990962
6012 -990962 -741419 -896490 -779977 -839948 -1039390 -223535 174984 104378 572228 76672
6002 76672 102964 159495 -385299 -554007 -960107 -1459173 -932618 -438817 -702797 -32177
5992 -32177 -86491 -232959 -829989 -973590 -484679 -236111 113040 -450555 -190462 -514515
5982 -514515 -233671 262440 -461797 -610532 -1257254 -1242700 -926107 -262111 247446 588172
5972 588172 1211126 1088050 -362176 -692565 -389041 39563 240591 -175750 -5170 -493808
5962 -493808 -1136670 -1697081 -1030688 -790258 -1506587 -1752892 -152409 344892 -277096 192748
5952 192748 717029 110950 -127284 -6419 -387625 -597153 -411216 -32505 -66689 799146
5942 799146 339046 170815 -323920 -486724 389136 870525 479444 113596 369462 522493
5932 522493 109175 -1027595 -936274 -44843 -573479 -314228 352952 397630 -365822 -933748
5922 -933748 -972514 -774781 -206176 -945342 339894 -176951 136389 516510 603491 -176305
5912 -176305 -188724 -788779 -990900 -269836 -402457 229576 -449004 -1235829 -1175440 -491922
5902 -491922 -54304 404962 325204 -279969 149841 -47951 226143 389846 -20037 -70671
5892 -70671 -332870 -115904 -322679 -616140 -388195 -253179 -505151 -347298 -339629 -3093
5882 -3093 -67491 52901 -203552 235134 -160733 -1211803 -877457 70474 1354 -312002
5872 -312002 214894 764396 345341 -405889 -303694 -1009504 -534808 -10559 371069 610339
5862 610339 635978 213800 35015 430372 386445 571744 120543 353103 465712 -372845
5852 -372845 -818235 -501167 -672807 -1119452 -486881 -781472 -555776 161757 -336715 49205
5842 49205 305487 -281886 -511386 327228 14340 -619753 -917723 -731823 -1260463 -1625616
5832 -1625616 -165169 -110159 -643356 -1288249 -858903 -982201 -1701361 -540876 -304978
5823 -304978 245230 -218614 -154594 -267422 -1228123 -238571 -864135 -1027461 -51433 -351115
5813 -351115 -808448 110504 -144810 -919175 -420991 -420596 -543123 -96589 -162534 105919
5803 105919 319083 -457384 -630000 -248048 -437416 -723137 141826 710527 743098 -604941
5793 -604941 -649315 -706591 -1314538 -1156805 225406 218875 -446676 -856991 -599683 -540995
5783 -540995 -468464 353530 541862 -59690 -431770 -118982 -784587 -684107 -75771 426886
5773 426886 125322 -152657 13576 472168 755692 792651 814534 345525 144933 130112
5763 130112 -444956 -151160 -98601 -887563 -620492 275332 -282833 -163602 195328 84072
5753 84072 62086 -206666 -406341 191234 193160 -216126 -107622 -121766 -265796 -494600 -349726
5742 -349726 -394233 -514987 -313070 -294872 -41376 -326485 -1072075 -876939 -626021 -189090
5732 -189090 1145230 716340 67255 1281 533374 211152 -277822 -193653 -153109 219007
5722 219007 -187357 -204676 -152839 -30899 -238508 -157049 -432085 162235 430023 381347
5712 381347 607887 845561 1085191 407297 -510822 -537133 -967783 -150822 240764 -67042
5702 -67042 333189 -686591 -1280944 56065 843122 968206 1363184 1410784 1357677 1552323
5692 1552323 993481 108287 23806 -365950 51311 627883 543596 1495121 541587 -786679
5682 -786679 49695 301726 109080 -67588 -447999 -278763 -442956 -423245 251833 215998
5672 215998 -258910 -1002413 -740017 -333879 -196973 38770 172224 29974 -86586 245040
5662 245040 -485605 -579438 -357244 53193 -896526 -961274 180155 578214 980139 -873076
5652 -873076 -46883 740064 367695 683880 1611575 1067892 439175 46422 -193113 583724
5642 583724 607546 506383 1216430 -15544 -405615 -443972 -634184 -278419 -180389 251193
5632 251193 627201 613094 949757 1544681 1448282 1338595 920328 -25107 367966 1335765
5622 1335765 1387374 699562 614062 855463 1204988 1031206 1714559 1425517 1644852 2540541
5612 2540541 2268139 2776092 2203203 1865474 948685 652128 601867 492003 1095972 1529353
5602 1529353 1750590 2160730 1776723 1247300 1930975 1689055 1395147 1714121 1510764 1864077
5592 1864077 1997091 2447267 2450760 2430203 2741090 2850760 2808511 2199079 2214860 2087815
5582 2087815 1859500 2342073 1274451 1497715 1573004 1084198 1633265 1953019 1868833 1590337
5572 1590337 1542561 1401887 780850 1103139 1224160 1592125 921925 750627 1056616 984960
5562 984960 1621720 1021758 730147 1150475 661218 409849 509482 619410 511436 1356572
5552 1356572 1707312 1237987 419845 132694 114276 841829 329622 984113 605726 -259644
5542 -259644 513344 546250 815900 241415 669519 1733450 1696531 1120644 909035 425630
5532 425630 939043 491446 96081 830883 796479 1318653 1060691 1408664 1243250 1108461
5522 1108461 745851 869985 651700 755832 469573 -113876 933095 1283 69118 558868
5512 558868 598740 456189 130870 366284 1648914 2134495 2072360 2047513 2157333 1943183
5502 1943183 2003328 1616151 1619379 1110198 788575 865377 905318 1204213 1180996 708738 751978
5491 751978 443599 697507 1207426 1308583 838123 340524 996850 1381587 768628 711929
5481 711929 -309595 359890 1393731 817221 488429 328827 -271717 230218 1241663
5472 1241663 1587814 2090333 2140902 2084878 1847068 1740507 1433483 1580708 1841247 1369129
5462 1369129 1361839 1891308 2181863 764338 270959 77815 243927 696379 481733 422914
5452 422914 700834 796928 850135 1480833 1603790 967613 687066 529588 657822 1227162
5442 1227162 1193809 651263 431324 646778 105425 494628 116671 74506 289513 227862
5432 227862 787868 901178 848758 554078 358663 413309 823156 1511608 1252566 335471
5422 335471 276244 1147015 1146542 782519 39396 331958 941168 346887 -113179 -1599
5412 -1599 460379 1376831 829347 -208339 927715 686048 231471 576760 332785 624783
5402 624783 216943 294796 1096244 1329844 648956 962732 180782 587313 1100767 830873
5392 830873 819601 991614 1386677 121723 149172 631370 607495 1000299 1312682 1125268
5382 1125268 779143 803222 -218516 385589 931093 1069843 1709419 1479655 1372028 1430667
5372 1430667 1156591 1589507 1601184 1361888 759795 58608 -23978 -171489 733870 1174868
5362 1174868 1056870 1303296 752888 -268767 497569 548046 933110 998594 1225619 1280700
5352 1280700 1662701 1537919 2205135 2809193 1743090 2155896 1637475 525157 992637
5343 992637 1645689 372851 1246114 1398703 2185896 2902919 2043586 1435093 1241002 1590722
5333 1590722 1012362 1155786 575789 809123 854323 491785 715302 1030987 832246 705923
5323 705923 763251 1104501 2025826 619271 -49139 275083 772568 1116544 906632 897700
5313 897700 262733 863114 774848 1330339 1762894 1600321 1490386 1364957 1165742 392335
5303 392335 596816 1081243 951270 1375868 1025339 986243 1443250 1253099 1746752 525067
5293 525067 677015 1564295 1338664 1745428 1010642 1017594 754970 711013 1451705 713656
5283 713656 -138768 715608 1377917 646888 192253 207774 1321364 1831594 1066873 980638
5273 980638 1032215 1000785 1840940 1879992 1600152 1266014 917427 1099450 355548 363038 588226
5262 588226 751374 967021 1031609 1343191 1398449 1636994 1319481 1013003 1595280 1951569
5252 1951569 1540155 651222 479033 1344837 849701 441046 416789 464123 43745 778794
5242 778794 553930 -3598 607090 1051971 1405003 1375423 839278 499424 820143 714455
5232 714455 1260984 1233209 848481 346384 -116018 -888975 -719024 558502 1209892 691217
5222 691217 798310 641038 937809 555251 946725 1088147 550973 1160164 1653865 1618550
5212 1618550 1565153 997343 867165 1230711 835794 424129 459032 707078 1766598 1785382
5202 1785382 535357 687035 812730 71074 -318269 1319800 1310460 1202963 911009 661512
5192 661512 1222205 728985 1165166 1407697 593598 -30059 1195454 1905958 1264245 789971
5182 789971 1335340 1805588 706152 1533312 878865 474873 1342224 1493136 1534703 1817918
5172 1817918 1650151 741710 870719 1102223 1192800 1332425 1441970 1814094 1910391 1812802
5162 1812802 2599482 2090617 1936634 1717150 1174188 1666625 2212978 2039117 1332157 1218780
5152 1218780 2126960 2313596 2786798 3508614 3100307 3770140 3634944 4024028 3829521 4625810
5142 4625810 4382290 4272951 4943009 4925460 4907402 5348325 4944072 4665700 4045558 4299903
5132 4299903 3799014 3628356 3941868 3738410 2893519 1725383 3178179 3304979 3946812
5123 3946812 5111747 5676657 4896471 5027872 4955858 4941307 5865406 5963332 5812244 5915678
5113 5915678 4950028 5057221 4342243 4104451 3912961 4721734 5102305 5157059 4969789 4945541
5103 4945541 5232885 5233232 6338494 5606121 5238025 6175770 5843988 5302487 5356201 4902211
5093 4902211 4324175 4640881 5347001 5134972 5666630 5097707 4586169 4588032 4781803 4723219
5083 4723219 5020329 5704051 5776172 5555504 4802565 5278260 4855400 4997203 5381359 5255885
5073 5255885 4685592 4009997 3719443 3534948 2677479 2472811 2723633 2797622 2634287 2172119
5063 2172119 1735890 1831946 1937838 2004652 2091006 1255157 1574538 2818351 2215330 1099000
5053 1099000 1648154 1475944 1918256 2199070 2893549 1919276 982856 996390 1135235 735439
5043 735439 1384645 1320329 1139159 2072743 1486798 1620770 2696462 2761737 2337915 2861251
5033 2861251 2205858 2044484 1657198 2279764 2185342 1319888 1308060 2034221 1900139 1510479
5023 1510479 1547548 1172174 589486 577377 207822 -139423 799720 1062746 1548181 1245127
5013 1245127 1417579 1415876 1575613 1094505 1199716 1165207 1524597 1320914 1840702 1342068
5003 1342068 1361367 1038826 1263561 1151068 1400462 1000299 605003 326901 -118016 850487
4993 850487 748857 1169964 1005249 619868 611965 60635 -225834 -25357 -16097 -23259 315775
4982 315775 608531 -49221 -170821 -191046 887874 412112 152972 398876 835590 818066
4972 818066 1012116 935325 410289 204969 990109 221622 911281 1240704 941439 371365
4962 371365 788188 642155 886099 998876 674844 1070800 1413765 1020554 118093 132925
4952 132925 -61582 1046817 1391413 1203437 2031835 1422079 1296919 958406 725248 238265
4942 238265 638779 854844 260579 529317 454531 -8916 590584 1369333 1347552 2016808
4932 2016808 354193 42307 1122413 1791391 2116336 1324992 791272 1623961 1522658
4923 1522658 1108066 1307765 1546664 914629 844002 477444 247701 194534 -608682 -112213
4913 -112213 588223 -245169 -349716 246066 1217199 1218921 1142243 1584754 1352494 522612
4903 522612 861323 1126284 401274 1097456 1468020 595081 1460919 1655101 1735428 2159188
4893 2159188 1230758 1613068 1953653 2235738 1871459 1629068 1624445 1532213 1512436 1262861
4883 1262861 2714995 2338762 2709070 3463066 2921431 2839958 2513609 1738727 1826587 2159335
4873 2159335 2248722 2303678 2239668 1615140 2183172 2622582 3071282 3307917 2567639 3096981
4863 3096981 3145792 3683355 2767143 2608019 3038797 3042599 2832738 2857546 2202881 2399907
4853 2399907 3433059 3764491 4171620 4405886 3748878 3869275 4226928 3432410 3733552
4844 3733552 3797518 3548313 2655843 3327137 3821604 3852481 3884692 4318493 4239629 3030079
4834 3030079 2978940 4079517 4321063 3883381 3347014 3559130 4046448 4912441 5940547
4825 5940547 5425241 5594581 5679406 4936146 5366629 5917922 5933007 6052374 6718485 6808964
4815 6808964 6332427 7264668 8452268 8610407 8554584 8393428 8773947 9877575 10156058
4806 10156058 10924441 11346123 11865856 11943556 12834163 14724271 17355148 18873959 20632555
4797 20632555 23209164 26081313 29087001 33916842 40015330 44819401 49587151 50835265
4789 50835265 48613698 44411650 39089138 33826669 28513658 24025411 20316181 18105629
4781 18105629 16688497 14976600 13370274 11938697 11123635 11484610 10186674 8323019
4773 8323019 8635306 8500891 8511512 8322810 7786334 8632493 8329227 7816095 8524539 7416497
4763 7416497 7248695 7142095 7350069 7730861 6816860 7230964 7487609 6661098 7038175 7608006
4753 7608006 6729386 7085847 7741543 7748025 7351345 7919539 8053640 8066415 8412820 8552633
4743 8552633 8408391 9389419 9907755 10932179 11933703 11728473 12242865 13090609 14541916
4734 14541916 15912745 16978047 19121830 21193158 22578650 25579649 29424525 34355483
4726 34355483 39101418 43922135 47589181 48664977 48041308 44866755 39632707 35055169
4718 35055169 30988896 25936346 21714917 18388287 16391498 15134669 13039104 11948160
4710 11948160 11666535 10792774 9363273 9133760 9196689 9193125 7780374 7036470 6808074 7261308
4700 7261308 6974002 7116887 6253364 6048394 5981116 5262393 4427799 3869778 5123952 4875922
4690 4875922 4797994 4689554 4901731 4689988 4948022 4147506 3995803 3540653 3431215 3418227
4680 3418227 2870497 2252073 2724779 2523198 2787749 2659171 2700725 3367892 3774371 3114871
4670 3114871 2531364 3172773 3131282 3522788 3481703 3385489 3150552 3040489 2592775 2651103
4660 2651103 2596959 3107904 3490760 3502640 3297494 3340817 3025781 2462722 2392999 3904106
4650 3904106 3711178 2892620 3086185 3174942 2939031 2659809 2884702 2578540 2388922 2319049
4640 2319049 1579087 1539063 2132744 2605781 3180837 3402879 2159221 1988436 2638888 1806007
4630 1806007 1109634 1757131 2025830 2839683 3305644 2639310 2420281 1826414 2109609 2743970
4620 2743970 3004658 3132026 2960341 2592747 2951485 2484703 2498858 4038094 4075534 3279602
4610 3279602 3008491 2527065 2373722 2810891 2177788 2093462 1959835 2241783 2555349 2398742
4600 2398742 2513070 2163151 2115425 2706957 2430008 2393154 2380643 1708275 1576799 2799527
4590 2799527 2522682 2223739 2557065 3052119 3017111 2731426 3064867 3955364 3006182 2128171
4580 2128171 2449553 2546446 3134501 2330780 2824636 3219467 3741157 3139531 3009767 2686007
4570 2686007 2292637 3203384 3348474 3071172 3685858 3289892 3513629 3628961 3502613 3827206
4560 3827206 4318903 3271576 3646083 3292104 3109912 3943397 3856458 3968497 3107998 2617023
4550 2617023 3320444 3916140 3943010 3586726 4018204 4175805 4033500 3971893 4428689 3543935
4540 3543935 4530735 4728614 4104228 4331163 4661746 5064016 5039377 4480091 4023874 4712501
4530 4712501 5304508 5281666 4787048 5110302 4870119 5892755 6008861 5769261 6599289 6911222
4520 6911222 6644123 6663750 6478955 6679259 6900718 6915020 6325681 6351927 6767692 6650728
4510 6650728 6599527 7003259 6674416 7781944 8219821 8385969 8773537 9355829 9135891 9299406
4500 9299406 9893325 9781251 10861360 12080519 12056075 12978413 13300699 13930266 14226003
4491 14226003 14507735 14851331 15704576 16708905 18032148 19388206 20865996 22464251 23522154
4482 23522154 25705384 27708239 27905092 29018109 30798947 32059503 31947713 30777770
4474 30777770 30743287 31028417 31533405 32143959 33128108 32611640 33248270 34388608 34979947
4465 34979947 35580737 35972353 36316961 36937927 37110955 37910440 37734806 37679731 37609008 38350148
4455 38350148 38675525 37956922 38117047 38433880 37967782 37240490 35946746 35278317 35485886
4446 35485886 34886608 33387844 34582153 35949652 37609507 38162339 38778210 39526054 40063250
4437 40063250 41463451 42224469 43605541 43618710 43638119 44169827 45304953 44836714 44729328
4428 44729328 44844728 44889148 43976914 42487821 42464424 41161558 39761078 37839730 35909504
4419 35909504 34912602 33123946 31227118 29241151 27024792 25550186 24701490 23411539
4411 23411539 21815793 20756064 20255294 19163123 19629805 19487337 18350303 18361110 17553868
4402 17553868 16248393 16268372 15951343 15900680 15625927 15496482 13658801 14550272 14477826 14065057
4392 14065057 14614849 13856564 13613614 13888890 14105493 13374527 13134174 13437348 12830994
4383 12830994 13042754 13678886 14348960 15260672 15116521 15178972 15242388 14785176 14881902 15698174
4373 15698174 15293600 16500213 16793360 16542726 16058541 15599945 15694904 15370130 15641752
4364 15641752 16537722 16875452 17208808 17203924 17092582 17291585 18474802 18725035 19232400 20764660
4354 20764660 21823175 22436805 24296259 25342875 25689063 27026149 28797228 30246378
4346 30246378 32175476 34917308 37801872 39592064 41677364 42993119 44132960 45599295
4338 45599295 46114946 46665641 47272888 48026434 48963002 49601062 50126122 49446671 48720984
4329 48720984 48296373 47751588 47657209 46885982 46643997 45180323 44301160 43278035 42597940
4320 42597940 41990226 40641743 40126834 40190836 40848914 41388875 41218930 41304503 41867224 42518555
4310 42518555 41843325 41131249 41204845 41903979 41407173 41037301 41484003 40624992 40490217 40094705
4300 40094705 40239299 39072990 38316437 38744968 37611772 36869024 36683487 36275981 35623949
4291 35623949 34174852 34152168 34012093 33644950 34519317 33420590 34001184 33671522 32251872
4282 32251872 30225347 28192052 27400763 26160085 24851322 23603078 22691126 22181011 21262593
4273 21262593 20055280 19334428 18396831 17817682 17367953 16661801 16876853 16640224 15888869
4264 15888869 15578985 15845220 16050740 15523127 14687083 13730176 14645324 14543482 14564102 14812159
4254 14812159 14175326 13858405 13735812 13948836 13990674 13800130 13259027 12358383 12585655 13671386
4244 13671386 13705696 12666961 12232725 12884748 12947081 12707494 13494000 14023375 13524639 13432627
4234 13432627 13713544 13547691 13939880 14020619 13657871 13852550 13693964 13635983 13982003 14160965
4224 14160965 14069984 13910519 13048110 12988123 13005330 13495363 13394103 13187118 12862388 13046046
4214 13046046 12997512 12310483 12108933 12602693 13097640 12588381 13120295 13040156 12391311 12026667
4204 12026667 12700359 13236573 13394400 12888507 13518899 14038017 13761103 14122125 14011553
4195 14011553 14024027 14160966 13840324 14553435 14110280 13018150 13371340 13419346 12889618 13447120
4185 13447120 13738589 13010577 13546924 14443226 14654244 14292404 14079840 15028614 14809419
4176 14809419 14472767 14979117 15465705 14747075 14921583 15596749 15155087 15683172 15497753
4167 15497753 15356704 15794912 16017986 16470269 17435071 17373635 18612217 18748749 19031020
4158 19031020 19487722 19854373 19935385 19382140 19950411 20229978 20869928 20366570 19275342
4149 19275342 19114848 18734026 19702381 20020261 20135651 19633435 20404434 20023274 20266057
4140 20266057 20775386 20900581 21112855 21036956 21203587 22614158 23781820 24486797 24415517
4131 24415517 25256968 26587649 26212589 26786945 26418846 27095095 27620015 28108526 28572991
4122 28572991 29823121 30437348 30850277 31096165 31806406 33156342 34667526 35934368 37136350
4113 37136350 38029189 39335497 40343028 41950995 42592466 44255157 46033798 48064591
4105 48064591 49272927 51438393 53799720 56197337 59224717 62558287 66184499 70327570
4097 70327570 75452093 80740757 88091023 95070384 103954708 114432889 126209240 141334122
4089 141334122 161005828 183033699 206232408 227722070 243246676 251098125 246548809
4082 246548809 232362708 213259284 193080828 171779243 151996667 135263454 121803470
4075 121803470 110366099 100134574 92542719 85513362 80396515 75889600 71943655 68203427
4067 68203427 64576876 62224892 60201378 58060805 57737676 56419755 54769460 54313943
4059 54313943 52658248 51944531 51779983 52013098 52418986 51537821 51313495 52801566 53332800
4050 53332800 53109257 52413774 52498321 52935391 51889506 51104242 49883899 50672407 51004504
4041 51004504 50901393 50831341 52109221 53024311 52837702 54259935 54940115 54938387 54958646 54296064
4031 54296064 53851371 52562857 51354379 50531463 49791739 48075893 47737452 46954521 46144125
4022 46144125 45698332 45001554 44917413 44742700 43540773 42017050 40787473 38865276 37352477
4013 37352477 35865025 34636145 34500314 33832947 33336299 33066469 32221707 32261319 30684936
4004 30684936 29054249 27771114 27569811 26920566 25896460 24860569 24151436 24548030 23875868
3995 23875868 22676441 22668789 22548983 22182765 21465127 20553524 19869336 19493102 18818598 18161311
3985 18161311 18075905 18027126 17627534 16998440 16467228 15973915 16031263 16240262 15833755 16071778
3975 16071778 15848284 14775197 15040028 15714498 15296934 15477445 15138488 15494404 15277074
3966 15277074 15381926 15011921 13600836 13417508 12666302 13344085 13247148 12808287 13490943
3957 13490943 13543800 12907625 12618755 12055898 11525398 11174488 10846679 10481253 10890903 11478025
3947 11478025 10836162 10785348 11580238 10793256 10004669 10860732 11424871 11133678 11322483 11690456
3937 11690456 11904455 11474765 11097738 11212935 11343014 12544747 12555733 12545498 11754828 11291715
3927 11291715 11986872 12689633 12665348 12219760 12605421 12072647 12013543 11933252 12317604 12723185
3917 12723185 12370688 11009938 10631807 11918088 12497317 12551865 12007139 11676997 11052783
3908 11052783 11097982 11036671 10437348 11127237 11696385 12407981 12828720 12333963 11500801 11431889
3898 11431889 11849231 12481066 13218213 12940109 11994208 12104104 13092444 12772898 12017128
3889 12017128 12257561 11834927 11665111 12060283 12726874 13168831 13290745 13361104 12651410 12465655
3879 12465655 12652494 12956287 12683360 12017187 11479900 11943966 12319631 12448079 12876780
3870 12876780 13547369 13257446 12795411 13331983 12615692 12527210 13304292 12742034 12215658 12908019
3860 12908019 12775979 13387969 13702347 13134032 12882642 12618481 12835735 12594041 12921438
3851 12921438 13787715 13452395 13508135 13762725 13431871 12502351 12107925 12598502 13159694 13360342
3841 13360342 13489754 13392216 13116109 13619705 13553885 13373030 13301467 14293724 14932856 14764323
3831 14764323 14424136 14998072 14678535 15097129 15598830 15372153 15414221 15986154 15389660 15038456
3821 15038456 15226825 15022200 15782585 15795580 16174068 16015042 16286922 17279600 16816568 16148911
3811 16148911 16502462 16164590 16443997 15949809 16114179 16379637 16815330 16369321 17132260
3802 17132260 17757159 18229023 18418186 18964976 19366076 19171122 19511341 20002290 20604477
3793 20604477 21079715 21182752 20735085 21071110 21149174 21881687 23047881 22875444 22704124
3784 22704124 22801358 23230313 23380596 23903211 24703419 24793969 25543732 25790399 25843982 26641221
3774 26641221 28584206 29514498 30276556 30529458 31748627 32142730 33653574 34068441 35208320
3765 35208320 36329258 36738673 38474867 39352684 39621906 41593189 43640271 45245732 47238114
3756 47238114 50046240 51816550 53074594 55471271 58072323 59691841 61777492 62743507
3748 62743507 64987620 67200452 68545047 71379013 73687577 75638565 78198407 81306664
3740 81306664 83343554 84985968 85584716 86316077 86455576 86507207 85262651 84286510 83788371
3731 83788371 82762279 81423861 80489699 79889765 79052515 76924280 74709179 73592536 71809974
3722 71809974 69526330 68013775 65781790 63035587 60063662 57174640 54021667 51671678
3714 51671678 49906101 47613663 45397554 43885211 41981658 39630657 38336153 37568448
3706 37568448 36439252 34481436 32793462 31215398 30627759 30138591 29913460 29422658 29837643
3697 29837643 29492529 28305695 28604009 27753092 26814792 26258343 26625159 26124940 25961780
3688 25961780 25979059 26262971 25455929 25494949 25719157 25205990 25360553 25185073 24850456 25126214
3678 25126214 24485973 24327254 24215641 23816628 23348464 23238816 23762467 23990899 23649503
3669 23649503 23122249 23169570 22579549 23043348 22898147 23270713 22795635 22197226 22154175 22264122
3659 22264122 22048886 21733226 21601708 21324588 22291342 22058224 22080104 22217219 22639815 22040002
3649 22040002 21959398 22518201 23921103 23225390 23188211 23312593 23343381 23373686 23372584 24281355
3639 24281355 25056823 25350255 24929633 25391435 25706931 25700490 25424897 26646686 26528503 27611398
3629 27611398 27643692 27647140 28435212 28348754 28181015 28939506 30661936 30351586 30542796 31510763
3619 31510763 32592230 33420489 34732160 36020162 36392245 37126287 38688394 39629149 41355392
3610 41355392 42045864 41993617 43448896 44223405 44777859 46276228 48453757 48384732 49245936
3601 49245936 49877014 50451096 51264466 51789295 52442285 52343086 52977091 53853212 54204190 55095887
3591 55095887 56319255 57031364 58637113 60039847 61029894 62740123 64945427 68410403
3583 68410403 69992798 73066328 75596923 78363155 80722875 84047884 87769745 90702739
3575 90702739 93614816 97477023 99702225 101447189 103578041 106393011 108426976 109827998
3567 109827998 111450362 112788443 115532073 118247031 120653492 122860864 124646410 127499980
3559 127499980 129749410 131563280 132881373 133679603 133922404 133715630 132686872 131756171 130920933
3550 130920933 128356450 127221100 125240137 122755804 120159258 116894045 114051584 111525330
3542 111525330 107968567 104302469 101009388 97681423 93646165 89225685 85234004 81564409
3534 81564409 77923672 73900706 69669894 65944091 62871471 60409507 57847398 54969637
3526 54969637 53258093 51652309 49182553 47088992 45541433 44773851 42486880 41765686
3518 41765686 41275410 40140551 39581171 39419913 38551335 39308333 38781822 38052413 37696462
3509 37696462 37043118 36395504 36736578 36523317 36040185 36282646 35943045 34479427 33769925
3500 33769925 33444404 33077377 33459774 32183579 31426770 31142497 30851729 30176403 29203964
3491 29203964 29180108 29213386 29542193 28036550 26931723 26690348 27050868 26913345 25739163
3482 25739163 24471037 24737183 24154065 23348483 22280816 21425505 20672540 21286582 20432495
3473 20432495 19817428 20208977 19714761 19249853 18502523 18253158 17706266 17463101 17285428
3464 17285428 17194195 17046791 16939991 15935114 15004829 15090317 16066336 15847881 15003983 14445064
3454 14445064 14087311 14731099 14458948 14870562 14890934 14912707 14927472 13958084 14199538 14320098
3444 14320098 15478475 14814086 14512284 14247393 14228020 14292681 14583356 15104043 15095358 13929840
3434 13929840 14168579 14142685 13877142 13763628 13659910 13912815 14940191 14358373 14160570
3425 14160570 14105057 14345609 15078630 15307092 15256538 14736398 14609534 14820336 14473994 14402468
3415 14402468 14262159 15265942 15045319 15261225 15406135 15281848 15976921 16528764 16758153
3406 16758153 16383093 16358671 16238613 16933424 17192429 17499307 17727016 18527078 18677932 18454311
3396 18454311 19007018 19839045 20490174 20906284 20522752 21070684 22335221 23261644 23805164
3387 23805164 24569509 25883549 25403659 25786582 25857906 26054347 28081355 28729949 29439544
3378 29439544 29474353 29828705 30899864 31559193 32537840 33085868 33009900 33116828 32836162 33620570
3368 33620570 33199454 34176358 34539488 33900777 33760108 34988962 35353411 35232510 35728791
3359 35728791 34819315 35015634 35235936 35420864 35368539 35674099 36377713 37144584 37322022 37617063
3349 37617063 37803228 37782865 38412435 39019504 40003982 41095240 40836628 42752990 43913128
3340 43913128 44779437 46512925 47700844 48922366 50107837 51920652 53457061 54727998
3332 54727998 57167654 59828071 62404899 64231919 67116921 70169726 71990152 74913321
3324 74913321 77794785 81286013 84489742 86720450 89555432 92826820 95361388 97306779
3316 97306779 99043817 100567949 101915480 102690061 104086081 104724930 106082199 107148376
3308 107148376 106406780 106278296 106282291 107359023 108386695 110211600 111371412 111458408 111808628
3299 111808628 112309645 112626494 112121912 112842059 113496985 113604516 113378979 113099587 112833398
3290 112833398 111432796 110009281 110051402 109039567 108255159 107855590 107213338 105829849 105415725
3281 105415725 104138110 102212578 101299915 99148056 97615448 95209825 93755086 91083147
3273 91083147 88254018 84427796 81988612 78981897 76194710 73376620 70203197 68014985
3265 68014985 64819551 61328682 58739691 58065608 56903918 54371406 53199442 51937225
3257 51937225 50868968 49712065 49155573 49049517 48581003 48260162 47914378 47910551 47581813
3248 47581813 46909562 47072780 47242169 47886047 48105937 48323068 48362316 47773645 46888240 45262163
3238 45262163 45862627 45375457 46134392 45646304 45434535 45208568 43942344 42868196 41669628
3229 41669628 41796615 41301530 40060116 39406219 39455368 38098951 38018352 37734629 37071595
3220 37071595 36879508 36636235 34612545 34471976 33975575 33574002 33474290 32372599 31917982
3211 31917982 30933983 30700826 29925773 29301521 29376096 28499473 27047589 26830694 27256803
3202 27256803 26193440 26647619 26112096 26104348 25847286 24974827 24553757 23869941 24889895
3193 24889895 24384339 23743613 23933692 23538763 23925440 23459915 22690083 22956717 23566927
3184 23566927 24490975 24614750 24998504 24501660 25145243 25619548 26261745 26249193 26496243 27109966
3174 27109966 28007816 28330448 29055691 29787371 30222590 31310478 32402165 32601706 34840068
3165 34840068 35476312 37021231 38416914 39520711 40949017 42209360 44086620 45825378
3157 45825378 47700101 49629086 51418998 53936239 56641516 59236707 61744006 64478371
3149 64478371 68358761 71983255 75119176 79695068 84900690 89605644 94160716 98729714
3141 98729714 101933743 105155431 108985283 112450148 113787457 114390915 114031508 112883876
3133 112883876 110062900 106849312 102458288 96442531 90444684 85165275 79570090 74247312
3125 74247312 68748354 63398230 59961666 55600799 52619798 49780214 46668512 45146179
3117 45146179 43045264 40066274 38040403 37414445 35820087 34096340 32172606 31002876
3109 31002876 30367592 28917331 28279962 26408546 25782815 25105937 24124658 23081648 22347995
3100 22347995 21791815 21257325 20507107 20470160 19904247 18782725 19226911 19358177 18271536
3091 18271536 17388081 16642796 17623630 17611822 17535326 17317745 16625149 16337768 16074039 15606016
3081 15606016 16149111 15349958 14873514 14475660 14627562 15143127 15190646 14341445 13382207 13307847
3071 13307847 13442966 12596392 12994762 12781863 11987014 11988708 11570567 11148211 11170116 11564280
3061 11564280 11557579 10266744 9900513 10014117 9754226 10204495 10210558 10184753 10039224 8713709
3051 8713709 8853255 8764409 9112745 9680324 9994944 9269884 9920418 9363657 9002156 8845699
3041 8845699 9177617 9284845 9563832 8607180 7977287 8239316 8750713 9767316 9479693
3032 9479693 8841618 8609946 9445651 9329604 9564145 9013931 9258826 9173552 9704867 9039331
3022 9039331 9315735 9272203 9265689 9696644 9109512 8576634 8779946 9152142 9676101 9493148
3012 9493148 9759207 9110439 8612310 9299300 9317520 8795971 9900077 10266002 9950088 10241378
3002 10241378 9840825 9272171 9526212 9154584 8763347 9208098 9666638 9915077 10259296
2993 10259296 9310293 8684566 9046733 9832477 10191526 10380141 9825753 10306619 9825959
2984 9825959 10232973 10353819 10512827 10601614 9751637 10124653 10609417 10600226 10249825 9574380
2974 9574380 9938761 11341953 11205288 10799200 11696692 11610973 12102698 12704331 12047743 12289022
2964 12289022 12761472 14020878 13727917 13570924 14385347 14521053 14784571 15881264 15782288
2955 15782288 15579591 16358608 16547739 17175578 17747680 17518246 17660641 17886594 17978827 18963725
2945 18963725 18959905 19506467 19944668 21037302 21221617 21199405 20844880 20899712 21876143 22794689
2935 22794689 23302636 23306456 23627230 23439916 24437551 24990185 25797210 25327136 25582978 26317624
2925 26317624 26719415 26690387 26974126 27822706 28949103 28733825 29461504 30658565 32029207
2916 32029207 34138254 34609526 34631925 35286635 36820955 37464720 37955798 39612506 41962375
2907 41962375 42716514 43977177 44884654 46768199 47791249 49710495 52763219 54051572
2899 54051572 55955139 57790331 60137079 63073856 65744325 69434547 73507051 77311575
2891 77311575 81590272 85148324 88988628 92599341 96322280 100349198 103577874 108416404
2883 108416404 114034180 119444714 126095281 133639025 140024070 146092338 153529554 160804484
2875 160804484 169437389 178978586 191115091 204195387 219135333 238009612 259240448
2868 259240448 283878139 312051795 340136764 367779881 393685354 413002860 423109616
2861 423109616 423968790 414763814 394931499 368151489 338355863 305841256 275358377
2854 275358377 248002277 224810354 204564853 188001447 173688914 161546824 151489058
2847 151489058 142353649 133953066 126909696 119615088 112500878 105573877 98620813 92443860
2839 92443860 86770413 81691723 77153887 73196048 69814426 67302497 64375097 61589802
2831 61589802 59125777 57345948 55633709 53333063 51751810 49483798 47818765 46741108
2823 46741108 44883413 43209345 41000807 39356143 38428303 37036568 35649199 34470119
2815 34470119 34323579 33288556 31906000 30927055 30255013 29318242 27511555 27126630 27034393
2806 27034393 26734285 26063957 26149955 25440774 24227790 23771142 23481480 22330988 21530622
2797 21530622 21439570 21490563 20681446 20112385 20358526 20617740 19540046 18912897 19113321 18564892
2787 18564892 18654086 18246624 17711160 17984245 17340172 17696223 17308612 17179338 17271582 16952132
2777 16952132 16319094 16566023 16963381 16280950 15946044 14575653 13877411 14310832 13490541
2768 13490541 12651361 12856680 12983184 13152038 11713479 10842552 11586545 10497542 10385258
2759 10385258 9949458 9413208 9678442 9036379 9693482 9373917 8376884 8515405 8394194
2750 8394194 8926531 8853824 9059627 8921173 8969262 8078957 8316815 7881788 8117298 7502322
2740 7502322 7471445 6990916 6075206 6842747 6510262 6577953 7122523 7215031 6551580 6928494
2730 6928494 6879713 5717792 5670317 5974500 5510138 5055269 4660864 5260197 5693863 5325247
2720 5325247 5540931 5189119 5117843 5039248 4840175 4969248 4415796 5033282 4872824 4801987
2710 4801987 4586956 4595302 4200397 3961494 4345091 4452348 4227365 4717050 4483094 4048342
2700 4048342 3653986 3862868 4057507 4275108 3882745 4551441 4590559 3922677 4397954 4158533
2690 4158533 3858871 3974861 3661889 3429291 3670040 3503032 3608877 3828959 2706961
2681 2706961 3081972 3879481 3941220 3198430 3668390 4780468 4489552 3681697 3119870 3555813
2671 3555813 4016727 4245930 3462272 3163942 2849609 2668696 3020735 3529242 2821713 2792109
2661 2792109 2289328 2382513 1997460 2119221 2712823 2647156 2367781 2214090 2872581 2854285
2651 2854285 2386539 1925480 2319918 2428881 2470645 2660154 1923820 1839739 2421157 2590955
2641 2590955 1983147 1190716 2100498 2532122 2919011 1942046 2262654 2858195 2621068 2902253
2631 2902253 3141788 2312208 1839139 2441564 2883031 2632041 2854452 2504173 2497858 2792778
2621 2792778 2038827 2242024 1911344 1296508 1458785 1911244 1802857 2501907 1789900 1934936
2611 1934936 2453030 2415921 3526993 3414780 2502589 2327367 1892791 1442049 1750369 1682539
2601 1682539 2054118 1925115 1048141 1231899 1676814 1596550 1553964 1943739 2164021 1418974
2591 1418974 1503671 1783680 2346646 1830998 1359092 2040989 2549756 2484831 3602107 3700360
2581 3700360 2948056 2706985 2242816 3612929 4251286 3828069 3445149 2586722 2894578
2572 2894578 2689057 1830096 2673872 2778284 2690611 2797336 3527619 2804716 1813348 2060514
2562 2060514 1804840 1342843 783930 1455271 1922723 1974627 2584730 2159696 1800990 1603411
2552 1603411 1939702 1634784 1589603 1737670 1280366 822268 942610 1344707 1021992 1036477
2542 1036477 1582330 1199110 846139 1303300 1438015 1272013 571740 390402 543338 1184288
2532 1184288 1349191 1374359 1252445 -20450 700825 1392840 1510465 1506923 840672 1301456
2522 1301456 1246283 1250448 1609680 1140541 747375 347797 914227 1001555 1049636 415331
2512 415331 366987 715674 754927 873201 775551 988919 1310585 1404048 551424 247428
2502 247428 1147190 1788335 549641 606108 765180 858869 318712 984467 589079 302534
2492 302534 166299 409848 626082 55952 -63767 89536 507724 394532 328088 -121435
2482 -121435 356377 785709 639704 -432697 228481 362942 449760 28512 -127657 214546
2472 214546 813130 287016 -302863 718886 1650804 1203909 579394 4895 372888 556686
2462 556686 424971 -563238 -417638 203216 853267 780885 820266 1070535 41970 380169
2452 380169 837621 918353 285198 836664 1256336 895991 666831 406527 610863 163335
2442 163335 -232440 498413 252853 379612 993466 893265 639085 933336 750909 802984
2432 802984 738004 408759 397059 30561 -664628 -555510 33645 427622 1044355 1055993
2422 1055993 945896 1131976 -184770 -425289 659159 509933 267551 45598 -45048
2413 -45048 238452 699879 466335 125428 77225 264983 594242 270879 376299 -79885
2403 -79885 977686 553706 -162681 59532 447363 1152093 1232188 874439 1012996 1097008
2393 1097008 368350 183644 68381 -18542 434812 475741 210197 -392680 173657 483001
2383 483001 -259464 -3707 -266477 -216262 154813 463823 523844 1508562 2200063 1622492
2373 1622492 1776295 1217482 1544278 1065510 726279 153213 -86710 206146 339814 96386
2363 96386 385531 153208 164744 758885 688884 678081 243243 885962 538983 989520
2353 989520 1103064 469273 376086 140944 -333758 443436 820896 775222 497498 172298
2343 172298 420135 25423 906007 945164 230705 -334200 -521086 198632 185528 780292
2333 780292 643365 657638 1095648 838045 962485 465917 -191912 266387 1541071 1393524
2323 1393524 1454480 1259176 229790 814581 967007 964062 1103222 803749 649683 881183
2313 881183 1054061 430979 490550 944863 1050589 795326 612682 1152674 353308 27975
2303 27975 784213 803050 811687 381592 226929 1352745 1666285 479442 22877 240813
2293 240813 312027 778863 795003 303423 905409 550594 156538 938184 1141434 698032
2283 698032 230478 562945 216024 -37414 1395552 2023770 225910 375540 838758
2274 838758 1106171 926693 1552754 811782 1051468 1575203 1005780 254717 148650 1460250
2264 1460250 1662690 1964893 2170944 1235739 1146324 1111713 1414458 900558 831592 517974
2254 517974 1343470 660901 178695 634417 1113913 2140506 1179155 1030898 888335 935604
2244 935604 1097900 1174943 1792624 1789504 1737405 502768 -68730 1276669 1092048 114356
2234 114356 85047 1091041 1352367 1304203 1303060 1459460 1854076 1920692 2238120 2558637
2224 2558637 1817864 2630587 2543614 2367817 1306044 1733706 1743100 1808722 1638778 2111694
2214 2111694 2462607 2569839 2897671 2478944 2725814 3288591 4281679 2997227 2914532 3401497
2204 3401497 4293129 3702396 3751021 3780647 4031887 4374478 3455617 4018087 4676484 4074120
2194 4074120 4259098 5013811 5185188 5816881 5378965 6061369 6266753 5695064 5169706 5543207
2184 5543207 6302097 6196751 5677649 6210085 5858830 5798934 5478558 5496086 5556422 5433206
2174 5433206 5957931 6835880 6103816 6501710 6606244 7473362 7795012 6841999 7611877 8077261
2164 8077261 8274599 8753784 8588584 9275726 8812259 8500597 9258029 9561357 10568436
2155 10568436 10991479 10998043 11701237 12111691 12644295 12178770 12560429 13135614 13266239 14313788
2145 14313788 15236742 15363691 16891648 17868659 18087153 18718914 19502819 20895287 21384213
2136 21384213 22890054 23488948 25167441 26227790 26674347 28015113 28841227 30406555 33333254
2127 33333254 36493757 38748065 42264761 45762981 49451788 53416892 57158174 61886702
2119 61886702 65553222 70591686 77883925 85609886 95458404 108129504 124674419 145625044
2111 145625044 176381028 217420813 263267542 299420137 320021651 329180417 298691056
2104 298691056 250820693 208780173 171060891 138354959 113416621 96565248 83890384
2097 83890384 74025143 67586548 61634507 55882714 52698110 49520974 46290455 42345754
2089 42345754 40004033 36125268 32672940 31138429 29605123 28402115 26645331 24675351
2081 24675351 23225528 22645904 21714448 20512232 18860281 18084550 17579999 16601715 15807476
2072 15807476 14982369 14333067 14001377 13382120 12771317 12143154 11774082 10708865 10392444
2063 10392444 11117898 10226989 9743333 9065978 8455541 8935818 8830406 8376928 8543737
2054 8543737 8335083 7922252 7541213 7784710 6890115 7057761 6889575 6410538 6575820 6113240
2044 6113240 5707362 6050350 5794920 6298294 6076018 5600175 5647739 5430462 4496784 4654760
2034 4654760 4584230 4355337 4252240 4345832 4877957 4429034 4168087 3688185 3623610 3240906
2024 3240906 2995074 3153663 3369279 3352337 2503688 2050394 2143626 2363434 1738881 1567346
2014 1567346 1991201 2877660 2831105 2549479 2654897 2308547 2188704 1560149 1742652 2196686
2004 2196686 2495099 2102849 1322784 2514529 2809665 1832511 1052437 2123104 1942433
1995 1942433 1866998 1482466 2100593 1780932 1833187 2698138 2061336 1597926 487469 394953
1985 394953 511066 1277722 965669 972215 1124269 1247546 1070592 1602785 1442911 1164702
1975 1164702 699872 1198157 1207187 956074 1121583 189651 537044 799276 542954 358943
1965 358943 249260 954010 849513 153002 718757 802415 285584 -164322 286863 1024639
1955 1024639 1268966 1290637 1536653 1252636 1311897 1061552 380772 490943 163976 -39960
1945 -39960 454103 655069 679363 347075 315967 953589 645512 663065 1185787 1729664
1935 1729664 1165403 403471 168212 432526 -182386 457894 196021 -48365 1380560
1926 1380560 993187 -213217 260822 616857 507636 234432 990928 1651285 1667262 1489686
1916 1489686 1191258 610672 376375 493858 293151 300184 293066 46958 -80235 890920
1906 890920 610866 651305 833190 1546945 1696562 737317 -38800 213370 459332 1277005
1896 1277005 162610 245645 584620 120057 151672 516734 536644 139207 100476 534867
1886 534867 -242579 440909 826054 484584 491076 -225183 -235381 -643267 -345470 118713
1876 118713 -41297 -353186 -254627 928621 876176 365871 319339 -66330 -222705 -166511
1866 -166511 -140254 -248098 482401 675285 318900 618473 69427 162095 165148 -133390
1856 -133390 -151058 -763389 -1070613 -1265717 -625728 -387714 -1407 -65632 -6261 382986
1846 382986 1578896 2144170 643036 646622 1164852 1194675 1896760 824179 254825 1273425
1836 1273425 1745741 1455899 2064224 1478885 646308 -13563 678913 317264 1309659 584257
1826 584257 512608 649650 500472 715715 827555 610646 602248 667952 79525 -762311
1816 -762311 -864863 -527337 -853310 -1057795 -493749 181892 122287 234952 761030 228592
1806 228592 -317546 -888843 -1010623 -446030 -425732 197170 976139 760618 647172 996177
1796 996177 983937 668207 -319502 473031 86287 -30369 64995 703303 49455 -381520
1786 -381520 -195459 -541289 -675505 -283097 -42992 -709480 -755594 -427243 -383642 -172925
1776 -172925 -325699 113689 126594 37529 -98666 -313534 258768 632433 301083 483469
1766 483469 609542 151641 -327962 208218 113757 -296287 -1239226 -362872 131626 -619909
1756 -619909 -640338 148716 307454 160758 -195677 148614 769436 521086 -181784 -609027
1746 -609027 -570315 -70565 -436568 -300131 -358521 -1043936 -615168 -581727 -637963 -739188
1736 -739188 -1080939 -1166866 -1074833 -622727 -109763 -473369 -454970 -136618 -96004 -1151841
1726 -1151841 -390605 -386029 -879820 -79128 38096 -146475 173579 -306594 769307 869763
1716 869763 -76516 862085 1524740 1292424 478021 348871 -217425 -421124 8999 655802
1706 655802 536581 208601 -519631 -708327 -1306672 -1085677 -472292 -504287 -277975 9092
1696 9092 -34930 -584514 -26627 -7209 196584 70449 -154940 -901114 -536650 -383255
1686 -383255 -322445 -469831 -1009678 -343513 -537577 246744 -2843 -440287 -1603339 -1440245
1676 -1440245 -547446 -533382 -111983 -3175 -277331 -153151 162560 -423905 -354180 -695006
1666 -695006 -115927 -635043 -451174 -156672 -54205 61408 15123 -7610 798862 219787
1656 219787 -279930 29869 -208608 145326 261099 -295965 -723731 49565 692422 744291
1646 744291 154188 -588710 -504879 -554779 -956603 -216911 -44516 -300966 158170 -537761
1636 -537761 -1115567 -1124446 -463758 -382605 -246492 649182 395926 -48873 -19639 108257
1626 108257 -197726 -758198 -879786 -242634 233755 37277 76502 -833077 -782271 -54099
1616 -54099 -165987 -718107 -135457 -525484 -583707 809438 383066 -142401 -358739 -504117
1606 -504117 -452425 -361196 -554292 -661530 -735940 -673235 -1183080 -880015 -589954 -492922 -568399
1595 -568399 -190338 -467462 -543853 236931 -322989 -679914 116128 180615 -30038 -252172
1585 -252172 -362460 -1033138 -910815 -273999 -490615 -127648 -122139 -517632 -346682 -130026
1575 -130026 -429810 -282792 -299984 838572 1537751 806214 651833 717789 -19212 297147
1565 297147 555409 -451197 -351393 -735356 -821978 -164566 -462582 -128524 317290 -215203
1555 -215203 -563843 82975 694506 1343849 266855 -858224 -473430 -932878 -973506 -898454
1545 -898454 -632997 -908457 -675979 -981642 -1146041 -805770 -366814 -509399 -575302 -793514
1535 -793514 -755932 -529551 -351367 -878553 -621062 -137493 -374571 -126951 -691475 -1026481
1525 -1026481 -999428 -1135119 -691667 -1446689 -755874 -413273 -289787 198452 503021 712177
1515 712177 426055 -129192 7792 458357 44851 311076 -209857 -247214 -985336 -8787
1505 -8787 -171928 -71350 91459 90968 408349 420995 201681 -149768 -348393 -1020918 -820476
1494 -820476 -753564 -1126405 -586598 -107375 -502525 -453174 -204792 -82687 218378 -878543
1484 -878543 -911732 -869368 -860670 -1119873 -1171940 -122032 -412173 -428734 -584661 -13043 414636
1473 414636 62593 -216058 -8352 -560811 -770736 -954457 -1353114 -836493 -480468 -520420
1463 -520420 -48455 151897 -196556 -192291 -153200 -512961 -243384 195356 -174714 -864045
1453 -864045 -616730 -182342 65210 274807 114497 347815 420716 -145492 -93863 -862223
1443 -862223 -383303 -67659 -439434 -677776 -909871 -823218 331221 808079 -179807 118002
1433 118002 381568 20197 155238 794492 -102347 849872 261999 -266005 -1142015 -182795
1423 -182795 1010871 905871 278642 335730 15399 77218 852614 496852 288378 -137166
1413 -137166 -609046 18410 755913 528290 91068 -304802 -109993 93860 -303677 -185957
1403 -185957 507676 940 -220146 -362074 -470662 -1717618 -1846493 -1524881 -865924 -452536
1393 -452536 26141 -561627 -872604 -255779 -447198 -473595 559795 -134126 332992 665486
1383 665486 -261033 203874 457889 81769 -723150 -712525 -783852 -265954 -1178 -186082
1373 -186082 96130 -55131 -106210 -600431 -876467 -1002448 -1260324 -1114029 -1182700 -644543
1363 -644543 -252513 -68881 -13499 -451445 -264634 254176 190377 44043 -171586 -7928
1353 -7928 -100832 -131370 439791 -53030 -133369 418840 954242 1131619 -200865 -329623
1343 -329623 -298898 -681460 -126343 -698528 -1090476 188290 472781 435985 516785 -83926
1333 -83926 539781 1063369 925673 -33687 160409 512940 212413 292788 196583 147854
1323 147854 326112 -87444 -450557 43810 -32163 -130375 -106267 62324 -728308 -1412716
1313 -1412716 -456059 -275104 -593871 -770523 -664944 -763676 79369 -74149 -743766 -465755
1303 -465755 -331232 925513 378569 278201 -376970 -1182586 -1000415 -343135 -125813 -615235
1293 -615235 -782999 -466630 -422327 -1433079 -1401935 -119694 -329341 -102206 -519559 -873161
1283 -873161 -1087920 -1445796 -1244607 -534908 -584795 -256456 240348 385398 -116615 -242210
1273 -242210 248490 211455 -71245 -78025 526389 467710 68726 75224 -60822 -111682 -294165
1262 -294165 -317427 -440196 -251952 -272479 -417506 -462643 -416550 -23175 -706797 -390713
1252 -390713 -206517 181800 -52936 -512928 -1060028 -179177 393838 235252 -124911 543693
1242 543693 308022 71004 373357 -128500 -887462 -128000 454534 925941 1073020 266554
1232 266554 -62822 311068 774338 904618 23039 -637285 -807723 -194422 144784 -280710
1222 -280710 -180218 -460452 -1181858 -1093858 -668094 -128304 -211869 -243292 670110 406375
1212 406375 56899 -435100 11741 648310 57558 -403695 95795 -436429 -1503007 -1228594
1202 -1228594 -860080 -1297675 -1274240 -748967 -843594 -606440 -728056 -612468 166576 -73004
1192 -73004 18908 -498919 -1185479 -1232077 -514536 -570017 -13260 392781 -752531 -563375
1182 -563375 236267 253258 -268007 -813311 -686374 -461113 -589491 23895 543861 1389452
1172 1389452 812166 43501 212017 292257 444722 630450 336825 984921 918367 877907
1162 877907 678329 -41793 214856 233332 -88106 -721036 180821 6089 -216496 368467
1152 368467 -105144 -19329 89241 -390251 376701 87314 -527622 -1151534 -1000597 -1011350
1142 -1011350 -378408 708982 153918 -982441 -1146524 -541730 -245840 -280712 -665414
1133 -665414 -373760 -495947 -691779 -549524 96244 110305 -7047 -430691 -872293 -774100
1123 -774100 -991919 -153079 36657 -181862 -280991 -461851 -667354 -154743 -605228 -219624
1113 -219624 -1012982 -317720 -279152 181721 -361796 -942602 -89333 159843 269958 18855
1103 18855 57117 174352 -173351 -353366 -576710 177300 562371 -937321 -1028750 -276676
1093 -276676 -323690 -684957 -100242 -423097 -41202 -480460 -280433 -651594 -325095 -236571
1083 -236571 -761614 -1007109 -874277 -449785 -589328 -416858 -42920 11309 -675814 -629287
1073 -629287 -385514 -512892 -466155 -267104 -36063 -1106322 -1135221 -62125 632452 766974
1063 766974 531875 170015 -12553 387990 -76471 -268466 269926 -99152 -166325 68216
1053 68216 394984 -87789 381302 1070586 1363539 1070817 878560 81205 -532131 -296426
1043 -296426 260450 -104451 -223699 276581 347418 -388614 -3035 62422 177845 -357440
1033 -357440 610557 200105 -210141 164722 -901742 -416887 -709416 -171373 -158521 -103334
1023 -103334 264583 146330 -415502 -65933 -528330 258881 601422 206443 1105731 233690
1013 233690 186927 -101438 164467 464253 205574 -69815 124768 39509 -111807 -18912
1003 -18912 442830 -307082 -502607 -198981 -355477 -85654 -277818 93637 439750 514912
993 514912 -175351 85861 -123375 476895 806668 489154 343366 -808118 -1701348 -755740
983 -755740 257407 -156571 -746094 -378238 -616421 469814 -460533 -375359 92763 825499
973 825499 139040 -630688 -493547 -469473 -736790 -608976 -768434 -755884 -972773 -874649
963 -874649 160381 -342263 -991428 -732907 -851723 -731155 -132756 -121493 -57253 -72963
953 -72963 933955 158367 -83205 -736366 8080 -134860 -366856 -275481 18633 196054
943 196054 124234 -427479 -682574 -1308143 -1382224 -625393 -865934 32272 -135624 -408529
933 -408529 -141085 447075 -485453 -509599 -1043972 -298487 -972177 -620930 -158328 -229160
923 -229160 79640 -1182401 -252385 495056 752732 -387666 431635 -169451 -228083 85829
913 85829 -631168 39096 119316 258081 204669 -724125 -1326779 -428722 -712139 -734952 -732558
902 -732558 -99912 -104346 -141876 -488092 -817263 -1118490 -1515376 -1019293 -243165 -801342
892 -801342 -494183 72174 -940087 -350717 -781746 -795350 -809187 -663605 -1275042 -999032
882 -999032 -443327 -865610 -807928 327985 117637 119066 -344944 174106 7800 -321885
872 -321885 329258 867826 995844 950372 621877 12541 325850 422091 611914 194159
862 194159 566939 262327 -57797 -16895 -754538 -536984 598489 -51776 834207 923904
852 923904 322473 1991 339100 736779 938298 402871 -101802 14005 -156357 539802
842 539802 402248 -558243 -946925 -732561 -501300 16061 943482 726119 161942 139145
832 139145 149363 697917 506024 988758 316958 481352 552492 1011698 1435717 932859
822 932859 650798 -35596 1131906 1377394 747149 293429 167947 8599 -272558 -71182
812 -71182 410070 333259 -213657 -817502 -486770 -331562 -851119 -1058535 -313916 437926
802 437926 605480 922174 399873 314207 263046 789796 213183 -328581 -89388 212481
792 212481 252010 8724 93279 -27789 -17272 -381046 -102083 287006 800460 611512
782 611512 623412 369218 -1507 325424 162375 1022978 68614 -374073 -309101 377391
772 377391 -476892 -536539 71546 -850336 -856631 -1074803 -678867 79422 494702 -475294
762 -475294 -911753 -606853 -829778 -308488 51829 -598691 -1293676 -383884 -309126 -548143
752 -548143 -172100 -165690 130114 -73168 -704864 -221916 -145449 -225288 442888 64386 -173021
741 -173021 -197231 1064193 327763 478143 378011 497439 691347 220597 -466806 -801807
731 -801807 -163938 -562928 214788 495893 968789 1136791 -272199 -517276 88783 997660
721 997660 1213749 740892 -438077 -493099 91015 586599 661478 260720 -69262 272040
711 272040 -22950 -76441 -124248 127326 931694 523846 -300862 8312 23362 -582180
701 -582180 -42591 -214229 -213041 -561847 -1109734 -822151 -1112070 -274224 233004 -438148
691 -438148 -338406 525519 -108263 25430 394178 439135 462488 251270 294214 -80247 652141
680 652141 1827583 1222514 -9479 238904 232684 27587 -772276 -382718 143955 -306035
670 -306035 -899744 -852325 -638951 738901 662130 60074 657915 412316 821592 501363
660 501363 -421718 -620312 -918953 -264385 -634980 -1230232 -766226 -603763 -720818 107411
650 107411 433417 -131061 -231751 161580 75533 -82785 445007 797844 1143772 547004
640 547004 295724 -231596 -54965 -73425 234704 -47651 -537479 -443132 59486 464972
630 464972 -36105 72844 -441079 253766 193411 111828 60825 -482802 -667470 -1214745
620 -1214745 -788577 201306 684479 1048977 869077 505565 686732 252347 -126243 187506
610 187506 254791 714526 8315 410778 314540 647225 785499 310343 308812 -173318 -599433
599 -599433 -750269 -917645 175193 58355 -52333 13936 -204740 -58177 272628 1158204
589 1158204 -125869 -152635 86705 -554286 504035 -152530 564589 1656565 1376732
580 1376732 1416403 746698 424107 38135 736426 325219 363801 687616 755543 915575
570 915575 410593 385427 948787 541016 650982 641327 -303052 212755 726934 461677
560 461677 92342 311177 676869 -73156 -32425 86976 1116798 1058342 1167230 409611
550 409611 -517639 -277154 -48242 -192642 -355510 -653755 113741 601164 163570 -38006
540 -38006 -321611 33212 -338430 -331142 206881 654585 589478 211848 815102 631039 268141
529 268141 354540 600701 382506 731831 929230 284887 18955 -538646 564935 1007996
519 1007996 -256776 132932 260839 190185 40942 -575884 -483872 323720 -103563 133302
509 133302 -205228 -1121434 -423413 -12164 -97636 -173849 111667 207995 34014 609548
499 609548 955282 771265 351185 744852 578518 -5729 12452 -274978 191476 -242239
489 -242239 316480 195374 -998941 -645422 -469594 -593404 -527176 -479200 715305 150674
479 150674 666099 476647 118252 -304934 98530 217197 -27292 -551732 484035 833360
469 833360 1201335 924707 411349 715972 937194 638063 -448634 -496378 353191 389902
459 389902 247948 784385 -23303 117576 -978312 -823855 -7945 421196 385631 192049
449 192049 -422907 -522088 -160766 186332 399630 380137 -499349 71129 -368874 -359811 -494535
438 -494535 -394047 650813 274412 -77064 235009 989263 31422 204820 693424 749190
428 749190 1254280 705141 1039692 944751 1253776 714293 346803 -106183 354274 493062
418 493062 -138408 628506 173348 53033 439000 602248 709892 901715 395338 19966
408 19966 38613 808267 927559 1382611 1129975 1180531 882255 896995 1209641 1009875 582201
397 582201 505887 198958 541200 1252892 870555 141918 -115494 262840 -3528 333054
387 333054 -472743 176168 692662 315250 57754 238039 -905 -918822 -635087 -1313974
377 -1313974 -397349 -521970 -282152 221670 466161 673796 90901 -74601 -44802 91898
367 91898 307517 -500995 -228569 -275648 -230589 153063 90195 834223 877425 719673 731016
356 731016 423555 -154112 98178 527671 1282565 1440723 1159845 579789 429230 254538
346 254538 129606 18450 -328851 -7638 294388 313404 713762 351990 160101 -698509
336 -698509 -1187279 -91588 499797 -104016 351380 527767 760147 233670 -413303 -219650
326 -219650 36788 721263 135866 165527 1312195 810105 -144371 710471 1378962 771625
316 771625 497637 -297653 375842 1037095 -47682 59791 613139 951466 559462 681371
306 681371 1035554 1359983 1459162 1517620 944863 1215516 2163568 1609376 1065108 754337
296 754337 1097813 838773 998838 1709282 1633966 1772392 1166197 1394293 1322269 1330678 927160
285 927160 204001 749964 203841 134870 -114716 66236 555139 970145 1030352 647956
275 647956 244636 423672 186541 -51289 -707263 -216571 -220899 345862 214996 -204255
265 -204255 218677 428097 1026025 1151723 1198395 806757 637212 1101183 552622 93405
255 93405 419168 -53404 -337330 -161614 736282 1313169 1250825 743696 914972 329147
245 329147 -657045 -768497 -1056471 -375510 804929 161701 317818 -84735 638652 1176035
235 1176035 1307758 317455 -602459 -332302 768936 1183096 686578 28234 -73261 -655843
225 -655843 9089 633940 792624 541101 135060 -126618 856855 1138840 -16171 267023
215 267023 525057 53629 -853849 -307765 635300 812202 245246 142168 709965 438031
205 438031 886852 727171 751232 925605 939077 192647 -11775 56220 525763 939573
195 939573 249865 1205100 836499 712513 798536 1025768 764604 746809 551026 335544
185 335544 10581 -102995 -774841 -742831 -161580 682610 939834 168765 284060 -143850
175 -143850 -314093 59051 173888 -81935 496579 294734 761741 1247758 940685 1525593
165 1525593 936535 324805 931322 558694 589865 1597904 723765 622565 646555 992249
155 992249 550374 478578 742862 599179 434369 297262 418646 1105545 628015 871104
145 871104 833575 606107 648359 431949 436274 488101 550424 749596 762690 1045788 1505457
134 1505457 1261010 739690 1105776 346383 163897 -12623 271113 908789 1178312 1361237
124 1361237 1561291 1162535 281649 361781 151819 -58315 347843 959957 1261882 988957
114 988957 498043 181350 -372203 198991 761533 565248 506012 972277 820783 842438
104 842438 298353 427723 754714 544101 595351 -548657 -284535 662063 379181 197474
94 197474 227122 482339 337087 670257 984231 900527 290798 321970 187476 459915 117425
83 117425 133701 653566 1023702 471561 610509 930174 953387 1152146 498619 -569606
73 -569606 559168 932201 832476 1113769 1147610 888403 1021797 926981 475076 -139475
63 -139475 -244980 181908 686450 -53759 812831 1387638 1211632 1001329 385643 1101618
53 1101618 975956 974726 700722 858060 645385 332103 501902 800959 448067 495655
43 495655 933081 558884 685867 665774 544591 762442 980297 747233 618670 855410
33 855410 863304 675613 425972 546305 993769 612109 1254412 1147941 545505 649694
23 649694 383459 208665 621258 816041 754152 489810 377076 312629 525624 675104
13 675104 628728 1383349 912330 634337 68788 497986 330769 572647 367513 616094
3 616094 739208 868107 516738
0 516738
$$ Imaginary data points
##PAGE= N=2
##DATA TABLE= (X++(I..I)), XYDATA
16383 -2713438 -2850457 -1997846 -2277328 -2497161 -3009021 -3430746 -2593989 -2508295 -2844571 -2967453
16373 -2967453 -2687893 -2435146 -2099698 -1594335 -1960121 -2174630 -2309879 -1921263 -1879334 -1940908
16363 -1940908 -1962385 -1906474 -1832894 -1668297 -1965525 -2336193 -2272053 -2497891 -2474234 -2493921
16353 -2493921 -2061338 -2181900 -2563989 -2904296 -2443397 -1801850 -1517320 -1307896 -1531641
16344 -1531641 -1116843 -1278464 -1290301 -957356 -627292 -1190849 -1008432 -1285604 -1343613 -1261258
16334 -1261258 -1404326 -1023760 -557698 -959839 -1306999 -1244805 -1524694 -1460530 -1310424 -1062459
16324 -1062459 -1192091 -1308461 -751504 -921574 -653377 -383575 -1221753 -1017636 -71041
16315 -71041 -541629 -284057 -176240 -293137 -144927 -169739 -595880 -27690 234195 80365
16305 80365 32740 415261 436983 -87303 -94755 294230 922389 408152 415169 468741 203055
16294 203055 48123 190129 262840 153447 -468199 458596 753859 764043 915660 265126
16284 265126 1084946 1570288 705112 354746 650089 813960 1112513 1338685 1062294 1340883
16274 1340883 1689253 1277932 886227 471559 871991 953885 956879 1777048 1234980 577522
16264 577522 827472 1179913 1480207 1385075 1384021 1594088 2418536 2230106 2051617 1676432
16254 1676432 832170 731686 1348607 1449752 1309240 1426125 2238328 1681174 2146885
16245 2146885 1647237 1234834 1169771 1002212 1570658 1805366 2181796 1632641 1557911 1590653
16235 1590653 1386133 1388634 2117516 2152568 1432928 1367164 1500228 1555240 1522959 1775953
16225 1775953 1955814 2273575 2238358 2078050 3014018 3170876 2404723 2301300 2560305 1926364
16215 1926364 3083079 2420849 2342070 2331753 1852702 1807430 2057032 2550841 2489247 1828051
16205 1828051 1787060 1799715 2252979 2093123 2451879 2603291 2263080 1687031 1451029 1491270
16195 1491270 1655845 2493258 3048946 2581453 2543295 2806443 2800559 2916740 3119037 2776022
16185 2776022 2093126 2158051 2146634 2282635 2521114 3086179 2578831 2003539 2044623 2945783
16175 2945783 3384544 2899221 2610933 3142375 2626714 2288841 2043853 2486090 3123692
16166 3123692 2460537 3153526 3127362 3612398 2797640 2160682 2328720 2627185 3298153 3513536
16156 3513536 3055270 3299821 3484593 3458862 2668216 3234593 3438249 2947432 3039913 3302194
16146 3302194 4197086 4020393 4223067 3201056 2251769 2340491 3083467 3316644 3705666
16137 3705666 3322120 3410935 3117472 3422438 3068599 3469229 3823625 3728254 3591760 4196620
16127 4196620 4150772 3529954 2576010 3266684 2989102 2396900 2903069 2739888 3227002 2846748
16117 2846748 2607057 2974418 3315406 3679007 3655471 3333244 3462061 3227684 3243033 3045221
16107 3045221 3024418 2812508 3321297 4113730 3849015 3415707 3174883 3582450 3876102 3477962
16097 3477962 2068613 2190758 3071417 4128886 3098439 2599462 3871270 4115830 4411837
16088 4411837 3127740 2750194 3332424 3433272 3267057 2508403 3414313 2983706 3078012
16079 3078012 4151542 4013813 4348528 4031335 3474204 2926803 3241952 3393414 3622637
16070 3622637 3073656 3309028 3388869 3072832 3510517 3308064 2664721 3158407 2642291 2852725
16060 2852725 3570721 3212420 3669661 3654573 3594360 3823614 3657695 3179908 3042049 2932452
16050 2932452 3265761 3333680 2713168 3062825 3160611 2930846 2686149 3038865 3134052 3734601
16040 3734601 3850777 3401949 3321408 2795123 2314804 3081278 3311134 3141429 3829499 3162420
16030 3162420 3228463 3850467 3278827 3204739 2956390 2060704 1890247 2730445 3768331 4220150
16020 4220150 4350158 3724772 3874405 4213997 3864404 3375414 3612446 3872365 4765306
16011 4765306 4111975 2683813 2760285 2687328 2701491 2721930 2463947 2809495 3147922 2633494
16001 2633494 3013621 3396131 3086822 2938399 3372861 3435555 3120767 3254391 4395351
15992 4395351 4038214 3775616 3396405 2253283 2792278 3453945 3324047 2599160 2836943
15983 2836943 3263091 3629130 3158606 3236896 3451353 3263069 3133339 3296378 3530445 4081237
15973 4081237 4855728 3681093 2647730 2496967 2965306 3875993 2886564 3067292 3351596
15964 3351596 3598389 3615096 3431791 4064645 2957709 2877223 2553994 3426981 3237909 3281505
15954 3281505 4225077 3521229 3175120 3098554 2878099 2537472 3487691 3388017 3821029 4573117
15944 4573117 3266942 3310856 3792673 3937945 3736821 2936974 3564066 4023318 3390573
15935 3390573 2884189 2596242 3307370 2737921 2647848 2715240 3166843 3460662 3420616 3027657
15925 3027657 3005673 2595951 2589966 3156504 3359772 3037778 3434223 3681924 3547046 2901439
15915 2901439 2869795 3108979 2411854 2605961 3020436 3665337 4005160 4075024 4373052 4106766
15905 4106766 3576724 3686454 2448006 3448424 3949303 3490799 3981525 3973095 3166641
15896 3166641 3165027 2995865 3199092 3548825 3475974 3777027 3335806 3089567 3011470 3149888
15886 3149888 3437140 2710027 3946789 3951869 3677411 4038833 3951395 3753137 3490447 3223832
15876 3223832 3261253 3725234 4051914 2678655 2576566 3733670 3665108 3210542 3187237 4533474
15866 4533474 4629669 3663120 2696052 2765619 3221429 2702142 3025179 3553731 3793150 3818383
15856 3818383 3747807 4010126 2690125 3538955 3930218 3447514 3619108 3694881 3284157 2599330
15846 2599330 3216075 2630923 3748744 3876482 4073737 3546763 3276530 3543300 3184199
15837 3184199 3896102 4153365 3520955 2749340 2960486 2953097 3393016 3330437 2843985 3430798
15827 3430798 3368739 3169484 3231748 2929717 3557270 3484060 2753591 3521717 3050238 2173777
15817 2173777 2358752 2655639 2873017 2617598 2993877 3519626 2698484 3235420 3823004
15808 3823004 3724634 4269220 2848779 2040385 2426660 3378216 4057841 4642598 3260561
15799 3260561 3517269 3131230 3550888 3257713 3056528 3036018 3040504 3807920 4184350 4367397
15789 4367397 3530774 3548363 3576102 3100637 2612984 3059090 3572307 3955388 3700306 3579563
15779 3579563 3282236 3437408 3490007 3049231 2512954 1897628 2377657 2722995 2397944 2785668
15769 2785668 2751105 2780775 2527456 2955108 3461556 2026777 2544785 3358304 3873913 4168133
15759 4168133 4437696 4109432 2969324 1846623 2627663 3325992 3052413 2941537 3054708
15750 3054708 3010729 3755524 3346835 2998566 3390815 2811920 3325646 3555544 3343630 2669615
15740 2669615 2454753 3108083 3832090 3519077 3701854 4004655 2888378 3004476 3144966
15731 3144966 2999299 3812994 3020462 3139736 3395799 3959992 4091276 3574352 3837840
15722 3837840 4382262 4018094 4010259 3754173 3483666 3715680 4087991 3888941 3156417 3119375
15712 3119375 3661729 3338398 3371079 3316472 2859258 3181202 3305970 3283702 2859890 2381912
15702 2381912 2745572 3181302 3272020 3226026 3313817 3269660 3399116 3044837 2994002 3111872
15692 3111872 2691245 2714287 2948977 2959981 2561432 3037158 2547389 2786174 3441024 2992021
15682 2992021 2480761 2107370 3042172 3754936 3163031 2787975 3355428 3414331 3386834 2933965
15672 2933965 3047775 3433937 3161644 2975661 2618530 2765058 3189399 3372861 3195066
15663 3195066 2867772 3282305 3238906 3129826 3219762 3601600 3304381 2416151 3063487 3276696
15653 3276696 2636436 3151328 3138221 3269153 2930467 2354473 3150568 3577308 3282288 3144188
15643 3144188 3484270 3625628 3426499 3431524 3822006 3912236 3440223 2883151 3111837 3549413
15633 3549413 2593922 2610123 3165809 2805627 2528551 2612499 2834616 3010068 3490206 2950990
15623 2950990 2825976 3228547 2418861 2690620 3309824 2539072 2540135 2708705 2902087 3052647
15613 3052647 3466422 4107467 4720062 4107352 3611615 3668393 4252920 4038271 4051381 3719979
15603 3719979 3276908 3883323 4452059 4355042 4032595 3935432 3688474 3634022 3400804 3380924
15593 3380924 3759712 3472517 3244569 3509697 3812536 3460126 4041101 3095929 3477697
15584 3477697 3303810 3551363 4111571 3156543 3566435 3245579 2555562 2468376 3088433 3369803
15574 3369803 3203521 3630942 4034543 4006812 3407849 1775918 2635541 4342267 3790179
15565 3790179 3051665 3500553 3401161 4014823 3111040 3019441 3875454 3762805 4198477 4038730
15555 4038730 3674093 4174758 2843433 2944346 4093663 3670664 3519150 2879806 3117994
15546 3117994 3838421 3299993 2968709 2879501 2679700 3316418 3520458 3191391 2845286 3195949
15536 3195949 4347255 3648306 3532619 3274622 3175687 4452128 4707430 4244341 4293925
15527 4293925 4465407 3322531 3032073 3134592 3454396 3385902 2527869 3200338 3690455
15518 3690455 3465761 3437372 3500062 3320565 3215611 3487381 2812405 2886542 2886433 3115619
15508 3115619 3574785 3666440 3738780 2909827 2403130 3171798 2730198 3065780 2902822 3453974
15498 3453974 3497983 3258614 3127853 2423178 2640037 3085434 3637184 3560149 3904124 2997187
15488 2997187 3754165 3893311 3889524 4118201 4256066 4898984 4863330 3863746 3358616 2965080
15478 2965080 4080968 4210230 3841817 4076763 4245460 3698688 4002164 4460624 3981165
15469 3981165 2655783 2894852 3550805 3985476 4100062 4474570 4155001 2974096 3495648
15460 3495648 3051420 2798577 2432149 2406677 3054404 3453811 2534668 2978650 3615985 3677184
15450 3677184 3613537 3487734 3188978 3487196 2798793 2868199 3799784 3171091 2703868 3533540
15440 3533540 4188208 2843563 2188879 2697439 3059977 3206229 2710497 2779685 3023068
15431 3023068 3159122 3004772 3114978 2951133 3054974 3935719 4272822 3192127 2751122
15422 2751122 2746448 2903836 2860948 2871664 3294100 3524144 3333904 3822891 4499117 3244725
15412 3244725 3384621 3606471 3678443 3698760 3641827 4159745 3912727 3617119 3152061 3699170
15402 3699170 3879813 3801845 3689765 3943711 3398644 3188048 3571995 3052642 3223352 3884380
15392 3884380 4134828 3583031 2799724 3614053 4162319 4011815 3887159 4138440 4210301 3741818
15382 3741818 2761481 3175228 4246454 4872776 3920157 3212269 3964481 3741599 2810734
15373 2810734 2734829 3833070 4050829 4467741 4154709 3691351 3333119 3305452 3755725 4254693
15363 4254693 3966885 3824512 3686520 3036046 3188982 3824351 3633730 3028944 3003016 3841586
15353 3841586 4830736 4444585 3800792 3504184 3549370 4094647 4087416 3771935 3445273 3772113
15343 3772113 4036877 4079946 3507241 4010362 4234072 3514051 3301022 3184372 3546455 4320159
15333 4320159 4221471 4321065 4511579 3301507 3975148 3657658 3491353 3962130 4445320 4635114
15323 4635114 3854217 3890811 2704296 3402534 3915495 4499865 3410525 2503745 2908557
15314 2908557 3403641 2855313 3258665 3352281 3052932 2836126 2440325 2827441 3383185 3327343
15304 3327343 2417631 2618375 3337154 4174229 4425398 3974817 4084570 4305579 3853415
15295 3853415 3641355 3859875 4081777 3952167 3457723 3422006 4302964 4002657 3862474 3520298
15285 3520298 3088105 3191911 4144699 4444479 3622669 3485992 3429303 3421075 3023177 2849147
15275 2849147 2404643 2971044 3843507 3264039 4299634 3784722 2930535 3495629 4296843
15266 4296843 4693439 4672159 4091199 4062494 4003658 4140620 3901052 3882471 3583803 3062670
15256 3062670 3659390 3236874 4316631 4381203 4429532 4533592 3841591 3741804 3731105 4170995
15246 4170995 3741180 3392943 3051234 3724277 3674040 4026581 4042349 3217973 3671251 4021640
15236 4021640 3758625 3929991 3702982 3795242 4077206 3449786 4271719 3911658 4122409 4503947
15226 4503947 3785812 3616406 3174960 3712427 3392790 3613936 4231149 3897809 3040105
15217 3040105 3089332 3589699 3606153 3823578 2968217 3273346 4231051 4365869 3953752 3321239
15207 3321239 4521703 3680760 3304922 3455546 3073358 3338416 3533466 3120536 2793052
15198 2793052 2790904 3016319 2609461 2942380 3461058 3126436 3351326 3429690 4021110 3381651
15188 3381651 2983552 2473847 2556725 3112646 3309407 3324186 2477584 2353272 3014579 3735920
15178 3735920 3925608 4716411 4895491 3823314 3352799 3646900 3098678 2900009 3888762
15169 3888762 3913278 3458628 3757701 3535439 4091680 3527395 3239047 2533315 2275055 2800520
15159 2800520 2487268 3521389 3637298 3490074 3718692 4314920 4106287 4188239 3819978
15150 3819978 3241864 2723989 3283426 3239060 3244013 2918393 2375029 2590008 3445458 2924731
15140 2924731 3099656 3124592 2651942 2216081 2179783 3412753 4557498 3963126 3773092
15131 3773092 3887962 4492002 4219323 3592295 3448614 3623281 4047936 4052705 3336202 2999744
15121 2999744 3001601 3372981 3255977 2787555 3191931 2641326 2790107 3188219 3486535 2921921
15111 2921921 3126596 3606689 3214502 3271406 2695646 3147604 3675952 3940415 4347819 3891949
15101 3891949 4149604 4033429 3954353 3895278 4144011 3831097 3682775 3980657 3871966 4372942
15091 4372942 4461346 4019683 3556263 3297633 3308826 3741609 4375490 4276278 3660945 4054047
15081 4054047 4159960 3282611 3341747 4199330 3752573 3205983 3676302 4059505 3474796 3334061
15071 3334061 3878514 3302727 3089436 3869367 4479335 3964666 4377170 3822044 2962057
15062 2962057 3167372 3979685 3427165 2919991 2229945 2314381 2512461 2914420 3649113 3756170
15052 3756170 3156594 3596828 3218254 3217430 4070590 4855853 4603945 3538593 3416219 3902881
15042 3902881 3084115 2866525 3252923 2734298 3659229 3871471 4039071 5121712 4149058
15033 4149058 3587800 3917844 3568052 3869034 4275018 4076684 3571363 3476390 3725638 3527530
15023 3527530 3545215 3537012 2543786 3242295 3182162 3351529 2692197 2950466 3344957 3641383
15013 3641383 4195662 3451856 3293764 2890578 3915884 4512214 3859076 3423343 2785794
15004 2785794 3799144 4666808 4110195 4240106 4321600 4088181 4300297 3903435 3509472
14995 3509472 3164423 3556306 3199410 3065448 4413957 4213064 3623536 3713056 4027217
14986 4027217 4394109 4371010 4155060 4198152 4140427 4100604 3302881 2892045 3367319 3421209
14976 3421209 3506360 2989219 2948180 3078770 2768197 2975333 2895880 3141322 3799096 4148878
14966 4148878 4486015 4340199 4092774 3702594 4193856 4663271 4089486 3085115 3165146
14957 3165146 2694167 2609846 2942030 3492357 3810094 2991952 3246795 3096467 3419542 3231169
14947 3231169 3236123 3490452 4513174 3833563 3668737 2994594 3742755 3864674 3745623 3734822
14937 3734822 3384355 4231351 3862492 4782200 4725528 3547947 2656488 3944645 3602203
14928 3602203 3795068 3335729 3859965 4616365 4004314 4076893 4070096 3670796 4368349 4111142
14918 4111142 3499448 2919693 3140048 3670408 3828965 3866466 2955009 2787231 2774499 2965412
14908 2965412 3582127 4079839 3950896 4114504 3832681 3381719 3307129 2849241 3800481 3526869
14898 3526869 3421283 3727052 3618283 3871082 3361018 2973557 3641162 3058661 3040612 3682645
14888 3682645 3284553 4206581 3992193 3699056 3404047 4126071 3534884 3281457 2823868
14879 2823868 3036055 4198249 4031211 3832724 3616503 4195253 4432904 3504457 2517503
14870 2517503 2160763 2138068 2828252 2706286 3234615 3608995 3711257 4589359 4187895 4057306
14860 4057306 3676521 4104507 4363270 3297906 3728778 3938379 3270371 3303580 3612722
14851 3612722 3751325 3952502 3773259 3651957 4241655 3517328 3399173 3576468 4352554
14842 4352554 4068309 3636653 3503114 3180893 4157109 4366597 4082796 3937715 4499388
14833 4499388 4210939 4629384 4234928 3839173 4144876 3673069 3258680 3528251 3710199
14824 3710199 3372183 4421370 3622013 3966750 3891166 4122370 3637746 3420332 4212631
14815 4212631 3609705 3444384 3562460 3890954 3570438 3111029 3816291 4219557 3859922
14806 3859922 4287463 4156073 4043926 3670667 4004037 4430842 3398327 2969517 4516206
14797 4516206 4931957 4992147 5060368 4689420 4516335 4454342 4343819 4789684 4532841 3743805
14787 3743805 3229662 3444285 3631012 3305594 3729395 4190277 4797958 4174755 3271268
14778 3271268 3653013 3993982 3527053 3703275 3736868 3889421 3538955 3416521 3471430 3449676
14768 3449676 3825358 3597903 3509257 3189432 3648518 4860254 4801079 4580228 4929480 4560174
14758 4560174 4204529 4097140 3579801 3902482 3754201 3335857 4061402 4148074 4070143 3646748
14748 3646748 3688867 3025765 3606697 3916367 3561128 3287338 3025417 3356092 3804090 4112417
14738 4112417 3848139 3082023 3275631 4105846 3073857 3252420 3969216 4002529 3503882
14729 3503882 2866985 2951691 3115737 3075069 3377449 4131115 3933591 3550952 3286204 3137718
14719 3137718 3312256 3706538 3749994 3323700 2973920 3044064 3521744 3657253 4439776 4617330
14709 4617330 3579205 4049525 4339364 3777912 4174101 4039826 3977240 3219699 2600303
14700 2600303 3354064 3974638 4916162 4828110 4331262 4390105 3028409 3017141 3488494 3632657
14690 3632657 3602874 3999233 5155192 4957356 3931702 3716927 3923321 3617928 3297676
14681 3297676 3643462 3423536 3426309 4282611 3680204 3682415 3298052 3120901 3382461 3589854
14671 3589854 3597693 3833243 4442612 4197858 3520764 3874846 4432816 4620344 4176834 3962969
14661 3962969 3763385 3908451 3591912 3792371 4193845 3642768 3266758 3762186 4462830
14652 4462830 3671195 3610832 4087696 4246613 4354448 4539228 3888995 3569292 3660170 3412355
14642 3412355 2720566 2625851 3287341 4085443 4355155 4362741 3892729 3202623 3770317 3779638
14632 3779638 3319124 3758289 4473620 3856167 4211861 4695326 4801012 4477082 4685264
14623 4685264 3340973 2680006 4461031 4466801 3372774 3938766 4741729 4541247 5060431
14614 5060431 4496258 4030388 3657014 3262157 3750815 4011476 4062143 4254678 3971939 3857375
14604 3857375 3706151 3123549 3441826 2876778 2435284 3497926 3650653 3681207 3742505 4439106
14594 4439106 4626049 3890897 3895919 3997376 2956741 3489482 4658841 4632467 3258219
14585 3258219 2953836 3344713 3635838 3698316 3776653 3316488 3199654 3423162 3430915 3598800
14575 3598800 3840078 3502949 3133410 2791935 3151071 3461646 3534084 3385620 2401708 3303346
14565 3303346 3876322 3426995 4013838 4186672 3845723 3189520 3403555 2711595 3427244
14556 3427244 2650018 3046640 2783078 2737332 2539657 2492314 2993145 3260272 4180119 3172362
14546 3172362 3415625 3365362 3658091 3437170 3653907 3295623 3724961 3515707 4881646
14537 4881646 4310358 3139906 3303837 2946240 3198506 3693231 3993990 4722188 4972093
14528 4972093 4993902 4859531 4813833 4154089 3941520 4367526 4380590 4149587 2939607 3069004
14518 3069004 3708168 4317218 4449804 3531541 3293915 3489128 3753851 2854120 3487452
14509 3487452 3368773 3675593 3740590 3468871 4349099 4858696 4693953 3580942 4110048
14500 4110048 3677597 3986808 4498060 4782835 4306683 4257265 4270608 3728645 3537326 2946441
14490 2946441 3748577 4477681 4364420 3688446 3716917 4215674 3900357 3836101 4025889 3917222
14480 3917222 4085051 3647893 3500320 4375750 4461374 3982851 4352901 4253375 3708906 3219517
14470 3219517 2740757 3347106 3728549 3759040 3428844 3425760 4357725 3963975 3763762 3875174
14460 3875174 3751985 3455169 3658380 3675164 4064450 4077306 4112340 3709770 3766997 4230395
14450 4230395 4066394 3628357 3533482 3780771 4256256 5011976 4669681 4843807 4156143 4109070
14440 4109070 4750313 4977389 4732824 4380287 4347099 3853367 3710898 4011380 4290344 4172380
14430 4172380 4167424 4460609 4374412 3658502 3313738 3248626 2999598 3345156 3969188 4178297
14420 4178297 4610658 4044481 3690905 4321115 3740073 4399777 5062671 4748582 3466809
14411 3466809 3452996 4018636 4330973 4450195 4442089 4345007 4477371 3843835 3502253 3729231
14401 3729231 3538268 3381396 2285251 2179195 2952133 2691504 3992696 4171076 3139832
14392 3139832 3261404 3079726 3189702 3785195 3898757 4037189 4152193 4644295 4021895
14383 4021895 3416934 3548082 3172767 3456316 3287089 4306375 4055347 3761961 3448937
14374 3448937 3776598 4082620 3645538 4382151 4702538 4650858 4622660 4472154 3902779 4137438
14364 4137438 4017212 2752049 2433493 3427235 3466188 3492677 3713342 4432958 4092906 4016559
14354 4016559 3473843 3720454 3813326 3867566 3536118 2544547 2431489 2839854 3224018 3758501
14344 3758501 3190101 2923793 3558084 3505488 4566604 3896258 4608588 3872144 3015133
14335 3015133 3570166 3595397 4536691 4977440 3962401 4069401 4459518 4708223 4542152
14326 4542152 4122993 3887629 4327128 3919213 3691236 3869936 3719777 3638646 3508636 3809609
14316 3809609 4347145 5061117 4884331 3315070 2671549 2551979 2239559 3457429 3376276
14307 3376276 3766796 3741205 3610776 4050528 4225640 4529027 4238274 3956637 4399359 4215304
14297 4215304 4390577 4726500 5377553 3952609 3511363 3726097 3636801 4875198 4805307
14288 4805307 4229060 4173685 3850740 3542182 4013339 4322250 4363610 4523124 4260272 3923290
14278 3923290 4222502 4400899 4790969 4663898 5021877 4575630 3205744 3476769 4291590
14269 4291590 3794528 3537550 3157041 4444426 4582727 3895244 3813077 3610133 4517966
14260 4517966 4322152 3246043 3574902 4063466 4369388 4304340 3733077 3862240 3789488 4022390
14250 4022390 3851053 4126579 4439971 4208415 4091323 3061464 3750225 3664262 3970093
14241 3970093 3854829 3699607 4295628 4043418 3572105 3060082 3388221 3738139 3968685
14232 3968685 3994578 3878232 3696653 4125084 4075643 3752667 3742276 2844157 3184979 2975342
14222 2975342 3337444 4044057 4680110 4063030 3954353 4243839 4165048 4867805 5739039 4970192
14212 4970192 3821427 3435579 3931393 4226109 3937168 3866235 4096767 4848797 3835684
14203 3835684 4395402 4279670 3480533 3678677 3882495 4550328 3985183 4847871 5202992
14194 5202992 4637702 4426002 3753927 2893553 3178444 4455334 4238923 4290298 3820293
$$ [...]
##END NTUPLES=NMR SPECTRUM
##END=
