##TITLE=1H_CG-1150-F1
 CDCl3
 8 sc, 
 15.3.2023
##JCAMPDX= 6.0         $$ Bruker NMR JCAMP-DX V2.0
##DATA TYPE= NMR SPECTRUM
##DATA CLASS= NTUPLES
##ORIGIN= UXNMR, Bruker Analytische Messtechnik GmbH
##OWNER= root
$$ XWIN-NMR		Version 3.5
$$ Wed Mar 15 14:32:13 2023 Russian Standard Time (UT+4h)  she@DPX200
##.OBSERVE FREQUENCY= 200.13135
##.OBSERVE NUCLEUS= ^1H
##.ACQUISITION MODE= SIMULTANEOUS
##.ACQUISITION SCHEME= undefined
##.AVERAGES= 8
##.DIGITISER RES= 18
##SPECTROMETER/DATA SYSTEM= spect
##.PULSE SEQUENCE= zg30
##.SOLVENT NAME= DMSO
##.SHIFT REFERENCE= (INTERNAL, DMSO, 0, 15.7535)
##AUDIT TRAIL= $$ (NUMBER, WHEN, WHO, WHERE, WHAT)
$$ ##TITLE= Audit trail, XWIN-NMR		Version 3.5
$$ ##JCAMPDX= 5.01
$$ ##ORIGIN= Bruker BioSpin GmbH
$$ ##OWNER= she
$$ F:/spectra/data/she/nmr/H-F/1/pdata/1/auditp.txt
$$ ##AUDIT TRAIL=  $$ (NUMBER, WHEN, WHO, WHERE, WHAT)
(   1,<2023-03-15 14:30:53.93 +0400>,<she>,<DPX200>,
      <created by zg, POWCHK disabled, PULCHK disabled
       configuration hash MD5:
       00 E9 B6 7A A2 85 ED C7 34 08 36 98 17 FE 4E 26
       data hash MD5: 16K
       68 DC 3B 73 F4 D6 07 35 AC B1 ED DD 6C 30 D7 4A>)
(   2,<2023-03-15 14:30:56.12 +0400>,<she>,<DPX200>,
      <Start of raw data processing
       efp BC_mod = 2 LB = 0.24 FT_mod = 6 PKNL = 1 PHC0 = -19106.72 PHC1 = 9.60074 SI = 16K 
       data hash MD5: 16K
       57 6F 3D 7A 51 47 FE BB B2 FC 64 E3 3D 1C 33 A4>)
(   3,<2023-03-15 14:31:19.84 +0400>,<she>,<DPX200>,
      <pk PHC0 = -0.09817299 PHC1 = 4.200001 
       data hash MD5: 16K
       2B 89 D9 E7 07 2D 8E A3 E5 D4 E7 E5 A5 A4 01 62>)
(   4,<2023-03-15 14:31:23.06 +0400>,<she>,<DPX200>,
      <abs ABSG = 5 
       data hash MD5: 16K
       99 D3 C9 B0 77 4F 37 27 5D 5C FD BE 59 FB 82 D8>)
$$ ##END=
$$ 
$$ hash MD5
$$ 40 01 11 C5 98 48 1F D4 A8 31 4D A0 42 AC B3 CB
##$RELAX= 
##$RELAX= 
##$RELAX= 
##$RELAX= 
##$RELAX= 
##$RELAX= 
$$ Bruker specific parameters
$$ --------------------------
##$DU= <F:/spectra>
##$EXPNO= 1
##$NAME= <H-F>
##$PROCNO= 1
##$TYPE= <nmr>
##$USER= <she>
##$AMP= (0..31)
100 100 100 100 100 100 100 100 100 100 100 100 100 100 100 100 100 100 
100 100 100 100 100 100 100 100 100 100 100 100 100 100 
##$AQSEQ= 0
##$AQ_mod= 1
##$AUNM= <au_zg>
##$AUTOPOS= <>
##$BF1= 200.13
##$BF2= 200.13
##$BF3= 200.13
##$BF4= 200.13
##$BF5= 200.13
##$BF6= 200.13
##$BF7= 200.13
##$BF8= 200.13
##$BYTORDA= 1
##$CFDGTYP= 0
##$CFRGTYP= 5
##$CHEMSTR= <none>
##$CNST= (0..31)
1 1 145 1 1 1 1 1 1 1 1 1 1 1 1 1 1 1 1 1 1 1 1 1 1 1 1 1 1 1 1 1 
##$CPDPRG= <>
##$CPDPRG1= <>
##$CPDPRG2= <>
##$CPDPRG3= <>
##$CPDPRG4= <mlev>
##$CPDPRG5= <mlev>
##$CPDPRG6= <mlev>
##$CPDPRG7= <mlev>
##$CPDPRG8= <mlev>
##$CPDPRGB= <>
##$CPDPRGT= <>
##$D= (0..31)
0 1.2 0 0 0 0 0 0 0 0.06 0 0.03 0 0 0 0 0.0002 0 0 0 0 0 0 0 0 0 0 0 0 
0 0 0 
##$DATE= 1678876253
##$DBL= (0..7)
120 120 120 120 120 120 120 120 
##$DBP= (0..7)
150 150 150 150 150 150 150 150 
##$DBP07= 0
##$DBPNAM0= <>
##$DBPNAM1= <>
##$DBPNAM2= <>
##$DBPNAM3= <>
##$DBPNAM4= <>
$$ [...]
##$SUBNAM3= <"">
##$SUBNAM4= <"">
##$SUBNAM5= <"">
##$SUBNAM6= <"">
##$SUBNAM7= <"">
##$SUBNAM8= <"">
##$SUBNAM9= <"">
##$SW= 18.05172834244
##$SWIBOX= (0..15)
0 0 2 0 0 0 0 0 0 0 0 0 0 0 0 0 
##$SW_h= 3612.71676300578
##$TD= 16384
##$TD0= 1
##$TE= 0
##$TE2= 300
##$TE3= 300
##$TEG= 300
##$TL= (0..7)
0 120 120 120 120 120 120 120 
##$TP= (0..7)
150 150 150 150 150 150 150 150 
##$TP07= 0
##$TPNAME0= <>
##$TPNAME1= <>
##$TPNAME2= <>
##$TPNAME3= <>
##$TPNAME4= <>
##$TPNAME5= <>
##$TPNAME6= <>
##$TPNAME7= <>
##$TPOAL= (0..7)
0.5 0.5 0.5 0.5 0.5 0.5 0.5 0.5 
##$TPOFFS= (0..7)
0 0 0 0 0 0 0 0 
##$TUNHIN= 0
##$TUNHOUT= 0
##$TUNXOUT= 0
##$USERA1= <user>
##$USERA2= <user>
##$USERA3= <user>
##$USERA4= <user>
##$USERA5= <user>
##$V9= 5
##$VALIST= <valist>
##$VCLIST= <CCCCCCCCCCCCCCC>
##$VD= 0
##$VDLIST= <DDDDDDDDDDDDDDD>
##$VPLIST= <PPPPPPPPPPPPPPP>
##$VTLIST= <TTTTTTTTTTTTTTT>
##$WBST= 1024
##$WBSW= 4
##$XGAIN= (0..3)
0 0 0 0 
##$XL= 0
##$YL= 0
##$YMAX_a= 810493
##$YMIN_a= -844228
##$ZGOPTNS= <>
##$ZL1= 120
##$ZL2= 120
##$ZL3= 120
##$ZL4= 120
##$ABSF1= 15.73256
##$ABSF2= -2.319289
##$ABSG= 5
##$ABSL= 3
##$ALPHA= 0
##$AQORDER= 0
##$ASSFAC= 0
##$ASSFACI= 0
##$ASSFACX= 0
##$ASSWID= 0
##$AUNMP= <proc_1d>
##$AZFE= 0.1
##$AZFW= 0.1
##$BCFW= 0
##$BC_mod= 2
##$BYTORDP= 0
##$COROFFS= 0
##$CY= -3
##$DATMOD= 1
##$DC= 0
##$DFILT= <>
##$DTYPP= 0
##$F1P= 0
##$F2P= 0
##$FCOR= 1
##$FTSIZE= 16384
##$FT_mod= 6
##$GAMMA= 0
##$GB= 0
##$INTBC= 1
##$INTSCL= 3.70164e-10
##$ISEN= 128
##$LB= 0.24
##$LEV0= 0
##$LPBIN= 0
##$MAXI= 10000
##$MC2= 0
##$MEAN= 0
##$ME_mod= 0
##$MI= 1.114404
##$NCOEF= 0
##$NC_proc= -5
##$NLEV= 6
##$NOISF1= 3.799351
##$NOISF2= 2.8
##$NSP= 0
##$NTH_PI= 0
##$NZP= 0
##$OFFSET= 15.7535
##$PC= 1
##$PHC0= -19106.82
##$PHC1= 13.80074
##$PH_mod= 1
##$PKNL= yes
##$PPARMOD= 0
##$PSCAL= 0
##$PSIGN= 0
##$REVERSE= no
##$SF= 200.130003610007
##$SI= 16384
##$SIGF1= 3
##$SIGF2= 2
##$SINO= 5.538805
##$SIOLD= 16384
##$SREGLST= <1H.CDCl3>
##$SSB= 0
##$STSI= 16384
##$STSR= 0
##$SW_p= 3612.71676300578
##$SYMM= 0
##$S_DEV= 0
##$TDeff= 16384
##$TDoff= 0
##$TI= <>
##$TILT= no
##$TM1= 0
##$TM2= 0
##$TOPLEV= 0
##$USERP1= <user>
##$USERP2= <user>
##$USERP3= <user>
##$USERP4= <user>
##$USERP5= <user>
##$WDW= 1
##$XDIM= 16384
##$YMAX_p= 286855493
##$YMIN_p= -155061
$$ End of Bruker specific parameters
$$ ---------------------------------
##NTUPLES= NMR SPECTRUM
##VAR_NAME=  FREQUENCY,     SPECTRUM/REAL,   SPECTRUM/IMAG
##SYMBOL=    X,             R,               I
##VAR_TYPE=  INDEPENDENT,   DEPENDENT,       DEPENDENT
##VAR_FORM=  AFFN,          ASDF,            ASDF
##VAR_DIM=   16384,         16384,           16384
##UNITS=     HZ,            ARBITRARY UNITS, ARBITRARY UNITS
##FACTOR=    0.220516191357247, 1,           1
##FIRST=     3152.7480088165, 0,             0
##LAST=      -459.968754189276, 0,           0
##MIN=       -459.968754189276, -155061,     0
##MAX=       3152.7480088165, 286855493,     0
$$ Real data points
##PAGE= N=1
##DATA TABLE= (X++(R..R)), XYDATA
$$ [...]
5799I1562n6566k2935L3795j1134O1144L7700q4218j8806L2758O540L5994J3232
$$ 91562 34996 12061 45856 34722 95866 133566 49348 30542 63300 69840 105834 119066
5787A19066j7504j0386r637k5793J7260J2166L7291J0134k6168j3736j3847K3475
$$ 119066 101562 91176 81539 55746 73006 85172 122463 132597 106429 92693 78846 102321
5775A02321k4135J1694j4619j7710Q131j4817N6239j7145k1696M3689k7347j1451
$$ 102321 78186 89880 75261 57551 65682 50865 107104 89959 68263 111952 84605 73154
5763G3154J1375m676P8710m307j8508k3173l4776j8062k4743k815L1135l1091
$$ 73154 84529 79853 158563 154256 135748 112575 77799 59737 34994 32179 63314 32223
5751C2223J7621N5906J9380j4585j0315O36k3092J7448J6158K4892m8872m1133
$$ 32223 49844 105750 125130 110545 100230 100866 77774 95222 111380 136272 87400 46267
5739D6267N3429K6525m334r891n2341m473l650L6700M6457Q938p6251l9899O8761
$$ 46267 99696 126221 121887 111996 59655 55182 51532 88232 134689 143627 67376 27477 96238
5726I6238J9514k0555j2192J4311j862r028p929J7861J2617l7001J0474L9768
$$ 96238 115752 95197 83005 97316 95454 86426 78497 96358 108975 71974 82448 122216
5714A22216j5579l4237j063N3679Q044j0018Q97j7092K199k5048J9574K1685j7347
$$ 122216 106637 72400 71337 125016 133060 123042 123939 106847 109046 83998 103572 125257 107910
5701A07910k7595l483O359K2073l3548J5593k0655r727L299L015K500P086Q086
$$ 107910 80315 76832 83191 105264 71716 87309 66654 56927 60226 63241 65741 72827 80913
5688H0913M434L0204K6957K2971l7127p409L9276j3950j1411J2626K1558j0287
$$ 80913 85347 115551 142508 165479 128352 120943 160219 146269 134858 147484 169042 158755
5676A58755k7728k379K9560j3393l8114J0761m7454l5995k2003L5811N3031J8097
$$ 158755 131027 128648 158208 144815 106701 117462 70008 34013 12010 47821 100852 118949
5664A18949l943J741P606k0351o999j9690M1820N7495k4045j9531n7088p404M275
$$ 118949 115006 116747 124353 104002 97003 77313 119133 176628 152583 133052 75964 68560 72835
5651G2835m906J4512R037O519M2400q715J2813K5321j0485k9227m4326K8900L577
$$ 72835 67929 82441 91478 97997 140397 131682 144495 169816 159331 130104 85778 114678 118255
5638A18255M774Q116m4134l7538L0615N6317p24P980L2860L7137k345k9327l4975
$$ 118255 123029 131145 87011 49473 80088 136405 135681 143661 176521 213658 211313 181986 147011
5625A47011p89R365J0921N8533l7405j187L7194q5365j2062L2005r375p601J8307
$$ 147011 146222 155587 166508 225041 187636 186449 223643 138278 126216 158221 148846 141245 159552
5612A59552m3405O2745K1592m3968M7900L7514j4092j4493K9094o115k5714P881
$$ 159552 116147 178892 200484 156516 204416 241930 227838 213345 242439 236324 210610 218491
5600B18491j3217k6016L8954L7209M1016m6445j8617J5342l9148M2571J6815n917
$$ 218491 205274 179258 218212 255421 296437 249992 231375 246717 207569 250140 266955 261038
5588B61038Q891l3496J2272j3201M3185M748k8356N632l7233k2856N8664M2114
$$ 261038 269929 236433 248705 235504 278689 283437 255081 260713 223480 200624 259288 301402
5576C01402P521M0662l351N2432O7031m383J5358M4840M4942n2842j2600J3709
$$ 301402 308923 349585 346234 398666 465697 461314 476672 521512 566454 513612 501012 514721
5564E14721l1476j2675j5505n4679k128O95j612j9748l7926K7366m494R573M8198
$$ 514721 483245 470570 455065 400386 398258 398953 397341 377593 339667 367033 362539 372112 420310
5551D20310q344o71P983m6199n26j1947L3839M7558N0088M1978j4712L126L031
$$ 420310 411966 411295 419278 373079 372553 360606 394445 442003 492091 534069 519357 522483 525514
5538E25514j9550K3855o7410J0635K6379m4755J4960L675m0623J4343N166n9309
$$ 525514 505964 529819 462409 473044 499423 454668 469628 473303 432680 447023 452189 392880
5526C92880k1894L1125O00q006K401L8300J1169k5272K8836n1257k0444K6352
$$ 392880 370986 402111 402711 394705 397106 435406 446575 421303 450139 398882 378438 404790
5514D04790P1284J178M671n9563l0481n865J1459Q617J0786L0799N3234O956q150
$$ 404790 476074 477252 481923 422360 391879 386014 397473 406090 416876 447675 500909 507865 499715
5501D99715q221p7317j2413p864M0604m2123j9237J4674K5291L2324k1725n8220
$$ 499715 491494 414177 401764 393900 434504 392381 373144 387818 413109 445433 423708 365488
5489C65488k6336L1216M3775L5535j2186n274K8677k9007R795J8064L881J4243
$$ 365488 339152 370368 414143 449678 437492 432218 460895 431888 441683 459747 463628 477871
5477D77871j6484r948N655k4536L0865O752m0243n6348J4913L4697q575K6R02
$$ 477871 461387 451439 457094 432558 463423 470175 429932 373584 388497 423194 414619 414645 415547
5464D15547N5736j4299l9701J6018l4492M2433J7311k6255r205p930M2504k0872
$$ 415547 471283 456984 417283 433301 398809 441242 458553 432298 423093 415163 457667 436795
5452D36795j6274j9596M7606J1417j7706N0378M1790j8869l4375K152N3658J1696
$$ 436795 420521 400925 448531 459948 442242 492620 534410 515541 481166 483318 536976 548672
5440E48672J0359L246o877L0721K1910L9864L2858P941k0416N4964M3824P1990
$$ 548672 559031 562277 555400 586121 608031 647895 680753 688694 668278 723242 767066 839056
5428H39056L943m414M5832J1162J04802q814K5862K2276O328j216j6717K1866
$$ 839056 842999 838585 884417 895579 1000381 991567 1017429 1039705 1046033 1044817 1028100 1049966
5416A049966M3987L4359j8530n0994M9038K1729K9552l3106j2007Q5564o4040
$$ 1049966 1093953 1128312 1109782 1058788 1107826 1129555 1159107 1126001 1113994 1199558 1135518
5405A135518n2454M928k7667l9395J7191k8851l6250m5177J6659j7613n2798J0456
$$ 1135518 1083064 1087992 1060325 1020930 1038121 1009270 973020 927843 944502 926889 874091 884547
5393H84547o3385L9443K2514P911J1830M438m7636p9207J0525Q414m5297j3307
$$ 884547 821162 860605 883119 891030 902860 907298 859662 780455 790980 799394 754097 740790
5381G40790j4820m286M8430k3514r531l180m5649l9977J607L9871K3641J2842
$$ 740790 725970 721684 770114 746600 737069 733889 688240 648263 649870 689741 713382 726224
5369G26224Q870j9194M5536K0722M481N172J0713j1255L2272l5771p0152j5434
$$ 726224 735094 715900 761436 782158 786639 791811 802524 791269 823541 787770 717618 702184
5357G02184l068N2645k875p033Q4608M452j8591J4429n1473j3138O6158J0219
$$ 702184 699116 751761 748886 741853 826461 830913 812322 826751 775278 762140 828298 838517
5345H38517J562K908o177M382N4778N8890L0471Q401L8783L8164O231O0836r490
$$ 838517 840079 842987 836810 841192 895970 954860 985331 993732 1032515 1070679 1076910 1137746 1128256
5332A128256j8734J3331k5888k2213O5356R122j8308K877j6203p7809j08617k1224
$$ 1128256 1109522 1122853 1096965 1074752 1140108 1149230 1130922 1133799 1117596 1039787 931170 909946
5320I09946l0888M4458J9763r701k3620l0915N6558R4126M0159R3294K8720l3084
$$ 909946 879058 923516 943279 933578 909958 879043 935601 1029727 1069886 1163180 1191900 1158816
5308A158816o160j4908M1240p5952K7684J8659l5733K1763n7276r453l7283o6012
$$ 1158816 1152656 1137748 1178988 1103036 1130720 1149379 1113646 1135409 1078133 1068680 1031397 965385
5296I65385n9290p2367k3111M2973l9008p2702j7026J3989j9697Q772k2968L0507
$$ 965385 906095 833728 810617 853590 814582 741880 724854 738843 719146 727918 704950 735457
5284G35457N266l9737M2728J6723o7896J4890j4553R310k073R099J259J4673K6428
$$ 735457 740723 700986 743714 760437 692541 707431 692878 702188 700115 709214 710473 725146 751574
5271G51574m0439l5238k5879n787n2639j2164j0527K9732o367n305K2861N7218
$$ 751574 711135 675897 650018 644231 591592 579428 568901 598633 592266 586961 609822 667040
5259F67040j4850K6229l9990j8477J4895k3951K359o8n315O421M7056m0020L3995
$$ 667040 652190 678419 638429 619952 634847 610896 613255 613187 607872 614293 661349 621329 655324
5246F55324K1616J2337L1158p674K1266m7666k5193m0256L3231l5442m5507n2047
$$ 655324 676940 689277 720435 712761 734027 686361 661168 620912 654143 618701 573194 521147
5234E21147L9256M1543J2550M365k0374l5065K8665K9734N301L4849J76R275J4725
$$ 521147 560403 601946 614496 618861 598487 563422 592087 621821 627122 661971 662147 671422 686147
5221F86147m9276L9905O444N389J0846L505n3858k1761K3013K7480J7105o168
$$ 686147 636871 676776 683220 688609 699455 702960 649102 627341 650354 677834 694939 688771
5209F88771l0641p0394N436R170o534m838L2728J4880l0045M3070j804o5834Q2912
$$ 688771 658130 587736 593172 602342 595808 590970 623698 638578 608533 651603 649799 583965 666877
5196F66877m5974n422J9830J0656L5818O264o7704j0746R091l3277M4608L1519
$$ 666877 620903 615481 635311 645967 681785 688049 620345 609599 618690 585413 630021 661540
5184F61540K8840K8692p0366l5256M4068m5383K508O4458O228K1833R001l207
$$ 661540 690380 719072 648706 613450 657518 612135 614643 679101 685329 707162 716163 712956
5172G12956J4483k6989r361P808N3390K4612L4410J8254j6105N9772L1674K2307
$$ 712956 727439 700450 691089 698897 752287 776899 811309 829563 813458 873230 904904 927211
5160I27211M950L5067M2327J3525r3633k165j6205M751j1618J5465j4972l409
$$ 927211 932161 967228 1009555 1023080 929447 927282 911077 915828 904210 919675 904703 901294
5148I01294L1067M3612J2412k8321l429k2820l7354R264L7371L8788Q5410n4326
$$ 901294 932361 975973 988385 960064 956635 933815 896461 905725 943096 981884 1067294 1012968
5136A012968k5543Q912l0476M989k8387k594j108J1177n6954k2796O6075j3871
$$ 1012968 987425 996337 965861 970850 942463 939869 938761 949938 892984 870188 936263 922392
5124I22392k0102L8530K587j09556j2170L8319L7424l4430k1253L6045o1765l213
$$ 922392 902290 940820 943407 833851 821681 860000 897424 862994 841741 877786 816021 812808
5112H12808J4381m630N1065O0780n1970k4061M654N2787K0802m3882L277n851
$$ 812808 827189 822559 873624 934404 882434 858373 863027 915814 936616 892734 896011 890160
5100H90160O239L6069L1283k2193p6167J4299N4205k7618l6862J0819j0796m4739
$$ 890160 896399 932468 963751 941558 865391 879690 933895 906277 869415 880234 869438 824699
5088H24699N9615N2774j0929j9529k0765L6476K1752K1088j1833k4307k382J2915
$$ 824699 884314 937088 926159 906630 885865 922341 944093 965181 953348 929041 926659 939574
5076I39574N9482j3802J9371m585k5760j9480j9418O7017k5907l5047l6403l0036
$$ 939574 999056 985254 1004625 1000040 974280 954800 935382 1002399 976492 941445 905042 875006
5064H75006O2682j1922P9716K4783O8O062L6440J6108J9891K0921N9548K6072
$$ 875006 937688 925766 1005482 1030265 1030333 1036395 1072835 1088943 1108834 1129755 1189303 1215375
5052A215375j1668L5100J9645n7804l9156j3081L2153L8293j1649l3514n5974
$$ 1215375 1203707 1238807 1258452 1200648 1161492 1148411 1180564 1218857 1207208 1173694 1117720
5041A117720m4272L6266L6467p5329J5444L6649l6924k3735j1690o237l0834J3006
$$ 1117720 1073448 1109714 1146181 1070852 1086296 1122945 1086021 1062286 1050596 1044359 1013525 1026531
5029A026531j819q9476J8305K7645J385n1920J5835J5273j7649K1074k2722j4978
$$ 1026531 1024712 935236 953541 981186 982571 930651 946486 961759 944110 965184 942462 927484
5017I27484k6424j4751l405Q1309j2587q6753m2122L457l267L0511j2456J2420
$$ 927484 901060 886309 882904 964213 951626 864873 822751 826208 822941 853452 840996 853416
5005H53416p707J715O424p8721L3461L9780k7088m998R040n7871k9549l0206R336
$$ 853416 845709 847424 853848 775127 808588 848368 821280 816282 825322 767451 737902 707696 717032
4992G17032N926J318M7880k4947l2862K4098O954J0123K9426n9333P2707j3491
$$ 717032 722958 724276 772156 747209 714347 738445 745399 755522 784948 725615 798322 784831
4980G84831j1662O3471j094j6217j0508l3116J8868K6453p2503N1425k1807l4989
$$ 784831 773169 836640 835546 819329 808821 775705 794573 821026 748523 799948 778141 743152
4968G43152j0932L3986J788J7891k3635o1136P1107J9065o1382J7559j4183L9879
$$ 743152 732220 766206 767994 785885 762250 701114 772221 791286 729904 747463 733280 773159
4956G73159q494R948J6753j1127J8301K4567N4919j1172N553j5095q357L8158
$$ 773159 764665 774613 791366 780239 798540 823107 878026 866854 872407 857312 848955 887113
4944H87113N662K2110J4265J8719J6408l4895L818J8887M9776n310J4023N7328
$$ 887113 892775 914885 929150 947869 964277 929382 933200 952087 1001863 996553 1010576 1067904
4932A067904M5895N2691K2842K2810p015K0247K5211j9068K0387J02983l185j1074
$$ 1067904 1113799 1166490 1189332 1212142 1205127 1225374 1250585 1231517 1251904 1354887 1351702 1340628
4920A340628L8932P5418N6861P1767K2448n029Q6355N9501P449M4437O1047O7526
$$ 1340628 1379560 1454978 1511839 1583606 1606054 1601025 1687380 1746881 1754330 1798767 1859814 1927340
4908A927340M4774P047K5933N7153L3557K1454N1664J7014J7124L5675O2347L5945
$$ 1927340 1972114 1979161 2005094 2062247 2095804 2117258 2168922 2185936 2203060 2238735 2301082 2337027
4896B337027J3464M5727J3429k1856L193P0948N1928j6718j7258O8883O9578N3081
$$ 2337027 2350491 2396218 2409647 2387791 2390984 2461932 2513860 2497142 2479884 2548767 2618345 2671426
4884B671426L2299N6447N6036L8407M0319L0473m1551N9344L4420N2797J08431
$$ 2671426 2703725 2760172 2816208 2854615 2894934 2925407 2883856 2943200 2977620 3030417 3138848
4873C138848j3119J6333K9897K7937P2419P2723M2812l8987L5257P7175j636K8289
$$ 3138848 3125729 3142062 3171959 3199896 3272315 3345038 3387850 3348863 3384120 3461295 3459659 3487948
4861C487948M3365L1108m770O9832O0801O4774Q765N06M7748M7485P0653q968
$$ 3487948 3531313 3562421 3557651 3627483 3688284 3753058 3761823 3762329 3810077 3857562 3928215 3919247
4849C919247k9110L9244j4056N1693L5500O0579M0814q217L3375M8572M1941P6125
$$ 3919247 3890137 3929381 3915325 3967018 4002518 4063097 4103911 4095694 4129069 4177641 4219582 4295707
4837D295707Q346l008K597L5000k018m2243m676R4130j1187l1956m1783M2330
$$ 4295707 4304053 4301045 4303642 4338642 4336624 4294381 4289705 4383835 4372648 4340692 4298909 4341239
4825D341239M417l8474R537l5555m4829l4825J4114J6930j8166o0185l3019o4894
$$ 4341239 4345656 4307182 4316719 4281164 4236335 4201510 4215624 4232554 4214388 4154203 4121184 4056290
4813D056290K7480K4070q603q194r0658q468O24k585J025J3799m7179M809j6765
$$ 4056290 4083770 4107840 4099237 4091043 4000385 3991917 3992541 3989956 3990981 4004780 3957601 3962410 3945645
4800C945645l9435k8885l692l8029j893M8997J2526k6090q016K7464k644P243
$$ 3945645 3906210 3877325 3873633 3835604 3833711 3882708 3895234 3869144 3861128 3888592 3885948 3893191
4788C893191K955J1949j4277J1196J1907N802Q559M4279l4159L3699j586k647
$$ 3893191 3896146 3908095 3893818 3905014 3916921 3922723 3931282 3975561 3941402 3975101 3973515 3970868
4776C970868k3153O7023P803l8976r939n3602p0740K2666L583J3662l3727j8074
$$ 3970868 3947715 4014738 4022541 3983565 3973626 3920024 3849284 3871950 3875533 3889195 3855468 3837394
4764C837394j4460k5081n480K33J6306m2311k2734N4600m7597r903N6351L1486
$$ 3837394 3822934 3797853 3792373 3792606 3808912 3766601 3743867 3798467 3750870 3740967 3797318 3828804
4752C828804N3340K9624M8275R7300P7300J48412K00819J84494K13681K17038
$$ 3828804 3882144 3911768 3960043 4057343 4134643 4283055 4483874 4668368 4882049 5099087
4742E099087L18674L59708L99711N07593O40568P01493Q21897R87538J099490
$$ 5099087 5417761 5777469 6177180 6684773 7325341 8026834 8848731 9836269 10935759
4733A0935759J119009R53083N35933J54372k55496o83993r93945j140529j155984
$$ 10935759 12054768 13007851 13543784 13698156 13442660 12758667 11764722 10624193 9468209
4724I468209j044356r67933p62071n57518m98252m65114l44536l08655k27441
$$ 9468209 8423853 7455920 6693849 6136331 5638079 5172965 4828429 4519774 4292333
4715D292333k44738k18925j14277j80031q5017j03760q5664n9095l0481j8798
$$ 4292333 4047595 3828670 3714393 3534362 3449345 3345585 3259921 3200826 3170345 3151547
4705C151547n1545O935k7712M4721L9162n26p239m8957r348p1242o1044K2069
$$ 3151547 3100002 3106937 3079225 3123946 3163108 3162582 3155343 3106386 3097038 3025796 2964752 2986821
4693B986821O5215m0099M0186O894M6358R7955M1907K0309J22204M9360Q3681
$$ 2986821 3052036 3011937 3052123 3059017 3105375 3203330 3245237 3265546 3387750 3437110 3520791
4682C520791J63055J35484J10118J24038J36123J55004K60348K92200L97871L50067
$$ 3520791 3683846 3819330 3929448 4053486 4189609 4344613 4604961 4897161 5295032 5645099
4672E645099M02141N98092P15044P81244R55541J046911J079070J009441O77057
$$ 5645099 6047240 6645332 7360376 8141620 9097161 10144072 11223142 12232583 12909640
4663A2909640L15240n9879n30389q10925j001414j092543j164467r73255q15970
$$ 12909640 13224880 13165001 12634612 11823687 10822273 9729730 8565263 7592008 6776038
4654F776038o31226m51286l52107j42289j91500k04847k37594k02019k44019l48293
$$ 6776038 6144812 5693526 5341419 5199130 5007630 4802783 4565189 4363170 4119151 3770858
4644C770858l14405k41523k30551k25844j55535j06168j24332j41125j16284l6859
$$ 3770858 3456453 3214930 2984379 2758535 2603000 2496832 2372500 2231375 2115091 2078232
4634B078232o0054o8083q6601j24436Q888n9354o514m2288p8514m8756l7756r7127
$$ 2078232 2018178 1950095 1863494 1739058 1747946 1688592 1682078 1639790 1561276 1512520 1474764 1377637
4622A377637k9188M9043k4797j8599l4336p8313k7216m9530n153R964m6696L1965
$$ 1377637 1348449 1397492 1372695 1354096 1319760 1241447 1214231 1164701 1159548 1169512 1122816 1154781
4610A154781k803p0697Q049m5191K134K1209k1341k219R032J260N817K4867L4627
$$ 1154781 1151978 1081281 1089330 1044139 1046273 1067482 1046141 1043922 1052954 1054214 1060031 1084898 1119525
4597A119525n9522q4797q764P0371L659J3384k7271m5916P16L9121o0865l7331
$$ 1119525 1060003 975206 966442 1036813 1040472 1053856 1026585 980669 981385 1020506 959641 922310
4585I22310j7487L332L759L7250J9644m458J0864n8012J3313l2698Q5124J5007
$$ 922310 904823 908155 911914 949164 968808 964350 975214 917202 930515 897817 982941 997948
4573I97948J8251o2377l7136p095m221P36J0708m1536L5643Q7127R408n5339L2316
$$ 997948 1016199 953822 916686 909591 905370 906106 916814 875278 910921 998048 1007456 952117 984433
4560I84433r139J7294r399k2172K3696l0863j4156K1818J1035M8940j6138l0747
$$ 984433 975294 992588 983189 961017 984713 953850 939694 961512 972547 1021487 1005349 974602
4548I74602l087L0258L8932J3975P248m3758N3812M1200J9138j0634k6029L7146
$$ 974602 971515 1001773 1040705 1054680 1061928 1018170 1071982 1113182 1132320 1121686 1095657 1132803
4536A132803L6926L9921j106O692R6065J5877k4111L2647m2672l918k1497j0412
$$ 1132803 1169729 1209650 1208544 1215236 1311301 1327178 1303067 1335714 1293042 1289124 1267627 1257215
4524A257215N2087o78l5823O715N3090J4140j8207K9893j190k3592r742O0095
$$ 1257215 1309302 1308624 1272801 1279516 1332606 1346746 1328539 1358432 1357242 1333650 1323908 1384003
4512A384003K0720J5766K5174m5955P906L807J9660J5394j5214j0292L4471k3170
$$ 1384003 1404723 1420489 1445663 1399708 1407614 1411421 1431081 1446475 1431261 1420969 1455440 1432270
4500A432270K2750N7218j8960p1962k2012L0056N8999l1167l5422j1204R672L0780
$$ 1432270 1455020 1512238 1493278 1421316 1399304 1429360 1488359 1457192 1421770 1410566 1420238 1451018
4488A451018j0841j4095j7183M818J7064J5375K9330k0892L2708J7418L8861N9234
$$ 1451018 1440177 1426082 1408899 1413717 1430781 1446156 1475486 1454594 1487302 1504720 1543581 1602815
4476A602815J9631N968O6948J899J0355N9367J1633L2939j713M1224J18111K7915
$$ 1602815 1622446 1628414 1695362 1697261 1707616 1766983 1778616 1811555 1809842 1851066 1969177 1997092
4464A997092M1017P9571J12902J29129P1679N005R2311M9348K6759L1175p0996
$$ 1997092 2038109 2117680 2230582 2359711 2431390 2436395 2528706 2578054 2604813 2635988 2564992
4453B564992m1957k0882m8993l2868O513n6925L4210M996n7291R265J0180p367
$$ 2564992 2523035 2502153 2453160 2420292 2426805 2369880 2404090 2409086 2351795 2361060 2371240 2363873
4441B363873J2002J138M0613J4069P3755N0200K3263K1769K9250J0114O9660N1895
$$ 2363873 2375875 2377013 2417626 2431695 2505450 2555650 2578913 2600682 2629932 2640046 2709706 2761601
4429B761601O5479R5929L7251J27978N9219M8870O7777L7528M3763R4449P7802
$$ 2761601 2827080 2923009 2960260 3088238 3147457 3196327 3264104 3301632 3345395 3439844 3517646
4418C517646Q7588P1050R9306L4033j4249K2231P5383L3867L8889K5174R42J35912
$$ 3517646 3605234 3676284 3775590 3809623 3795374 3817605 3892988 3926855 3965744 3990918 3991860 4127772
4406D127772K7516N4650M6065L6535O4456N4960J1939j1540o028K1268Q598J4230
$$ 4127772 4155288 4209938 4256003 4292538 4356994 4411954 4423893 4412353 4406325 4427593 4436191 4450421
4394D450421M3212j3000K3419K4904l5645j339P6204O1595o527O652N0977R7768
$$ 4450421 4493633 4480633 4504052 4528956 4493311 4491972 4568176 4629771 4623244 4629896 4680873 4778641
4382D778641N2317J0778N0569N2619N5442P2877M4420J764N4432P0248M4173N7153
$$ 4778641 4830958 4841736 4892305 4944924 5000366 5073243 5117663 5119427 5173859 5244107 5288280 5345433
4370E345433O4922j1094l839l6271l9012k6010r1205k6362q6295j49857j33921
$$ 5345433 5410355 5399261 5395422 5359151 5320139 5294129 5202924 5176562 5090267 4940410 4806489
4359D806489j15317j09148q3164j28374j40854j04516n2746j21898q3308J212
$$ 4806489 4691172 4582024 4498860 4370486 4229632 4125116 4072370 3950472 3867164 3868376
4349C868376n6356j2704k046k5600N581n145m3501M1576Q046M5286O3729K3647
$$ 3868376 3812020 3799316 3797270 3771670 3777251 3772106 3728605 3770181 3778227 3823513 3887242 3910889
4337C910889J4395N3703N0932r706Q8382P4921K0523K8983j9360n2773j6109k7346
$$ 3910889 3925284 3978987 4029919 4020213 4108595 4183516 4204039 4233022 4213662 4160889 4144780 4117434
4325D117434L4742p3675n3865l0235j7843P915p621o918K017N9543k3804L3962
$$ 4117434 4152176 4078501 4024636 3994401 3976558 3984473 3976852 3969934 3971951 4031494 4007690 4041652
4313D041652J08379P1220J5514J6976P9341J23919P8579O3730L9201P9721J18585
$$ 4041652 4150031 4221251 4236765 4253741 4333082 4457001 4535580 4599310 4638511 4718232 4836817
4302D836817J14397L1987J04048P3820L7065N3954M9505M3831Q2966L5306N3084
$$ 4836817 4951214 4983201 5087249 5161069 5198134 5252088 5301593 5345424 5428390 5463696 5516780
4291E516780L1749o623p2914q066r1953l9616m3670o7527l3290k8740j5234j3241
$$ 5516780 5548529 5541906 5468992 5460926 5368973 5329357 5285687 5218160 5184870 5156130 5140896 5127655
4279E127655k603l9183R858J0160N6851k3037M173q431N2046N4614o911k923K4712
$$ 5127655 5125052 5085869 5095727 5105887 5162738 5139701 5143874 5135443 5187489 5242103 5235192 5232269 5256981
4266E256981M3952q602p933J6168k0593l0433K1432j9j8764r928o8550J6298j0893
$$ 5256981 5300933 5292331 5284398 5300566 5279973 5249540 5270972 5270953 5252189 5242261 5173711 5190009 5179116
4253E179116k9478k4778l2689n0517j2931k6661m5079J1201j5564K484K8695m508
$$ 5179116 5149638 5124860 5092171 5041654 5028723 5002062 4956983 4968184 4952620 4955104 4983799 4979291
4241D979291j4048l3312N6566l3516J4897l4019p6932m1791R997k7982m02J5242
$$ 4979291 4965243 4931931 4988497 4954981 4969878 4935859 4858927 4817136 4827133 4799151 4798749 4813991
4229D813991j5145q7091l2614O5108P375L7045j3716J6025M2841L0005M9571K2051
$$ 4813991 4798846 4711755 4679141 4744249 4751624 4788669 4774953 4790978 4833819 4863824 4913395 4935446
4217D935446M6119L8822N4464J17074J33358R5158P9291N6488O4184J28913M214
$$ 4935446 4981565 5020387 5074851 5191925 5325283 5420441 5499732 5556220 5620404 5749317 5753531
4206E753531o194O6626J1938k8416J05933J27831R7636J14964K1164N8531J16119
$$ 5753531 5747337 5813963 5825901 5797485 5903418 6031249 6128885 6243849 6265013 6323544 6439663
4195F439663P8624Q3705J05467J10207P2883J23782J15189J45003J83224J07805
$$ 6439663 6518287 6601992 6707459 6817666 6890549 7014331 7129520 7274523 7457747 7565552
4185G565552J14279J23154J36072K01082J47707J78525J47387J25352P2334P3032
$$ 7565552 7679831 7802985 7939057 8140139 8287846 8466371 8613758 8739110 8811444 8884476
4175H884476L9606M7407J16344N1385O9227O8181R5154R2682m7366R0434J27744
$$ 8884476 8924082 8971489 9087833 9139218 9208445 9276626 9371780 9464462 9417096 9507530 9635274
4164I635274M1388J2836R0194J40615P8236M6888N6246R6757R1443J44094J86149
$$ 9635274 9676662 9689498 9779692 9920307 9998543 10045431 10101677 10198434 10289877 10433971 10620120
4153A0620120J59409J85802K01466J86129J67591K08160K23064J96782J42051
$$ 10620120 10779529 10965331 11166797 11352926 11520517 11728677 11951741 12148523 12290574
4144A2290574K04828K00590K33352K83952L36714L08082K91887M83413M12343
$$ 12290574 12495402 12695992 12929344 13213296 13550010 13858092 14149979 14633392 15045735
4135A5045735K76944K29021J37763K2677n5433p0649j22956q0316q5215m5945
$$ 15045735 15322679 15551700 15689463 15712140 15656707 15586058 15463102 15382786 15297571 15251626
4125A5251626k3886R681L0714m973N0350J1362R418M0547Q7733L5210J2153R8684
$$ 15251626 15227740 15237421 15268135 15263162 15313512 15324874 15334292 15374839 15462572 15497782 15509935 15608619
4113A5608619M9904M2094R3108K6494N8711N2973K2688P5194Q3799K8828J230
$$ 15608619 15658523 15700617 15793725 15820219 15878930 15931903 15954591 16029785 16113584 16142412 16143642
4102A6143642R7188J18188M3687L1111K5535J23502R1912J20523J17943J23810
$$ 16143642 16240830 16359018 16402705 16433816 16459351 16582853 16674765 16795288 16913231 17037041
4092A7037041J94672J60472P0837J59868J78784K00487J94702K25438K97473K97396
$$ 17037041 17231713 17392185 17463022 17622890 17801674 18002161 18196863 18422301 18719774 19017170
4082A9017170K94618L23777L87589M42715L73719L95719M01464M65803M50752
$$ 19017170 19311788 19635565 20023154 20465869 20839588 21235307 21636771 22102574 22553326
4073B2553326M74884M82092M85357N44753N46744M97651N17950N35060N01896
$$ 22553326 23028210 23510302 23995659 24540412 25087156 25584807 26102757 26637817 27139713
4064B7139713N61646O02725O27050O39517P41848Q96099J007306J027644J226357
$$ 27139713 27701359 28304084 28931134 29570651 30312499 31208598 32215904 33243548 34469905
4055C4469905J348588J584639J719744J990786K312029K553907K846114L236916
$$ 34469905 35818493 37403132 39122876 41113662 43425691 45979598 48825712 52062628
4047E2062628L657102M203831M903724N706757O241035O430087N928192M445223
$$ 52062628 55719730 59923561 64827285 70534042 76775077 83205164 89133356 93578579
4039I3578579J708513j403499l669796n186259n916965n877405n255414m372722
$$ 93578579 95287092 93883593 90213797 85027538 79110573 73233168 67977754 63605032
4031F3605032l471871k802118k107138j574927j160318q53211n54171k53080m9530
$$ 63605032 60133161 57331043 55223905 53648978 52488660 51635449 51081278 50828198 50778668
4022E0778668Q6627K51611L44178M52059N24002P18538R25854J075279J440370
$$ 50778668 50865295 51116906 51461084 51913143 52437145 53155683 54081537 55156816 56597186
4013E6597186J727537J987228K380044K729518L096610L563625M157707M814204
$$ 56597186 58324723 60311951 62691995 65421513 68518123 72081748 76239455 81053659
4005H1053659N592764O210680O381243N944382M428420J569139j808417m266366
$$ 81053659 86646423 92857103 99238346 105182728 109611148 111180287 109371870 105105504
3997A05105504n645110o231571o056746n508895m708752l786714l141340k572244
$$ 105105504 99460394 93228823 87172077 81663182 76954430 73167716 70026376 67454132
3989F7454132k120900j780425j450592j172696r13648o97021n49396n17744n35186
$$ 67454132 65333232 63552807 62102215 60929519 60015871 59318850 58769454 58251710 57716524
3980E7716524n25153n68312n94658p22349p26023o96322o24652n35650m93951
$$ 57716524 57191371 56623059 56028401 55306052 54580029 53883707 53259055 52723405 52229454
3971E2229454m09300l15387k33089j12360j52345k11280k24195l87031n30130
$$ 52229454 51820154 51504767 51271678 51159318 51006973 50795693 50571498 50184467 49654337
3962D9654337o41449q25782q95077r23224r77625j027238j006236j016900r43785
$$ 49654337 49012888 48187106 47292029 46368805 45391180 44363942 43357706 42340806 41397021
3953D1397021r45212r35843q77876p71420o31285o24652n33083l63263k48683
$$ 41397021 40451809 39515966 38638090 37866670 37235385 36610733 36077650 35714387 35465704
3944C5465704j90385j94775k29009k61085l06478k77059l23846k68592k52545
$$ 35465704 35275319 35080544 34851535 34590450 34283972 34006913 33683067 33414475 33161930
3935C3161930j48765o4598q2334j4517o4885r6888j24361k47012l40309l80210
$$ 33161930 33013165 32948567 32866233 32851716 32786831 32689943 32565582 32318570 31978261 31598051
3925C1598051m18094l62066l44405m07508m26252n17382n54225n58860p42341
$$ 31598051 31179957 30817891 30473486 30065978 29639726 29122344 28568119 28009259 27266918
3916B7266918p84205r05234r52332q85256q55353p54801q02913o96777o16331
$$ 27266918 26482713 25577479 24625147 23739891 22884538 22129737 21326824 20630047 20013716
3907B0013716n28885n04410m24178l55945l01705j75336p2154j37481l2717L3952
$$ 20013716 19484831 18980421 18556243 18200298 17898593 17723257 17651103 17513622 17480905 17514857
3897A7514857Q9727R8606J01725J29971R6330J9437k0811j42190k81460l11881
$$ 17514857 17604584 17703190 17804915 17934886 18031216 18050653 18029842 17887652 17606192 17294311
3887A7294311l91060l39938l40690l55728k89676k06624j65757j76574j84210
$$ 17294311 16903251 16563313 16222623 15866895 15577219 15370595 15204838 15028264 14844054
3878A4844054j56763j30743j00317j02798k3701N6359N5547J28175Q5351J5272
$$ 14844054 14687291 14556548 14456231 14353433 14329732 14386091 14441638 14569813 14655164 14670436
3868A4670436J7389p4861j33642j34940m5633l2372p5572k3302K6691J3919J583
$$ 14670436 14687825 14612964 14479322 14344382 14298749 14266377 14190805 14167503 14194194 14208113 14209696
3857A4209696j7628j0557k3325r3941o7808j8267l5822r4322o3785R383k3942
$$ 14209696 14192068 14181511 14158186 14064245 13996437 13978170 13942348 13848026 13784241 13793624 13769682
3846A3769682K7589j904K7897Q9594J00156J71789J65676J98107K55106K56875
$$ 13769682 13797271 13795367 13823264 13912858 14013014 14184803 14350479 14548586 14803692 15060567
3836A5060567M16760M07682L96088N26561N14192N41852N33208N07826M02914
$$ 15060567 15477327 15885009 16281097 16807658 17321850 17863702 18396910 18904736 19307650
3827A9307650K41038R4288k838r8640k31734l22631l43031l20441l28767k46844
$$ 19307650 19548688 19642976 19640138 19541498 19309764 18987133 18644102 18323661 17994894 17748050
3817A7748050j65601j55507n6339q332J3784J35960K08305K65288L37519M11179
$$ 17748050 17582449 17426942 17370603 17362271 17376055 17512015 17720320 17985608 18323127 18734306
3807A8734306M11822N84410O98263O06959N48681N87506M44650K81425J58272
$$ 18734306 19146128 19730538 20428801 21035760 21584441 22171947 22616597 22898022 23056294
3798B3056294k9980j81432j48431j00053m9385N7503P8191K05456K72138L09722
$$ 23056294 23026314 22844882 22696451 22596398 22547013 22604516 22682707 22888163 23160301 23470023
3788B3470023L05723L72719L25440K31157K37251K25102K24620K17656K17239
$$ 23470023 23775746 24148465 24473905 24705062 24942313 25167415 25392035 25609691 25826930
3779B5826930K73199M03053M15205M73313N18001N70471N65248N51077N32109
$$ 25826930 26100129 26503182 26918387 27391700 27909701 28480172 29045420 29596497 30128606
3770C0128606N39480L79078K98863K39830J03585M9580p0794o9941p9801l0000
$$ 30128606 30668086 31047164 31346027 31585857 31689442 31739022 31668228 31598287 31518486 31488486
3760C1488486j06023p1530q1962r7871r0140j35225j05236k3847m219P0103K11498
$$ 31488486 31382463 31310933 31228971 31131100 31040960 30905735 30800499 30776652 30772433 30842536 31054034
3749C1054034K48245L11637N35884N89206P27454P42773R01989J001195J046113
$$ 31054034 31302279 31613916 32149800 32739006 33466460 34209233 35111222 36112417 37158530
3740C7158530J109640J142630J199395J212512J210879J050705R48523R11181
$$ 37158530 38268170 39410800 40610195 41822707 43033586 44084291 45032814 45943995
3732D5943995P99346N69517L48732P8845j36374l14217m25191n57724n13768n54327
$$ 45943995 46743341 47312858 47661590 47740435 47604061 47289844 46864653 46306929 45793161 45238834
3722D5238834m44784m53753m54464l69090l48013l26300l20690l46080k89435
$$ 45238834 44794050 44340297 43885833 43516743 43168730 42842430 42521740 42175660 41886225
3713D1886225k81454k06387l28503l61922l48665k57349k69465l03166l97386
$$ 41886225 41604771 41398384 41069881 40707959 40359294 40101945 39832480 39529314 39131928
3704C9131928m20577l83830m48677m11781m01798l79667l67607l34496m33981
$$ 39131928 38711351 38327521 37878844 37467063 37065265 36685598 36317991 35983495 35549514
3695C5549514m19750m84802n14656n22523n45619n03490m60205m73680m24123
$$ 35549514 35129764 34644962 34130306 33607783 33062164 32558674 32098469 31624789 31200666
3686C1200666m06612l17507k52064k19863j41088o1493j8456N7972J19069J99565
$$ 31200666 30794054 30476547 30224483 30004620 29863532 29802039 29783583 29841555 29960624 30160189
3676C0160189J73509K42026L25993L06751L35976M97414N05192O43721P53805
$$ 30160189 30333698 30575724 30901717 31208468 31544444 32041858 32547050 33190771 33944576
3667C3944576Q56268J064738J243529J336580J546629J698482J819791J933619
$$ 33944576 34800844 35865582 37109111 38445691 39992320 41690802 43510593 45444212
3659D5444212K073319K164351K192513K225922K104072J975988J716353J358642
$$ 45444212 47517531 49681882 51874395 54100317 56204389 58180377 59896730 61255372
3651F1255372R73410N49076J69147j22478l19342m32277m75908l70579k74738
$$ 61255372 62228782 62777858 62947005 62824527 62505185 62072908 61597000 61226421 60951683
3642F0951683k53678k39863k60412l28018n87841r39086j145049j513544j796763
$$ 60951683 60698005 60458142 60197730 59869712 59281871 58342785 57197736 55684192 53887429
3633E3887429k111966k348551k444029k474986k440334k386082k174247j987178
$$ 53887429 51775463 49426912 46982883 44507897 42067563 39681481 37507234 35520056
3625C5520056j746077j649028j422403j215319j093399r25829p95719p27818n34782
$$ 35520056 33773979 32124951 30702548 29487229 28393830 27468001 26672282 25944464 25409682
3616B5409682m31290m26073k47251k33354j55778j54146l7767M1403M8288J25315
$$ 25409682 24978392 24552319 24305068 24071714 23915936 23761790 23724023 23765426 23813714 23939029
3606B3939029J70850K23419K27615K39216K50400K15878J83981J20342Q5900P3285
$$ 23939029 24109879 24333298 24560913 24800129 25050529 25266407 25450388 25570730 25656630 25729915
3596B5729915N6757k4624j6348q5422R976m3461J9370R7940O3292J52550K12184
$$ 25729915 25786672 25762048 25745700 25660278 25670254 25626793 25646163 25744103 25807395 25959945 26172129
3585B6172129K80035L46665M21064M61408N47038O62547P11704Q44951R82584
$$ 26172129 26452164 26798829 27219893 27681301 28228339 28890886 29602590 30447541 31430125
3576C1430125J043192J176879J347885J501790J626618J768297J915282K069891
$$ 31430125 32473317 33650196 34998081 36499871 38126489 39894786 41810068 43879959
3568D3879959K211465K327825K380059K383372K326492K279859K090812J805429
$$ 43879959 46091424 48419249 50799308 53182680 55509172 57789031 59879843 61685272
3560F1685272J554947J204436Q28895M07387k0201l59434p21488j138265j354917
$$ 61685272 63240219 64444655 65273550 65680937 65660736 65301302 64579814 63441549 62086632
3551F2086632j449647j621899j638871j630379j599327j536107j398509j306046
$$ 62086632 60636985 59015086 57376215 55745836 54146509 52610402 51211893 49905847
3543D9905847j126513j002119r11141p62953p29418o90286o16195o10159o49968
$$ 49905847 48779334 47777215 46866074 46103121 45373703 44683417 44067222 43457063 42807095
3534D2807095n82788n75134n75576n56124n02163n51011n69081m83077m18881
$$ 42807095 42224307 41649173 41073597 40517473 40015310 39464299 38895218 38412141 37993260
3525C7993260m78788n28874m54900l64925l89629l41108l83062l09683k17864
$$ 37993260 37514472 36985598 36530698 36165773 35776144 35435036 35051974 34742291 34524427
3516C4524427k04618j72245j59697l2834J182M1685J18580J24282K33850K35743
$$ 34524427 34319809 34147564 33987867 33955033 33956215 33997900 34116480 34240762 34474612 34710355
3506C4710355K90622M70133N27479N80104N67266P96692Q61742R19306J162677
$$ 34710355 35000977 35471110 35998589 36578693 37145959 37942651 38804393 39723699 40886376
3497D0886376J341287J444334J724440J964882K191798K530896K913634L204703
$$ 40886376 42227663 43671997 45396437 47361319 49553117 52084013 54997647 58202350
3489E8202350L688683M160513M581967N028334N504379N931856O168793O424518
$$ 58202350 61891033 66051546 70633513 75661847 81166226 87098082 93266875 99691393
3481I9691393O590439O490532O238304N660271M886696L773525K338862P93787
$$ 99691393 106281832 112772364 119010668 124670939 129557635 133331160 135670022 136463809
3473A36463809q58042k493326l959672n229525o221324o887997p272839p369659
$$ 136463809 135605767 133112441 129152769 123923244 117701920 110813923 103541084 96171425
3465I6171425p261317o967192o554568o108553n568659m984513m421965m022151
$$ 96171425 88910108 81942916 75388348 69279795 63711136 58726623 54304658 50282507
3457E0282507l582608l204006k840534k515765k242003k057706j849866j610150
$$ 50282507 46699899 43495893 40655359 38139594 35897591 33839885 31990019 30379869
3449C0379869j442797j377496j234859j043207j050676q68315p97072q33157p33116
$$ 30379869 28937072 27559576 26324717 25281510 24230834 23362519 22565447 21732290 20999174
3440B0999174n93274n74529n49386n20517m58789m42273l96087l28179l69834
$$ 20999174 20405900 19831371 19281985 18761468 18302679 17860406 17464319 17136140 16766306
3431A6766306k91258k59346k45548j87758k36378j46200k02630j44723j36818
$$ 16766306 16475048 16215702 15970154 15782396 15546018 15399818 15197188 15052465 14915647
3422A4915647j46819j73027j36536j95088k34381j57006j34832j99709k54219
$$ 14915647 14768828 14595801 14459265 14264177 14029796 13872790 13737958 13538249 13284030
3413A3284030j77216k46142k41359k29626k20420j29671j71704j33405j50405
$$ 13284030 13106814 12860672 12619313 12389687 12169267 12039596 11867892 11734487 11584082
3404A1584082q5930j10822n1940m5012q4400n0397o116M3878l7679M5021N6800
$$ 11584082 11498152 11387330 11335390 11290378 11205978 11155581 11149465 11193343 11155664 11200685 11257485
3393A1257485M1853N615O5184J04504J05195R6115O5559J17284M8437J55785J34063
$$ 11257485 11299338 11304953 11370137 11474641 11579836 11675951 11741510 11858794 11907231 12063016 12197079
3382A2197079J31935J54494J18777J64540J82132K40037J44856K03945K34523
$$ 12197079 12329014 12483508 12602285 12766825 12948957 13188994 13333850 13537795 13772318
3373A3772318K22228K85892K86164K88302K30981L08822L10179K68012K48556
$$ 13772318 13994546 14280438 14566602 14854904 15085885 15394707 15704886 15972898 16221454
3364A6221454K77046K08471J90332K08014J63840J97697J22863J16413K09810
$$ 16221454 16498500 16706971 16897303 17105317 17269157 17466854 17589717 17706130 17915940
3355A7915940J81372J92611J96709J90039J83815J93280K02584J69593J30837
$$ 17915940 18097312 18289923 18486632 18676671 18860486 19053766 19256350 19425943 19556780
3346A9556780R6386J27736J98724K05474K10805K96737K95822L20294L71504M28930
$$ 19556780 19653166 19780902 19979626 20185100 20395905 20692642 20988464 21308758 21680262 22109192
3336B2109192M56873N34826O17220O48078P54892P61572Q42412Q05865Q10704
$$ 22109192 22566065 23100891 23718111 24366189 25121081 25882653 26725065 27530930 28341634
3327B8341634Q43173Q12772Q05041P06015P70497P70717P77899P11799P98487
$$ 28341634 29184807 29997579 30802620 31508635 32279132 33049849 33827748 34539547 35338034
3318C5338034R33636R83354J031857J165951J167853J226763J069542J043627
$$ 35338034 36271670 37255024 38286881 39452832 40620685 41847448 42916990 43960617
3310D3960617J028733Q58178P90282O88693N66984N23278M79170L92350L53731
$$ 43960617 44989350 45847528 46637810 47326503 47893487 48416765 48895935 49288285 49642016
3301D9642016M32290M34996L87552M41084M70819M89417N47889N65707N54428
$$ 49642016 50074306 50509302 50896854 51337938 51808757 52298174 52846063 53411770 53966198
3292E3966198N25858N90852N46142N99977O52211P13321P87722R63256J098790
$$ 53966198 54492056 55082908 55629050 56229027 56881238 57594559 58382281 59345537 60444327
3283F0444327J217798J387308J635725J876247K020173K164776K328426K434433
$$ 60444327 61662125 63049433 64685158 66561405 68581578 70746354 73074780 75509213
3275G5509213K395857K418666K306992K118643J872599J616366J358973J106865
$$ 75509213 77905070 80323736 82630728 84749371 86621970 88238336 89597309 90704174
3267I0704174P91690N51415L98815K83125J57295P5077L4263q2709r9712j64034
$$ 90704174 91495864 92047279 92446094 92729219 92886514 92961591 92995854 92913145 92813433 92649399
3257I2649399l11664n12998o72529p79157q86108q95471j027779j075948j011683
$$ 92649399 92337735 91824737 91152208 90373051 89486943 88591472 87563693 86487745 85476062
3248H5476062r25859r53161q35318q01610p68134q57626r07965r32332r94186
$$ 85476062 84550203 83597042 82761724 81960114 81191980 80334354 79426389 78494057 77499871
3239G7499871j024739j055765j029491j031112r13236r32712q57326q60119r04800
$$ 77499871 76475132 75419367 74389876 73358764 72445528 71512816 70655490 69795371 68890571
3230F8890571j002664j105023j274969j503586j632298j909726k001243k193280
$$ 68890571 67887907 66782884 65507915 64004329 62372031 60462305 58461062 56267782
3222E6267782k329178k393870k258121k191943k076022j918695j742438j563107
$$ 56267782 53938604 51544734 49286613 47094670 45018648 43099953 41357515 39794408
3214C9794408j441407j319115j175901j102979r87602q86559q57006q08444p03334
$$ 39794408 38353001 37033886 35857985 34755006 33767404 32880845 32023839 31215395 30512061
3205C0512061n66447n87873n23422m76964m69865m38221k90453k62549k28509
$$ 30512061 29945614 29357741 28834319 28357355 27887490 27449269 27158816 26896267 26667758
3196B6667758j59156j44189m9372p332M7408Q5549P8270Q7174P9619N6264m0488
$$ 26667758 26508602 26364413 26315041 26307709 26355117 26440666 26518936 26606110 26685729 26741993 26701505
3185B6701505n0428p4441j25058j95148k16888j67496k12960j60433j86181k16038
$$ 26701505 26651077 26576636 26451578 26256430 26039542 25872046 25659086 25498653 25312472 25096434
3175B5096434k34744k40416l26398k85500l22764l71123l79496l77074m56454
$$ 25096434 24861690 24621274 24294876 24009376 23686612 23315489 22935993 22558919 22102465
3166B2102465m32759l75595l53396l36801k99275j76117j60237r3872m9399J4739
$$ 22102465 21669706 21294111 20940715 20603914 20304639 20128522 19968285 19874413 19825014 19839753
3156A9839753Q6205J42418J70743K24704K63700L15665L70198M23100M56089N29961
$$ 19839753 19925958 20068376 20239119 20463823 20727523 21043188 21413386 21836486 22292575 22822536
3146B2822536M68971N43479N49738O39468P31158P56657Q28299R22755J028542
$$ 22822536 23291507 23834986 24384724 25024192 25755350 26512007 27340306 28263061 29291603
3137B9291603J115548J147210J236520J317372J359411J399872J464369J401933
$$ 29291603 30407151 31554361 32790881 34108253 35467664 36867536 38331905 39733838
3129C9733838J443396J365717J356530J289584J147121J051896Q37593O78879
$$ 39733838 41177234 42542951 43899481 45189065 46336186 47388082 48225675 48904554
3121D8904554M90726K48244J024j63584l81845n66981o21689o01613o05821o32734
$$ 48904554 49395280 49643524 49644548 49480964 49099119 48532138 47910449 47308836 46703015 46070281
3111D6070281n30287m33006l49493k22691k3793J16742K55805L55363O07678Q30501
$$ 46070281 45539994 45106988 44757495 44534804 44511011 44627753 44883558 45238921 45846599 46677100
3101D6677100R79926J234438J490443J736129J898563K154873K340533K420384
$$ 46677100 47657026 48891464 50381907 52118036 54016599 56171472 58512005 60932389
3093F0932389K533695K548809K489927K300064J956007J600150J019932M03136
$$ 60932389 63466084 66014893 68504820 70804884 72760891 74361041 75380973 75784109
3085G5784109m19322j181642j938991k610669l113883l531646l812262l978629
$$ 75784109 75364787 74183145 72244154 69633485 66519602 62987956 59175694 55197065
3077E5197065l890763l684194l537061l324914k960110k596402k365282k121647
$$ 55197065 51306302 47622108 44085047 40760133 37800023 35203621 32838339 30716692
3069C0716692j872082j643661j528038j445932j228571j126557j028169q84525
$$ 30716692 28844610 27200949 25672911 24226979 22998408 21871851 20843682 19959157
3061A9959157q46528q16265p99917p25635o49966o31792n68521m51686m57233
$$ 19959157 19112629 18296364 17496447 16770812 16120846 15489054 14920533 14468847 14011614
3052A4011614m60496m24491l64426l35069l95364l43068k73861l12341k79658
$$ 14011614 13551118 13126627 12762201 12427132 12031768 11688700 11414839 11102498 10822840
3043A0822840k53129k13940k38925j93508j21988k02989j30093j45178j83497
$$ 10822840 10569711 10355771 10116846 9923338 9801350 9598361 9468268 9323090 9139593
3034I139593j36768n6298j04123r9084j35508j43021j19004r9118j10513j42741
$$ 9139593 9002825 8946527 8842404 8743320 8607812 8464791 8345787 8246669 8136156 7993415
3024G993415p6846j51920j82373j21980n7441r8566j08795r1982o4866j29943
$$ 7993415 7916569 7764649 7582276 7460296 7402855 7304289 7195494 7103512 7038646 6908703
3014F908703q8634o5774p917p7222j53264l2727j22335m2153r606o5976p079k4028
$$ 6908703 6820069 6754295 6746378 6669156 6515892 6483165 6360830 6318677 6309071 6243095 6236016 6211988
3002F211988n9017m5684r9922n0799o0128m5764K5683o6424M586K5489J1602O2061
$$ 6211988 6152971 6107287 6007365 5956566 5896438 5850674 5876357 5809933 5814519 5840008 5851610 5913671
2990E913671M6180J3060L7057K5500N5922R5039L8671J193O2452Q2124J4223p821
$$ 5913671 5959851 5972911 6009968 6035468 6091390 6186429 6225100 6226293 6288745 6370869 6385092 6377271
2978F377271J2253Q9895N8773M8437K9040L3567O3461J9386P5459L4445J7030
$$ 6377271 6389524 6479419 6538192 6586629 6615669 6649236 6712697 6732083 6807542 6841987 6859017
2967F859017M5910J02459Q4137J1385M409N4478O5647R1957P7805O5153J20703
$$ 6859017 6904927 7007386 7091523 7102908 7107317 7161795 7227442 7319399 7397204 7462357 7583060
2956G583060P0115N8700P5389R6023N7434N967Q3872J02305P1025J12482L9522
$$ 7583060 7653175 7711875 7787264 7883287 7940721 7946688 8030560 8132865 8203890 8316372 8355894
2945H355894P9861J14148J84505J63026J50021J44105J76006K06619J60680J68034
$$ 8355894 8435755 8549903 8734408 8897434 9047455 9191560 9367566 9574185 9734865 9902899
2935I902899J15176K12345K17270R6580J72823J62815J71865K10100K16216K24367
$$ 9902899 10018075 10230420 10447690 10544270 10717093 10879908 11051773 11261873 11478089 11702456
2925A1702456K38608K36738K03147K78914K54397K55394K76298K93034L51377
$$ 11702456 11941064 12177802 12380949 12659863 12914260 13169654 13445952 13738986 14090363
2916A4090363K89819L04986L17869L36588L14884L32264M14044M40559M48611
$$ 14090363 14380182 14685168 15003037 15339625 15654509 15986773 16400817 16841376 17289987
2907A7289987M17892N13164N24302M99500N01974N58224M66019N49439N59963
$$ 17289987 17707879 18221043 18745345 19244845 19746819 20305043 20771062 21320501 21880464
2898B1880464N28672M73760N45075N64456N75522O34658O71963P09279P60596
$$ 21880464 22409136 22882896 23427971 23992427 24567949 25202607 25874570 26583849 27344445
2889B7344445Q46302Q56826Q99554R20473J054859J047266J064035J093430J141874
$$ 27344445 28190747 29047573 29947127 30867600 31922459 32969725 34033760 35127190 36269064
2880C6269064J254470J260225J396449J553321J661127J793720J802072J922457
$$ 36269064 37523534 38783759 40180208 41733529 43394656 45188376 46990448 48912905
2872D8912905K005605K124425K196449K352317K598768K855175L193852L659517
$$ 48912905 50918510 53042935 55239384 57591701 60190469 63045644 66239496 69899013
2864F9899013M116547M582284N091962N661941O223357O798669P387623Q011545
$$ 69899013 74015560 78597844 83689806 89351747 95575104 102373773 109761396 117772941
2856A17772941Q854521R608542R811999R397609P855681N150260J769774j476636
$$ 117772941 126627462 136236004 146048003 155445612 163301293 168451553 170221327 168744691
2848A68744691l826857n232483n795418n463483m687917l733549k901196k212894
$$ 168744691 164917834 159685351 153889933 148426450 143738533 140004984 137103788 134890894
2840A34890894j630286j312741q89664n06464k06128K46790P71131J366190K079337
$$ 134890894 133260608 131947867 131058203 130551739 130345611 130592401 131363532 132729722 134809059
2831A34809059K817811L608041M507236N467644O637217Q134751J0022716J2363845
$$ 134809059 137626870 141234911 145742147 151209791 157847008 165981759 176004475 188368320
2823A88368320J4996907J7555299J9309798J9204713J6196373J0016832J207251
$$ 188368320 203365227 220920526 240230324 259435037 275631410 285648242 286855493
2816B86855493q150111j5827561k0683788k2873909k2750944k0964591j8396647
$$ 286855493 278705382 262877821 242194033 219320124 196569180 175604589 157207942
2809A57207942j5754884j3381876j1421868r820137q556557p589178o628571n867074
$$ 157207942 141453058 128071182 116649314 106829177 98272620 90683442 84054871 78187797
2801G8187797n302608m649417m180408l723157l346644l088936k910409k633884
$$ 78187797 72885189 68235772 64055364 60332207 56985563 53896627 50986218 48352334
2793D8352334k431612k331703k140165j957183j839205j663924j463642j413535
$$ 48352334 45920722 43589019 41448854 39491671 37652466 35988542 34524900 33111365
2785C3111365j312225j243655j190023j109225j016349j070522q91176q55260
$$ 33111365 31799140 30555485 29365462 28256237 27239888 26169366 25278190 24422930
2777B4422930q19239q09511p38340o75767o49503o40679n76827n86123o02677
$$ 24422930 23603691 22794180 22055840 21380073 20730570 20089891 19513064 18926941 18324264
2768A8324264n66833o00435m76307m73262l76442m40791m09411l31334l32347
$$ 18324264 17757431 17156996 16680689 16207427 15830985 15390194 14980783 14649449 14317102
2759A4317102k78796k60149l44955l81458l22313l43052l80577l17231l46953
$$ 14317102 14038306 13778157 13433202 13051744 12729431 12386379 12005802 11688571 11341618
2750A1341618k52102k56365l40812k73410k44988k24724k38098k66609k44107
$$ 11341618 11089516 10833151 10492339 10218929 9973941 9749217 9511119 9244510 9000403
2741I000403k09902j80753j52893k15204j80105j99602j30117j52465j82187j67851
$$ 9000403 8790501 8609748 8456855 8241651 8061546 7861944 7731827 7579362 7397175 7229324
2731G229324k08069q9050j39262j17644j34372j16030j44080j19561j34215p7982
$$ 7229324 7021255 6932205 6792943 6675299 6540927 6424897 6280817 6161256 6027041 5949059
2721E949059r5198j73341j00304j05044r4123j63932j03701q4953r6818j6986
$$ 5949059 5853861 5680520 5580216 5475172 5381049 5217117 5113416 5028463 4931645 4914659
2711D914659j35787j31070p0571l1731n2660j30647q5939m06p4462j14940j24325
$$ 4914659 4778872 4647802 4577231 4545500 4492840 4362193 4276254 4275848 4201386 4086446 3962121
2700C962121j03608k9031o9067m8141n0131l3393n3232k3148p2994k6266P777
$$ 3962121 3858513 3829482 3760415 3712274 3662143 3628750 3575518 3552370 3479376 3453110 3460887
2689C460887n6153p7826k0802m8258l6661L464n0554p3071l8874l7643k1516n6831
$$ 3460887 3404734 3326908 3306106 3257848 3221187 3224651 3174097 3101026 3062152 3024509 3002993 2946162
2677B946162M1609j9449l1974J1839r5654m4125K3268m6666j8932k1772k7945
$$ 2946162 2987771 2968322 2936348 2948187 2852533 2808408 2831676 2785010 2766078 2744306 2716361
2666B716361Q95n3698k0875l2299j5853l9623k9243q305j649n8146n2088j4930
$$ 2716361 2717256 2663558 2642683 2610384 2594531 2554908 2525665 2517360 2515711 2457565 2405477 2390547
2654B390547n324k7045J5050K2231l6840K9159L4455J5247L156R6993j7773l4526
$$ 2390547 2385223 2358178 2373228 2395459 2358619 2387778 2422233 2437480 2440636 2537629 2519856 2485330
2642B485330m4787l8212m3614n455r104j00108l8631o5154o8461K4554L2733j5555
$$ 2485330 2440543 2402331 2358717 2353262 2344158 2244050 2205419 2140265 2071804 2096358 2129091 2113536
2630B113536k9468o2415q6070o1167j5586M158m0172m0932l0686J5384J1640r7134
$$ 2113536 2084068 2021653 1935583 1874416 1858830 1862988 1822816 1781884 1751198 1766582 1778222 1681088
2618A681088M2605k6341j4340j5192K8677j2747R710k6161n1126o3833j5786J5870
$$ 1681088 1723693 1697352 1683012 1667820 1696497 1683750 1693460 1667299 1616173 1552340 1536554 1552424
2606A552424j6757K2303L3876j1757J0108M320n9046L157o1447m572J3112M9078
$$ 1552424 1535667 1557970 1591846 1580089 1590197 1594517 1535471 1538628 1477181 1472609 1485721 1534799
2594A534799K9367J3031k2113k7751K8842j5183l7847O600M4522j1985q5014n145
$$ 1534799 1564166 1577197 1555084 1527333 1556175 1540992 1503145 1509745 1554267 1542282 1457268 1452123
2582A452123O0268K4953j9222J9416L6748j6244N8157j9704j1276N4880O2619
$$ 1452123 1512391 1537344 1518122 1537538 1574286 1558042 1616199 1596495 1585219 1640099 1702718
2571A702718P0748L4722o219M5847M1626r2321J4771j1860n6118p6322K6635l7502
$$ 1702718 1773466 1808188 1801969 1847816 1889442 1797121 1811892 1800032 1743914 1667592 1694227 1656725
2559A656725j9571m8432p1020K8788P867r2068n6885L0591Q856L047k4820k1200
$$ 1656725 1637154 1588722 1517702 1546490 1554357 1462289 1405404 1435995 1444851 1447898 1423078 1401878
2547A401878L0722L6330O2784P4759l6697O2525L0481M5372N7256O5192J35295
$$ 1401878 1432600 1468930 1531714 1606473 1569776 1632301 1662782 1708154 1765410 1830602 1965897
2536A965897M7861L1364j953k643r2358o9796m5291j05272j19704j30958l9664
$$ 1965897 2013758 2045122 2043169 2040526 1948168 1878372 1833081 1727809 1608105 1477147 1437483
2525A437483r7089p1499p5934j1743q9716j05469l0280p624l4224m3188k8186
$$ 1437483 1340394 1268895 1192961 1181218 1091502 986033 955753 948129 913905 870717 842531
2514H42531k7818k0863j5642j2979N0369M7553k4845p5732o7812j0471J4111j4843
$$ 842531 814713 793850 778208 765229 815598 863151 838306 762574 694762 684291 698402 683559
2502F83559K5941M866j5355j5669j085m2655o4634k002o7027L041N9936l2049
$$ 683559 709500 714366 699011 683342 682257 639602 574968 572966 505939 508980 568916 536867
2490E36867j7818j3431p901j0714l8562J7321L2778M864j0548m2967k6691M2302
$$ 536867 519049 505618 497717 487003 448441 465762 498540 503404 492856 449889 423198 465500
2478D65500m1345K4415O823j9986J1540K1631M34r363J9546k4160l710L661O010
$$ 465500 424155 448570 455393 435407 446947 468578 469012 459649 479195 455035 451325 454986 460996
2465D60996l9465J989O030r990M1596j1319k3230q427l467k0310O523k0135R135
$$ 460996 421531 423520 429550 419560 461156 449837 426607 418180 414713 394403 400926 380791 389926
2452C89926J1370j3954q727J4695L609j5897n5486J3266M3377m2581P979P850
$$ 389926 401296 387342 378615 393310 396919 381022 325536 338802 382179 339598 347577 355427
2440C55427L045p99j3116J7072l5273m0275q315L662Q4155j574k6653l0935k6458
$$ 355427 358472 357673 344557 361629 326356 286081 277766 281428 365583 364009 337356 306421 279963
2427B79963J1836K2142L128l833M430o344k984k6447K3164j0556k7696k4314l4027
$$ 279963 291799 313941 317069 313236 317666 311322 308338 281891 305055 294499 266803 242489 208462
2414B08462K2899K5733m4209J201m6210M034q695K3143N1328K4827m513j8824
$$ 208462 231361 257094 212885 214086 167876 171910 163215 186358 237686 262513 258000 239176
2402B39176m7317n0081J0335O3070K2201j7886k1567j5236j8826q900N3037M9007
$$ 239176 191859 141778 152113 215183 237384 219498 197931 182695 163869 154969 208006 257013
2390B57013q728k7655P016l0366m1336J4026K0870J1711J2920l4702K9472j2572
$$ 257013 248285 220630 227646 197280 155944 169970 190840 202551 215471 180769 210241 197669
2378A97669n5544K0931O0152M1486J0678q1260m8065N646l9115P523L8619K6546
$$ 197669 142125 163056 223208 264694 275372 194112 146047 151693 112578 120101 158720 185266
2366A85266k1540M3027J0018o6429N5259M3757j4181l1115K3488j652l592K3465
$$ 185266 163726 206753 216771 150342 205601 249358 235177 204062 227550 225898 222306 245771
2354B45771J4557j6308L522L9429k8489j3634K306Q3892j7243o3299n2821o125
$$ 245771 260328 244020 247542 286971 258482 244848 247154 331046 313803 250504 197683 191558
2342A91558P636J7490m2073k9805M2699J9057l2996K992L6827m2212K9630j165
$$ 191558 199194 216684 174611 144806 187505 206562 173566 176558 213385 171173 200803 199638
2330A99638R386L72p922j7689M3886j4142O987P179j510l8831L2279L5196l1033
$$ 199638 209024 209396 201474 183785 227671 213529 220516 227695 226185 187354 219633 254829 223796
2317B23796o7728j1736J5757m9430k178K9802N9053O9001n3896k0173K2062o278
$$ 223796 156068 144332 160089 110659 108481 138283 197336 266337 212441 192268 214330 208052
2305B08052k9280m5680J8097K9654k3377M1706M347k8575k8069M1852m6377M84
$$ 208052 178772 133092 151189 180843 157466 199172 203519 174944 146875 188727 142350 142834
2293A42834J3675j5417o634K7017Q581K524M3753l0483J3602n0588M2718j3682
$$ 142834 156509 141092 134458 161475 170056 172580 216333 185850 199452 148864 191582 177900
2281A77900l0419K7267k8444q636j3358J6156J8059k0557K6229l9697K7696o108
$$ 177900 147481 174748 146304 137668 124310 140466 158525 137968 164197 124500 152196 146088
2269A46088J2633O067j9206j3501k010R238k3294l0083J8370L3853m3748M4634
$$ 146088 158721 164788 145582 132081 130071 139309 116015 85932 104302 138155 94407 139041
2257A39041K3684q80l9048J8005O7721m8818L6824L036o5926J7127j16j2711p532
$$ 139041 162725 161845 122797 140802 208523 159705 196529 199565 133639 150766 150650 137939 130407
2244A30407K2057K7646o5825j9883j4913M2440O4295R65j5422o2679j1916L2777
$$ 130407 152464 180110 114285 94402 79489 121929 186224 187189 171767 109088 97172 129949
2232A29949L8753n156q2806J3792L8471J279n6830K5850N5105L7636l8514k6097
$$ 129949 168702 163546 80740 94532 133003 134282 77452 103302 158407 196043 157529 131432
2220A31432M8669K2492o1758k6466l452J1923j2194k0061J9640K4301l1259q737
$$ 131432 180101 202593 140835 114369 110917 122840 110646 90585 110225 134526 103267 94530
2208I4530L6483O9328n6845n1140N7054K1445n92M0161l1834l472M198m6315P318
$$ 94530 131013 200341 143496 92356 149410 170855 170263 210424 178590 175118 179316 133001 140319
2195A40319p104M2389K2546k0406L0588o064K9986J3146p9469R467J3222k5047
$$ 140319 133215 175604 198150 177744 208332 202268 232254 245400 165931 175398 188620 163573
2183A63573n460J1304L6281Q108p3983m647r056J8991N9029K3645n381m565K5856
$$ 163573 158113 169417 205698 213806 139823 135176 126120 145111 204140 227785 222404 217839 243695
2170B43695N8385J1526m1286k6253J8980K0625J7945J67k927l1925J5802P5853
$$ 243695 302080 313606 272320 246067 265047 285672 303617 303784 300857 268932 284734 360587
2158C60587K0590o7708M0708K4124n3954L4939L1479J7656k202J0780J6448J4346
$$ 360587 381177 313469 354177 378301 324347 359286 390765 408421 406219 416999 433447 447793
2146D47793P106J6795j3319m359L5928k566M1950l2516K7039K0671k1104K7455
$$ 447793 454899 471694 458375 454016 489944 487378 529328 496812 523851 544522 523418 550873
2134E50873l5610K1631L6947j0836p492Q772N5371J0780M9450J0215N9012K0956
$$ 550873 515263 536894 573841 563005 555513 564285 619656 630436 679886 690101 749113 770069
2122G70069M4990K392O9202O0072P5369N1475M3486M1079R4226O5778R109M5867
$$ 770069 815059 817451 886653 946725 1022094 1073569 1117055 1158134 1252360 1318138 1327247 1373114
2110A373114L3432O1552P7751M5043P3867J04923J34932J80904J53866K01771
$$ 1373114 1406546 1468098 1545849 1590892 1664759 1769682 1904614 2085518 2239384 2441155
2100B441155K25475J94039K11354K50350K93098L25392L58180M25437O38118Q17936
$$ 2441155 2666630 2860669 3072023 3322373 3615471 3940863 4299043 4724480 5362598 6180534
2090F180534J219487J526899J964248K113967J491455M79165j178467j762760
$$ 6180534 7400021 8926920 10891168 13005135 14496590 14975755 13797288 12034528
2082A2034528j804589j752170j520780j235993q60574o32929n48916m15575k96812
$$ 12034528 10229939 8477769 6956989 5720996 4860422 4227493 3678577 3263002 2966190
2073B966190j51391j71502j74843j64273j59118j45717j81990j29748j28565n2359
$$ 2966190 2814799 2643297 2468454 2304181 2145063 1999346 1817356 1687608 1559043 1506684
2063A506684p7678j34529j22943p0517o9912p0274l6589k8112o5222q1225j6410
$$ 1506684 1429006 1294477 1171534 1101017 1031105 960831 924242 896130 830908 749683 733273
2052G33273j8942P543o2708n4j9667n8962l5695o630l5880m8932l56j4624L1492
$$ 733273 714331 721874 659166 659112 639445 580483 544788 538158 502278 453346 452990 438366 469858
2039D69858L2810p9080o5110L4317L4892j1179n0471j1223L2133m1855k2188K8151
$$ 469858 502668 423588 358478 392795 427687 416508 366037 354814 386947 345092 322904 351055
2027C51055M552j3501N230m5491L1049P047m7218l6033j1062j8410k6103J1187
$$ 351055 355607 342106 347336 301845 332894 339941 292723 256690 245628 227218 201115 212302
2015B12302M988J5932p350j0004K5192l5434k4333l7542Q3950K7260o6821j0793
$$ 212302 217290 233222 225872 215868 241060 205626 181293 143751 227701 254961 188140 177347
2003A77347r137k1337M967L4362k4259N413K3808j4338j3623K7701j4884j9691
$$ 177347 168210 146873 151840 186202 161943 167356 191164 176826 163203 190904 176020 156329
1991A56329j9991J6679p88o304j2456L0702k4632l0632M506j9202J3856j1278
$$ 156329 136338 153017 152229 145925 133469 164171 139539 108907 113413 94211 108067 96789
1979I6789j0180L007j850m7262L0099p185k39J8773m6690K4596M669R555M824
$$ 96789 86609 89616 87766 40504 70603 63418 63179 81952 35262 59858 64527 74082 78906
1966G8906j1418l3265M8234l2612L4055M4327o3428M82K6292l9099k1207n725
$$ 78906 67488 34223 82457 49845 83900 128227 64799 65281 91573 52474 31267 25542
1954B5542M0594q411l414m4886N1702n068r746k1827K0956k2199J4102M2113n5434
$$ 25542 66136 57725 54311 9425 61127 56059 46313 24486 45442 23243 37345 79458 24024
1941B4024L0151o85P866k5120J5564M1053J3691k6652n6295q952L5459J0938L7164
$$ 24024 54175 53490 61356 36236 51800 92853 106544 79892 23597 14645 50104 61042 98206
1928I8206m4379m9123J3341L4645P6153p1265p2852N3035Q199P499K6846n2771
$$ 98206 53827 4704 18045 52690 128843 57578 -15274 37761 45960 53459 80305 27534
1916B7534J466N6659K2209l6478K8579j4149j3437k1270r261K2712l0332J3619
$$ 27534 29000 85659 107868 71390 99969 85820 72383 51113 41852 64564 34232 47851
1904D7851J8729n449k3876j0072K318J8468j569J5076N165k4241l4570j0459k2075
$$ 47851 66580 61131 37255 27183 29501 47969 46400 61476 66641 42400 7830 -2629 -24704
1891b4704o032J5116K2596k1437M1249l468k8693L5618L0100m8733m610l634J2396
$$ -24704 -30736 -15620 6976 -14461 26788 23320 -5373 30245 60345 11612 7002 3368 15764
1878A5764K1658k8296L011K3230N5302m980q475J1405l3210l0379j2516N0251
$$ 15764 37422 9126 12137 35367 90669 85689 77214 88619 55409 25030 12514 62765
1866F2765j1106r725m700j9328j6718N2623J1954o1169K5593O3327p1636n615
$$ 62765 51659 41934 37234 17906 1188 53811 65765 4596 30189 93516 21880 16265
1854A6265L0163k3431K1588L3118o700L1283m2868K278m7142J5847J8815J1967
$$ 16265 46428 22997 44585 77703 71003 102286 59418 61696 14554 30401 49216 61183
1842F1183j8634j4914j6062N379L7404m2184R018K3574k7624m2978J3954L7916
$$ 61183 42549 27635 11573 16952 54356 12172 21190 44764 17140 -25838 -11884 26032
1830B6032J4535l3937L6906o101J0137K818k4627J1373J8647m3130K6922L4446
$$ 26032 40567 6630 43536 37435 47572 50390 25763 37136 55783 12653 39575 74021
1818G4021L740k3321O791r610K6676l6371M8989l9639k2410K773K8935p063o8293
$$ 74021 77761 54440 61231 51621 78297 41926 90915 51276 28866 31639 60574 53511 -14782
1805a4782k6583M5900M8634J180l3768k7731j3542o2886N7503L5930k9789J6581
$$ -14782 -41365 4535 53169 54349 20581 -7150 -20692 -83578 -26075 9855 -19934 -3353
1793c353Q95j6728L0543l8468k6614M5786k204j4977K1632j9194P492j0440l2630
$$ -3353 -2458 -19186 11357 -27111 -53725 -7939 -10143 -25120 -3488 -22682 -15190 -25630 -58260
1780e8260M5796p996L1885j7755J0011k059J2463R386p093m982J042R124n073
$$ -58260 -12464 -20460 11425 -6330 3681 1622 14085 23471 16378 11396 12438 21562 16489
1767A6489o1291p22M9003j9292N1264l9285k6268m466K0829L0153m1148k4371
$$ 16489 -44802 -45524 3479 -15813 35451 -3834 -30102 -34568 -13739 16414 -24734 -49105
1755d9105P5182q6393l33R5260R616q4264M3067K5813N866k4613K026Q537l0295
$$ -49105 26077 -60316 -60649 34611 44227 -40037 3030 28843 34709 10096 12122 20659 -9636
1742i636k2846j6416o710J3040M2995m734L0623m1052l0654M7561R113k6772J870
$$ -9636 -32482 -48898 -55608 -42568 427 -4307 26316 -14736 -45390 2171 11284 -15488 -13618
1729a3618K7022j6570o541L166j8106J6396N4270K06m3394n6423j2396J6116K2317
$$ -13618 13404 -3166 -9707 -6541 -24647 -8251 46019 46225 2831 -53592 -65988 -49872 -27555
1716b7555K5015j1212N836j0370m755N799L9195K1987n996m1282J724J4170L4699
$$ -27555 -2540 -13752 -7916 -18286 -23041 -17242 21953 43940 37944 -3338 -1614 12556 47255
1703D7255n7640j1089J3108l6455J697j0106p159k0941M8710N7868l5104m4090
$$ 47255 -10385 -21474 -8366 -44821 -43124 -53230 -60389 -81330 -32620 25248 -9856 -53946
1691e3946J1659L3381k6700l7300N6827L6834j3228L590l9166K2814j9270J0084
$$ -53946 -42287 -8906 -35606 -72906 -16079 20755 7527 11117 -28049 -5235 -24505 -14421
1679a4421j4528l3914K354L979Q5622j6316l2138J2822j6660j0539L5667m9345
$$ -14421 -28949 -62863 -60509 -56530 29092 12776 -19362 -6540 -23200 -33739 1928 -47417
1667d7417k7362L3456m615O220J5701l8655K3516L4375j4445K5715m1888K3217
$$ -47417 -74779 -41323 -45938 -39718 -24017 -62672 -39156 -4781 -19226 6489 -35399 -12182
1655a2182N0109n2081K42m756q184K1481l0378K2915k1507k0956L4851J1493m141
$$ -12182 37927 -14154 -13912 -18668 -26852 -5371 -35749 -12834 -34341 -55297 -20446 -8953 -13094
1642a3094l2451K4265R808o3933O858K0691M7964K3427k0204l495p833j9759l0503
$$ -13094 -45545 -21280 -11472 -75405 -68547 -47856 108 23535 3331 -164 -7997 -27756 -58259
1629e8259p1706K0928M3835L2759K8501R137K8282k8296m9756N0289R903k2112
$$ -58259 -129965 -109037 -65202 -32443 -3942 5195 33477 5181 -44575 5714 15617 -6495
1617f495K7098j2185k6985J399j5394l0029j0472q007k9865r412N5862M2410J1215
$$ -6495 20603 8418 -18567 -17168 -32562 -62591 -73063 -81070 -110935 -120347 -64485 -22075 -10860
1604a0860k1972Q328K7069j4734o091q637k6010j4426J8091K8329L4355J0670
$$ -10860 -32832 -24504 2565 -12169 -18260 -26897 -52907 -67333 -49242 -20913 13442 24112
1592B4112m9582P5849k5390j1937p2947m718N1512j2943n5447L0708M6865n5702
$$ 24112 -25470 50379 24989 13052 -59895 -64613 -13101 -26044 -81491 -50783 -3918 -59620
1580e9620J5402L5611J8014L2308l8998j227J0386k458l3070J1350J0647p8014
$$ -59620 -44218 -8607 9407 41715 2717 1490 11876 9418 -23652 -12302 -1655 -79669
1568g9669P668L1049J2965n4464k6016O5080M0231j1902m4563K4531l1819n776
$$ -79669 -72001 -40952 -27987 -82451 -108467 -43387 -3156 -15058 -59621 -35090 -66909 -72685
1556g2685N4463K1885J9149n8566J7565n9196j583N0388J6628K6703k705k350
$$ -72685 -18222 3663 22812 -35754 -18189 -77385 -78968 -28580 -11952 14751 12046 9696
1544I696m393K7898o740j7621M6820l5342m90J01k2666J7875k7608L0178m2135
$$ 9696 5303 33201 26461 8840 55660 20318 19828 19929 -2737 15138 -12470 17708 -24427
1531b4427l7147J8494j5608j7150M0119O6762n0492M1272m3440K786L8553l6247
$$ -24427 -61574 -43080 -58688 -75838 -35719 31043 -19449 21823 -21617 -18831 19722 -16525
1519a6525k7134K3985o0796O4713P796l3553N9962M0700K4893p8446k8884m0645
$$ -16525 -43659 -19674 -80470 -15757 -7961 -41514 18448 59148 84041 5595 -23289 -63934
1507f3934J3468N7261K3524k8365K0928K8752n1108J2176R146m4560l278R982
$$ -63934 -50466 6795 30319 1954 22882 51634 526 12702 21848 -22712 -25990 -16008
1495a6008Q800O319m7174J546L2824l2695r342L703N6557N9584L9120o7297n5743
$$ -16008 -7208 -889 -48063 -46517 -13693 -46388 -55730 -52027 4530 64114 103234 35937 -19806
1482a9806j4916L0416k9877q4Q405J9092n5332r226N9708k4317K6117r085j6149
$$ -19806 -34722 -4306 -34183 -34267 -25862 -6770 -62102 -71328 -11620 -35937 -9820 -18905 -35054
1469c5054q84L5923O798m9555J016j6993j7515M9761K8623q8858j6287L1779K421
$$ -35054 -35938 -15 6783 -42772 -41756 -58749 -76264 -26503 2120 -86738 -103025 -71246 -68825
1456f8825N677M7129O2829K5570n3597m1519N1013l8312l1419J4350n0692K3189
$$ -68825 -63148 -16019 46810 72380 18783 -22736 28277 -10035 -41454 -27104 -77796 -54607
1444e4607r196J9226P640L1676l342j9789J6261K149j2183J1464J0377k6856K9736
$$ -54607 -63803 -44577 -36937 -5261 -8603 -28392 -12131 -9982 -22165 -10701 -324 -27180 2556
1431B556r862q314j9786L1960P252k3173p536R066p747L8428O412J9402n6612
$$ 2556 -7306 -15620 -35406 -3446 3806 -19367 -26903 -17837 -25584 12844 19256 38658 -17954
1418a7954j798n2821K451M3575k806l4694K9545M2088K0767m1299l5048J9234
$$ -17954 -19752 -72573 -70122 -26547 -29353 -64047 -34502 7586 28353 -12946 -47994 -28760
1406b8760R726L933n6244k8043K7142N1420k8372l4687L9218M5730P420j3746
$$ -28760 -19034 -15101 -71345 -99388 -72246 -20826 -49198 -83885 -44667 1063 8483 -5263
1394e263K3383k1101L4877p19K4325J1296k7885m0424l9960J6173M5239o8334
$$ -5263 18120 -2981 31896 31177 55502 66798 38913 -1511 -41471 -25298 19941 -48393
1382d8393m314M0208p945N1757r223p678j1779m0122j5330k4862P341M6120m195
$$ -48393 -52707 -12499 -20444 31313 22090 14412 2633 -37489 -52819 -77681 -70340 -24220 -28415
1369b8415L0273n8666j1042J653K4140J3513L7029L5423o4751j5320P41J4295
$$ -28415 1858 -56808 -67850 -66197 -42057 -28544 8485 43908 -20843 -36163 -35422 -21127
1357b1127M1494j208J4305K1357o2092l1991M1557k0521j1026n7265N1818M1509
$$ -21127 20367 19159 33464 54821 -7271 -39262 2295 -18226 -29252 -86517 -34699 6810
1345F810Q8701l4006J1850j9192m5483M924k4780k2918l611m151K3030J6210j0939
$$ 6810 95511 61505 73355 54163 8680 13604 -11176 -34094 -37705 -41856 -18826 -2616 -13555
1332a3555p953K8961k7310M239m2565J953N2660j1996J1507K3766o9089o495J8072
$$ -13555 -21508 7453 -19857 -15618 -58183 -56230 -3570 -15566 -4059 19707 -49382 -55877 -37805
1319c7805N4563N853r557L2202n4539Q375N76J6223j306N5544p2790o5718K3963
$$ -37805 16758 22611 13054 45256 -9283 -908 -332 15891 14585 70129 -2661 -68379 -44416
1306d4416L5158J7009k8583m1902K0139j1298M3447K214M029n537r064K2856K9976
$$ -44416 -9258 7751 -20832 -62734 -42595 -53893 -10446 -8232 -4203 -9740 -18804 4052 34028
1293C4028Q354l1417P004j9900J9332J6162m0249l9668l1430l564J0059L3961
$$ 34028 42382 10965 17969 -1931 17401 33563 -6686 -46354 -77784 -81348 -71289 -37328
1281c7328l732j6616K8208N7155j8400l4764m260L4523j2413j7782R288J0620
$$ -37328 -41060 -57676 -29468 27687 9287 -25477 -29737 4786 -7627 -25409 -16121 -5501
1269e501N343k6445n9381J3415J4371Q2147l7701l508o89M1508J2829k7262K3795
$$ -5501 -158 -26603 -85984 -72569 -58198 23949 -13752 -17260 -17949 23559 36388 9126 32921
1256C2921m9529k4037q952M9536k7720j8579Q193p980j179m561l8771L6045M8239
$$ 32921 -16608 -40645 -49597 -61 -27781 -46360 -38167 -46147 -47326 -51887 -90658 -54613 -6374
1243f374l8973L1318J0322J6267k5764l4657M8271q8l4168M6178j6412k953L8502
$$ -6374 -45347 -14029 -3707 12560 -13204 -47861 410 322 -33846 12332 -4080 -7033 31469
1230C1469m8123J4689k4172J7074K3910K3386l1949P27j282k659N6542R517l4583
$$ 31469 -16654 -1965 -26137 -9063 14847 38233 6284 7011 5729 3070 59612 69129 34546
1217C4546k4253N0148j0642k9165k6071O911j7941m481n240J8951j9644m9915
$$ 34546 10293 60441 49799 20634 -5437 1474 -16467 -20948 -26188 -7237 -26881 -76796
1205g6796j1185M9258K5176q4600L7759R914M1287N3547m702J4305l7247l1724
$$ -76796 -87981 -38723 -13547 -98147 -60388 -50474 -9187 44360 39658 53963 16716 -15008
1193a5008L0148k0839k1749L618J5953N407M2429l8101j0510J9628o1847j8855
$$ -15008 15140 -5699 -27448 -23830 -7877 -2470 39959 1858 -8652 10976 -50871 -69726
1181f9726M8867R06m680J8163O433j5019N691l5672K6176J3990J3078j7228k6059
$$ -69726 -20859 -19953 -24633 -6470 -37 -15056 -9365 -45037 -18861 -4871 8207 -9021 -35080
1168c5080l8911K5603O1389J274n507n6022Q747J4289R10J7111O809k3475K7262
$$ -35080 -73991 -48388 13001 14275 8768 -47254 -38507 -24218 -23308 -6197 612 -22863 4399
1155D399n372j7176k7399P308J6404K6437l4976Q605O388K7900O541m3713J9849
$$ 4399 -973 -18149 -45548 -38240 -21836 4601 -30375 -21770 -15382 12518 19059 -24654 -4805
1142d805K8806l6633J3620k1350m1931P2970k2867k6373k0756K35M443K7319J7857
$$ -4805 24001 -12632 988 -20362 -62293 10677 -12190 -38563 -59319 -59084 -54641 -27322 -9465
1129i465j2298K3482k9320m3253P488k659n72l611N1783M1079M074j8911j7669
$$ -9465 -21763 1719 -27601 -70854 -63366 -66025 -66597 -70208 -18425 22654 26728 7817 -9852
1116i852J497R189k8523J660Q251M348K013r809J2381l9831K3256J8973j5365
$$ -9852 -8355 834 -27689 -26029 -17778 -13430 -11417 -21226 -8845 -48676 -25420 -6447 -21812
1103b1812J658J5815K1388k8519J1155L9713q9516k782p236Q834P3562o126j2160
$$ -21812 -20154 -4339 17049 -11470 -315 39398 -50118 -52900 -60136 -51302 22260 16134 3974
1090C974j4593l5767K9049M1971l2077k4294K1656n0973K1113O7515j779k1780
$$ 3974 -10619 -46386 -17337 24634 -7443 -31737 -10081 -61054 -39941 27574 25795 4015
1078D015j2333k0513k3249K1768j4084p634N2792K0347O603J7875n2654J0681
$$ 4015 -8318 -28831 -52080 -30312 -44396 -52030 762 21109 27712 45587 -7067 3614
1066C614K2781m6620n5851K3220l4672J2168J0074j4875M2367M8482j9478j5653
$$ 3614 26395 -20225 -76076 -52856 -87528 -75360 -65286 -80161 -37794 10688 -8790 -24443
1054b4443n82K2671J2370o964j6294n162j3110q506J9512n142k7380l6723O1147
$$ -24443 -25025 -2354 10016 3052 -13242 -18404 -31514 -40020 -20508 -25650 -53030 -89753 -28606
1041b8606l383M1288O016K851J1028n8161J2435K7302J5653j3903j4899k0147
$$ -28606 -31989 9299 15315 18166 29194 -28967 -16532 10770 26423 12520 -2379 -22526
1029b2526L6768J0574l967M3939J5002p224n6346j1464N3800m5761J5253J978
$$ -22526 14242 24816 20849 64788 79790 72566 16220 4756 58556 12795 28048 30026
1017C0026k5494K923j7406j37l0507L7897Q575n0438k3307M0803Q251r358k9557
$$ 30026 4532 7455 -9951 -10088 -40595 -2698 5877 -44561 -67868 -27065 -18814 -28172 -57729
1004e7729P5948l6858m0276P67L7460M2537l4180j1625J4977K0639o136m3796
$$ -57729 18219 -18639 -58915 -58148 -20688 21849 -12331 -23956 -8979 11660 5524 -38272
992c8272O041R537o252J4386q667J1668J7616L3736p780m064j4994m80K2264n7266
$$ -38272 -32231 -22694 -28946 -14560 -23227 -11559 6057 39793 32013 27949 12955 12475 34739 -22527
978b2527J7101j6352j2150O4793j465n0932j6292L2327K1274l8565k3749J2249
$$ -22527 -5426 -21778 -33928 30865 29400 -21532 -37824 -5497 15777 -22788 -46537 -34288
966c4288m4882q355M7711N0919k1175l6943K1426k5540j546K8972j3739l863K3888
$$ -34288 -79170 -87525 -39814 11105 -10070 -47013 -25587 -51127 -52673 -23701 -37440 -41303 -17415
953a7415K0467K4451n971l2261K3101j6718j8675J5027K1624J9557m5824K9474
$$ -17415 3052 27503 21532 -10729 12372 -4346 -23021 -7994 13630 33187 -12637 16837
941A6837L1904l3176P32l763J182m9541M078M6909k213Q285J4570o4492n513Q528
$$ 16837 48741 15565 16297 12534 13716 -35825 -31747 15162 12949 21234 35804 -28688 -34201 -25673
927b5673K748L0752K218l5321k0113J4480K6497n7290J5395M6321l8212j8003
$$ -25673 -22925 7827 10045 -25276 -45389 -30909 -4412 -61702 -46307 14 -38198 -56201
915e6201M7408K9052j6499k1820O729O403p178j9123Q629l3139K0950P58k9847
$$ -56201 -8793 20259 3760 -18060 -11331 -4928 -12106 -31229 -22600 -55739 -34789 -34031 -63878
902f3878j9309L1943k4841l4276O1726J9893K4126N5846l9502l5814J8568j0064
$$ -63878 -83187 -51244 -76085 -110361 -48635 -28742 -4616 51230 11728 -24086 -5518 -15582
890a5582k159k0619k2851L4355l763J2686L1846J3282n2156L9185J9952m2988
$$ -15582 -17741 -38360 -61211 -26856 -30619 -17933 13913 27195 -24961 14224 34176 -8812
878h812K2558M1485l5324o0953P572J5078N6542k0010j0502P767l7930l1213J5820
$$ -8812 13746 55231 19907 -41046 -33474 -18396 38146 18136 7634 15401 -22529 -53742 -37922
865c7922k7228L1931k75L0931l9711l194K7550L936l2396Q28L9518j2873M2912
$$ -37922 -65150 -33219 -33494 -2563 -42274 -45468 -17918 -13982 -46378 -45550 -6032 -18905 24007
852B4007m9656K2902M0282J8158k0928L23J8197k7855l8439l7231L9712j7820
$$ 24007 -25649 -2747 37535 55693 34765 35088 53285 25430 -13009 -50240 -10528 -28348
840b8348J4270n219l227O9519O823o9959J8145j970N5772j3137j8352J2578j5905
$$ -28348 -14078 -19297 -22524 46995 53818 -16141 2004 34 55806 42669 24317 36895 20990
827B0990m8052l7285M0524o166k6309r719j6393N6926j3175P879n933K8255k1354
$$ 20990 -27062 -64347 -23823 -29989 -56298 -66017 -82410 -25484 -38659 -30780 -36713 -8458 -29812
814b9812J955L5254r935L4491L149k0685n3982M4045j157n9299N6950L5049l080
$$ -29812 -27857 7397 -2538 31953 35102 14417 -39565 4480 3323 -55976 974 36023 32943
801C2943o250m1734k1597K5975L5959k4371L6432N002j6541N208j6297k4919r825
$$ 32943 26693 -15041 -36638 -10663 25296 925 37357 42359 25818 31026 14729 -10190 -20015
788b0015J8892P043K3253q564n962k151R517l5570l5034L2482l0902Q657M4403
$$ -20015 -1123 5920 29173 20609 14647 12496 22013 -13557 -48591 -16109 -47011 -38354 6049
775F049p271q702R556k5273k9253L2674O9379k8334J9225j8048k6060o972k4140
$$ 6049 -1222 -9924 -368 -25641 -54894 -22220 47159 18825 38050 20002 -6058 -13030 -37170
762c7170j497L5966L176J3239n2707m678O2607l9808R144p282m009K8588n521
$$ -37170 -38667 -2701 475 13714 -38993 -43671 18936 -20872 -11728 -19010 -23019 5569 48
749D8K3692J474o7200O830N0379n0130J6721N496m5751j1481M2981Q124K2960
$$ 48 23740 25214 -41986 -35156 15223 -34907 -18186 -12690 -58441 -69922 -26941 -18817 4143
736D143O634n826k0382n654J3477j8740L4935l3625k2143k6807N0676L3214J064
$$ 4143 10777 4951 -15431 -21085 -7608 -26348 8587 -25038 -47181 -73988 -23312 9902 10966
723A0966Q186K7489L115l5060P981K1479j1614n1755n965L7032j2297J7303k647
$$ 10966 19152 46641 49756 14696 22677 44156 32542 -19213 -25178 11854 -443 16860 14213
710A4213l1010J3543K8193M7485n928J0032l2170m822n8913K3053J8927q088K2594
$$ 14213 -16797 -3254 24939 72424 66496 76528 44358 39536 -19377 3676 22603 14515 37109
697C7109j1280j9556j1596K3408j3357o4864L0691J7402M893L8766j6755l2427
$$ 37109 25829 6273 -5323 18085 4728 -60136 -29445 -12043 -7150 31616 14861 -17566
685a7566K9650K0803N956L360o1241k5322Q4665K9191l3488Q847l9826L7737m3751
$$ -17566 12084 32887 38843 42203 -19038 -44360 40305 69496 36008 44855 5029 42766 -985
672i85m7402j3139j357p16M9517L7037j243K0305N819J0724J1883n229p7948o791
$$ -985 -48387 -61526 -62883 -63599 -14082 22955 21712 42017 47836 58560 70443 65214 -12734 -19525
658a9525K1033k5244j1057M2722K9744o333j8254l3831J3500M4465J1070j7218
$$ -19525 1508 -23736 -34793 7929 37673 31340 13086 -20745 -7245 37220 48290 31072
646C1072o1732k5824Q2168m301J9813J0266k6436q038L7970l8753J8313L104k9581
$$ 31072 -30660 -56484 25684 21383 41196 51462 25026 16988 54958 16205 34518 37622 8041
633H041K0915J1738l4038M436N2153j8620k9915K0208l8236j7150K3377k3872
$$ 8041 28956 40694 6656 11092 63245 44625 14710 34918 -3318 -20468 2909 -20963
621b0963J8193N011J8010N0675l6293m9203J3786j0851k4358K892O5052l7699
$$ -20963 -2770 2241 20251 70926 34633 -14570 -784 -11635 -35993 -33101 31951 -5748
609e748k7132l9977O0355K6215m1106k0787n430Q159L6867Q1570k8989n9611J1700
$$ -5748 -32880 -72857 -12502 13713 -27393 -48180 -53610 -45451 -8584 72986 43997 -15614 -3914
596c914K6473j1461J9208m6191J3431K1025P136L9430j9606l5794m8622M4206
$$ -3914 22559 11098 30306 -15885 -2454 18571 25707 65137 45531 9737 -38885 5321
584E321k4095K6560L97q117j80J390J8457k151n654J7833K2848l31L316n4037
$$ 5321 -18774 7786 8183 66 -114 1276 19733 17582 11928 29761 52609 52278 55594 1557
570A557K4379k0261k6829Q546L1946O572n51J6482J380n0746M0585R26n0791j4115
$$ 1557 25936 5675 -21154 -12608 19338 25910 25359 41841 43221 -7525 33060 33986 -16805 -30920
556c0920K1080K7134r053J1979m6950K227O5649p5237k874M7211K7887o111J6889
$$ -30920 -9840 17294 8241 20220 -26730 -24503 41146 -34091 -36965 10246 38133 32022 48911
543D8911k7416j0941L9357m0802k1434P615L8811l8951L4362M1690n5222l877
$$ 48911 21495 10554 49911 9109 -12325 -4710 34101 -4850 29512 71202 15980 12103
531A2103K3747L3457k5490m1489n6129N7098R923K8714Q865j2919q273k743k3833
$$ 12103 35850 69307 43817 2328 -53801 3297 13220 41934 50799 37880 29607 26864 3031
518C031P288L1260k2296R403l8613o736L8723p356P670K4170n8034O11M778K6201
$$ 3031 10319 41579 19283 28686 -9927 -16663 22060 14704 22374 46544 -11490 -10879 -6101 20100
504B0100k8286J1065j6077N2922k4249K5746m0315j5949j0277j6532J0899N583
$$ 20100 -8186 2879 -13198 39724 15475 41221 906 -15043 -25320 -41852 -30953 -25370
492b5370O5047j515j4950L9332l1310R32J0800K3166j9399p53k2467m652N7031
$$ -25370 39677 38162 23212 62544 31234 32166 42966 66132 46733 45980 23513 18861 75892
479G5892j0932j7978M7417k4010k7907M0511m590j2595m7229k6356N626Q662J2069
$$ 75892 64960 46982 94399 70389 42482 82993 78403 65808 18579 -7777 -2151 6511 18580
466A8580L5320m6813j8783J1834k8603M4619k6699k2261N7012J9336J6867K8167
$$ 18580 53900 7087 -11696 138 -28465 16154 -10545 -32806 24206 43542 60409 88576
454H8576o691l8641J9316l8525r394j9916K6962n4693m294q817k0515L0828K3323
$$ 88576 81885 43244 62560 24035 14641 -5275 21687 -33006 -37300 -46117 -66632 -35804 -12481
441a2481K0185L5530o0486m2455N2122K2034L7410k8865M87L851J30j6253L3520
$$ -12481 7704 43234 -17252 -59707 -7585 14449 51859 22994 23481 27332 27462 11209 44729
428D4729k728n1104n2234K7628L9547J0217J7096l1735N1674k6303p39J6835m1280
$$ 44729 42001 -9103 -61337 -33709 5838 16055 33151 1416 53090 26787 26048 42883 1603
415A603k4649J6260P475K5129k5238J002p828k3083j7848L4361J9115K3445K4036
$$ 1603 -23046 -6786 689 25818 580 1582 -6246 -29329 -47177 -12816 6299 29744 53780
402E3780o8555R810L8157j2066m7615K8608j1231n6274M9340K7880L1997m2820
$$ 53780 -14775 -4965 33192 21126 -26489 2119 -9112 -65386 -16046 11834 43831 1011
390A011k4502M4014m1656m494M618J1041k4060J3198J0385K1080p717J231j0400
$$ 1011 -23491 20523 -21133 -25627 -21009 -9968 -34028 -20830 -10445 10635 2918 4149 -6251
377f251j1697J2461k4821k042J3828M0906r960J2868j89K5158k8065K7921P119
$$ -6251 -17948 -5487 -30308 -32350 -18522 22384 12424 25292 25103 50261 22196 50117 57236
364E7236o1198l4438L2898K9265m1759k1230L1346L214L8327j5336m3568J9181
$$ 57236 -3962 -38400 -5502 23763 -17996 -39226 -7880 -4666 33661 18325 -25243 -6062
352f062J4115l6508K5911k1491m2307L8348M2015J5804l3032J6698L152l8753
$$ -6062 8053 -28455 -2544 -24035 -66342 -27994 14021 29825 -3207 13491 16643 -22110
340b2110k9j2822L8748L6796n9289Q90K7806J2087N53R483l6335j6397n345J8348
$$ -22110 -22139 -34961 3787 40583 -18706 -17816 9990 22077 22630 32113 -4222 -20619 -25964 -7616
326g616K3863j769j8414j4225j1622J007k5977L8781K3241M340p677p636J2058
$$ -7616 16247 14478 -3936 -18161 -29783 -28776 -54753 -15972 7269 11609 3932 -3704 8354
313H354j2471j6918J1204k60j9823K437L7930j099K9807n4039l1928M0706N0406
$$ 8354 -4117 -21035 -9831 -10091 -29914 -27477 10453 9354 39161 -14878 -46806 -6100 44306
300D4306Q905o016l2707L0256k7574n7375Q712M0105j5317M0054q706m0678l6947
$$ 44306 53211 47195 14488 44744 17170 -40205 -31493 8612 -6705 33349 24643 -16035 -52982
287e2982J4904M7565l3486m49O1157k0549j1752j7952n170k9921L5901J9649j6881
$$ -52982 -38078 9487 -23999 -24448 36709 16160 4408 -13544 -18714 -48635 -12734 6915 -9966
274i966J3614j906o606l4813N7396l2578M0029l750N0413r935n8998o894M1806
$$ -9966 3648 1742 -4864 -39677 17719 -14859 25170 21420 71833 61898 2900 -3994 37812
261C7812Q962J0892m1992K696K9453n1392j5632K2706j0527L8628m4329J193M4054
$$ 37812 46774 57666 15674 18370 47823 -3569 -19201 3505 -7022 31606 -12723 -11530 32524
248C2524L8575m0350P40P579j06059J1774Q621M2322J1696R353l3818k447j6334
$$ 32524 71099 30749 31489 39068 -66991 -55217 -46596 -4274 7422 16775 -17043 -19490 -35824
235c5824J9020L3265R4P419l4481J5608K748m8450K9255K8361J917J8061k905
$$ -35824 -16804 16461 16555 23974 -10507 5101 7849 -40601 -11346 17015 18932 36993 34088
222C4088J7173m0690k5266L7013K4491q3805k1951M2928j6672m829Q479J6171
$$ 34088 51261 10571 -14695 22318 46809 -36996 -58947 -16019 -32691 -37520 -29041 -12870
210a2870J9159r50M1707l0589K8885j1524l4253L7625J4362k2745k5316Q110j7051
$$ -12870 6289 5339 47046 16457 45342 33818 -435 37190 51552 28807 3491 11601 -5450
197e450q466O468J6499K5438q997j0653m1616O279l4360L4824K886k8972q701
$$ -5450 -13916 -7448 9051 34489 25492 14839 -26777 -20498 -54858 -20034 -17148 -46120 -54821
184e4821J5561j2523J0180L5352J6103J8183j2626L5520J8541q372n1390m647
$$ -54821 -39260 -51783 -41603 -6251 9852 28035 15409 50929 69470 61098 9708 5061
172E061l7308N0775Q814n2850K4116J2208k4452L7945J9541k8542J9380K9859
$$ 5061 -32247 18528 27342 -25508 -1392 10816 -13636 24309 43850 15308 34688 64547
160F4547k2197o713R368l2166r226j7881R59o924l427J2719j2902K4302M0227
$$ 64547 42350 35637 45005 12839 3613 -14268 -13309 -20233 -23660 -10941 -23843 459 40686
147D0686L8999m0184L799j2809R284j7095k012k7512o5043J9066K6452k4202M7880
$$ 40686 79685 39501 43300 30491 39775 22680 20668 -6844 -71887 -52821 -26369 -50571 -2691
134b691M1642O064J4603k9343l7156K810K0794j5010m5317M2771M0838q100K3434
$$ -2691 38951 45015 59618 30275 -6881 -4071 16723 1713 -43604 -833 40005 31905 55339
121E5339m3406m4096J5575M2007r054k9631J1627L286R154m780j0701K193K343
$$ 55339 11933 -32163 -16588 25419 16365 -13266 -1639 1647 10801 6021 -4680 -2487 -144
108a44k719R193k4139L848M6912l1797K3623l424l0441L9219k0211j825j0028
$$ -144 -2863 6330 -17809 -13961 32951 1154 24777 21353 -9088 30131 9920 8095 -1933
95a933j4104J8459J1023p623J3797M881l791j1021k4145K514L6182k8191J9082
$$ -1933 -16037 2422 13445 5822 19619 24500 20709 9688 -14457 -11943 24239 -3952 15130
82A5130M222n1067O676O014k5307K9299O0704n2119l0357J6297O6670k686j7577
$$ 15130 19352 -31715 -25039 -19025 -44332 -15033 45671 -6448 -36805 -20508 46162 43476 25899
69B5899j9712J0689K5456R976k3926K3900N052j5897J5385r887J2990j7431n9764
$$ 25899 6187 16876 42332 52308 28382 52282 57334 41437 56822 46935 59925 42494 -17270
56a7270J569K4001n846J6010n815J1205M9781r227n4182l386P220L9716l1865
$$ -17270 -15701 8300 2454 18464 12649 23854 73635 64408 10226 6840 14060 53776 21911
43B1911j7670P118l7600K1998k3228J0967J2958n414M037J9958P426J211j4549
$$ 21911 4241 11359 -26241 -4243 -27471 -16504 -3546 -8960 -4923 15035 22461 23672 9123
30I123L316m3042L3165K1365N48Q624l1682k0812J2594K3847k775p548R52j3089
$$ 9123 12439 -30603 2562 23927 24475 33099 1417 -19395 -6801 17046 14271 6723 7675 -5414
16e414j2474O2098j8504j9412k3658J8718N4921o169Q236j2075l3866j0296J3970
$$ -5414 -17888 44210 25706 6294 -17364 1354 56275 50106 58342 46267 12401 2105 16075
3A6075O177k7150j3956
$$ 16075 22252 -4898 -18854
0a8854
$$ -18854
$$ Imaginary data points
##PAGE= N=2
##DATA TABLE= (X++(I..I)), XYDATA
16383a870779K3862L1895J7448L1958L2037J6096L4155j1298K4302P901J5584
$$ -1870779 -1846917 -1815022 -1797574 -1765616 -1733579 -1717483 -1683328 -1694626 -1670324 -1662423 -1646839
16372a646839O1026M7057k189M2262J9177L9723J5571j859r269K3053O6925M7072
$$ -1646839 -1585813 -1538756 -1540945 -1498683 -1479506 -1439783 -1424212 -1426071 -1435340 -1412287 -1345362 -1298290
16360a298290L3812j8583M704O0317L7641K7398P565L0527K1492K7542j4980O833
$$ -1298290 -1264478 -1283061 -1278357 -1218040 -1180399 -1153001 -1145436 -1114909 -1093417 -1065875 -1080855 -1074022
16348a074022N9786K7684M9634L1225m650K6885M8850P471J4547L2744O743O2861
$$ -1074022 -1014236 -986552 -936918 -905693 -910343 -883458 -834608 -827137 -812590 -779846 -773103 -710242
16336g10242Q221Q821j8835J3375M1963L4785M5595K2362J0868k3029J5399L2759
$$ -710242 -702021 -693200 -712035 -698660 -656697 -621912 -576317 -553955 -543087 -566116 -550717 -517958
16324e17958O8620j832N2760M7395J5875K690J9271L0298L4898J6430K7430K8576
$$ -517958 -449338 -451170 -398410 -351015 -335140 -332450 -313179 -282881 -247983 -231553 -204123 -175547
16312a75547K1390N4629k685J424M0557q995p662K0337L0248J9793J7198K3101
$$ -175547 -154157 -99528 -102213 -100789 -60232 -69227 -76889 -56552 -26304 -6511 10687 33788
16300C3788L8822k2063K1494J2236L9481J5310L2829L6846Q880L8112j33K071
$$ 33788 72610 50547 72041 84277 123758 139068 171897 208743 217623 255735 255602 257673
16288B57673O1542M0981K447j8123K8779Q0330p128K821K3919J310K6738J5780
$$ 257673 319215 360196 362643 344520 373299 453629 446501 449322 473241 474551 501289 517069
16276E17069K163J5445M4013L7200J533K8819p367l4375K5110K5428Q1924J1434
$$ 517069 519232 534677 578690 615890 617423 646242 638875 604500 629610 655038 736962 748396
16264G48396L1740J4393k6743J2980J4264P7320J059j7842l893L7680K712l851
$$ 748396 780136 794529 767786 780766 795030 872350 873409 855567 851674 889354 892066 888215
16252H88215j3878M4914p395L1747K0396M6264k4937K273O9899L2184J4736K3096
$$ 888215 874337 919251 911856 943603 963999 1010263 985326 987599 1057498 1089682 1104418 1127514
16240A127514J1102j6530j6479M6782O9014k3111k1929J9572N5098M202M3793
$$ 1127514 1138616 1122086 1105607 1152389 1221403 1198292 1176363 1195935 1251033 1255235 1299028
16229A299028O988k8077j74J8488L2960m2867K009K7472Q071M1551R639Q41J3873
$$ 1299028 1306016 1277939 1277765 1296253 1329213 1286346 1288355 1315827 1323898 1365449 1375088 1375929 1389802
16216A389802R948J530L4327R2084j9029l5571j4744N1689L4564l7735l776M049
$$ 1389802 1399750 1401280 1435607 1527691 1508662 1473091 1458347 1510036 1544600 1506865 1503089 1507138
16204A507138Q410K0833K9436j8773J7587L8136o573J1832j0316L2387J4626k2922
$$ 1507138 1515548 1536381 1565817 1547044 1564631 1602767 1596194 1608026 1597710 1630097 1644723 1621801
16192A621801R512K1410K7320m0080J934J0024P034M2859J4814N70m8673J949
$$ 1621801 1631313 1652723 1680043 1639963 1641897 1651921 1658955 1701814 1716628 1717198 1668525 1670474
16180A670474J1094k8695n019L0976K7729m0946k9535Q60M9965P9736M0365k8139
$$ 1670474 1681568 1652873 1647854 1678830 1706559 1665613 1636078 1636938 1686903 1766639 1807004 1778865
16168A778865L792k2869k423O2855l298J4689k5657m6392k817m4140N3589N8709
$$ 1778865 1782657 1759788 1757365 1820220 1816922 1831611 1805954 1759562 1756745 1712605 1766194 1824903
16156A824903j0272m4714M0237Q3871K6204m7499P673l942j2540J3561L1856l4942
$$ 1824903 1814631 1769917 1810154 1894025 1920229 1872730 1880403 1876461 1863921 1877482 1909338 1874396
16144A874396J3158k6998k9085K9193J5841J9671m430K1724K5864j6061k8437
$$ 1874396 1887554 1860556 1831471 1860664 1876505 1896176 1891746 1913470 1939334 1923273 1894836
16133A894836J1717L9344P0331p4358m9720K6918O384N771K3103P531l4087L0861
$$ 1894836 1906553 1945897 2016228 1941870 1892150 1919068 1925452 1931223 1954326 1961857 1927770 1958631
16121A958631n226J8171l5161M0787K3729k3503P851j9663m950k6994M0177M0148
$$ 1958631 1953405 1971576 1936415 1977202 2000931 1977428 1985279 1965616 1960666 1933672 1973849 2013997
16109B013997R926j6109k1620K0130j5330j5055L9750k1120k4602K2241M8704
$$ 2013997 2023923 2007814 1986194 2006324 1990994 1975939 2015689 1994569 1969967 1992208 2040912
16098B040912J1364L4408J2666k1592j771k2589j9526k9280L229M8317k6063N94
$$ 2040912 2052276 2086684 2099350 2077758 2075987 2053398 2033872 2004592 2007821 2056138 2030075 2030669
16086B030669J3037J7914l2150O1514L6503k6010q4918K2506K9115m8953L4121
$$ 2030669 2043706 2061620 2029470 2090984 2127487 2101477 2016559 2039065 2068180 2019227 2053348
16075B053348L0957K6671o7054M5226N209K0762m0641J475L8676m9790j0869q650
$$ 2053348 2084305 2110976 2043922 2089148 2094357 2115119 2074478 2075953 2114629 2064839 2053970 2045320
16063B045320L9004L6934m270l7713J39K5072L1613l9546K4179l1115j0809K5301
$$ 2045320 2084324 2121258 2116988 2079275 2079414 2104486 2136099 2096553 2120732 2089617 2078808 2104109
16051B104109J3268j9411l1076K6650j3641n114J4336r601K3432K0693J0337j2462
$$ 2104109 2117377 2097966 2066890 2093540 2079899 2074785 2089121 2079520 2102952 2123645 2133982 2121520
16039B121520k052K2062l4211k5644M991k6022J988K5588K5307r600r135l431
$$ 2121520 2119468 2141530 2107319 2081675 2086666 2060644 2062632 2088220 2113527 2103927 2094792 2091361
16027B091361L8493l5998q053j5262j4824p11M0353L4855K661m4165l4244Q0236
$$ 2091361 2129854 2093856 2085803 2070541 2055717 2055006 2095359 2130214 2132875 2088710 2054466 2134702
16015B134702j2930l9094j8975L5906K7906q5383L1712M5590m1406K4766k5087
$$ 2134702 2121772 2082678 2063703 2099609 2127515 2042132 2073844 2119434 2078028 2102794 2077707
16004B077707L6500M739P3750m7613o5188M1579J9774l0226L034k9428J6505J7428
$$ 2077707 2114207 2118946 2192696 2145083 2079895 2121474 2141248 2111022 2114056 2084628 2101133 2118561
15992B118561j2786J3890j8950Q509P300l05l5181K7895q036l4527l831r077K5592
$$ 2118561 2105775 2119665 2100715 2109224 2116524 2116219 2081038 2108933 2100897 2066370 2062539 2053462 2079054
15979B079054J4428K5737j9285K9329J0277j2509M548k0811j0531M8108k5260
$$ 2079054 2093482 2119219 2099934 2129263 2139540 2127031 2131579 2110768 2100237 2148345 2123085
15968B123085j4820k7638k5486J7975M772p600k2269N5299m097n711K9843m8565
$$ 2123085 2108265 2080627 2055141 2073116 2077888 2070288 2048019 2103318 2099221 2093510 2123353 2074788
15956B074788J3195O2796M751n3825J504N113j130l5636J3834O31O444O914R85
$$ 2074788 2087983 2150779 2155530 2101705 2103209 2108322 2107192 2071556 2085390 2086021 2092465 2099379 2100364
15943B100364K1797m6257k4978L6353Q9506m8142j2007L5504j0627L8730m6700
$$ 2100364 2122161 2075904 2050926 2087279 2176785 2128643 2116636 2152140 2141513 2180243 2133543
15932B133543k4297N754j3174k4425m2549K9815K1318q352O2372L5667l7226K9190
$$ 2133543 2109246 2115000 2101826 2077401 2034852 2064667 2085985 2077633 2140005 2175672 2138446 2167636
15920B167636l7021l2338k9285N6769k846K2215N669k0885n2942J3729M4125o957
$$ 2167636 2130615 2098277 2068992 2125761 2122915 2145130 2150799 2129914 2076972 2090701 2134826 2127869
15908B127869n900j1354j1788m8544J5517N9429n362L785J0337J1102k3238m3209
$$ 2127869 2121969 2110615 2098827 2050283 2065800 2125229 2119867 2123652 2133989 2145091 2121853 2078644
15896B078644J8354K7944k6944J1522k0328L937M1197p013K6692m585m637j6222
$$ 2078644 2096998 2124942 2097998 2109520 2089192 2093129 2134326 2127313 2154005 2149420 2144783 2128561
15884B128561j2057n940j0092O0596K3245o2025j679J5381n3313L3404K147l3534
$$ 2128561 2116504 2110564 2100472 2161068 2184313 2122288 2120609 2135990 2082677 2116081 2118228 2084694
15872B084694j2597N978L0111N664j7228M3031J9614n0078L6180K4239m4115j5820
$$ 2084694 2072097 2078075 2108186 2113850 2096622 2139653 2159267 2109189 2145369 2169608 2125493 2109673
15860B109673l8708l688M9152J8275k0210L811j5132J8359K9970p530J8456j557
$$ 2109673 2070965 2067277 2116429 2134704 2114494 2118305 2103173 2121532 2151502 2143972 2162428 2160871
15848B160871j7026j919k1650k3972P1467J1368k8312n738L6613J4476K3295p4705
$$ 2160871 2143845 2141926 2120276 2096304 2167771 2179139 2150827 2145089 2181702 2196178 2219473 2144768
15836B144768k6281L0748N483M9913j5330m9388J6933k0048L8713J0617k0371
$$ 2144768 2118487 2149235 2154718 2204631 2189301 2139913 2156846 2136798 2175511 2186128 2165757
15825B165757j4897n5745p642P1158m520J6697K5100K1996o3840m2556k9565M6099
$$ 2165757 2150860 2095115 2087473 2158631 2154111 2170808 2195908 2217904 2154064 2111508 2081943 2128042
15813B128042j8092J7748O8295J6713n586o3765J7426Q14n4322j7606J4539L5132
$$ 2128042 2109950 2127698 2195993 2212706 2207120 2143355 2160781 2161595 2107273 2089667 2104206 2139338
15801B139338j6969n5254N3540L3607M4094k0486j473l56r6374O696K7206j5313
$$ 2139338 2122369 2067115 2120655 2154262 2198356 2177870 2176397 2176041 2079667 2086363 2113569 2098256
15789B098256L2091K8094K544m034K8105P350O836k6422m7610J2121m5574L0467
$$ 2098256 2130347 2158441 2160985 2156951 2185056 2192406 2199242 2172820 2125210 2137331 2091757 2122224
$$ [...]
##END NTUPLES=NMR SPECTRUM
##END=
