##TITLE=1H_CG-1150-F
 CDCl3
 8 sc, 
 14.3.2023
##JCAMPDX= 6.0         $$ Bruker NMR JCAMP-DX V2.0
##DATA TYPE= NMR SPECTRUM
##DATA CLASS= NTUPLES
##ORIGIN= UXNMR, Bruker Analytische Messtechnik GmbH
##OWNER= root
$$ XWIN-NMR		Version 3.5
$$ Tue Mar 14 15:21:43 2023 Russian Standard Time (UT+4h)  she@DPX200
##.OBSERVE FREQUENCY= 200.13135
##.OBSERVE NUCLEUS= ^1H
##.ACQUISITION MODE= SIMULTANEOUS
##.ACQUISITION SCHEME= undefined
##.AVERAGES= 8
##.DIGITISER RES= 18
##SPECTROMETER/DATA SYSTEM= spect
##.PULSE SEQUENCE= zg30
##.SOLVENT NAME= CDCl3
##.SHIFT REFERENCE= (INTERNAL, CDCl3, 0, 15.7326)
##AUDIT TRAIL= $$ (NUMBER, WHEN, WHO, WHERE, WHAT)
$$ ##TITLE= Audit trail, XWIN-NMR		Version 3.5
$$ ##JCAMPDX= 5.01
$$ ##ORIGIN= Bruker BioSpin GmbH
$$ ##OWNER= she
$$ F:/spectra/data/she/nmr/H-F/1/pdata/1/auditp.txt
$$ ##AUDIT TRAIL=  $$ (NUMBER, WHEN, WHO, WHERE, WHAT)
(   1,<2023-03-14 15:19:25.15 +0400>,<she>,<DPX200>,
      <created by zg, POWCHK disabled, PULCHK disabled
       configuration hash MD5:
       00 E9 B6 7A A2 85 ED C7 34 08 36 98 17 FE 4E 26
       data hash MD5: 16K
       95 84 5D 61 97 07 EF 87 A6 A4 30 E2 6A 7C 47 5F>)
(   2,<2023-03-14 15:19:27.46 +0400>,<she>,<DPX200>,
      <Start of raw data processing
       efp BC_mod = 2 LB = 0.24 FT_mod = 6 PKNL = 1 PHC0 = -19111.71 PHC1 = 19.20074 SI = 16K 
       data hash MD5: 16K
       71 91 68 57 5F D7 EA B4 83 C6 E4 FA A4 5E F4 A8>)
(   3,<2023-03-14 15:19:44.87 +0400>,<she>,<DPX200>,
      <pk PHC0 = 1.810693 PHC1 = -3.4 
       data hash MD5: 16K
       79 F9 90 6D E0 F0 94 BD 84 64 52 B3 70 3E C7 D2>)
(   4,<2023-03-14 15:19:48.06 +0400>,<she>,<DPX200>,
      <abs ABSG = 5 
       data hash MD5: 16K
       81 07 D5 2B 35 1D B3 CF 5B 07 AE 96 6D 8A 44 1E>)
$$ ##END=
$$ 
$$ hash MD5
$$ A9 C6 1F 0F A4 61 5F 5F 9B 1A C3 04 E1 65 D2 8C
##$RELAX= 
##$RELAX= 
##$RELAX= 
##$RELAX= 
##$RELAX= 
##$RELAX= 
$$ Bruker specific parameters
$$ --------------------------
##$DU= <F:/spectra>
##$EXPNO= 1
##$NAME= <H-F>
##$PROCNO= 1
##$TYPE= <nmr>
##$USER= <she>
##$AMP= (0..31)
100 100 100 100 100 100 100 100 100 100 100 100 100 100 100 100 100 100 
100 100 100 100 100 100 100 100 100 100 100 100 100 100 
##$AQSEQ= 0
##$AQ_mod= 1
##$AUNM= <au_zg>
##$AUTOPOS= <>
##$BF1= 200.13
##$BF2= 200.13
##$BF3= 200.13
##$BF4= 200.13
##$BF5= 200.13
##$BF6= 200.13
##$BF7= 200.13
##$BF8= 200.13
##$BYTORDA= 1
##$CFDGTYP= 0
##$CFRGTYP= 5
##$CHEMSTR= <none>
##$CNST= (0..31)
1 1 145 1 1 1 1 1 1 1 1 1 1 1 1 1 1 1 1 1 1 1 1 1 1 1 1 1 1 1 1 1 
##$CPDPRG= <>
##$CPDPRG1= <>
##$CPDPRG2= <>
##$CPDPRG3= <>
##$CPDPRG4= <mlev>
##$CPDPRG5= <mlev>
##$CPDPRG6= <mlev>
##$CPDPRG7= <mlev>
##$CPDPRG8= <mlev>
##$CPDPRGB= <>
##$CPDPRGT= <>
##$D= (0..31)
0 1.2 0 0 0 0 0 0 0 0.06 0 0.03 0 0 0 0 0.0002 0 0 0 0 0 0 0 0 0 0 0 0 
0 0 0 
##$DATE= 1678792764
##$DBL= (0..7)
120 120 120 120 120 120 120 120 
##$DBP= (0..7)
150 150 150 150 150 150 150 150 
##$DBP07= 0
##$DBPNAM0= <>
##$DBPNAM1= <>
##$DBPNAM2= <>
##$DBPNAM3= <>
##$DBPNAM4= <>
$$ [...]
##$SUBNAM3= <"">
##$SUBNAM4= <"">
##$SUBNAM5= <"">
##$SUBNAM6= <"">
##$SUBNAM7= <"">
##$SUBNAM8= <"">
##$SUBNAM9= <"">
##$SW= 18.05172834244
##$SWIBOX= (0..15)
0 0 2 0 0 0 0 0 0 0 0 0 0 0 0 0 
##$SW_h= 3612.71676300578
##$TD= 16384
##$TD0= 1
##$TE= 0
##$TE2= 300
##$TE3= 300
##$TEG= 300
##$TL= (0..7)
0 120 120 120 120 120 120 120 
##$TP= (0..7)
150 150 150 150 150 150 150 150 
##$TP07= 0
##$TPNAME0= <>
##$TPNAME1= <>
##$TPNAME2= <>
##$TPNAME3= <>
##$TPNAME4= <>
##$TPNAME5= <>
##$TPNAME6= <>
##$TPNAME7= <>
##$TPOAL= (0..7)
0.5 0.5 0.5 0.5 0.5 0.5 0.5 0.5 
##$TPOFFS= (0..7)
0 0 0 0 0 0 0 0 
##$TUNHIN= 0
##$TUNHOUT= 0
##$TUNXOUT= 0
##$USERA1= <user>
##$USERA2= <user>
##$USERA3= <user>
##$USERA4= <user>
##$USERA5= <user>
##$V9= 5
##$VALIST= <valist>
##$VCLIST= <CCCCCCCCCCCCCCC>
##$VD= 0
##$VDLIST= <DDDDDDDDDDDDDDD>
##$VPLIST= <PPPPPPPPPPPPPPP>
##$VTLIST= <TTTTTTTTTTTTTTT>
##$WBST= 1024
##$WBSW= 4
##$XGAIN= (0..3)
0 0 0 0 
##$XL= 0
##$YL= 0
##$YMAX_a= 104265
##$YMIN_a= -117388
##$ZGOPTNS= <>
##$ZL1= 120
##$ZL2= 120
##$ZL3= 120
##$ZL4= 120
##$ABSF1= 15.78656
##$ABSF2= -2.265291
##$ABSG= 5
##$ABSL= 3
##$ALPHA= 0
##$AQORDER= 0
##$ASSFAC= 0
##$ASSFACI= 0
##$ASSFACX= 0
##$ASSWID= 0
##$AUNMP= <proc_1d>
##$AZFE= 0.1
##$AZFW= 0.1
##$BCFW= 0
##$BC_mod= 2
##$BYTORDP= 0
##$COROFFS= 0
##$CY= -3
##$DATMOD= 1
##$DC= 0
##$DFILT= <>
##$DTYPP= 0
##$F1P= 0
##$F2P= 0
##$FCOR= 1
##$FTSIZE= 16384
##$FT_mod= 6
##$GAMMA= 0
##$GB= 0
##$INTBC= 1
##$INTSCL= 3.70164e-10
##$ISEN= 128
##$LB= 0.24
##$LEV0= 0
##$LPBIN= 0
##$MAXI= 10000
##$MC2= 0
##$MEAN= 0
##$ME_mod= 0
##$MI= 1.114404
##$NCOEF= 0
##$NC_proc= -9
##$NLEV= 6
##$NOISF1= 3.799351
##$NOISF2= 2.8
##$NSP= 0
##$NTH_PI= 0
##$NZP= 0
##$OFFSET= 15.73257
##$PC= 1
##$PHC0= -19109.9
##$PHC1= 15.80074
##$PH_mod= 1
##$PKNL= yes
##$PPARMOD= 0
##$PSCAL= 0
##$PSIGN= 0
##$REVERSE= no
##$SF= 200.130007800684
##$SI= 16384
##$SIGF1= 3
##$SIGF2= 2
##$SINO= 5.538805
##$SIOLD= 16384
##$SREGLST= <1H.CDCl3>
##$SSB= 0
##$STSI= 16384
##$STSR= 0
##$SW_p= 3612.71676300578
##$SYMM= 0
##$S_DEV= 0
##$TDeff= 16384
##$TDoff= 0
##$TI= <>
##$TILT= no
##$TM1= 0
##$TM2= 0
##$TOPLEV= 0
##$USERP1= <user>
##$USERP2= <user>
##$USERP3= <user>
##$USERP4= <user>
##$USERP5= <user>
##$WDW= 1
##$XDIM= 16384
##$YMAX_p= 530643949
##$YMIN_p= -2320877
$$ End of Bruker specific parameters
$$ ---------------------------------
##NTUPLES= NMR SPECTRUM
##VAR_NAME=  FREQUENCY,     SPECTRUM/REAL,   SPECTRUM/IMAG
##SYMBOL=    X,             R,               I
##VAR_TYPE=  INDEPENDENT,   DEPENDENT,       DEPENDENT
##VAR_FORM=  AFFN,          ASDF,            ASDF
##VAR_DIM=   16384,         16384,           16384
##UNITS=     HZ,            ARBITRARY UNITS, ARBITRARY UNITS
##FACTOR=    0.220516191357247, 1,           1
##FIRST=     3148.5592956889, 0,             0
##LAST=      -464.157467316879, 0,           0
##MIN=       -464.157467316879, -2320877,    0
##MAX=       3148.5592956889, 530643949,     0
$$ Real data points
##PAGE= N=1
##DATA TABLE= (X++(R..R)), XYDATA
$$ [...]
$$ plain form
5553 2769505 2745217 2367241 1364317 1829133 2530873 2559425 2617662 1981682 1539670 1627314
5543 1627314 1530128 1591697 2320425 2431984 3030492 1804053 1499854 1078079 1205169 1298669
5533 1298669 1286904 1531868 1157404 1280875 1414044 1426121 1806299 1434704 1235850 902720
5523 902720 1624949 1599166 1042097 1590660 1603465 1044651 319135 707183 1270210 1431260
5513 1431260 1453584 1594206 754264 765475 1570312 2384508 2549391 1793753 2248350 1902622
5503 1902622 1928436 1433141 1066766 1414658 1383412 1382334 1900619 1900056 1933702 2016625 1315204
5492 1315204 1046332 1887525 2027600 1498494 1032998 1240573 1957299 1321754 1625096 1845635
5482 1845635 1890445 2168817 1729590 1293714 1140250 1523646 1728687 1108422 1635173 1795555
$$ packed form
5553B769505k4288l77976j002924M64816P01740K8552N8237o35980m42012Q7644
5543A627314r7186O1569P28728J11559N98508j226439l04199m21775J27090R3500
5533A298669j1765K44964l74464J23471J33169J2077L80178l71595j98854l33130
5523I02720P22229k5783n57069N48563J2805n58814p25516L88048N63027J61050
5513A431260K2324J40622q39942J1211Q04837Q14196J64883p55638M54597l45728
5503A902622K5814m95295l66375L47892l1246j078N18285n63L3646Q2923p01421
5492A315204k68872Q41193J40075n29106m65496K07575P16726o35545L03342K20539
5482A845635M4810K78372m39227m35876j53464L83396K05041o20265N26751J60382
$$ plain form
5472 1795555 1271575 1193889 1310658 1433845 1869874 1232784 1944823 2089669 1872583 1871698
5462 1871698 1961653 1872158 1995921 858479 380976 155033 1110835 1891355 2207893 1422986
5452 1422986 1597845 1957436 1733477 2443207 2522318 2660201 2536939 2838300 2384181 1668184
5442 1668184 1497533 1993230 2178123 1930207 1081877 1888148 1145514 1222212 2037471 1963586
5432 1963586 2708792 2779236 2216183 1564542 1763353 1682877 2126068 2105111 1611967 1529530
5422 1529530 1329275 1011089 1361296 2728289 2248794 2143390 1649137 1642398 1686756 1524615
5412 1524615 787371 670538 1043263 1632421 894506 1149980 642443 819242 690616 698545
5402 698545 1771408 1951772 2389992 1288654 973590 1292290 2110478 2084980 1770569 2344710
$$ packed form
5472A795555n23980p7686J16769J23187M36029o37090P12039J44846k17086q85
5462A871698Q9955q9495J23763j137442m77503k25943R55802P80520L16538p84907
5452A422986J74859L59591k23959P09730P9111J37883j23262L01361m54119p15997
5442A668184j70651M95697J84893k47916q48330Q06271p42634P6698Q15259p3885
5432A963586P45206P0444n63053o51641J98811q0476M43191k0957m93144q2437
5422A529530k00255l18186L50207J366993m79495j05404m94253o739M4358j62141
5412A524615p37244j16833L72725N89158p37915K55474n07537J76799j28626P929
5402F98545J072863J80364M38220j101338l15064L18700Q18188k5498l14411N74141
$$ plain form
5392 2344710 2237040 2068322 1466058 953817 1845120 1393549 1117213 2323301 2553755
5383 2553755 2502752 2167967 1544795 1017507 346546 481979 798984 1375023 1700710 2291665
5373 2291665 2242095 2006540 2224753 2048620 1576531 686904 837423 1444447 1725336 1961500
5363 1961500 1879492 2003162 1811564 1956258 1468230 1772759 2204987 2223449 2468687 1810162
5353 1810162 1195339 1914105 2034730 1759668 1648287 1599769 2270308 2016754 2635213 2798634
5343 2798634 2534678 2107879 2368570 2577778 1903803 2462821 2732872 2794760 2270872 2356003
5333 2356003 2487342 2383530 1849413 2110131 2424932 1971650 1742270 1314329 1544956 2230475
5323 2230475 2511686 1955463 2277643 2651066 2427256 1924086 1861980 1814033 1625898 2130864
$$ packed form
5392B344710j07670j68718o02264n12241Q91303m51571k76336J206088K30454
5383B553755n1003l34785o23172n27288o70961J35433L17005N76039L25687N90955
5373B291665m9570k35555K18213j76133m72089q89627J50519O07024K80889K36164
5363A961500q2008J23670j91598J44694m88028L04529M32228J8462K45238o58525
5353A810162o14823P18766J20625k75062j11381m8518O70539k53554O18459J63421
5343B798634k63956m26799K60691K09208o73975N59018K70051O1888n23888Q5131
5333B356003J31339j03812n34117K60718L14801m53282k29380m27941K30627O85519
5323B230475K81211n56223L22180L73423k23810n03170o2106m7947j88135N04966
$$ plain form
5313 2130864 2115389 2476572 1924754 3051656 3313382 2532354 2441618 1937073 1240127 1121215
5303 1121215 1710102 1979051 1721972 1563083 1600457 1386089 1979742 1814274 1579294 2133491
5293 2133491 1925119 2216891 2867768 2181918 2572444 2840351 2540451 2931371 2328315 1957082
5283 1957082 2686391 2544082 2208893 2273272 1804563 1749129 1923763 2393597 2249329 2245246
5273 2245246 2582752 2299276 2293075 2291053 2599640 2607050 2299730 1763446 2132340 1400310 2595102
5262 2595102 3481850 3343571 2214052 2081029 1852493 1417044 2314306 2643011 2087405
5253 2087405 1428515 1825797 2050193 1802042 1146700 1689113 2132175 2039593 1856937 2210754
5243 2210754 2010724 1725756 1802250 1510324 1960454 1670217 994226 2064236 2458098 1786332
$$ packed form
5313B130864j5475L61183n51818J126902K61726p81028r0736n04545o96946j18912
5303A121215N88887K68949k57079j58889L7374k14368N93653j65468k34980N54197
5293B133491k08372K91772O50877o85850L90526K67907k99900L90920o03056l71233
5283A957082P29309j42309l35189O4379m68709n5434J74634M69834j44268m083
5273B245246L37506k83476o201k022L08587P410l07320n36284L68894p32030J194792
5262B595102Q86748j38279j129519j33023k28536m35449Q97262L28705n55606
5253B087405o58890L97282K24396k48151o55342N42413M43062r2582j82656L53817
5243B210754k00030k84968P6494k91926M50130k90237o75991J070010L93862o71766
$$ plain form
5233 1786332 2716594 3039352 2419462 2222689 2319049 1713419 1325483 2652717 2658425 2188870
5223 2188870 1222280 847491 796470 1378240 1739013 2066007 2272561 1960499 1932505 2414702
5213 2414702 2486770 1197874 840209 1445387 1045913 887861 1903243 2341405 2523734
5204 2523734 3305580 2817486 2419444 2300819 2748408 2180441 1927071 1755384 1269106 1536300
5194 1536300 1027931 1570111 1459721 2019849 2463281 1554752 2462575 2784525 2298888 2191841
5184 2191841 1485149 1680485 2254492 2240171 2717076 2437304 2230621 2311311 1774504 2111538
5174 2111538 2742966 2534490 2667301 2620464 2259568 2675914 2558466 2189872 2594288 3133982
5164 3133982 2823095 2821465 2655211 2475466 2177573 2084577 2100293 2503691 2363025 1549830
$$ packed form
5233A786332R30262L22758o19890j96773R6360o05630l87936J327234N708m69555
5223B188870r66590l74789n1021N81770L60773L26994K06554l12062k7994M82197
5213B414702P2068j288896l57665O05178l99474j58052J015382M38162J82329
5204B523734P81846m88094l98042j18625M47589n67967k53370j71687m86278K67194
5194A536300n08369N42180j10390N60128M43432r08529R07823L21950m85637j07047
5184B191841p06692J95336N74007j4321M76905k79772k06683Q0690n36807L37034
5174B111538O31428k08476J32811m6837l60896M16346j17448l68594M04416N39694
5164C133982l10887j630j66254j79745k97893r2996J5716M03398j40666q13195
$$ plain form
5154 1549830 2245644 2749720 2863067 3745020 2833233 3407675 4036896 4211583 4517940 5135832
5144 5135832 5850914 5694313 5666675 5504003 6219842 7040372 7023888 7790794 7109598 6649174
5134 6649174 6178164 6465425 6470378 6562024 7231932 6448685 6413090 6095545 6636377 6715499
5124 6715499 6041264 7141663 7145543 7694673 8112679 7954755 8438810 8228038 9037448 8325807
5114 8325807 8172361 8435812 8016418 7814096 7571293 7736688 7619337 6458620 6701787
5105 6701787 6764144 6671805 6755361 7756546 8400220 8697670 8590477 9002997 9427460 8512012
5095 8512012 7925350 8232884 8575231 8175971 7232769 7349387 8451461 8658831 8018470
5086 8018470 7347823 7619420 8233888 8524382 8570797 9526441 8919792 8436101 9348948 9079131
$$ packed form
5154A549830O95814N04076J13347Q81953r11787N74442O29221J74687L06357O17892
5144E135832P15082j56601k7638j62672P15839Q20530j6484P66906o81196m60424
5134F649174m71010K87261M953R1646O69908p83247l5595l17545N40832P9122
5124F715499o74235J100399L880N49130M18006j57924M84055k10772Q09410p11641
5114H325807j53446K63451m19394k02322k42803J65395j17351j160717K43167
5105F701787O2357r2339Q3556J001185O43674K97450j07193M12520M24463r15448
5095H512012n86662L07534L42347l99260r43202J16618J102074K07370o40361
5086H018470o70647K71597O14468K90494M6415R55644o06649m83691R12847k69817
$$ plain form
5076 9079131 8507306 8546399 8559817 8549716 8538419 8272057 7704001 7898666 8015868 6963745
5066 6963745 6434085 5919667 6973180 7109104 6111975 5738034 5343478 6036772 6314465
5057 6314465 5997937 5608012 5609977 5435611 5617907 5757767 5172568 5153200 5635574 5268898
5047 5268898 5045842 5333917 5353703 4723702 4978272 4714182 4924652 5003165 5554840 5739082
5037 5739082 5086786 4994708 4595077 5104873 4739927 4767965 3918791 3671751 3739159 4849622
5027 4849622 5115059 4591671 3767126 3227190 4015497 4076758 3945803 3402069 3425232 3567547
5017 3567547 3025363 3747258 3755922 3661408 3219457 3278100 3405671 3888303 4671455 4244158
5007 4244158 4100667 3663634 3419327 3640897 3941408 3381196 4049698 4028094 4840581 4960041
$$ packed form
5076I079131n71825L9093J3418j0101j1297k66362n68056J94665J17202j052123
5066F963745n29660n14418J053513J35924r97129l73941l94556O93294K77693
5057F314465l16528l89925J965j74366J82296J39860n85199j9368M82374l66676
5047E268898k23056K88075J9786o30001K54570k64090K10470P8513N51675J84242
5037E739082o52296r2078l99631N09796l64946K8038q49174k47040O7408J110463
5027D849622K65437n23388q24545n39936P88307O1261j30955n43734K3163J42315
5017C567547n42184P21895Q664r4514m41951N8643J27571M82632P83152m27297
5007D244158j43491m37033k44307K21570L00511n60212O68502k1604Q12487J19460
$$ plain form
4997 4960041 5396407 5477046 5280587 5628525 5292863 5384667 5470296 5562171 5146975 5126848
4987 5126848 4815319 4522506 4311507 3987811 3315122 3493727 4397501 4007689 3752220 4044011
4977 4044011 4541533 3678375 3530181 3953646 2938259 2962272 3464459 3485256 3141227 2676279
4967 2676279 2507139 2040722 2654966 2927879 2853053 2969027 2407001 3084195 2652023 2009225
4957 2009225 2166078 2073918 2509584 3103193 1661556 1751396 2406420 1901187 1320017 1079751
4947 1079751 1257680 1861219 2524142 1831465 2053675 2389712 1965368 2760611 2739773 2547218
4937 2547218 2838848 3220533 2840184 2336731 2369796 2337190 2714066 2781492 3280175 2636792
4927 2636792 2774164 2440886 2465604 2755520 2568761 2288120 2731730 2977627 2639444 2625629
$$ packed form
4997D960041M36366Q0639j96459L47938l35662R1804Q5629R1875m15196k0127
4987E126848l11529k92813k10999l23696o72689J78605R03774l89812k55469K91791
4977D044011M97522q63158j48194M23465j015387K4013N02187K0797l44029m64948
4967B676279j69140m66417O14244K72913p4826J15974n62026O77194m32172o42798
4957B009225J56853r2160M35666N93609j441637Q9840O55024n05233n81170k40266
4947A079751J77929O03539O62923o92677K22210L36037m24344P95243k0838j92555
4937B547218K91630L81685l80349n03453L3065l2606L76876O7426M98683o43383
4927B636792J37372l33278K4718K89916j86759k80641M43610K45897l38183j3815
$$ plain form
4917 2625629 2765854 2677773 2372114 2488626 3439533 3769506 3242499 3284947 3640560 3466702
4907 3466702 3156693 3540446 3731385 3510870 3400849 3272187 4245284 4153607 3388931 3354312
4897 3354312 3916921 4053293 3827348 4005003 3704149 3293438 3802534 3556136 3919042 3915607
4887 3915607 3549837 3627109 3741575 3932313 3852630 3851371 3277628 3867398 4659506 4619969
4877 4619969 4415745 4274082 4386749 3779436 2794279 3632008 3662314 4451911 4662191 4450995
4867 4450995 3797266 3958298 4323488 4226616 4855644 4638848 4538326 4176749 4118668 4762123
4857 4762123 5014983 4607752 4614662 5680210 5501041 5284057 5820527 5931245 5584303 5728349
4847 5728349 5817439 6320237 5883197 6384837 6625883 5957688 6865195 6831118 6238623 6891599
$$ packed form
4917B625629J40225q8081l05659J16512R50907L29973n27007M2448L55613j73858
4907C466702l10009L83753J90939k20515j10021j28662R73097r1677p64676l4619
4897C354312N62609J36372k25945J77655l00854m10711N09096k46398L62906l435
4887C915607l65770P7272J14466J90738p9683j259n73743N89770P92108l9537
4877D619969k04224j41663J12667o07313r85157Q37729L0306P89597K10280k11196
4867D450995o53729J61032L65190r6872O29028k16796j00522l61577n8081O43455
4857D762123K52860m07231O910J065548j79169k16984N36470J10718l46942J44046
4847E728349Q9090N02798m37040N01640K41046o68195R07507l4077n92495O52976
$$ plain form
4837 6891599 6667440 6354138 6984201 6949566 6603810 6952258 6984076 7132401 6500678 7315287
4827 7315287 7795971 7013976 7828552 7638443 7898809 8504300 9522183 9899922 9394547
4818 9394547 9866890 10269476 10531908 10829259 10393295 11113747 11410916 11753178 12350632 12360910
4808 12360910 12459803 12783469 13115754 14093964 14688096 15436815 16430455 16743644 17640078 19151112
4798 19151112 21180184 23060586 25559528 27987896 30284832 33059877 37723432 42865470
4790 42865470 48072084 54428679 61670489 67932194 72562097 72887068 70492800 66556340
4782 66556340 60520635 53719529 46100625 39750959 34989136 31288870 27564971 24744508
4774 24744508 22838776 21860596 19371737 17945918 16673983 15874179 15950093 15257994 14947137
$$ packed form
4837F891599k24159l13302O30063l4635l45756L48448L1818J48325o31723Q14609
4827G315287M80684p81995Q14576j90109K60366O05491J017883L77739n05375
4818I394547M72343M02586K62432K97351m35964P20452K97169L42262N97454J0278
4808A2360910R8893L23666L32285R78210N94132P48719R93640L13189Q96434J511034
4798A9151112K029072J880402K498942K428368K296936K775045M663555N142038
4790D2865470N206614O356595P241810O261705M629903L24971k394268l936460
4782F6556340o035705o801106p618904o349666m761823l700266l723899k820463
4774B4744508j905732r78180k488859j425819j271935p99804P5914o92099l10857
$$ plain form
4765 14947137 13991927 13389280 12550467 12579398 12427394 12307542 12221465 11863669 11119567 11816978
4755 11816978 11800989 12040155 12366431 12344765 12675424 12453621 12925760 12921146 12771734 12354107
4745 12354107 12655458 12976729 14499604 14571605 15314011 15313852 15059743 15491840 16155880 16663667
4735 16663667 17037283 17350086 18507497 19727517 21117068 22915072 24521981 26161830
4727 26161830 29503538 32699508 36238905 41010869 46171513 52515063 59051948 65338900
4719 65338900 69494561 71058491 69855001 66274143 60567918 54872918 48684681 42520955
4711 42520955 36529517 32167456 28545811 25514844 22321552 20235473 19087044 17712495
4703 17712495 17024262 15839321 15349680 15034903 14994095 13765715 12960080 12019634 11656825
$$ packed form
4765A4947137r55210o02647q38813K8931j52004j19852q6077l57796p44102O97411
4755A1816978j5989K39166L26276k1666L30659k21803M72139m614j49412m17627
4745A2354107L01351L21271J522875P2001P42406j59k54109M32097O64040N07787
4735A6663667L73616L12803J157411J220020J389551J798004J606909J639849
4727B6161830L341708L195970L539397M771964N160644O343550O536885O286952
4719F5338900M155661J563930j203490l580858n706225n695000o188237o163726
4711D2520955n991438m362061l621645l030967l193292k086079j148429j374549
4703A7712495o88233j184941m89641l14777m0808j228380q05635r40446l62809
$$ plain form
4694 11656825 10809192 9875511 9775725 10162445 9831259 9455707 9579162 8472035 8091024
4685 8091024 8400411 7623136 6791615 6608729 6676199 7241382 6472236 5773017 6700977 6668688
4675 6668688 6034489 6710361 6640606 5764205 5326582 5168529 5015907 5766953 6178396 5586556
4665 5586556 4526181 4895090 4669031 4283508 4862512 5908214 5885360 6099781 5463166
4656 5463166 4712192 4953277 4994640 5120711 5084907 4883946 5000327 4542597 4726930 3979062
4646 3979062 4261769 4281033 3864708 3871121 3980915 4418367 4729501 4532705 4353527 4446347
4636 4446347 5560799 5615299 5189875 5234796 4633290 4383789 4110194 4826141 4661329 5027650
4626 5027650 4790034 5216899 4566857 4957886 4741671 4093031 4904712 4691282 4436146 4286190
$$ packed form
4694A1656825q47633r33681r9786L86720l31186l75552J23455j107127l81011
4685H091024L09387p77275q31521j82886O7470N65183p69146o99219R27960l2289
4675F668688o34199O75872o9755q76401m37623j58053j52622P51046M11443n91840
4665E586556j060375L68909k26059l85523N79004J045702k2854K14421o36615
4656E463166p50974K41085M1363J26071l5804k00961J16381m57730J84333p47868
4646C979062K82707J9264m16325O413J09794M37452L11134j96796j79178R2820
4636D446347J114452N4500m25424M4921o01506k49501k73595P15947j64812L66321
4626E027650k37616M26865o50042L91029k16215o48640Q11681k13430k55136j49956
$$ plain form
4616 4286190 4302583 4540446 4220613 4326649 4472917 4086854 3769027 4007234 4504476 4272474
4606 4272474 5075305 4345279 3922673 3844701 4516325 4174546 3901044 4337395 4373809 4784151
4596 4784151 4602586 4432896 4171276 3878686 4151429 3858386 4316807 4808207 4503779 5156954
4586 5156954 4301528 4013440 4744218 3946401 3587865 4774656 5055881 4397780 4459472 4620268
4576 4620268 4758698 4664052 4968194 5343480 5068085 4700962 4764643 4860142 4687558 5336543
4566 5336543 4958543 4876443 5109932 5089604 4687904 5180170 5219559 5131961 4648617 5716464
4556 5716464 5524634 5016574 4988221 5092898 6185851 6271988 6249355 6086636 4656741 4846286
4546 4846286 5942324 5649704 5376188 5602902 6092001 6610737 6390936 6240754 6397858
$$ packed form
4616D286190J6393K37863l19833J06036J46268l86063l17827K38207M97242k32002
4606D272474Q02831p30026m22606p7972O71624l41779k73502M36351L6414M10342
4596D784151j81565j69690k61620k92590K72743k93043M58421M91400l04428O53175
4586E156954q55426k88088P30778p97817l58536J186791K81225o58101O1692J60796
4576D620268J38430r4646L04142L75286k75395l67123O3681R5499j72584O48985
4566E336543l78000q2100K33489k0328m01700M92266L9389q7598m83344J067847
4556E716464j91830n08060k8353J04677J092953Q6137k2633j62719j429895J89545
4546D846286J096038k92620k73516K26714M89099N18736k19801j50182J57104
$$ plain form
4537 6397858 6557854 6545959 6233925 6499914 6434111 6137961 6816332 6352751 6640033 7695678
4527 7695678 7916274 7904778 7329866 7871157 7938863 7816459 7953052 8640546 8876438 8732053
4517 8732053 8572732 8515804 8675421 8243956 9282613 9473876 9431087 10174801 10582512 10759554
4507 10759554 10588044 11731750 11342107 10864211 10989049 11090257 11598874 11905259 12275050
4498 12275050 12669283 12675908 13476989 14947858 14114226 14253841 16215625 16475230 16435175 17445380
4488 17445380 18634404 19694325 20671448 21026874 21705973 22899464 24738415 25564537 26376168
4479 26376168 28277382 30547294 31912115 33076739 34171735 35897271 37782991 38200130
4471 38200130 38214548 37758630 37803990 38690386 38230401 38751209 39359981 39503134 39517634 39929809
$$ packed form
4537F397858J59996j1895l12034K65989o5803k96150O78371m63581K87282J055645
4527G695678K20596j1496n74912N41291O7706j22404J36593O87494K35892j44385
4517H732053j59321n6928J59617m31465J038657J91263m2789P43714M07711J77042
4507A0759554j71510J143706l89643m77896J24838J01208N08617L06385L69791
4498A2275050L94233O625Q01081J470869q33632J39615J961784K59605m0055J010205
4488A7445380J189024J059921R77123L55426O79099J193491J838951Q26122Q11631
4479B6376168J901214K269912J364821J164624J094996J725536J885720M17139
4471C8200130J4418m55918M5360Q86396m59985N20808O08772J43153J4500M12175
$$ plain form
4461 39929809 40938868 41177677 41669173 42971538 43576261 44507819 45011840 45295456 45367792
4452 45367792 44297132 44172566 44785497 45623854 45389827 45287664 44788582 43914238 43582972
4443 43582972 43138784 42666574 42411901 42575115 43255015 44339413 45275806 46222902 46778280
4434 46778280 47880381 48516053 49625482 50650260 50406332 51001303 51787398 51949405 52000085
4425 52000085 52382018 52654543 52763468 52328443 51739363 50657691 49437803 49038233 47436575
4416 47436575 46190796 43949651 41855820 40181519 38689636 37075258 35152075 33151776
4408 33151776 31469952 30784680 29278491 28568332 27815677 26984442 25451077 24997408 23968370
4399 23968370 23317693 22836810 22022696 21819818 21342920 20721546 20402892 20282836 19115096
$$ packed form
4461C9929809J009059K38809M91496J302365O04723R31558N04021K83616P2336
4452D5367792j070660j24566O12931Q38357k34027j02163m99082q74344l31266
4443D3582972m44188m72210k54673J63214O79900J084398R36393R47096N55378
4434D6778280J102101O35672J109429J024778k43928N94971P86095J62007N0680
4425E2000085L81933K72525J08925m35025n89080j081672j219888l99570j601658
4416D7436575j245779k241145k093831j674301j491883j614378j923183k000299
4408C3151776j681824o85272j506189p10159p52655q31235j533365m53669j029038
4399B3968370o50677m80883q14114k02878m76898o21374l18654j20056j167740
$$ plain form
4390 19115096 19132981 19681435 18996057 19100855 18718087 19059693 19287759 18845135 19081140 18885396
4380 18885396 19512603 20065189 19868563 19042931 18823202 20225403 19832265 20210822 20271830
4371 20271830 20990688 21300452 20666055 21396033 22134783 22020029 21564850 21695156 22070182
4362 22070182 22315532 22410365 22229139 22319641 23209897 23354249 23261744 23511314 23713221 24837942
4352 24837942 26046461 27131892 28368864 29393756 30278467 31916717 33416511 35406992
4344 35406992 36880652 38930120 41300949 43463898 46251068 48225770 49574333 50690678
4336 50690678 52857860 54053879 55377192 56531017 57853176 57483667 57624201 57935785 58665334
4327 58665334 58922227 58695252 58417445 56971331 56296591 56148542 55434157 54368416 53554828
$$ packed form
4390A9115096J7885N48454o85378J04798l82768L41606K28066m42624K36005j95744
4380A8885396O27207N52586j96626q25632k19729J402201l93138L78557O1008
4371B0271830P18858L09764o34397P29978P38750j14754m55179J30306L75026
4362B2070182K45350R4833j81226R0502Q90256J44352r2505K49570K01907J124721
4352B4837942J208519J085431J236972J024892Q84711J638250J499794J990481
4344C5406992J473660K049468K370829K162949K787170J974702J348563J116345
4336E0690678K167182J196019J323313J153825J322159l69509J40534L11584P29549
4327E8665334K56893k26975k77807j446114o74740j48049p14385j065741q13588
$$ plain form
4318 53554828 52688912 51367317 50414699 50160094 49401278 49392644 49244135 49340404 49330404 49682732
4308 49682732 50576254 50663839 49913166 50443869 50505467 49640798 50445178 50259842 49719211 48699626
4298 48699626 49055173 49265736 48889041 48267951 47678167 47314348 46983412 46058685 44665339
4289 44665339 43989988 43545755 43233328 43622341 43299254 42319715 41647146 41310990 40532609
4280 40532609 39514755 38334531 37578312 36809917 35703891 33539761 32472162 31410394
4272 31410394 30421131 30077855 28045608 26997010 26168874 25797207 24915611 24466089 24046903
4263 24046903 23791201 23529998 23758721 23420099 23192692 22822864 22484010 22824429 23484422
4254 23484422 23360212 22985479 22758981 22547080 22672854 23610757 23739390 22273848 22552708
$$ packed form
4318E3554828q65916j321595r52618k54605p58816q634j48509R6269j0000L52328
4308D9682732Q93522Q7585p50673N30703O1598q64669Q04380j85336n40631j019585
4298D8699626L55547K10563l76695o21090n89784l63819l30936r24727j393346
4289D4665339o75351m44233l12427L89013l23087r79539o72569l36156p78381
4280D0532609j017854j180224p56219p68395j106026k164130j067599j061768
4272C1410394r89263l43276k032247j048598q28136l71667q81596m49522m19186
4263B4046903k55702k61203K28723l38622k27407l69828l38854L40419O59993
4254B3484422j24210l74733k26498k11901J25774R37903J28633j465542K78860
$$ plain form
4245 22552708 22986196 21810101 21795788 22073214 22269996 22011152 21678703 21867271 21239750
4236 21239750 21309561 21506496 21363865 20240110 20306900 20623355 21320884 21815033 21397205 21461801
4226 21461801 21374045 20627836 20052993 20022985 20653192 21009439 20656786 20893402 20980053 20910558
4216 20910558 21530772 21776775 20971900 20746479 21133596 21218690 20490491 20008663 20520866 21121300
4206 21121300 20766667 21096363 21050122 21110489 20787329 21136490 21163645 21177259 21989041 22549822
4196 22549822 22497728 22921376 23738359 24151716 24510446 24571704 24818467 24739166 25117928 25337125
4186 25337125 25549291 25846875 25461520 25534574 25284111 25569716 26258566 25456409 25583534 25216842
4176 25216842 25148003 25727397 25990043 25885646 25702758 26282292 26630594 26840312 26893895 27004206
$$ packed form
4245B2552708M33488j176095j4313K77426J96782k58844l32449J88568o27521
4236B1239750O9811J96935j42631j123755O6790L16455O97529M94149m17828O4596
4226B1461801q7756p46209n74843l0008O30207L56247l52653K36616Q6651o9495
4216B0910558O20214K46003q04875k25421L87117Q5094p28199m81828N12203O00434
4206B1121300l54633L29696m6241O0367l23160L49161K7155J3614Q11782N60781
4196B2549822n2094M23648Q16983M13357L58730O1258K46763p9301L78762K19197
4186B5337125K12166K97584l85355P3054k50463K85605O88850q02157J27125l66692
4176B5216842o8839N79394K62646j04397j82888N79534L48302K09718N3583J10311
$$ plain form
4166 27004206 26777242 26909928 27724946 27741432 27998103 28662178 27771699 28425188 29463289
4157 29463289 29951453 30471001 31609820 32144586 32269998 33326639 33342553 32943512 32987625
4148 32987625 33611656 33277614 33275198 33138084 33899066 34685990 35104406 35299315 35813724 36267403
4138 36267403 36695578 37055865 37048970 36968312 38286364 38496788 39540799 40185490 40587499 40783448
4128 40783448 40485334 41316493 41760892 41533771 42465742 43335745 43978071 45329798 45536968
4119 45536968 45961815 46390565 46979419 48307460 49964212 50032088 50001111 50503513 51697933
4110 51697933 53037800 55479468 57300624 59761367 62481730 65150807 67086099 68695671
4102 68695671 70138076 72357263 75231928 77762072 80913485 83202744 86605152 91291412
$$ packed form
4166B7004206k26964J32686Q15018J6486K56671O64075q90479O53489J038101
4157B9463289M88164N19548J138819N34766J25412J056641J5914l99041M4113
4148C2987625O24031l34042k416j37114P60982P86924M18416J94909N14409M53679
4138C6267403M28175L60287o895q0658J318052K10424J044011O44691M02009J95949
4128D0783448k98114Q31159M44399k27121R31971Q70003O42326J351727K07170
4119D5536968M24847M28750N88854J328041J656752O7876l0977N02402J194420
4110E1697933J339867K441668J821156K460743K720363K669077J935292J609572
4102F8695671J442405K219187K874665K530144L151413K289259L402408M686260
$$ plain form
4094 91291412 96802001 102464928 109484745 116775731 125603950 135486955 147384098 161284979
4086 161284979 177829915 198262301 221316788 246531651 271284033 290438501 299513195
4079 299513195 301819971 297207745 284781248 267316029 248362340 230771085 213863708
4072 213863708 200256174 189277612 179119017 169867921 161208750 152702048 144243272 135964800
4064 135964800 127272954 120674104 115335646 110764944 106316803 103381226 99748503 97811878
4056 97811878 95241673 93674165 93286722 92083721 92090277 91537819 91936469 92718342 92724320 93719184
4046 93719184 94426268 94970508 95580986 95868291 95923730 96651824 97599081 98397453 100061647
4037 100061647 102160370 105247699 108904068 112459076 117013218 122165451 128416396 134998300
$$ packed form
4094I1291412N510589N662927P019817P290986Q828219R883005J1897143J3900881
4086A61284979J6544936K0432386K3054487K5214863K4752382J9154468R074694
4079B99513195K306776m612226j2426497j7465219j8953689j7591255j6907377
4072B13863708j3607534j0978562j0158595r251096q659171q506702q458776q278472
4064A35964800q691846o598850n338458m570702m448141k935577l632723j936625
4056I7811878k570205j567508l87443j203001O556n52458L98650P81873N978R94864
4046I3719184P07084N44240O10478K87305N5439P28094R47257P98372J664194
4037A00061647K098723L087329L656369L555008M554142N152233O250945O581904
$$ plain form
4029 134998300 138234168 138082641 134565077 130076111 125253905 120338364 115048006 109664517
4021 109664517 104812518 101853538 98092118 95894643 93951569 92418015 90779801 89317351
4013 89317351 87513063 85617141 84870139 83359098 81548400 79689062 78129205 77618584
4005 77618584 76937947 75400436 73781508 72120019 70594410 68965764 68127925 67020664
3997 67020664 66662910 65953164 63667053 61919029 60586696 59029236 56938508 56170096 54512687
3988 54512687 53487964 52747918 51006165 49275112 48690518 48328636 47547759 47639603 47086730
3979 47086730 46242566 45268267 45589659 45408806 44145729 43720922 43709483 43067472 42759053
3970 42759053 42487928 42762202 43015310 43372649 43017371 42225156 40955196 39837336 39628419
$$ packed form
4029A34998300L235868j51527l517564m488966m822206m915541n290358n383489
4021A09664517m851999k958980l761420k197475j943074j533554j638214j462450
4013H9317351j804288j895922p47002j511041j810698j859338j559857n10621
4005G7618584o80637j537511j618928j661489j525609j628646q37839j107261
3997F7020664l57754p09746k286111j748024j332333j557460k090728p68412j657409
3988E4512687j024723p40046j741753j731053n84594l61882p80877R1844n52873
3979D7086730q44164r74299L21392j80853j263077m24807j1439o42011l08419
3970D2759053k71125K74274K53108L57339l55278p92215j269960j117860k08917
$$ plain form
3961 39628419 38097668 36804965 36792404 35948689 36107141 34898339 35531871 34582203 33446310
3952 33446310 32786755 32281413 31628172 31224384 30725393 30000008 30140002 29392089 28437166
3943 28437166 27144842 26789995 27492384 26597273 25586638 25634065 25759695 26200496 25794386
3934 25794386 25931377 27097464 26552458 27014697 27555794 27061273 26892463 27205332 27876554
3925 27876554 28524414 29032231 29009293 29690279 28973626 29849603 28869217 29187184 28725141 28169007
3915 28169007 27666237 26093505 25382391 26015253 25481697 24194867 24231409 24290967 23846883
3906 23846883 24044566 24473538 24172266 24331445 24558725 25005089 24515379 24433722 25222588 25439361
3896 25439361 25661160 25617085 25807101 25602850 25307492 24586172 25042238 25134207 25126706 24942906
$$ packed form
3961C9628419j530751j292703j2561q43715J58452j208802O33532r49668j135893
3952C3446310o59555n05342o53241m03788m98991p25385J39994p47913r54923
3943B8437166j292324l54847P02389q95111j010635M7427J25630M40801m06110
3934B5794386J36991J166087n45006M62239N41097m94521j68810L12869O71222
3925B7876554O47860N07817k2938O80986p16653Q75977r80386L17967m62043n56134
3915B8169007n02770j572732p11114O32862n33556j286830L6542N9558m44084
3906B3846883J97683M28972l01272J59179K27280M46364m89710q1657P88866K16773
3896B5439361K21799m4075J90016k04251k95358p21320M56066R1969p501j83800
$$ plain form
3886 24942906 25372931 25160465 25214788 25083436 24856549 24532995 24279079 24026020 23762584 24948008
3876 24948008 24960978 24871564 24140163 24329259 23943074 23765233 24220721 25038694 25194617 25114896
3866 25114896 25099110 26129232 26391956 26825640 27960581 27995762 28588117 28771266 29182983
3857 29182983 29432047 30088630 30561271 30184782 29539514 28552228 28672561 28903253 28468825
3848 28468825 28189909 27183685 27580653 27951237 27969588 28536754 28031855 27378249 27686866
3839 27686866 29111554 29770506 30035291 30102237 31039474 30946348 31417766 31898478 32066773 32627683
3829 32627683 33013524 33159812 32698249 32679084 33174091 32303833 32179863 32663710 33129826 33059331
3819 33059331 33644781 35170082 35183905 35000623 34883574 35541200 36084869 36002980 35575200 35837584
$$ packed form
3886B4942906M30025k12466N4323j31352k26887l23554k53916k53059k63436J185424
3876B4948008J2970q9414p31401J89096l86185j77841M55488Q17973J55923p9721
3866B5114896j5786J030122K62724M33684J134941L5181N92355J83149M11717
3857B9182983K49064O56583M72641l76489o45268r87286J20333K30692m34428
3848B8468825k78916j006224L96968L70584J8351N67166n04899o53606L08617
3839B7686866J424688O58952K64785O6946R37237r3126M71418M80712J68295N60910
3829C2627683L85841J46288m61563j9165M95007q70258j23970M83847M66116p0495
3819C3059331N85450J525301J3823j83282j17049O57626N43669q1889m27780K62384
$$ plain form
3809 35837584 36719258 36562430 36474847 36767502 37601258 38112395 39076190 39899850 40513910 40768438
3799 40768438 41187482 41040651 41858636 43436448 43226252 43338984 43272975 43481212 43710932
3790 43710932 44940081 45731070 47212425 48350193 48972273 49059626 49546841 50731359 51161660
3781 51161660 52124191 52602042 53451356 55420677 56636458 56934918 58180160 59668043 61270993
3772 61270993 62568723 63750777 65130683 65710713 66528442 68328789 69685855 70675528 71565329
3763 71565329 72578627 73858257 74282252 75236301 76472306 76493022 77606907 78807367 80484126
3754 80484126 82369139 83631408 84273665 85566602 86989431 87724080 88952329 90533155
3746 90533155 91994841 93313211 95315327 98180337 101095664 103402592 106020063 109227388
$$ packed form
3809C5837584Q81674j56828q7583K92655Q33756N11137R63795Q23660O14060K54528
3799D0768438M19044j46831Q17985J577812k10196J12732o6009K08237K29720
3790D3710932J229149P90989J481355J137768O22080Q7353M87215J184518M30301
3781E1161660R62531M77851Q49314J969321J215781K98460J245242J487883J602950
3772F1270993J297730J182054J379906N80030Q17729J800347J357066R89673Q89801
3763G1565329J013298J279630M23995R54049J236005K0716J113885J200460J676759
3754H0484126J885013J262269O42257J292937J422829P34649J228249J580826
3746I0533155J461686J318370K002116K865010K915327K306928K617471L207325
$$ plain form
3738 109227388 112101281 113868011 115413715 117263221 117821004 118538580 118359712 117115469
3730 117115469 116416964 115142707 114410900 112775473 111173289 109565923 108131923 106222978
3722 106222978 104040827 101644190 98942757 97913569 95733687 93328728 91082458 87902007
3714 87902007 84628583 82491013 80053435 75916890 73991783 71544908 68797521 67102651
3706 67102651 65167809 63207809 62482059 61230491 60438960 59643894 58620251 57539952 55902746
3697 55902746 56302051 56759570 56992300 56812437 57563592 58148269 59203890 60722506 61121470
3688 61121470 62176974 64082990 66344532 67107552 68820176 70039976 70455182 70658839 71791045
3679 71791045 72308479 71790008 71297794 69768056 69153981 69154278 68868982 68285718 67098945 67151332
$$ packed form
3738A09227388K873893J766730J545704J849506N57783P17576j78868j244243
3730A17115469o98505j274257p31807j635427j602184j607366j434000j908945
3722A06222978k182151k396637k701433j029188k179882k404959k246270l180451
3714H7902007l273424k137570k437578m136545j925107k446875k747387j694870
3706F7102651j934842j960000p25750j251568p91531p95066j023643j080299j637206
3697E5902746L99305M57519K32730j79863P51155N84677J055621J518616L98964
3688F1121470J055504J906016K261542P63020J712624J219800M15206K03657J132206
3679G1791045N17434n18471m92214j529738o14075K97k85296n83264j186773N2387
$$ plain form
3669 67151332 67297052 67371052 67762541 67188598 65347639 64296786 63158196 61739554 59731340
3660 59731340 57236655 54942509 52762402 50826472 49330781 48250654 47866323 45982714
3652 45982714 44146151 44362279 43631660 42847487 42569701 43359074 42807543 42080370 41695415
3643 41695415 41727883 42521876 43032674 43693349 44562514 45001288 44735400 45478925 45898141 46629483
3633 46629483 47278365 47087672 46919572 47203624 47552732 46956230 48504090 48713519 49352739
3624 49352739 49827261 49988422 51085437 52473108 52393151 53618294 55302278 56862352 58226991
3615 58226991 59366145 61880261 64094800 65741356 68508938 71639333 73962163 76355986
3607 76355986 79610671 82461636 85223864 88208157 90909061 93457573 95406675 97399942
$$ packed form
3669F7151332J45720P4000L91489n73943j840959j050853j138590j418642k008214
3660E9731340k494685k294146k180107j935930j495691j080127l84331j883609
3652D5982714j836563K16128p30619p84173k77786P89373n51531p27173l84955
3643D1695415L2468P93993N10798O60675Q69165M38774k65888P43525M19216P31342
3633D6629483O48882j90693j68100K84052L49108n96502J547860K09429O39220
3624D9352739M74522J61161J097015J387671p9957J225143J683984J560074J364639
3615E8226991J139154K514116K214539J646556K767582L130395K322830K393823
3607G6355986L254685K850965K762228K984293K700904K548512J949102J993267
$$ plain form
3599 97399942 99361400 100377566 101500380 103078579 103709014 104202507 103809226 103590579 102693546
3590 102693546 102978513 102241523 100707838 100200326 100474067 100352983 100740980 101121462 102522342
3581 102522342 104592871 105340536 108244140 110765921 113509605 115690940 119683818 122564229
3573 122564229 124701235 127223315 129906759 132528853 134328344 136593969 137828545 139031362
3565 139031362 141162611 142447202 143836177 145757468 147919736 149728339 152560589 155862966
3557 155862966 157449991 160536102 161950106 163605985 165730855 166686548 166615408 166663414 166940565
3548 166940565 165460013 163230714 162139902 160410392 158029089 155430682 153518644 150748094
3540 150748094 147492313 143400238 139853746 136231212 131850273 128524533 123695071 119364494
$$ packed form
3599I7399942J961458J016166J122814J578199O30435M93493l93281k18647q97033
3590A02693546K84967p36990j533685n07512K73741j21084L87997L80482J400880
3581A02522342K070529P47665K903604K521781K743684K181335L992878K880411
3573A22564229K137006K522080K683444K622094J799491K265625J234576J202817
3565A39031362K131249J284591J388975J921291K162268J808603K832250L302377
3557A55862966J587025L086111J414004J655879K124870R55693p1140M8006K77151
3548A66940565j480552k229299j090812j729510k381303k598407j912038k770550
3540A50748094l255781m092075l546492l622534m380939l325740m829462m330577
$$ plain form
3532 119364494 115620633 111219319 107656016 104238599 101313375 98987346 96849045 94511325
3524 94511325 92427357 90608999 89433162 89607452 88731298 89632141 90802174 91793637 94196436
3515 94196436 96658811 99641596 101993983 105590756 109118329 113125733 117063969 121407853
3507 121407853 125592269 128560886 131876714 133163466 133782536 132962896 131318266 128180646
3499 128180646 124781077 120570721 115031747 109318844 102869892 96459302 91058634 85921267
3491 85921267 81524421 76651296 72051905 68319427 65224011 62470789 60096536 56890241
3483 56890241 54184271 53697765 50768268 49097299 47798012 45802773 44339518 43467858
3475 43467858 42834696 41927671 40219459 39080185 37906655 37363990 37093239 35797666 34772936
$$ packed form
3532A19364494l743861m401314l563303l417417k925224k326029k138301k337720
3524I4511325k083968j818358j175837J74290q76154R00843J170033R91463K402799
3515I4196436K462375K982785K352387L596773L527573M007404L938236M343884
3507A21407853M184416K968617L315828J286752O19070q19640j644630l137620
3499A28180646l399569m210356n538974n712903o448952o410590n400668n137367
3491H5921267m396846m873125m599391l732478l095416k753222k374253l206295
3483E6890241k705970m86506k929497j670969j299287j995239j463255q71660
3475D3467858o33162r07025j708212j139274j173530n42665k70751j295573j024730
$$ plain form
3466 34772936 33931896 33433534 31683156 31590237 32610415 32039510 30894571 29697663 29535747
3457 29535747 29543072 29563921 28559022 28459114 28464672 28321753 28430073 28217849 27450596 27038700
3447 27038700 26910680 27179142 26453649 25719990 26119123 24915932 24355355 25187576 24931481
3438 24931481 24328384 25398718 25302520 25026829 24912524 24378767 24186540 23696124 23888967
3429 23888967 24363063 24667740 24472488 24647286 24501436 25074493 24859349 24961623 25140121
3420 25140121 24087662 24567036 25207966 25148061 24889852 25394751 26385080 26658107 26345317
3411 26345317 26436332 26757588 27144464 27359409 27582740 27816711 28423801 28649317 30283741
3402 30283741 31262426 31200820 31142778 31469657 31965876 32599693 33183628 34261152 33515408 33930717
$$ packed form
3466C4772936q41040m98362j750378r2919J020178n70905j144939j196908j61916
3457B9535747P325K0849j004899r9908N558j42919J08320k12224p67253m11896
3447B7038700j28020K68462p25493p33659L99133j203191n60577Q32221k56095
3438B4931481o03097J070334r6198k75691j14305n33757j92227m90416J92843
3429B3888967M74096L04677j95252J74798j45850N73057k15144J02274J78498
3420B5140121j052459M79374O40930n9905k58209N04899R90329K73027l12790
3411B6345317R1015L21256L86876K14945K23331K33971O07090K25516J634424
3402C0283741R78685o1606n8042L26879M96219O33817N83935J077524p45744M15309
$$ plain form
3392 33930717 33756143 34747153 36048335 37107769 38154269 37893505 38602693 39148351 39308420
3383 39308420 40409240 41569974 42061422 42629814 42814010 43842809 44972448 45922069 46479012
3374 46479012 46478036 47380595 48859668 50228090 51150764 51819325 52597361 52461462 52893654 53898035
3364 53898035 55417982 55361524 55989964 56806563 57508284 58594908 60255197 60888507 61857903
3355 61857903 63452692 64425774 65594888 66812445 68198112 68265502 69799634 70456419 70793793
3346 70793793 72191366 73461153 74639056 76142697 77679932 78265359 79246024 80433174
3338 80433174 82088262 84289431 86314064 87241121 89338347 91487109 93456354 95581593
3330 95581593 97912190 99803846 101204717 104200728 106798193 108867691 111133722 114159237
$$ packed form
3392C3930717j74574R91010J301182J059434J046500k60764P09188N45658J60069
3383C9308420J100820J160734M91448N68392J84196J028799J129639R49621N56943
3374D6479012r76R02559J479073J368422R22674O68561P78036j35899M32192J004381
3364E3898035J519947n6458O28440Q16599P01721J086624J660289O33310R69396
3355F1857903J594789R73082J169114J217557J385667O7390J534132O56785L37374
3346G0793793J397573J269787J177903J503641J537235N85427R80665J187150
3338H0433174J655088K201169K024633R27057K097226K148762J969245K125239
3330I5581593K330597J891656J400871K996011K597465K069498K266031L025515
$$ plain form
3322 114159237 117164867 120558706 124053182 128589408 132693291 135851725 140146419 143401329
3314 143401329 146470606 149578359 151843644 154499558 157462772 160078701 161681943 163196283
3306 163196283 165700020 168120604 170452981 172412512 174341293 177292998 179275285 180785089
3298 180785089 181987999 183410306 184649774 184449726 185478825 185114229 184047103 183405309
3290 183405309 182566531 182129407 180864857 180314764 179925060 178201326 176393267 175077807 173768711
3281 173768711 171557782 170139127 168937405 166848015 164503223 162161051 160040924 159009085
3273 159009085 157253860 154236542 150739634 146995910 143532577 140606756 136468180 132438726
3265 132438726 128540658 124678958 121849929 118417672 115051287 111792867 109766830 106974832
$$ packed form
3322A14159237L005630L393839L494476M536226M103883L158434M294694L254910
3314A43401329L069277L107753K265285K655914K963214K615929J603242J514340
3306A63196283K503737K420584K332377J959531J928781K951705J982287J509804
3298A80785089J202910J422307J239468k00048J029099l64596j067126o41794
3290A83405309q38778m37124j264550n50093l89704j723734j808059j315460j309096
3281A73768711k210929j418655j201722k089390k344792k342172k120127j031839
3273A59009085j755225l017318l496908l743724l463333k925821m138576m029454
3265A32438726l898068l861700k829029l432257l366385l258420k026037k791998
$$ plain form
3257 106974832 104505995 103155580 100792188 98641124 96034090 93560969 91364872 89698944
3249 89698944 88044884 86024841 84725292 83869457 81683107 80944875 79550494 78349360
3241 78349360 78008693 76478400 75963353 74516760 73014763 71997987 70990311 70079618 69317391
3232 69317391 68741221 68068200 66931034 65827075 64692281 64233510 63377731 62775160 62230946
3223 62230946 60911131 60583472 60229116 59718218 59555359 59589934 59640917 58827598 58377114 58053411
3213 58053411 56457416 55688078 54941818 53918125 53901645 52203099 50823198 49995758 49881283
3204 49881283 50154212 50083665 49466968 48896282 48251198 48119072 47926006 47180041 45881953
3195 45881953 45501556 45004657 44143967 43882067 44540107 44709557 43957408 43377944 43527288
$$ packed form
3257A06974832k468837j350415k363392k151064k607034k473121k196097j665928
3249H9698944j654060k020043j299549q55835k186350p38232j394381j201134
3241G8349360l40667j530293n15047j446593j501997j016776j007676r10693p62227
3232F9317391n76170o73021j137166j103959j134794m58771q55779o02571n44214
3223F2230946j319815l27659l54356n10898j62859L4575N0983q13319m50484l23703
3213E8053411j595995p69338p46260j023693j6480j698546j379901q27440j14475
3204D9881283K72929p0547o16697n70686o45084j32126j93066p45965j298088
3195D5881953l80397m96899q60690k61900O58040J69450p52149n79464J49344
$$ plain form
3186 43527288 43551466 43326594 43822039 43919500 43539247 43053130 43684121 44624994 45489038 46283434
3176 46283434 47313130 48385345 49416779 51024444 52513293 53603397 55979576 57943118
3168 57943118 59674641 60654583 62431434 64613139 66420185 68613909 70624205 72353669
3160 72353669 74724564 76083020 77410330 78441890 79950926 81751134 83348895 84961820
3152 84961820 87298044 89464229 91791073 93519212 95454862 97797364 101080801 104942280
3144 104942280 109136914 113904406 118269176 122862172 127178551 132193796 136595642 140774110
3136 140774110 144285633 148023537 150216046 151416991 151629080 150910773 148960107 147037742
3128 147037742 142919370 138850911 134623921 129539944 125221550 121693622 117911185 114693669
$$ packed form
3186D3527288K4178k24872M95445R7461l80253m86117O30991R40873Q64044P94396
3176D6283434J029696J072215J031434J607665J488849J090104K376179J963542
3168E7943118J731523R79942J776851K181705J807046K193724K010296J729464
3160G2353669K370895J358456J327310J031560J509036J800208J597761J612925
3152H4961820K336224K166185K326844J728139J935650K342502L283437L861479
3144A04942280M194634M767492M364770M592996M316379N015245M401846M178468
3136A40774110L511523L737904K192509J200945K12089p18307j950666j922365
3128A47037742m118372m068459m226990n083977m318394l527928l782437l217516
$$ plain form
3120 114693669 111939967 108954877 107205707 104394571 102103925 101541763 99263041 96634603
3112 96634603 93891529 90676987 87959069 83859487 79349502 75910803 71572723 67630377
3104 67630377 64035422 60404505 57341761 53845084 50627763 47965500 45661868 44389194
3096 44389194 43333316 40848188 38870334 37148245 36521544 34770423 33944538 33517171 33342277
3087 33342277 32356631 30350128 29962645 30286033 29225610 27926959 28316278 27822297 26070223
3078 26070223 25969995 25896943 25808102 25197131 24887891 24582976 23873779 23602529 22996649 22611788
3068 22611788 21945645 22266170 21914474 21366640 20663684 20062176 19825092 19327917 19102924
3059 19102924 19088389 19398735 19322786 18087680 18218898 18056696 18210978 19284045 19626749
$$ packed form
3120A14693669k753702k985090j749170k811136k290646n62162k278722k628438
3112I6634603k743074l214542k717918m099582m509985l438699m338080l942346
3104F7630377l594955l630917l062744l496677l217321k662263k303632j272674
3096D4389194j055878k485128j977854j722089o26701j751121q25885m27367j74894
3087C3342277r85646k006503l87483L23388j060423j298651L89319m93981j752074
3078B6070223j00228p3052q8841o10971l09240l04915p09197k71250o05880l84861
3068B2611788o66143L20525l51696n47834p02956o01508k37084m97175k24993
3059A9102924j4535L10346p5949j235106J31218j62202J54282J073067L42704
$$ plain form
3050 19626749 18064279 17406565 17137843 17594087 17694470 16877548 17215375 17442809 16527102
3041 16527102 16181763 16182253 15442978 15797453 15859967 15548828 17058469 16933302 17145681 17698056
3031 17698056 17846946 16991525 16641572 17026927 16384884 15850198 15355022 15075777 15273249
3022 15273249 16292569 15826205 16051719 15624282 15808810 15640556 15876186 15945870 15623917
3013 15623917 15275240 15094423 15267038 15261607 14903314 15246028 15394586 15684850 16369670 16635139
3003 16635139 15922278 15673732 15503364 15819593 16280027 16200552 16154801 16260374 16081829 16505881
2993 16505881 16329783 16291293 16353392 16748972 17399052 17775067 17284691 16990324 17480610 18153466
2983 18153466 17896992 17800861 17737163 17586085 17317887 16954677 18049916 18418117 18814666 19032312
$$ packed form
3050A9626749j562470o57714k68722M56244J00383q16922L37827K27434r15707
3041A6527102l45339M90p39275L54475O2514l11139J509641j25167K12379N52375
3031A7698056J48890q55421l49953L85355o42043n34686m95176k79245J97472
3022A5273249J019320m66364K25514m27437J84528j68254K35630O9684l21953
3013A5623917l48677j80817J72615n431l58293L42714J48558K90264O84820K65469
3003A6635139p12861k48546j70368L16229M60434p9475m5751J05573j78545M24052
2993A6505881j76098l8490O2099L95580O50080L76015m90376k94367M90286O72856
2983A8153466k56474r6131o3698j51078k68198l63210J095239L68201L96549K17646
$$ plain form
2973 19032312 19394105 19499773 19698213 19915653 19795096 20037643 20619682 21248580 21268543 21716472
2963 21716472 22597531 21744845 22371271 22981929 23343849 23548524 23939597 24898294 24487239
2954 24487239 24768061 25375311 25378875 26285440 27136391 28035231 28395255 28623351 28897475 30145001
2944 30145001 30989632 31115658 31027673 31681522 32870978 33704717 33845972 34763352 35588150
2935 35588150 35950708 37450464 37673053 38727735 39918705 41310141 41754315 42480297 43826146
2926 43826146 44932020 46683279 47534134 48784265 49212654 49521996 51270020 53395131 53845002
2917 53845002 55222471 56841021 58367072 60068133 61088323 61627249 63593150 65528899
2909 65528899 67764025 71201187 73383216 75082331 76437161 80199874 82403293 85416225
$$ packed form
2973A9032312L61793J05668J98440K17440j20557K42547N82039O28898J9963M47929
2963B1716472Q81059q52686O26426O10658L61920K04675L91073R58697m11055
2954B4487239K80822O07250L564R06565Q50951Q98840L60024K28096K74124J247526
2944C0145001Q44631J26026q7985O53849J189456Q33739J41255R17380Q24798
2935C5588150L62558J499756K22589J054682J190970J391436M44174P25982J345849
2926D3826146J105874J751259Q50855J250131M28389L09342J748024K125111M49871
2917E3845002J377469J618550J526051J701061J020190N38926J965901J935749
2909F5528899K235126L437162K182029J699115J354830L762713K203419L012932
$$ plain form
2901 85416225 88801311 91957209 97064298 102182059 106348451 111858667 118224646 124567968
2893 124567968 131979526 141059034 151698426 162807849 175011697 188795649 201686399
2886 201686399 210476216 216367835 218475496 218963640 218566157 218096986 217568253 218324518 220914976
2877 220914976 224997462 230601960 237718227 245215186 255137696 265834611 277790283 291083506
2869 291083506 306910858 325335688 345749493 370329452 398001893 426487307 454546846
2862 454546846 479214407 501424882 519145920 529087172 530643949 523768601 507515690
2855 507515690 485556074 459867011 433094933 408825218 387982743 371122312 359426079
2848 359426079 353608901 352163317 354887987 358278206 358520768 353094816 337690975 316581815
$$ packed form
2901H5416225L385086L155898N107089N117761M166392N510216O365979O343322
2893A24567968P411558R079508J0639392J1109423J2203848J3783952J2890750
2886B01686399Q789817N891619K107661M88144l97483m69171n28733P56265K590458
2877B20914976M082486N604498P116267P496959R922510J0696915J1955672J3293223
2869B91083506J5827352J8424830K0413805K4579959K7672441K8485414K8059539
2862D54546846K4667561K2210475J7721038R941252J556777o875348j6252911
2855E07515690k1959616k5689063k6772078k4269715k0842475j6860431j1696233
2848C59426079n817178j445584K724670L390219K42562n425952j5403841k1109160
$$ plain form
2840 316581815 292646898 266839424 242257319 219112088 199496973 182826105 168421697
2833 168421697 155770362 144946030 135078068 128039186 120841542 114177896 107931838 103082354
2825 103082354 98414460 94649124 90859759 87003392 82924393 79066732 76385351 73444945
2817 73444945 70979680 69406398 65970641 63465182 61246764 59496597 57774207 55132673
2809 55132673 53307931 51575977 50493867 49149268 46401556 45192310 43800596 42962633
2801 42962633 41786014 40709200 39195267 38853422 38369465 37664826 36248134 35188293 34361758
2792 34361758 33729062 33417653 32891365 31434509 30818083 31197178 30264351 30000522 29465607
2783 29465607 29480944 28987837 28536148 27802005 26691279 26677132 26762238 26598037 26318121 25633798
$$ packed form
2840C16581815k3934917k5807474k4582105k3145231j9615115j6670868j4404408
2833A68421697j2651335j0824332r867962p038882p197644o663646o246058m849484
2825A03082354m667894l765336l789365l856367m078999l857661k681381k940406
2817G3444945k465265j573282l435757k505459k218418j750167j722390k641534
2809E5132673j824742j731954j082110j344599k747712j209246j391714q37963
2801D2962633j176619j076814j513933l41845m83957p04639j416692j059841q26535
2792C4361758o32696l11409n26288j456856o16426L79095r32827k63829n34915
2783B9465607J5337m93107m51689p34143j110726j4147Q5106j64201k79916o84323
$$ plain form
2773 25633798 25986721 25003013 24711774 24272302 23374776 22281403 22534822 22034699 21251900
2764 21251900 20795869 20551533 19547545 18850393 18355450 17563263 17705058 17417641 16047561
2755 16047561 15273046 15067713 14785180 14603539 14141325 14080504 14197505 14564349 13650532 12815241
2745 12815241 13458607 13419595 12705747 12651491 12528042 11741372 11863402 12130309 11495462 11512099
2735 11512099 11245059 10781560 11053529 10777171 10198067 10252837 10391555 10952719 10597263 9645380
2725 9645380 9618342 10050078 9721262 9006467 8916330 9512699 9316973 8497214 8954344 8585805
2715 8585805 7928522 7726097 7310847 7150462 7976179 7837118 7209670 7007816 7255190 7071735
2705 7071735 6991582 7040297 7072822 6855840 6813413 7383778 7181835 6970567 6716998 6196724
$$ packed form
2773B5633798L52923r83708k91239m39472q97526j093373K53419n00123p82799
2764B1251900m56031k44336j003988o97152m94943p92187J41795k87417j370080
2755A6047561p74515k05333k82533j81641m62214o0821J17001L66844r13817q35291
2745A2815241O43366l9012p13848n4256j23449p86670J22030K66907o34847J6637
2735A1512099k67040m63499K71969k76358n79104N4770J38718N61164l55456r51883
2725I645380k7038M31736l28816p14795r0137N96369j95726q19759M57130l68539
2715H585805o57283k02425m15250j60385Q25717j39061o27448k01854K47374j83455
2705G071735q0153M8715L2525k16982m2427N70365k01943k11268k53569n20274
$$ plain form
2695 6196724 6912673 7211212 6784240 6485756 6760732 6261264 6469374 6583308 6093756 5495358
2685 5495358 6039969 6502742 5824191 5834445 5862754 5399840 5556748 5535827 5526386 5184157
2675 5184157 4946392 4892183 5316303 5932328 5408684 4691918 5018471 5103541 5278704 5524882
2665 5524882 4773168 4315384 5243173 5291105 4666270 4274830 4523495 4483354 4583489 5412248
2655 5412248 5510161 5768666 4882410 4570903 4980387 4033183 4095875 4529301 4239549 4957388
2645 4957388 4068088 4292178 3946116 3559504 3862038 3822673 4274683 3240946 2930745 3977169
2635 3977169 4747803 4455217 3894097 3850443 4119994 4276501 4089225 3030668 2593811 2830722
2625 2830722 3256027 3921219 4051472 4016377 3318323 3400913 2996174 3708906 3504169 3591663
$$ packed form
2695F196724P15949K98539m26972k98484K74976m99468K08110J13934m89552n98398
2685E495358N44611M62773o78551J0254K8309m62914J56908k0921r441l42229
2675E184157k37765n4209M24120O16025n23644p16766L26553Q5070J75163K46178
2665E524882p51714m57784R27789M7932o24835l91440K48665m0141J00135Q28759
2655E412248R7913K58505q86256l11507M09484r47204O2692M33426k89752P17839
2645D957388q89300K24090l46062l86612L02534l9365M52010j033737l10201J046424
2635C977169P70634k92586n61120m3654K69551J56507j87276j058557m36857K36911
2625B830722M25305O65192J30253l5095o98054Q2590m04739P12732k04737Q7494
$$ plain form
2615 3591663 3175053 3680163 2616973 3017090 3200414 3010470 2840051 2876193 4296842
2606 4296842 4466938 4198501 4628033 4342003 4608394 4905570 4584553 3958122 3745757 4246762
2596 4246762 3396934 3318518 3682197 4225005 3994318 3981877 4341704 3627083 3386186 3795784
2586 3795784 3698937 3881396 5446740 5885870 4225447 4267936 3591017 4676728 5385038
2577 5385038 5261604 5420834 5108260 4509541 5042773 5443731 4869650 3986954 4274388 4608231
2567 4608231 3946512 4398198 4971676 4591265 4747862 4048882 3922017 5001899 4266004
2558 4266004 4229133 4016462 3854954 3728977 3714840 3517523 3071380 2654270 3640406 3814722
2548 3814722 3352253 3868232 3371342 2669304 2874245 3763110 3125271 2188393 2138526 2050915
$$ packed form
2615C591663m16610N05110j063190M00117J83324j89944j70419L6142J420649
2606D296842J70096k68437M29532k86030K66391K97176l21017o26431k12365N01005
2596D246762q49828p8416L63679N42808k30687j2441L59827p14621k40897M09598
2586C795784r6847J82459J565344M39130j660423M2489o76919J085711P08310
2577E385038j23434J59230l12574n98719N33232M00958n74081q82696K87434L33843
2567D608231o61719M51686N73478l80411J56597o98980j26865J079882p35895
2558D266004l6871k12671j61508j25977j4137j97317m46143m17110R86136J74316
2548C814722m62469N15979m96890p02038K04941Q88865o37839r36878m9867q7611
$$ plain form
2538 2050915 2145487 2221858 1954545 2123234 2720761 2594327 1555093 1549038 2261254 2290956
2528 2290956 1717051 1894178 2420457 2296575 2095988 1355306 2394314 2148189 1883772
2519 1883772 1143544 1197869 955582 864101 731289 904350 1935863 2232895 1399589 1257328
2509 1257328 1488018 1393760 1729354 1879264 2224128 1351512 1505423 1085898 1080926 589118
2499 589118 636261 470821 517925 419024 1972833 2245063 2259197 1781096 1012511 911380
2489 911380 1591761 1636495 1348143 417484 576661 636494 1106261 729454 645955 1662076
2479 1662076 1724237 526081 1770703 1981844 490596 729162 584457 1376739 2022282
2470 2022282 1252631 1043081 1933711 1548844 886615 1069770 684246 960396 1285430 857892
$$ packed form
2538B050915R4572P6371k67313J68689N97527j26434j039234o055P12216K9702
2528B290956n73905J77127N26279j23882k00587p40682J039008k46125k64417
2519A883772p40228N4325k42287r1481j32812J73061J031513K97032q33306j42261
2509A257328K30690r4258L35594J49910L44864q72616J53911m19525m972m91808
2499E89118M7143j65440M7104r8901J553809K72230J4134m78101p68585j01131
2489I11380O80381M4734k88352r30659J59177N9833M69767l76807q3499J016121
2479A662076O2161j198156J244622K11141j491248K38566j44705P92282O45543
2470B022282p69651k09550Q90630l84867o62229J83155l85524K76150L25034m27538
$$ plain form
2460 857892 1070042 673789 391791 655063 1556702 1411935 1497756 1055683 1723328 1999432
2450 1999432 1144756 298940 372262 -6411 142180 542114 381658 553916 217708 702779
2440 702779 171788 649244 1066679 580808 405836 453398 974557 215302 -643664 -488707
2430 -488707 647635 277052 140888 334613 840424 582406 899335 488243 297243 1005173
2420 1005173 1060175 1373344 638407 322823 616725 412235 320248 483337 983361 544381
2410 544381 641314 739120 859688 1053856 939980 609052 338461 1517091 1204767 372617
2400 372617 113436 60711 313817 95334 648346 534986 1022782 656250 952229 585025
2390 585025 860643 1134570 795822 902354 198173 458179 1472855 1354854 985885 295369
$$ packed form
2460H57892K12150l96253k81998K63272R01639j44767Q5821m42073O67645K76104
2450A999432q54676q45816P3322l78673J48591L99934j60456J72258l36208M85071
2440G02779n30991M77456M17435m85871j74972M7562N21159p59255q58966J54957
2430d88707J136342l70583j36164J93725N05811k58018L16929m11092j91000P07930
2420A005173N5002L13169p34937l15584K93902k04490r1987J63089N00024m38980
2410E44381R6933R7806J20568J94168j13876l30928k70591J178630l12324q32150
2400C72617k59181n2725K53106k18483N53012j13360M87796l66532K95979l67204
2390E85025K75618K73927l38748J06532p04181K60006J014676j18001l68969o90516
$$ plain form
2380 295369 850137 1225154 998722 1144160 152130 618049 1162255 2206699 3321805
2371 3321805 2758357 2214278 1739106 2219656 2074271 1376109 1521009 1099002 1116622 1254240
2361 1254240 1202795 975008 1055393 458514 606414 834649 462400 -51219 487572 1069472
2351 1069472 1653098 1463780 1060042 480353 223889 484499 434931 358272 868426 428843
2341 428843 798159 1199758 1474591 1461001 713092 1496037 1737289 1055799 505406 367918
2331 367918 357369 1395697 1208755 491443 438891 619727 1123110 635906 1027308 868268
2321 868268 951969 1226679 306786 -315240 -626968 92884 215854 618800 1111451 1027628
2311 1027628 1325928 950800 1431198 810952 364624 1092079 755952 -226468 341937 982089
$$ packed form
2380B95369N54768L75017k26432J45438r92030M65919N44206J044444J115106
2371C321805n63448n44079m75172M80550j45385o98162J44900m22007J7620J37618
2361A254240n1445k27787Q0385n96879J47900K28235l72249n13619N38791N81900
2351A069472N83626j89318m03738n79689k56464K60610m9568p6659N10154m39583
2341D28843L69316M01599K74833j3590p47909P82945K41252o81490n50393j37488
2331C67918j0549J038328j86942p17312n2552J80836N03383m87204L91402j59040
2321H68268Q3701K74710r19893o22026l11728P19852J22970M02946M92651q3823
2311A027628K98300l75128M80398o20246m46328P27455l36127r82420N68405O40152
$$ plain form
2301 982089 606583 1010480 480145 -54007 197879 1102022 326608 240530 557232 615587
2291 615587 2180746 1894279 1417143 863445 1338098 1723501 2652925 2649468 1633485 884271
2281 884271 852633 1173298 1700852 1572340 824200 802688 236822 808533 1067570 1536239
2271 1536239 1427476 1071012 393897 935644 1592195 1943834 1387715 724894 862445 385701
2261 385701 347894 398375 957149 645111 1172509 933973 997080 1038610 974164 1554980 1778913
2250 1778913 2096418 1981732 1990907 2292482 1699023 1177874 1944547 1143639 786084 543809
2240 543809 812202 1617990 1217204 446443 1305664 1796015 1336347 694776 1125713 2160343
2230 2160343 2374421 2526064 2750594 2363087 1950409 2413655 2983237 2869610 2320277 2050261
$$ packed form
2301I82089l75506M03897n30335n34152K51886R04143p75414q6078L16702N8355
2291F15587J565159k86467m77136n53698M74653L85403R29424l457j015983p49214
2281H84271l1638L20665N27554j28512p48140k1512n65866N71711K59037M68669
2271A536239j08763l56464o77115N41747O56551L51639n56119o62821J37551m76744
2261C85701l7807N0481N58774l12038N27398k38536O3107M1530o4446N80816K23933
2250A778913L17505j14686R175L01575n93459n21149P66673q00908l57555k42275
2240E43809K68393Q05788m00786p70761Q59221M90351m59668o41571M30937J034630
2230B160343K14078J51643K24530l87507m12678M63246N69582j13627n49333k70016
$$ plain form
2220 2050261 2061872 2178904 2392661 2299596 2418917 2289853 2126861 1038225 1575883 1436093
2210 1436093 1681341 1482356 1117929 2400021 1371169 2110599 2285962 2483827 2801700
2201 2801700 2680663 2971058 3576905 2632134 3062752 3284266 2937100 2508534 3037429 2996882
2191 2996882 3113327 3785614 4029622 4426247 3751193 3363446 4200082 5276924 4662524
2182 4662524 4590889 4750587 5320641 4979575 5226670 5647556 5264466 5351691 6023663 6672553
2172 6672553 6443550 6971241 6678979 6982979 7185765 7368861 7775860 7455814 7318885 7284287
2162 7284287 7472400 7433615 7636229 7616569 7932329 7784596 8505951 8944591 9060432 9317667
2152 9317667 9709025 9567789 10078852 10081357 10326798 10837822 11359390 11517936 11938763 13493419
$$ packed form
2220B050261J1611J17032K13757r3065J19321j29064j62992j088636N37658j39790
2210A436093K45248j98985l64427J282092j028852P39430J75363J97865L17873
2201B801700j21037K90395O05847r44771M30618K21514l47166m28566N28895m0547
2191B996882J16445O72287K44008L96625o75054l87747Q36636J076842o14400
2182D662524p1635J59698N70054l41066K47095M20886l83090Q7225O71972O48890
2172F672553k29003N27691k92262L04000K02786J83096M06999l20046j36929l4598
2162G284287J88113l8785K02614j9660L15760j47733P21355M38640J15841K57235
2152I317667L91358j41236N11063K505K45441N11024N21568J58546M20827J554656
$$ plain form
2142 13493419 14076041 14905864 15133817 17195199 17930775 18732940 19811652 20351961 22591943
2133 22591943 23234910 23398787 24452618 25290540 27660093 28771863 30065621 32877889 34900936
2124 34900936 37544022 40409574 43780381 47205926 50504669 54486401 58857757 64731563
2116 64731563 70841594 76461019 84871216 95985703 109498151 127486467 151784833 180315085
2108 180315085 219106883 270526657 321412852 323876860 289099836 253876457 215735235
2101 215735235 179105101 145985945 118816106 99087565 84216766 72596470 65328937
2094 65328937 59098913 54035265 51511636 49780812 46888499 43125469 39163534 36333765
2086 36333765 33520555 31266718 29586409 27206784 25310783 24357468 22498504 20203289
$$ packed form
2142A3493419N82622Q29823K27953K061382P35576Q02165J078712N40309K239982
2133B2591943O42967J63877J053831Q37922K369553J111770J293758K812268K023047
2124C4900936K643086K865552L370807L425545L298743L981732M371356N873806
2116F4731563O110031N619425Q410197J1114487J3512448J7988316K4298366K8530252
2108A80315085L8791798N1419774N0886195K464008l4777024l5223379l8141222
2101B15735235l6630134l3119156k7169839j9728541j4870799j1620296p267533
2094F5328937o230024n063648k523629j730824k892313l763030l961935k829769
2086C6333765k813210k253837j680309k379625j896001r53315j858964k295215
$$ plain form
2078 20203289 19756160 19464640 18349791 17595220 16746064 15847261 15702665 15323829 14537946
2069 14537946 12975108 12259452 12569550 12106382 11767276 10891711 10607401 10470937 10153005
2060 10153005 9895850 9318745 8508454 8007446 7876569 8298294 8868134 8188207 7470326
2051 7470326 7654003 7836695 7558931 7641759 7391798 6316674 6586289 6321133 6311499 5667989
2041 5667989 6210487 5391485 4798725 4601479 5092710 5081841 5223260 4735005 4544622 4025764
2031 4025764 3033695 3320971 3825234 4065177 4150411 3843869 3484394 3425989 2765254 3196344
2021 3196344 2804546 3165243 3371423 3076868 2809686 2801094 2728356 2900560 2889441 2659554
2011 2659554 2216206 2222439 2638568 2222174 2582239 2170698 2411349 3059807 2666861 2245758
$$ packed form
2078B0203289m47129k91520j114849p54571q49156q98803j44596l78836p85883
2069A4537946j562838p15656L10098m63168l39106q75565k84310j36464l17932
2060A0153005k57155n77105q10291n01008j30877M21725N69840o79927p17881
2051G470326J83677J82692k77764Q2828k49961j075124K69615k65156r634o43510
2041E667989N42498q19002n92760j97246M91231j0869J41419m88255j90383n18858
2031D025764r92069K87276N04263K39943Q5234l06542l59475n8405o60735M31090
2021C196344l91798L60697K06180k94555k67182q592p2738J72204j1119k29887
2011B659554m43348O233M16129m16394L60065m11541K40651O48458l92946m21103
$$ plain form
2001 2245758 2429776 2267431 1366016 1735928 1340399 1869970 1535968 815568 917139 1298478
1991 1298478 1525191 1510729 1939671 1511953 808954 1023355 498995 278436 414202 1014233
1981 1014233 1333589 1002921 1779106 1318630 603028 1072882 1396100 885041 767761 889889
1971 889889 1488508 1013855 1177075 1769571 1782339 1426571 1319581 1380803 1089828 1000894
1961 1000894 588782 1282434 832165 360336 252220 239692 338530 975496 1347027 1392165
1951 1392165 1166381 576904 237203 240036 928127 842522 1634426 1628303 1164866 1377098
1941 1377098 444292 516739 672088 908217 1073856 621201 258225 574517 688326 177275
1931 177275 637427 661047 -144837 -921020 -944319 -958053 -188333 -323365 578629 806784
$$ packed form
2001B245758J84018j62345r01415L69912l95529N29571l34002p20400J01571L81339
1991A298478K26713j4462M28942m27718p02999K14401n24360k20559J35766O00031
1981A014233L19356l30668P76185m60476p15602M69854L23218n11059j17280J22128
1971H89889N98619m74653J63220N92496J2768l55768j06990O1222k90975q8934
1961A000894m12112O93652m50269m71829j08116j2528R8838O36966L71531M5138
1951A392165k25784n89477l39701K833O88091q5605P91904o123m63437K12232
1941A377098r32806P2447J55349K36129J65639m52655l62976L16292J13809n11051
1931A77275M60152K3620q05884p76183k3299j3734P69720j35032R01994K28155
$$ plain form
1921 806784 811591 870963 -110847 179471 -175733 -558955 -155062 180259 189575 771580 -26778
1910 -26778 714747 206420 -293532 -12003 250728 445308 1062572 727182 -303861 -511665
1900 -511665 201371 -313618 436323 304997 -33760 252572 -286609 89577 1041029 117779
1890 117779 230803 1081918 1034569 661733 141000 401101 462945 -121287 216939 659982
1880 659982 846990 1445526 605434 585876 283569 285035 582298 747378 743883 -259440
1870 -259440 -262643 -537991 -36403 990412 416129 665013 793250 152364 -70530 108436
1860 108436 -714751 30214 -63874 -672585 -545629 -156296 255683 1181945 249839 -53132
1850 -53132 -229337 308689 894953 1375396 1166395 534984 514056 720970 1121549 265681
$$ packed form
1921H06784M807N9372r81810K90318l55204l83222M03893L35321R316N82005p98358
1910b6778P41525n08327m99952K81529K62731J94580O17264l35390j031043k07804
1900e11665P13036n14989P49941j31326l38757K86332n39181L76186R51452r23250
1890A17779J13024Q51115m7349l72836n20733K60101O1844n84232L38226M43043
1880F59982J87008N98536q40092j9558l02307J466K97263J65080l495j003323
1870b59440l203k75348N01588J026815n74283K48884J28237o40886k22894J78966
1860A08436q23187P44965r4088o08711J26956L89333M11979R26262r32106l02971
1850e3132j76205N38026N86264M80443k09001o31411k0928K06914M00579q55868
$$ plain form
1840 265681 60911 1208280 1047569 874953 1076995 1243672 1209826 1159077 1426740 1156946
1830 1156946 655173 1525113 1317364 733622 277779 -124690 311630 -53419 -163405 -219514
1820 -219514 -130493 -22785 -241833 -413606 -979674 -252959 122879 25754 -213491 -22772
1810 -22772 740082 224910 -1068585 -408382 -207945 -776329 -1047060 -643147 -692057 -1296965
1800 -1296965 -980738 -458483 595688 46223 -223208 176808 604739 1208846 -2973
1791 -2973 -21773 424654 928621 307580 -208802 -381928 -394210 208446 422856 925318
1781 925318 584511 664121 611814 1072182 252327 542139 -643826 -1171497 -75338 259030
1771 259030 -479528 -242944 67061 36183 206881 -555567 -238200 -231954 528050 389223
$$ packed form
1840B65681k04770J147369j60711j72616K02042J66677l3846n0749K67663k69794
1830A156946n01773Q69940k07749n83742m55843m02469M36320l65049j09986n6109
1820b19514Q9021J07708k19048j71773n66068P26715L75838r7125k39245J90719
1810b2772P62854n15172j293495O60203K00437n68384k70731M03913m8910o04908
1800a296965L16227N22255J054171n49465k69431M00016M27931O04107j211819
1791b973j8800M46427N03967o21041n16382j73126j2282O02656K14410N02462
1781I25318l40807P9610n2307M60368q19855K89812j185965n27671J096159L34368
1771B59030p38558K36584L10005l0878J70698p62448L17367O246P60004j38827
$$ plain form
1761 389223 -177466 290987 -597816 -663802 -155301 -87587 86001 873775 710571 479702
1751 479702 -368637 108876 12579 224995 389656 -52333 -387919 -252243 -751612 -1214798
1741 -1214798 -807305 -170344 139214 -263861 592089 1217352 -54736 215914 390355
1732 390355 -310952 199426 335900 249332 -269732 -239304 -233269 -945211 -440708 216989
1722 216989 -139843 -367200 245515 206388 -26166 -577604 -607479 -1351104 -979737 -414766
1712 -414766 -169866 60963 -331327 -174287 40341 177431 364911 488860 -400006 -300752
1702 -300752 -648805 -572314 -900683 -948938 -985223 -655301 -1136077 -784181 -278286 486617
1692 486617 231546 370297 694666 -30918 -729967 -412706 347194 1075602 82142 -177512
$$ packed form
1761C89223n66689M68453q88803o5986N08501O7714J73588P87774j63204k30869
1751D79702q48339M77513r6297K12416J64661m41989l35586J35676m99369m63186
1741a214798M07493O36961L09558m03075Q55950O25263j272088K70650J74441
1732C90355p01307N10378J36474q6568n19064L0428O035p11942N04503O57697
1722B16989l56832k27357O12715l9127k32554n51438k9875p43625L71367N64971
1712d14766K44900K30829l92290J57040K14628J37090J87480J23949q88866R9254
1702c00752l48053P6491l28369m8255l6285L29922m80776L51896N05895P64903
1692D86617k55071J38751L24369p25584o99049L17261P59900P28408r93460k59654
$$ plain form
1682 -177512 66877 -190251 -453396 -427289 51116 797601 490247 205183 -825086 -331809
1672 -331809 -560424 -1238344 -108046 -1037565 -896172 -1002884 300194 239243 821377 495321
1662 495321 559271 -371682 -629891 597852 367778 -234467 655616 655683 -20543 90886
1652 90886 170131 332334 -8288 -228357 60966 355899 1017573 869178 491666 942241
1642 942241 28856 976101 640710 -47877 -13971 -45637 125447 39776 -802322 -531554
1632 -531554 -550742 -322399 -834563 -594950 -53596 -317974 -929752 -660293 100076 779
1622 779 -141443 118819 649153 575639 912232 705311 273202 620861 209860 23618
1612 23618 -717567 -927444 -383965 -129322 620285 494775 61307 -787251 -791600 -936056
$$ packed form
1682a77512K44389k57128k63145K6107M78405P46485l07354k85064j030269M93277
1672c31809k28615o77920J130298r29519J41393j06712J303078o0951N82134l26056
1662D95321O3950r30953k58209J227743k30074o02245Q90083O7o76226J11429
1652I0886P9245J62203l40622k20069K89323K94933O61674j48395l77512M50575
1642I42241r13385R47245l35391o88587L3906l1666J71084q5671q42098K70768
1632e31554j9188K28343n12164K39613N41354k64378o11778K69459P60369r9297
1622G79j42222K60262N30334p3514L36593k06921m32109L47659m11001j86242
1612B3618p41185k09877N43479K54643P49607j25510m33468q48558m349j44456
$$ plain form
1602 -936056 -713086 -192889 -579748 -173486 -67621 -583270 -1346277 -652962 1077274 708889
1592 708889 -124230 -358419 -220897 -714944 -521791 -685643 -131804 -656129 -842592 -465651
1582 -465651 -281514 -754156 -993552 -863552 -467433 -514289 -1043574 -813565 -656115 -519517
1572 -519517 -70963 658946 80536 -346153 -104310 14876 -577724 -850518 -1313590 -1306148
1562 -1306148 -781282 -1007461 -302830 -87999 -157395 -103272 -632372 90843 -379048 -192204
1552 -192204 -392632 -1203906 -803427 3150 -114463 -661064 -796289 -734181 159920 -445301
1542 -445301 -694585 -637699 -566960 37397 461740 598507 129738 396655 405534 415893 288704
1531 288704 93907 -526460 -677220 63775 -201622 -305873 -190773 5259 -1342583 -1218213
$$ packed form
1602i36056K22970N20197l86859M06262J05865n15649p63007O93315J730236l68385
1592G08889q33119k34189J37522m94047J93153j63852N53839n24325j86463L76941
1582d65651J84137m72642k39396J30000L96119m6856n29285K30009J57450J36598
1572e19517M48554P29909n78410m26689K41843J19186n92600k72794m63072P442
1562a306148N24866k26179P04631K14831o9396N4123n29100P23215m69891J86844
1552a92204k00428q11274M00479Q06577j17613n46601j35225O2108Q94101o05221
1542d45301k49284N6886P0739O04357M24343J36767m68769K66917Q879J0359j27189
1531B88704j94797o20367j50760P40995k65397j04251J15100J96032j347842J24370
$$ plain form
1521 -1218213 -885795 -662030 -17942 -191657 -268144 -452158 -806963 29379 35175 109495
1511 109495 316020 -1015003 -738437 -326254 493719 532293 -804128 -1070765 155025
1502 155025 -300918 -575804 28842 -90212 -352423 -856132 -56392 27568 397517 249121
1492 249121 -473589 -178315 -67829 -351180 -1075658 -419700 -536886 -333547 -124414 -451119
1482 -451119 -536583 -418003 414238 1038051 173661 113084 -99546 256672 -15873 -11354
1472 -11354 -728825 -1582441 -1456946 -1018305 -869628 -940599 -566847 -227307 -279630 -235944
1462 -235944 -735995 -292714 -23079 -801143 -894663 -423307 -673517 -242906 -71922 -288645
1452 -288645 462365 -296046 235618 504270 155052 128601 89888 -169740 20479 174623
$$ packed form
1521a218213L32418K23765O44088j73715p6487j84014l54805Q36342N796P4320
1511A09495K06525j331023K76566M12183Q19973L8574j336421k66637J225790
1502A55025m55943k74886O04646j19054k62211n03709P99740Q3960L69949j48396
1492B49121p22710K95274J10486k83351p24478O55958j17186K03339K09133l26705
1482d51119q5464J18580Q32241O23813q64390o0577k12630L56218k72545M519
1472a1354p17471q53616J25495M38641J48677p0971L73752L39540n2323M3686
1462b35944n00051M43281K69635p78064r3520M71356k50210M30611J70984k16723
1452b88645P51010p58411N31664K68652l49218k6451l8713k59628J90219J54144
$$ plain form
1442 174623 867739 255256 106532 -581375 -468410 -1112065 -54618 -478767 -1467608 -1423260
1432 -1423260 -1439480 -1001955 -952864 -1713985 -653522 -401059 -861625 -549683 -1190982 -1566322
1422 -1566322 -1186933 -833590 -793122 -919502 -350688 14719 -130928 321545 -346317 -345790
1412 -345790 311045 712447 112270 394810 -155893 92476 60113 -438203 -559596 -482597
1402 -482597 -113347 -198177 -398907 450612 315360 2860 -325391 168364 193617 5481
1392 5481 -286910 -600987 -224645 -1044925 -761878 -3732 678696 387367 -58776 -1300905
1382 -1300905 -1293149 -628766 -202726 799219 433187 217534 508770 -373772 -291642 -308638
1372 -308638 -476603 -410169 -4474 441868 366816 201597 51640 -352930 -622842 -549960
$$ packed form
1442A74623O93116o12483j48724o87907J12965o43655J057447m24149r88841M4348
1432a423260j6220M37525M9091p61121J060463K52463m60566L11942o41299l75340
1422a566322L79389L53343M0468j26380N68814L65407j45647M52473o67862N27
1412c45790O56835M01402o00177K82540n50703K48369l2363m98316j21393P6999
1402d82597L69250q4830k00730Q49519j35252l12500l28251M93755K5253j88136
1392E481k92391l14077L76342q20280K83047P58146O82428k91329m46143j242129
1382a300905P756O64383M26040J001945l66032k15653K91236q82542Q2130j6996
1372c08638j67965O6434M05695M46342p5052j65219j49957m04570k69912P2882
$$ plain form
1362 -549960 -876686 14830 520957 322745 -160576 -468737 -676591 65223 -41775 -109457
1352 -109457 -916979 -1184666 -628567 -1133227 -846852 -476048 -222133 626133 264558 -535336
1342 -535336 -1097397 -540269 -526042 579593 708446 1110919 719680 560860 413108 -183365
1332 -183365 -130693 -624049 -562356 110585 259890 -97271 -706295 -1161989 -789527 -782299
1322 -782299 -1569204 -1295171 -572055 -736679 -388760 -399579 -79436 -536684 -389582 -423383
1312 -423383 -102054 -119351 41358 -80527 -276139 96955 63812 -274823 -889635 -731621
1302 -731621 -306355 -260164 50444 -493177 -613849 -290379 -276499 -1040726 -639568 219772
1292 219772 507775 -19940 -934508 -256647 -587649 -757868 -690945 -268248 67037 -35495
$$ packed form
1362e49960l26726Q91516N06127j98212m83321l08161k07854P41814j06998o7682
1352a09457q07522k67687N56099n04660K86375L70804K53915Q48266l61575p99894
1342e35336n62061N57128J4227J105635J28853M02473l91239j58820j47752n96473
1332a83365N2672m93356O1693O72941J49305l57161o09024m55694L72462P228
1322g82299p86905K74033P23116j64624L47919j0819L20143m57248J47102l3801
1312d23383L21329j7297J60709j21885j95612L73094l3143l38635o14812J58014
1302g31621M25266M6191L10608n43621j20672L23470J3880p64227M01158Q59340
1292B19772K88003n27715r14568O77861l31002j70219O6923M22697L35285j02532
$$ plain form
1282 -35495 273594 -631073 -965010 -672540 -42651 -814940 -741781 -1498190 -1052360 -693806
1272 -693806 -1451803 -828884 -536844 -1066913 -741812 -127923 167388 259707 -180778 -506443
1262 -506443 -966273 -616965 -1006118 -1458637 -823449 -189749 -805523 406130 360114 713896
1252 713896 1363706 645377 140587 512064 485449 312058 -474645 -317906 -347495 -667016
1242 -667016 -676565 -509117 -143414 -427511 877262 728657 90856 -41199 -309958 -470421
1232 -470421 -128299 -290195 -286656 18897 20360 -687481 -189432 -110787 334822 -783986
1222 -783986 -782461 536519 189207 719379 686647 -833188 -994502 -136557 -267870 394460
1212 394460 709239 147257 -332095 -270595 297892 275163 6119 356548 153986 -103038
$$ packed form
1282c5495L09089r04667l33937K92470O29889p72289P3159p56409M45830L58554
1272f93806p57997O22919K92040n30069L25101O13889K95311R2319m40485l25665
1262e06443m59830L49308l89153m52519O35188O33700o15774J211653m6016L53782
1252G13896O49810p18329n04790L71477k6615j73391p86703J56739k9589l19521
1242f67016r549J67448L65703k84097J304773j48605o37801j32055k68759j60463
1232d70421L42122j61896L539L05553J463p07841M98049P8645M45609j118808
1222g83986J525J318980l47312N30172l2732j519835j61314Q57945j31313O62330
1212C94460L14779n61982m79352O1500N68487k2729k69044L50429k02562k57024
$$ plain form
1202 -103038 99441 -55859 -229666 -13432 -258244 -304422 116269 -247990 -676906 -19380
1192 -19380 202265 702830 747769 -387797 -565449 -1123886 -783897 -752172 -238963 253706
1182 253706 -319572 -244967 -300257 -161687 -224647 -147919 165056 28229 -927799 -1279701
1172 -1279701 -320492 64298 799411 243505 212474 690276 658774 27738 -471752 -375237
1162 -375237 -52878 1069764 1274087 703212 432442 410132 -529441 -629084 -419123 443964
1152 443964 -11963 312807 -515056 -758224 -169987 476610 170723 271013 -285317 -855708
1142 -855708 -303359 -362479 106238 9703 72957 512634 1051277 7090 -228562 292258
1132 292258 -433422 489583 -41153 -3953 -272732 -54459 -197767 -272244 527572 295772
$$ packed form
1202a03038K02479j55300j73807K16234k44812m6178M20691l64259m28916O57526
1192a9380K21645N00565M4939j135566j77652n58437L39989L1725N13209M92669
1182B53706n73278P4605n5290J38570o2960P6728L12975j36827r56028l51902
1172a279701R59209L84790P35113n55906l1031M77802l1502o31036m99490R6515
1162c75237L22359J122642K04323n70875k70770k2310r39573r9643K09961Q63087
1152D43964m55927L24770q27863k43168N88237O46597l05887J00290n56330n70391
1142h55708N52349n9120M68717r6535O3254M39677N38643j044187k35652N20820
1132B92258p25680R23005n30736L7200k68779K18273j43308p4477P99816k31800
$$ plain form
1122 295772 426415 -276134 -889662 -493125 -136542 -144365 193090 -114410 -545243 -954433
1112 -954433 -654101 -11554 1298987 1371093 455015 123747 492593 818013 651139 191205
1102 191205 -416260 -490377 211601 393918 338155 422834 -380942 -514419 422451 761521
1092 761521 -523950 -787681 -192837 -422610 459753 711055 644098 431441 265023 99206
1082 99206 237589 -323724 57443 -413381 -227743 80024 -138803 -203613 351683 5740
1072 5740 -183556 198803 -10595 -756430 -995601 61004 54064 38323 -581565 -925677
1062 -925677 -638694 -330797 74665 123604 115461 448900 81305 -118898 309615 1102868
1052 1102868 484406 144427 618184 204265 175665 178381 -169122 164935 -216805 -334995
$$ packed form
1122B95772J30643p02549o13528L96537L56583p823L37455l07500m30833m09190
1112i54433L00332O42547J310541P2106r16078l31268L68846L25420j66874m59934
1102A91205o07465p4117P01978J82317n5763Q4679q03776j33477R36870L39070
1092G61521j285471k63731N94844k29773Q82363K51302o6957k12657j66418j65817
1082I9206J38383n61313L81167m70824J85638L07767k18827o4810N55296l45943
1072E740j89296L82359k09398p45835k39171J056605o940j5741o19888l44112
1062i25677K86983L07897M05462M8939q143L33439l67595k00203M28513P93253
1052A102868o18462l39979M73757m13919k8600K716l47503L34057l81740j18190
$$ plain form
1042 -334995 -204699 131443 392658 173068 -514501 239315 395961 -189354 729845 201749
1032 201749 -451727 -463354 -952038 -648443 1848 156868 653393 -164443 -332346 412763
1022 412763 -178326 256064 475686 -27227 363294 364375 343355 -63881 -298718 -8453
1012 -8453 326743 543535 614283 27635 -651874 -651995 -1310271 -657746 282261 13013 507361
1001 507361 285608 505235 813885 80756 641676 379337 -337950 114947 -253496 70692
991 70692 138940 345325 -385942 -768124 -494551 30205 302334 9558 339680 1169456
981 1169456 391425 -635805 -210234 -734911 -521537 20305 637631 261948 -162034 53804
971 53804 -496272 347293 853647 -263247 -256781 -633654 -555000 -383170 -104987 -313372
$$ packed form
1042c34995J30296L36142K61215k19590o87569P53816J56646n85315R19199n28096
1032B01749o53476j1627m88684L03595O50291J55020M96525q17836j67903P45109
1022D12763n91089M34390K19622n02913L90521J081k1020m07236k34837K90265
1012h453L35196K16792P0748n86648o79509j21o58276O52525R40007k69248M94348
1001E07361k21753K19627L08650p33129N60920k62339p17287M52897l68443L24188
991G0692O8248K06385p31267l82182K73573N24756K72129k92776L30122Q29776
981A169456p78031j027230M25571n24677K13374N41842O17326l75683m23982K15838
971E3804n50076Q43565N06354j116894O466l76873P8654J71830K78183k08385
$$ plain form
961 -313372 -457385 470398 670182 917232 535195 220935 889503 469522 -687573 -377945
951 -377945 -65405 -161944 -95991 -647409 -834051 -989188 -941776 -959 409142 235033
941 235033 751705 784969 471684 365444 330088 469890 754130 792919 -521074 -403565
931 -403565 610902 -448220 -579899 -71522 244196 149698 -523513 -237140 349591 279158
921 279158 59480 371824 110133 -229306 -191643 446397 -429177 -959662 72849 -11840
911 -11840 160564 -155001 266821 93118 49400 136699 -196002 -144603 -491810 -273707 -517465
900 -517465 -809971 -164313 42408 31015 -89598 182355 774799 193263 205951 220382
890 220382 -211052 41293 -136536 315183 573114 476289 -967164 -921694 -1304961 -1000040
$$ packed form
961c13372j44013R27783J99784K47050l82037l14260O68568m19981j157095L09628
951c77945L12540r6539O5953n51418j86642j55137M7412R40817M10101j74109
941B35033N16672L3264l13285j06240l5356J39802K84240L8789j313993J17509
931d03565J014467j059122j31679N08377L15718r4498o73211K86373N86731p0433
921B79158k19678L12344k61691l39439L7663O38040q75574n30485J032511q4689
911a1840J72404l15565M21822j73703m3718Q7299l32701N1399l47207K18103k43758
900e17465k92506O45658K06721j1393j20613K71953N92444n81536J2688J4431
890B20382m31434K52345j77829M51719K57931r6825j443453M5470l83267L04921
$$ plain form
880 -1000040 -681993 -228752 758314 253451 991952 252337 -31910 -313557 -200501 -255800
870 -255800 -433708 -796308 -735337 -378355 -465779 -201398 -707876 -775152 -353649 305347
860 305347 645625 49433 194476 299693 584890 370562 -402635 -150455 -388189 -137839
850 -137839 -186735 487500 -217702 -1285529 -403023 -325747 -385329 -690520 -660882 -767432
840 -767432 -450399 -189133 444227 356412 -378678 -951760 -504449 181730 -8557 -614436
830 -614436 -1049891 -1330778 -1137785 -679100 -950614 -732906 -209948 -377886 -1078399 -546701
820 -546701 -247132 -281036 99368 -138277 -17753 -493616 -234039 -241397 -67415 288373
810 288373 435019 453767 22058 -667292 -1163239 -237565 238934 784746 400975 142983
$$ packed form
880a000040L18047M53241R87066n04863P38501p39615k84247k81647J13056n5299
870b55800j77908l62600O0971L56982q7424K64381n06478o7276M21503O58996
860C05347L40278n96192J45043J05217K85197k14328p73197K52180k37734K50350
850a37839m8896O74235p05202j067827Q82506P7276n9582l05191K9638j06550
840g67432L17033K61266O33360q7815p35090n73082M47311O86179j90287o05879
830f14436m35455k80887J92993M58685k71514K17708N22958j67938p00513N31698
820e46701K99569l3904L80404k37645J20524m75863K59577p358J73982L55788
810B88373J46646J8748m31709o89350m95947R25674M76499N45812l83771k57992
$$ plain form
800 142983 69389 -480536 -448731 -351093 -455418 -311053 -716223 -210262 56403 -544089
790 -544089 -647699 -507067 856639 246097 241534 395843 271834 446687 -410342 -512138
780 -512138 -248022 -766600 -574477 -834714 -686096 569888 -122922 -100674 696166 871114
770 871114 305202 -355506 -370716 345387 277653 -437511 -205576 76182 -193396 224255
760 224255 839696 410684 -333859 -81560 966714 407199 -274426 -322863 -174479 608799
750 608799 462972 576603 241990 430463 495677 381241 23329 27049 -102116 -1030813
740 -1030813 -579998 109405 -67554 -198185 -98189 80051 405274 286044 62162 1186641
730 1186641 1642527 1014570 34712 -901820 -426641 341896 23409 -386038 361031 633386
$$ packed form
800A42983p3594n49925L1805R7638j04325J44365m05170N05961K66665o00492
790e44089j03610J40632J363706o10542m563J54309j24009J74853q57029j01796
780e12138K64116n18578J92123k60237J48618J255984o92810K2248P96840J74948
770H71114n65912o60708j5210P16103o7734p15164K31935K81758k69578M17651
760B24255O15441m29012p44543K52299J048274n59515o81625m8437J48384P83278
750F08799j45827J13631l34613J88473O5214j14436l57912L720j29165r28697
740a030813M50815O89403j76959j30631R9996J78240L25223j19230k23882J124479
730A186641M55886o27957r79858r36532M75179P68537l18487m09447P47069K72355
$$ plain form
720 633386 168263 589394 605026 -452490 -200599 211826 333973 -433194 -620814 -816761
710 -816761 3515 -197073 -93516 -618693 -647712 -607208 -78234 361200 -299808 -681488
700 -681488 -241747 -678834 474892 1068291 624412 684058 -244836 132892 107668 682369
690 682369 546986 95009 -286329 -587881 -258217 -496158 -1137072 -376389 -10483 378548
680 378548 832889 1567081 462296 5166 -108816 -345762 -721470 -285029 167457 -174321
670 -174321 -1149059 -1277406 -278721 466279 545794 370866 48737 339553 252395 620570
660 620570 645165 21154 171897 482411 66565 608748 294034 115539 -416832 -452403
650 -452403 389852 -191891 -131581 578239 944989 160000 -76334 317197 274520 -29578
$$ packed form
720F33386m65123M21131J5632j057516K51891M12425J22147p67167j87620j95947
710h16761Q20276k00588J03557n25177k9019M0504N28974M39434o61008l81680
700f81488M39741m37087J153726N93399m43879N9646r28894L77728k5224N74701
690F82369j35383m51977l81338l01552L29664k37941o40914P60683L65906L89031
680C78548M54341P34192j104785m57130j13982k36946l75708M36441M52486l41778
670a74321r74738j28347R98685P45000P9515j74928l22129K90816q7158L68175
660F20570K4595o24011J50743L10514m15846N42183l14714j78495n32371l5571
650d52403Q42255n81743O0310P09820L66750p84989k36334L93531m2677l04098
$$ plain form
640 -29578 -390105 -103382 -114904 -149127 198286 -28555 -102583 355380 709201 195517 -130792
629 -130792 239153 241349 469991 660323 -9333 184573 -636530 -1240139 -796824 -472117
619 -472117 -281499 -962369 -917498 -938989 -969633 -625137 -761699 -528144 -454674 260114 157798
608 157798 -341871 13204 34236 235960 651210 93601 499880 -253945 166757 547908
598 547908 472500 1040496 666963 252178 632441 1378674 1227524 133800 163540 487705
588 487705 907229 329885 859144 522644 -66863 389709 52893 180348 808793 1410325
578 1410325 370708 467057 72204 -341807 -15801 108078 906542 231822 29651 -239121
568 -239121 279019 278533 33092 33881 -356781 -522346 -889030 -963259 -182497 589574 -31264
$$ packed form
640b9578l60527K86723j1522l4223L47413k26841p4028M57963L53821n13684l26309
629a30792L69945K196K28642J90332o69656J93906q21103o03609M43315L24707
619d72117J90618o80870M4871k1491l0644L44496j36562K33555P3470P14788j02316
608A57798m99669L55075K1032K01724M15250n57609M06279p53825M20702L81151
598E47908p5408N67996l73533m14785L80263P46233j51150j093724K9740L24165
588D87705M19524n77344N29259l36500n89507M56572l36816J27455O28445O01532
578A410325j039617R6349l94853m14011L26006J23879P98464o74720k02171k68772
568b39121N18140m86k45441P89l90662j65565l66684p4229P80762P72071o20838
$$ plain form
557 -31264 232869 -407173 -222623 -850284 -355032 1031445 1408523 1021721 -171028 313735
547 313735 1012733 1101367 696160 193578 749207 1282318 599403 77388 373525 1036106
537 1036106 -45668 -6547 253342 396267 735051 -1077686 -1211782 -1466524 -873175 15347
527 15347 165067 72524 -271798 315363 125042 525289 1084215 594117 -77841 -407742
517 -407742 -758488 -645282 163002 1373328 989937 500890 -118551 -21122 617061 255969
507 255969 -160645 -821660 122134 425134 1097252 755392 666036 303310 -646706 -310609
497 -310609 -145205 -262618 -409885 550322 816476 179464 260455 199506 -320967 675535
487 675535 876081 -125125 -502645 32324 -140171 -865280 -57319 453835 346902 -419721
$$ packed form
557c1264K64133o40042J84550o27661M95252J386477L77078l86802j192749M84763
547C13735O98998Q8634m05207n02582N55629N33111o82915n22015K96137O62581
537A036106j081774L9121K59889J42925L38784j812737j34096k54742N93349Q88522
527A5347J49720r2543l44322N87161j90321M00247N58926m90098o71958l29901
517d07742l50746J13206Q08284J210326l83391m89047o19441R7429O38183l61092
507B55969m16614o61015R43794L03000O72118l41860q9356l62726r50016L36097
497c10609J65404j17413j47267R60207K66154o37012Q0991o0949n20473R96502
487F75535K00546j001206l77520N34969j72495p25109Q07961N11154j06933p66623
$$ plain form
477 -419721 -338129 -93401 -133726 -85127 -230264 -550031 -709964 -362825 328502 240439 -133364
466 -133364 244920 281067 -264068 -395575 29317 163751 462699 153789 -290403 81434
456 81434 60229 165923 -8014 421461 482642 194167 440361 375597 256995 -157465 -740615
445 -740615 -746865 -60721 863474 852832 371952 167683 463300 646622 854616 574772
435 574772 241195 -81322 -719213 -637863 -245255 -261154 -47126 374859 497933 550022
425 550022 -125208 63473 153479 20912 135072 -190550 538104 14517 -521758 437137
415 437137 -651541 -167704 99394 246848 324542 58063 225185 -39576 261814 22490
405 22490 -452812 -1289506 -1033611 -543909 -637852 -756050 -609934 233569 21079 347996
$$ packed form
477d19721Q1592K44728m0325M8599j45137l19767j59933L47139O91327q8063l73803
466a33364L78284L6147n45135j31507M24892J34434K98948l08910m44192L71837
456H1434k1205J05694j73937M29475O1181k88475K46194o4764j18602m14460n83150
445g40615o250O86144R24195j0642m80880k04269K95617J83322K07994k79844
435E74772l33577l22517o37891Q1350L92608j5899K14028M21985J23074N2089
425E50022o75230J88681R0006j32567J14160l25622P28654n23587n36275R58895
415D37137j088678M83837K67098J47454P7694k66479J67122k64761L01390k39324
405B2490m75302q36694K55895M89702r3943j18198J46116Q43503k12490L26917
$$ plain form
395 347996 531254 593797 446151 406425 -101922 -287875 663056 1060921 549299 228017
385 228017 72039 -262646 69054 221311 -160457 294762 491961 19827 69541 320538
375 320538 359258 31047 -437320 -487168 69887 281313 837899 621006 135941 614994
365 614994 734475 1034011 1118987 75012 119472 -14311 601089 144395 6581 -62102
355 -62102 -530576 385021 697136 -263542 -240904 -255597 223738 619256 868782 747165
345 747165 -43870 -26560 526812 355313 102416 600797 188083 732156 1308099 339118
335 339118 -466072 67604 19725 245685 253234 571898 -176233 -158100 304789 -712927
325 -712927 -1377573 -532596 -113133 -1184871 -1030197 -946362 -398976 38655 28303 -93143
$$ packed form
395C47996J83258O2543j47646l9726n08347j85953R50931L97865n11622l21282
385B28017j55978l34685L31700J52257l81768M55219J97199m72134M9714K50997
375C20538L8720l28211m68367m9848N57055K11426N56586k16893m85065M79053
365F14994J19481K99536Q4976j043975M4460j33783O15400m56694j37814o8683
355f2102m68474R15597L12115r60678K2638j4693M79335L95518K49526j21617
345G47165p91035J7310N53372j71499k52897M98381m12714N44073N75943r68981
335C39118q05190N33676m7879K25960P549L18664p48131J8133M62889j017716
325g12927o64646Q44977M19463j071738J54674Q3835N47386M37631j0352j21446
$$ plain form
315 -93143 -725814 599211 -254204 -881316 -948080 -391263 -72469 383048 -138537 -142974
305 -142974 -343641 -7226 122463 267637 131514 -84739 131705 366012 -2789 -608184
295 -608184 -351134 -355419 41229 -38002 86521 -353901 234916 -199635 519706 784069
285 784069 554465 208904 796246 641099 579995 -204860 -566714 423273 400693 -224451
275 -224451 -438523 231444 661088 247349 781538 751947 639812 -5951 -4124 123075
265 123075 1347040 860088 48522 245332 229661 -399496 -312157 506244 593178 829930
255 829930 554714 170746 525502 1335852 96702 -154718 222278 401848 465949 34896
245 34896 -49956 -391907 -941608 -615178 -1050248 -160131 -99634 -640406 -1279545 -116262
$$ packed form
315i3143o32671J325025q53415o27112o6764N56817L18794M55517n21585m437
305a42974k00667L36415J29689J45174j36123k16253K16444K34307l68801o05395
295f08184K57050m285L96648p9231J24523m40422N88817m34551P19341K64363
285G84069k29604l45561N87342j55147o1104p84855l61854R89987k2580o25144
275b24451k14072O69967M29644m13739N34189k9591j12135o45763J827J27199
265A23075J223965m86952q11566J96810j5671o29157Q7339Q18401Q6934K36752
255H29930k75216l83968L54756Q10350j239150k51420L76996J79570O4101m31053
245C4896q4852l41951n49701L26430m35070Q90117O0497n40772o39139J163283
$$ plain form
235 -116262 -187787 73034 372624 771503 1067110 558820 215568 -393950 -608506 -590162
225 -590162 -497419 -804444 -322237 -488757 -262840 -159520 290234 -170896 252110 601599
215 601599 603270 872696 -62939 150434 62762 -443063 822923 677598 445079 666077
205 666077 445182 130043 244252 358920 -23293 -248556 -709377 441323 384623 -12870
195 -12870 704643 1131526 706334 3376 46325 390711 -132770 -147304 449603 829271
185 829271 586979 -181510 526930 624201 369906 397528 255358 -15878 91716 38951
175 38951 304878 540516 303695 208987 90815 326697 -88268 -321682 84510 920787
165 920787 362913 -177372 121571 14118 -43554 186361 -98954 543947 533199 212435
$$ packed form
235a16262p1525K60821K99590L98879K95607n08290l43252o09518k14556J8344
225e90162R2743l07025M82207j66520K25917J03320M49754m61130M23006L49489
215F01599J671K69426r35635K13373q7672n05825J265986j45325k32519K20998
205F66077k20895l15139J14209J14668l82213k25263m60821J150700n6700l97493
195a2870P17513M26883m25192p02958M2949L44386n23481j4534N96907L79668
185H29271k42292p68489P08440R7271k54295K7622j42170k71236J07594n2765
175C8951K65927K35638k36821r4708j18172K35882m14965k33414M06192Q36277
165I20787n57874n40285K98943j07453n7672K29915k85315O42901j0748l20764
$$ plain form
155 212435 564386 -354206 -656436 14692 177308 259675 537401 343505 809582 -178787
145 -178787 -313859 -416213 -878738 -539479 -691714 -409103 217582 -236413 -126005 479840
135 479840 252806 329302 -15972 52679 870760 1021688 845477 620418 1080393 301353
125 301353 823190 474306 187218 601094 845739 959584 742784 443703 256249 175664
115 175664 98475 205868 365869 652672 134911 88788 -111311 -519959 -683060 -253266
105 -253266 569 -45277 141427 295616 -78190 249179 308371 582251 324267 364409
95 364409 169096 -491562 -325442 434741 -321746 -655288 -719310 74839 -409627 -183085
85 -183085 -72289 -254209 251793 73151 -76485 -294690 377550 943887 1083152 909587
$$ packed form
155B12435L51951r18592l02230O71128J62616Q2367K77726j93896M66077r88369
145a78787j35072j02354m62525L39259j52235K82611O26685m53995J10408O05845
135D79840k27034P6496l45274O8651Q18081J50928j76211k25059M59975p79040
125C01353N21837l48884k87088M13876K44645J13845k16800k99081j87454q0585
115A75664p7189J07393J60001K86803n17761m6123k00099m08648j63101M29794
105b53266K53835m5846J86704J54189l73806L27369N9192K73880k57984M0142
95C64409j95313o60658J66120P60183p56487l33542o4022P94149m84466K26542
85a83085J10796j81920N06002j78642j49636k18205O72240N66337J39265j73565
$$ plain form
75 909587 546911 335664 371932 44478 278400 235371 -149817 292334 -103919 204017
65 204017 -128564 -440223 251821 378418 108907 293861 344310 260326 402030 323569 188653
54 188653 -326063 258491 876689 271091 -103861 -359194 14751 112442 21640 67859 65627
43 65627 274232 -324738 -63988 61221 -203752 323145 503514 464286 -553666 -436858
33 -436858 109275 362733 381505 464166 824589 534565 656528 15076 264319 290328 212519
22 212519 720413 747093 -127785 509598 909728 568124 270609 350363 277824 367859 735919
11 735919 570661 -184540 -295646 -136559 77609 -74795 36845 321311 411303 -5270
1 -5270 -29710
$$ packed form
75I09587l62676k11247L6268l27454K33922m3029l85188M42151l96253L07936
65B04017l32581l11659O92044J26597k69511J84954N0449q3984J41704p8461j34916
54A88653n14716N84554O18198o05598l74952k55333L73945R7691r0802M6219k232
43F5627K08605n98970K60750J25209k64973N26897J80369l9228j017952J16808
33d36858N46133K53458J8772Q2661L60423k90024J21963o41452K49243K6009p7809
22B12519N07894K6680q74878O37383M00130l41604k97515P9754p2539R0035L68060
11G35919j65258p55201j11106J59087K14168j52404J11640K84466Q9992m16573
1e270k4440
$$ plain form
0 -29710
$$ packed form
0b9710
$$ Imaginary data points
##PAGE= N=2
##DATA TABLE= (X++(I..I)), XYDATA
$$ plain form
16383 -3721970 -3865805 -4239155 -3971697 -4262515 -4107796 -4252097 -4323192 -4188407 -4117035 -3979097
16373 -3979097 -3828938 -3573107 -3189021 -2839864 -3162254 -3716495 -3499712 -3478018 -2771779 -3027736
$$ packed form
16383c721970j43835l73350K67458k90818J54719j44301p1095J34785P1372J37938
16373c979097J50159K55831L84086L49157l22390n54241K16783K1694P06239k55957
$$ [...]
##END NTUPLES=NMR SPECTRUM
##END=
