##TITLE=1H_CG-1150-E41
 CDCl3
 8 sc, 
 15.11.2021
##JCAMPDX= 6.0         $$ Bruker NMR JCAMP-DX V2.0
##DATA TYPE= NMR SPECTRUM
##DATA CLASS= NTUPLES
##ORIGIN= UXNMR, Bruker Analytische Messtechnik GmbH
##OWNER= root
$$ XWIN-NMR		Version 3.5
$$ Mon Nov 15 11:15:34 2021 Russian Standard Time (UT+4h)  she@DPX200
##.OBSERVE FREQUENCY= 200.131346
##.OBSERVE NUCLEUS= ^1H
##.ACQUISITION MODE= SIMULTANEOUS
##.ACQUISITION SCHEME= undefined
##.AVERAGES= 8
##.DIGITISER RES= 18
##SPECTROMETER/DATA SYSTEM= spect
##.PULSE SEQUENCE= zg30
##.SOLVENT NAME= D2O
##.SHIFT REFERENCE= (INTERNAL, D2O, 0, 15.7149)
##AUDIT TRAIL= $$ (NUMBER, WHEN, WHO, WHERE, WHAT)
$$ ##TITLE= Audit trail, XWIN-NMR		Version 3.5
$$ ##JCAMPDX= 5.01
$$ ##ORIGIN= Bruker BioSpin GmbH
$$ ##OWNER= she
$$ F:/spectra/data/she/nmr/H-F/1/pdata/1/auditp.txt
$$ ##AUDIT TRAIL=  $$ (NUMBER, WHEN, WHO, WHERE, WHAT)
(   1,<2021-11-15 11:14:19.01 +0400>,<she>,<DPX200>,
      <created by zg, POWCHK disabled, PULCHK disabled
       configuration hash MD5:
       00 E9 B6 7A A2 85 ED C7 34 08 36 98 17 FE 4E 26
       data hash MD5: 16K
       D3 3B C7 A4 89 FF CE 0A A4 88 65 EF 73 5D C2 FA>)
(   2,<2021-11-15 11:14:22.03 +0400>,<she>,<DPX200>,
      <Start of raw data processing
       efp BC_mod = 2 LB = 0.24 FT_mod = 6 PKNL = 1 PHC0 = -15513.84 PHC1 = 16.00081 SI = 16K 
       data hash MD5: 16K
       B8 9C B5 AE 1F 06 EE 81 15 0A 18 D7 46 6A AD 04>)
(   3,<2021-11-15 11:14:48.18 +0400>,<she>,<DPX200>,
      <pk PHC0 = 1.645779 PHC1 = -4.399999 
       data hash MD5: 16K
       95 85 9B B9 87 78 C7 02 30 24 FA A3 C6 C1 1D 8B>)
(   4,<2021-11-15 11:14:50.95 +0400>,<she>,<DPX200>,
      <abs ABSG = 5 
       data hash MD5: 16K
       7D 53 1B 96 F8 83 84 C3 15 32 1A 2A 3E 33 0F 72>)
$$ ##END=
$$ 
$$ hash MD5
$$ 36 C6 FA 34 AE FC 33 CF C9 20 18 3D FD C2 7F 17
##$RELAX= 
##$RELAX= 
##$RELAX= 
##$RELAX= 
##$RELAX= 
##$RELAX= 
$$ Bruker specific parameters
$$ --------------------------
##$DU= <F:/spectra>
##$EXPNO= 1
##$NAME= <H-F>
##$PROCNO= 1
##$TYPE= <nmr>
##$USER= <she>
##$AMP= (0..31)
100 100 100 100 100 100 100 100 100 100 100 100 100 100 100 100 100 100 
100 100 100 100 100 100 100 100 100 100 100 100 100 100 
##$AQSEQ= 0
##$AQ_mod= 1
##$AUNM= <au_zg>
##$AUTOPOS= <>
##$BF1= 200.13
##$BF2= 200.13
##$BF3= 200.13
##$BF4= 200.13
##$BF5= 200.13
##$BF6= 200.13
##$BF7= 200.13
##$BF8= 200.13
##$BYTORDA= 1
##$CFDGTYP= 0
##$CFRGTYP= 5
##$CHEMSTR= <none>
##$CNST= (0..31)
1 1 145 1 1 1 1 1 1 1 1 1 1 1 1 1 1 1 1 1 1 1 1 1 1 1 1 1 1 1 1 1 
##$CPDPRG= <>
##$CPDPRG1= <>
##$CPDPRG2= <>
##$CPDPRG3= <>
##$CPDPRG4= <mlev>
##$CPDPRG5= <mlev>
##$CPDPRG6= <mlev>
##$CPDPRG7= <mlev>
##$CPDPRG8= <mlev>
##$CPDPRGB= <>
##$CPDPRGT= <>
##$D= (0..31)
0 1.2 0 0 0 0 0 0 0 0.06 0 0.03 0 0 0 0 0.0002 0 0 0 0 0 0 0 0 0 0 0 0 
0 0 0 
##$DATE= 1636960458
##$DBL= (0..7)
120 120 120 120 120 120 120 120 
##$DBP= (0..7)
150 150 150 150 150 150 150 150 
##$DBP07= 0
##$DBPNAM0= <>
##$DBPNAM1= <>
##$DBPNAM2= <>
##$DBPNAM3= <>
##$DBPNAM4= <>
$$ [...]
##$SUBNAM2= <"">
##$SUBNAM3= <"">
##$SUBNAM4= <"">
##$SUBNAM5= <"">
##$SUBNAM6= <"">
##$SUBNAM7= <"">
##$SUBNAM8= <"">
##$SUBNAM9= <"">
##$SW= 18.0517287032376
##$SWIBOX= (0..15)
0 0 2 0 0 0 0 0 0 0 0 0 0 0 0 0 
##$SW_h= 3612.71676300578
##$TD= 16384
##$TD0= 1
##$TE= 0
##$TE2= 300
##$TE3= 300
##$TEG= 300
##$TL= (0..7)
0 120 120 120 120 120 120 120 
##$TP= (0..7)
150 150 150 150 150 150 150 150 
##$TP07= 0
##$TPNAME0= <>
##$TPNAME1= <>
##$TPNAME2= <>
##$TPNAME3= <>
##$TPNAME4= <>
##$TPNAME5= <>
##$TPNAME6= <>
##$TPNAME7= <>
##$TPOAL= (0..7)
0.5 0.5 0.5 0.5 0.5 0.5 0.5 0.5 
##$TPOFFS= (0..7)
0 0 0 0 0 0 0 0 
##$TUNHIN= 0
##$TUNHOUT= 0
##$TUNXOUT= 0
##$USERA1= <user>
##$USERA2= <user>
##$USERA3= <user>
##$USERA4= <user>
##$USERA5= <user>
##$V9= 5
##$VALIST= <valist>
##$VCLIST= <CCCCCCCCCCCCCCC>
##$VD= 0
##$VDLIST= <DDDDDDDDDDDDDDD>
##$VPLIST= <PPPPPPPPPPPPPPP>
##$VTLIST= <TTTTTTTTTTTTTTT>
##$WBST= 1024
##$WBSW= 4
##$XGAIN= (0..3)
0 0 0 0 
##$XL= 0
##$YL= 0
##$YMAX_a= 158539
##$YMIN_a= -163247
##$ZGOPTNS= <>
##$ZL1= 120
##$ZL2= 120
##$ZL3= 120
##$ZL4= 120
##$ABSF1= 15.71714
##$ABSF2= -2.334709
##$ABSG= 5
##$ABSL= 3
##$ALPHA= 0
##$AQORDER= 0
##$ASSFAC= 0
##$ASSFACI= 0
##$ASSFACX= 0
##$ASSWID= 0
##$AUNMP= <proc_1d>
##$AZFE= 0.1
##$AZFW= 0.1
##$BCFW= 0
##$BC_mod= 2
##$BYTORDP= 0
##$COROFFS= 0
##$CY= -3
##$DATMOD= 1
##$DC= 0
##$DFILT= <>
##$DTYPP= 0
##$F1P= 0
##$F2P= 0
##$FCOR= 1
##$FTSIZE= 16384
##$FT_mod= 6
##$GAMMA= 0
##$GB= 0
##$INTBC= 1
##$INTSCL= 0
##$ISEN= 128
##$LB= 0.24
##$LEV0= 0
##$LPBIN= 0
##$MAXI= 10000
##$MC2= 0
##$MEAN= 0
##$ME_mod= 0
##$MI= 1.114404
##$NCOEF= 0
##$NC_proc= -8
##$NLEV= 6
##$NOISF1= 3.799351
##$NOISF2= 2.8
##$NSP= 0
##$NTH_PI= 0
##$NZP= 0
##$OFFSET= 15.71494
##$PC= 1
##$PHC0= -15512.19
##$PHC1= 11.60081
##$PH_mod= 1
##$PKNL= yes
##$PPARMOD= 0
##$PSCAL= 0
##$PSIGN= 0
##$REVERSE= no
##$SF= 200.130007327843
##$SI= 16384
##$SIGF1= 3
##$SIGF2= 2
##$SINO= 5.538805
##$SIOLD= 16384
##$SREGLST= <1H.CDCl3>
##$SSB= 0
##$STSI= 16384
##$STSR= 0
##$SW_p= 3612.71676300578
##$SYMM= 0
##$S_DEV= 0
##$TDeff= 16384
##$TDoff= 0
##$TI= <>
##$TILT= no
##$TM1= 0
##$TM2= 0
##$TOPLEV= 0
##$USERP1= <user>
##$USERP2= <user>
##$USERP3= <user>
##$USERP4= <user>
##$USERP5= <user>
##$WDW= 1
##$XDIM= 16384
##$YMAX_p= 418255164
##$YMIN_p= -5661892
$$ End of Bruker specific parameters
$$ ---------------------------------
##NTUPLES= NMR SPECTRUM
##VAR_NAME=  FREQUENCY,     SPECTRUM/REAL,   SPECTRUM/IMAG
##SYMBOL=    X,             R,               I
##VAR_TYPE=  INDEPENDENT,   DEPENDENT,       DEPENDENT
##VAR_FORM=  AFFN,          ASDF,            ASDF
##VAR_DIM=   16384,         16384,           16384
##UNITS=     HZ,            ARBITRARY UNITS, ARBITRARY UNITS
##FACTOR=    0.220516191357247, 1,           1
##FIRST=     3145.03107158705, 0,            0
##LAST=      -467.685691418731, 0,           0
##MIN=       -467.685691418731, -5661892,    0
##MAX=       3145.03107158705, 418255164,    0
$$ Real data points
##PAGE= N=1
##DATA TABLE= (X++(R..R)), XYDATA
$$ [...]
5654g6999R0742J32952K38743j22466m2554K46439k89889k4157J98J8578J31045
5643C02632M27563J61559k06838k61120k05201q5836K18607P9601K07987m85866
5633A53088R1865K1281j36220j27595K3601M01366k81540J00424L57751K11509
5623H15530q2926L45237l23050j65107j69682K68829N3330n498l7051R6810N8727
5612H55149J86570K26731l14999K5372R9729j35368m04677N41547K93932l82928
5602I91058j73047K87695J88242L14588j13647j94741k73269K53043N4899j42515
5592A192306N12059k20877j405l50406o7857n368N1844M7298j81211k15167J92386
5581I53602J22652K94396K37855j09809k81485J77944L24255m19231l84248Q5009
$$ y = [-76999, 13743, 146695, 385438, 262972, 220418, 466857, 176968, 152811, 153009, 171587, 302632, 730195, 891754, 684916, 423796, 218595, 132759, 351366, 430967, 638954, 153088, 244953, 266234, 130014, 2419, 26020, 427386, 145846, 246270, 604021, 815530, 732604, 1077841, 754791, 589684, 420002, 688831, 742161, 736663, 699612, 796422, 855149, 1041719, 1268450, 953451, 978823, 1078552, 943184, 538507, 1080054, 1373986, 991058, 818011, 1105706, 1293948, 1608536, 1494889, 1300148, 1026879, 1279922, 1334821, 1192306, 1704365, 1483488, 1482083, 1131677, 1063820, 1058452, 1110296, 1157594, 976383, 761216, 953602, 1076254, 1370650, 1608505, 1498696, 1217211, 1395155, 1719410, 1300179, 915931, 1000940]
5571A000940L92081M1519J18634l5566n51901K03668j57793k92879K17116J3334
5561I49153K03142k41934j88031Q2864n7988K2662M5876J48158l9233l04956J67622
5550G87335K09067j29667p9506Q3777q4705P3630k53754K36852L98557l90447
5540H51139P4952L2635j41046k66877N3515k86690J58521L14020n60104j62767
5530F7298l9200K26537j25416N564K40918l82777L47923M0031O6325K96953K8071
5519G72227O4173j47792r3400J15284r64m33493J9466L4548M00614j45983j01476
5508D83204k37342j01347K88828L57322o8152k8267O9612k83087J83851j65568
5498D99054k92044j01716L21212J03041J72181q3629J2599J21378Q859p274L22386
$$ y = [1000940, 1393021, 1434540, 1553174, 1517608, 965707, 1169375, 1011582, 718703, 935819, 949153, 1152295, 910361, 722330, 805194, 747206, 769868, 815744, 963902, 924669, 619713, 787335, 996402, 866735, 787229, 871006, 786301, 859931, 606177, 843029, 1241586, 851139, 926091, 958726, 817680, 550803, 604318, 317628, 476149, 790169, 230065, 67298, 28098, 254635, 129219, 134783, 375701, -7076, 340847, 380878, 447203, 744156, 772227, 836400, 688608, 595208, 710492, 709528, 276035, 295501, 330049, 730663, 584680, 483204, 245862, 144515, 433343, 790665, 722513, 694246, 763858, 480771, 664622, 499054, 207010, 105294, 426506, 529547, 701728, 618099, 630698, 752076, 760935, 753661, 1076047]
5487A076047k48464p24644j35154K15609j74442N8466L70760l59196R7334J32073
5477C08389l68178L5576J43526k16222k89692M00228Q2860l09450j4530K38305
5467A0812L95595l12642L16245K76046l536k42574n3372M2913J60837k67034k2532
5456C00758J65866K54127j91113k30019p4245j17937J01560k11841n9161M1013
5446b0992J85827L77070j6081M1689k4574n8702j38995k63642J61444j40896N7700
5435A59848L1761j07858L56066L4633L3003L10723k47693o13846L6192J79996
5425A72825j25295k9533L31182j46150K17618k04389j00002K89704K22374J21791
5415G50125l68255J12610l0438r4286J51892j81700k95512N69433K80349m01676
$$ y = [1076047, 827583, 102939, -32215, 183394, 8952, 67418, 438178, 78982, 176316, 308389, -59789, -24213, 119313, -96909, -386601, 13627, 96487, -212963, -227493, 10812, 406407, 93765, 410010, 686056, 682520, 439946, 386574, 429487, 590324, 323290, 300758, 466624, 720751, 529638, 299619, 225374, 107437, 208997, -2844, -62005, -20992, 164835, 541905, 525824, 567513, 542939, 484237, 345242, 81600, 243044, 102148, 159848, 191609, 83751, 439817, 474450, 507453, 818176, 570483, -43363, -7171, 172825, 47530, 17997, 349179, 203029, 420647, 216258, 116256, 405960, 628334, 750125, 381870, 494480, 464042, 369756, 521648, 339948, 44436, 613869, 894218, 492542]
5405D92542o0546k73953L35648K49579j52166L03992O2913j79011m00164r0242
5395B88592K65799J67412k16087p9330l5930p6786M00560K95861l20258Q8314
5385G78147n6695J15858j33318K72599n00118Q4524J24163J80550P7605o60257
5375B83058l9207J8184J55933L85393p7773K357J6396k03398j50307J00796m6944
5364D44488j01417K14148j92539j33790J84061L55437j13186m36659j63349L42736
5354C99930R0421k26159O23935j08310L82161K6244j35000k45010m7617j0987
5344G49608J87875j49370l30537L42396l52916J24020K14510k71087L36875J45357
5334I96731k79082k33712j5543l39890k02485K86750o4708K08038j856J06174
$$ y = [492542, 431996, 158043, 493691, 743270, 591104, 895096, 958009, 778998, 378834, 288592, 554391, 721803, 505716, 426386, 390456, 313670, 714230, 1010091, 689833, 778147, 721452, 837310, 703992, 976591, 476473, 560997, 685160, 865710, 943315, 283058, 243851, 262035, 417968, 803361, 725588, 727945, 744341, 540943, 390636, 491432, 444488, 343071, 557219, 364680, 230890, 414951, 770388, 657202, 220543, 57194, 399930, 490351, 264192, 888127, 779817, 1161978, 1188222, 1053222, 808212, 760595, 749608, 937483, 788113, 457576, 799972, 447056, 571076, 785586, 514499, 851374, 996731, 717649, 483937, 468394, 128504, -73981, 212769, 148061, 356099, 354243, 460417]
5324D60417lj29497q684M0019J13809R3452Q5905L1158Q246P1744j47249M3243
5312F62560L4213P2058j9696L0564j42160n9990j0932J93127p7064j28804R4335
5301F48211r8619k33762L5925J06993N15285j76790m83995Q7357q5886J38627
5291D53346L17192k25873Q0509j28773M32846J24241o3812k00343j04558k52649
5281D32126K50676L4872J97036k18223j18316K59595J24551k9384j6179p4062
5271H42692m86902K54699J05658M7074l06829J2668M44932l8335r266J76738o0785
5260I82344l46233J70791K07569o8906q0082Q8209n9532l70291l21272J38826
5250C41423M18987K53985j54508k35123K75867m95015K32287j40134k87617L42382
$$ y = [460417, 460414, 330917, 322233, 362252, 476061, 569513, 655418, 686576, 694822, 766566, 619317, 662560, 696773, 768831, 749135, 779699, 637539, 577549, 566617, 759744, 682680, 553876, 648211, 549592, 315830, 351755, 458748, 974033, 797243, 313248, 400605, 314719, 453346, 770538, 544665, 625174, 496401, 929247, 1053488, 989676, 789333, 684775, 432126, 682802, 717674, 914710, 696487, 578171, 837766, 962317, 932933, 916754, 842692, 355790, 610489, 716147, 763221, 456392, 469060, 913992, 875657, 866391, 1043129, 982344, 636111, 806902, 1014471, 945565, 865483, 953692, 894160, 523869, 202597, 341423, 760410, 1014395, 859887, 624764, 900631, 405616, 637903, 497769, 210152, 552534]
5240E52534J15920j75822J10760o0291l91668J2950L23001M11938J05907k11212
5230G94017k7245R7280m0231k32767J82981J1754l38362N94849j04726J82503
5220A120053k11790l59669O99166k95790O4401L81244J26082k19868p2580m41163
5210G90086K83364r405J52823j95145P0612O2017n7929L7526k34687J5375J60786
5199A075423K42956j13718K64867l00778J75753L12289k86930l32417P9389K44123
5189A360957K88007L23200k37836Q7381q0566k06321l8589K43571l5095k70979
5179A433730K45055M5466q7192m31419r462J16721N43046k97341L14018Q12456
5169B685078k6762m40753n9529P05216Q4571k17784K26358L59079m5887M35163
$$ y = [552534, 668454, 492632, 603392, 543101, 151433, 164383, 487384, 899322, 1005229, 794017, 766772, 864052, 823821, 591054, 774035, 785789, 447427, 1042276, 937550, 1120053, 908263, 548594, 1247760, 951970, 1016371, 1397615, 1523697, 1303829, 1231249, 790086, 1073450, 1064045, 1216868, 1021723, 1092335, 1154352, 1096423, 1133949, 899262, 914637, 1075423, 1318379, 1204661, 1469528, 1168750, 1344503, 1656792, 1369862, 1037445, 1116834, 1360957, 1648964, 1972164, 1734328, 1821709, 1741143, 1534822, 1496233, 1739804, 1704709, 1433730, 1678785, 1724251, 1637059, 1205640, 1196178, 1312899, 1855945, 1558604, 1872622, 2685078, 2658316, 2217563, 2158034, 2863250, 2947821, 2730037, 2956395, 3315474, 3269587, 3704750]
5159C704750K08360K00166J58301J73580R1739n4662K51566K90636P5349M94976
5149E594761J48618k27800j61726K5454K18585K117j68800j83180J5867l5834
5139E228062J41032p5221o7460J48303J5976M20339J30508r5227L74703N37129
5129F758144k70848j96769L09084L2005J81929J46863k04231l7134k69627l35356
5119F114060J13033K23280M2498j33815m412L29031q857K22354M59112j84713
5109G171571K58913J02146j10375J55555R4951j18802k70891j32846J65703j66035
5099G149890K8726K33119p8205K81022O584m39439n9290K85303k31450l88443
5089F787817M34435j07211p1681o94947Q4405k21300m89199j61894j67157m55714
$$ y = [3704750, 3913110, 4113276, 4271577, 4445157, 4536896, 4482234, 4733800, 5024436, 5099785, 5594761, 5743379, 5515579, 5353853, 5379307, 5597892, 5600009, 5431209, 5248029, 5263896, 5228062, 5369094, 5293873, 5226413, 5374716, 5390692, 5811031, 5941539, 5846312, 6221015, 6758144, 6487296, 6290527, 6599611, 6631616, 6813545, 6960408, 6756177, 6719043, 6449416, 6114060, 6227093, 6450373, 6492871, 6359056, 6354644, 6683675, 6674818, 6897172, 7356284, 7171571, 7430484, 7532630, 7422255, 7577810, 7672761, 7553959, 7283068, 7150222, 7315925, 7149890, 7178616, 7411735, 7333530, 7614552, 7621136, 7181697, 7122407, 7407710, 7176260, 6787817, 7222252, 7115041, 7043360, 6348413, 6432818, 6211518, 5722319, 5560425, 5393268, 4937554]
5079D937554l74430J18109m91720m11332j77646j22023J90166L8689k63495j79571
5069C264301o5272L58528J1177j99008O464K4431N3017N05341j99366K0183N28402
5058D308198k40216n5181P8902p980j89473K28010j82787l67160J22817K0334
5048C715464L82513K45662k28063k25668J594Q0729k41551l15804M78628J02567
5038C996071j23200j92809j46286J39033l2123L46605K43548k02963m28191O9989
5028C669674L36320j58358j01698n845R2241R8625l77654j43213P9121l61415
5018C127798Q4374R6987K66367J14573k80302J06287j2994k92228q0037L75073
5008C505898j98299o47022k3430n22755j62619K42740L90432J67740l21166k33099
$$ y = [4937554, 4563124, 4681233, 4189513, 3778181, 3600535, 3478512, 3668678, 3707367, 3443872, 3264301, 3199029, 3557557, 3568734, 3369726, 3376190, 3400621, 3453638, 3958979, 3759613, 3779796, 4308198, 4067982, 4012801, 4091703, 4083723, 3894250, 4122260, 3939473, 3572313, 3695130, 3715464, 4097977, 4343639, 4115576, 3889908, 3891502, 3972231, 3730680, 3414876, 3893504, 3996071, 3872871, 3680062, 3533776, 3672809, 3640686, 3987291, 4230839, 4027876, 3599685, 3669674, 4005994, 3847636, 3745938, 3740093, 3832334, 3930959, 3553305, 3410092, 3489213, 3127798, 3212172, 3309159, 3575526, 3690099, 3409797, 3516084, 3503090, 3210862, 3130825, 3505898, 3307599, 2660577, 2637147, 2114392, 1951773, 2194513, 2584945, 2752685, 2431519, 2198420]
4998B198420J56964O9252j36282r6803l86569N15410K04521k04135Q7370K09608
4988B617756J66094R4671L36262l46998J11151K2755L43222J39456l73866J67886
4978C278389M05785P7089l49483O4922Q2953k88592l81243J27135K86608n060
4968C298503q6284j16907j69928j11890p48725j96841O9014r8189k08195j7500
4958A613058o3154J16641M64193k55827p23081J1758J41570J69720J82841m00975
4948A256744R127m20575N5012K59921J80667K21681j53167k61202K19847k61828
4938A106227j83576j70727J70686P2974p4865K20577k47201K73622J91210k05102
4928A153825m6308j6558l19270k08520m8289M54064K43104n7241n2799j02776
$$ y = [2198420, 2355384, 2424636, 2288354, 2191551, 1804982, 2320392, 2524913, 2320778, 2408148, 2617756, 2783850, 2878521, 3214783, 2867785, 2978936, 3001691, 3344913, 3484369, 3110503, 3278389, 3684174, 3761263, 3411780, 3476702, 3559655, 3271063, 2889820, 3016955, 3303563, 3298503, 3212219, 3095312, 2925384, 2813494, 2064769, 1867928, 1936942, 1838753, 1630558, 1613058, 1549904, 1666545, 2130738, 1874911, 1151830, 1163588, 1305158, 1474878, 1657719, 1256744, 1265871, 845296, 900308, 1160229, 1340896, 1562577, 1409410, 1148208, 1368055, 1106227, 922651, 751924, 922610, 995584, 920719, 1141296, 894095, 1167717, 1358927, 1153825, 1107517, 1090959, 771689, 563169, 514880, 968944, 1212048, 1154807, 1102008, 999232]
4918I99232P8206k26809N6471K10402j32803O6804N8955N1655j21625k3905J12168
4907A128751k25052P13K74318k71937j9815m15760M75292K15246k98307J28336
4897I91785j73567M5678L32986o9068k06317k33734J07914m0766J35006k15397
4887F74520K92502J18478l3217P1243L7701M9209j01136O9124l19844j76709j29086
4876E52785J49499j84168P0305K73984J08968R760m1946L3694k6731l29985j72544
4865D43621M30567J90403k93986Q4689k25292L20212M02125k58899k7186Q4075
4855A150329j08364L63658r5428k9518k4148k19342K27406J70013l39058p4076
4845A021472o9736M95891k07680l94181j32113K06535Q6396O4415L11389o0590
$$ y = [999232, 1077438, 850629, 907100, 1117502, 984699, 1051503, 1110458, 1162113, 1040488, 1016583, 1128751, 903699, 904412, 1178730, 906793, 886978, 471218, 946510, 1161756, 863449, 991785, 818218, 863896, 1196882, 1127814, 921497, 687763, 795677, 754911, 889917, 674520, 967022, 1085500, 1052283, 1123526, 1161227, 1210436, 1109300, 1178424, 858580, 681871, 552785, 702284, 518116, 588421, 862405, 971373, 981133, 939187, 972881, 946150, 616165, 443621, 874188, 1064591, 770605, 855294, 630002, 950214, 1352339, 1093440, 1066254, 1150329, 1041965, 1405623, 1310195, 1280677, 1256529, 1037187, 1264593, 1434606, 1095548, 1021472, 951736, 1447627, 1239947, 845766, 713653, 920188, 1006584, 1070999, 1382388, 1321798]
4835A321798J22285K41535j33011K14581m8708l66961M6220j03320j15758L50229
4825A528890J57174J52074j02953M6933q9722k44959L51837k97785q8622M5608
4815A458475k32115j18559j20813K67233N3654K57704K36257n2334n6128P0021
4805A763395k20106n15799J59852J47872J50777l45396J21644L00281M2556j93457
4795A411619l01846K95045L64307j88100j47381j29215L40207L1246m4892k8625
4785A602365J80074k28429k30172k78525L82975j51765L0962L29538M9041n7860
4775A628204k84192L28056p651r4093j04379r0410O001j44421R8117o6741R0319
4764A358810j43929Q2818J50331j39593m85435K26858K1910j2810L60339J61655
$$ y = [1321798, 1444083, 1685618, 1552607, 1767188, 1718480, 1351519, 1397739, 1294419, 1178661, 1528890, 1686064, 1838138, 1735185, 1782118, 1692396, 1447437, 1799274, 1501489, 1412867, 1458475, 1226360, 1107801, 986988, 1254221, 1307875, 1565579, 1801836, 1749502, 1693374, 1763395, 1543289, 1027490, 1187342, 1335214, 1485991, 1140595, 1262239, 1562520, 1605076, 1411619, 1109773, 1404818, 1769125, 1581025, 1433644, 1304429, 1644636, 1675882, 1630990, 1602365, 1782439, 1554010, 1323838, 1045313, 1428288, 1276523, 1307485, 1637023, 1686064, 1628204, 1344012, 1672068, 1664417, 1570324, 1465945, 1375535, 1381536, 1237115, 1335232, 1268491, 1358810, 1214881, 1297699, 1448030, 1308437, 823002, 1049860, 1071770, 1058960, 1419299, 1580954]
4754A580954j01162n54012J34849N63691l65190j14568K1023L87298J03173M008
4744A660064J23914j63189j67569R5026M26909o18729j14904M18581N66543l05347
4734A921299l26350K68993J88571k00594k91713Q3576J65654J77337Q3548l05219
4724A765102K46239m6878l57705N3120J43714l94658J7800m9349l01305J96072
4714A272152K08470k48803K46247k0002Q094N9608J44418r1852r3659j300L48109
4703A831482k66926M922K92432j10591J45107L7066O2729m78007k43821L53653
4693A628046J07050N7968J00783J65659n4884m69948j48058L20631j00931j31534
4683A474782r3476J41039R280m6490K09915L3496j6101K1172J40529k12680m864
$$ y = [1580954, 1479792, 925780, 1060629, 1624320, 1259130, 1144562, 1165585, 1552883, 1656056, 1660064, 1783978, 1620789, 1453220, 1548246, 1975155, 1356426, 1241522, 1660103, 2226646, 1921299, 1594949, 1863942, 2052513, 1851919, 1560206, 1643782, 1809436, 1986773, 2070321, 1765102, 2011341, 1964463, 1606758, 1659878, 1803592, 1408934, 1426734, 1377385, 1076080, 1272152, 1480622, 1231819, 1478066, 1458064, 1466158, 1525766, 1670184, 1578332, 1484673, 1483373, 1831482, 1564556, 1569478, 1861910, 1751319, 1896426, 1933492, 1996221, 1518214, 1274393, 1628046, 1735096, 1793064, 1893847, 2059506, 2004622, 1534674, 1386616, 1707247, 1606316, 1474782, 1381306, 1522345, 1531625, 1485135, 1695050, 1728546, 1712445, 1733617, 1874146, 1661466, 1656602]
4672A656602l1148j88866L14818K64895m27558k57796M09613J20646j8495o6898
4662A775813k54213N672L7705j42500J02378L56610j02850k29421J81509Q2126
4652A812829j69536P0292J2878M5359L09168j54183k75345j19987J13591J79304
4642A824370K02439N34457J02030j59845N2756m62738j9320J99415Q8944O7020
4632B429528l02031J56997J49269J19301j09972m44667K74126K75297j80827L21294
4622B688315k12932l41526J20045K27468Q1588j93118l51917K49128j18000K59202
4612B408253J86253k56449R576n6445L10288K28618R1532j03374j16612K44470
4602B946110O6019M22134j38019k38158o3043q8021K97160R5593k44932L9584
$$ y = [1656602, 1625454, 1436588, 1751406, 2016301, 1588743, 1330947, 1740560, 1861206, 1842711, 1775813, 1521600, 1527272, 1564977, 1422477, 1524855, 1881465, 1778615, 1549194, 1730703, 1812829, 1643293, 1713585, 1726463, 1771822, 2080990, 1926807, 1651462, 1531475, 1645066, 1824370, 2026809, 2561266, 2663296, 2503451, 2556207, 2093469, 2074149, 2273564, 2362508, 2429528, 2127497, 2284494, 2433763, 2553064, 2443092, 1998425, 2272551, 2547848, 2367021, 2688315, 2475383, 2133857, 2253902, 2481370, 2562958, 2369840, 2017923, 2267051, 2149051, 2408253, 2594506, 2338057, 2347633, 2291188, 2601476, 2830094, 2921626, 2818252, 2701640, 2946110, 3012129, 3434263, 3296244, 3058086, 2995043, 2907022, 3204182, 3299775, 3054843, 3094427]
4592C094427n2704L9432J49365J52583l21905M21522k90369j93718M56032j2842
4582C441823r7685K88606k54075j36567J76499K87434j30489l56987J11031O3400
4572C392990J02030J54776J62940l00985o0077Q8524L10085o9691J23344J34414
4562D038350K79315j66005j16307n7962L09825N63902j93303J26212K46j22205
4552D662068j72012L03648O7541j21148J77392k00823M47142Q6719j63504N35940
4542E622963J17149O450Q0617q7976Q3317J69088N61741r9057K16965M01487J36602
4531G209346N50622J31491l12114L15269Q3121L69759J57317K15512O2851O6006
4521H849180R207j7823M94804M28506K45865P46963j89408J9562L94605m6292
$$ y = [3094427, 3041723, 3081155, 3230520, 3383103, 3061198, 3482720, 3192351, 2998633, 3454665, 3441823, 3344138, 3632744, 3378669, 3242102, 3418601, 3706035, 3575546, 3218559, 3329590, 3392990, 3495020, 3649796, 3812736, 3511751, 3451674, 3540198, 3850283, 3780592, 3903936, 4038350, 4317665, 4151660, 4035353, 3977391, 4287216, 4851118, 4657815, 4784027, 4784273, 4662068, 4490056, 4793704, 4861245, 4740097, 4917489, 4716666, 5163808, 5250527, 5087023, 5622963, 5740112, 5746562, 5827179, 5739203, 5822520, 5991608, 6553349, 6454292, 6671257, 7072744, 7209346, 7759968, 7891459, 7579345, 7894614, 7977735, 8347494, 8504811, 8720323, 8783174, 8849180, 8858387, 8840564, 9335368, 9763874, 10009739, 10756702, 10567294, 10586856, 10981461, 10935169]
4511A0935169J01265L64734P70498O00894M79816P61909N87983K62987N36055
4502A5401310O07621O76184Q30187J102373O95995P65373J254665J369696J022975
4493B3726379J665854J693688J441796R16580J349863J866350J678116J608340
4485C5946966J404880J003073O71589O41306M92613P56422J48809M65376P72659
4476D2303693J60224R75973Q80809N07240Q89056P16959O56851O37676M53153
4467D8181634J023301Q98564k19684P12707N0520K67593K14205m31421l16571
4458E0380848N9230J76807n9388Q8485n66464n88207K73563j01023K58623R5761
4448E0018235L42593J061577P79942J359432J218693N64152Q53063J05352O44212
$$ y = [10935169, 11036434, 11401168, 12171666, 12772560, 13252376, 14014285, 14602268, 14865255, 15401310, 16008931, 16685115, 17515302, 18617675, 19313670, 20079043, 21333708, 22703404, 23726379, 25392233, 27085921, 28527717, 29444297, 30794160, 32660510, 34338626, 35946966, 37351846, 38354919, 39026508, 39667814, 40160427, 40916849, 41065658, 41531034, 42303693, 42463917, 43439890, 44320699, 44827939, 45716995, 46433954, 47090805, 47728481, 48181634, 49204935, 50103499, 49883815, 50596522, 50647042, 50914635, 51128840, 50697419, 50380848, 50440078, 50616885, 50557497, 50645982, 50079518, 49491311, 49764874, 49663851, 49922474, 50018235, 50360828, 51422405, 52202347, 53561779, 54780472, 55344624, 56197687, 56303039, 56947251]
4439E6947251M70420J20208L0191j37785L52313R9661j88751q79682p97689j201591
4429E4814546j310276j659518j299397j321755k011387k247969k060501k212487
4421D0691256k091223j777645j855062j928287j589511j588265q89597j054425
4413B7917241q74497j325330j202123j168145n25008o99682m75839n01366n51769
4404B0593482m04045k37970n06812o56236J0631P701k07408l825j56367K8113
4394A8467264K29706L99740j02341k7197J0736K99742K56584K02461L5942J85261
4384A9957898J29558J36848L61747J33130J29588J6509J27338M55734L04511K27340
4374B1980201P0378L51597J02676J56625M97047L35527O43939P50171O90191K81952
$$ y = [56947251, 57417671, 57537879, 57568070, 57430285, 57782598, 57882259, 57693508, 56813826, 56016137, 54814546, 53504270, 51844752, 50545355, 49223600, 47212213, 44964244, 42903743, 40691256, 38600033, 36822388, 34967326, 33039039, 31449528, 29861263, 28971666, 27917241, 27042744, 25717414, 24515291, 23347146, 22822138, 22122456, 21646617, 21145251, 20593482, 20189437, 19951467, 19444655, 18788419, 18799050, 18806751, 18599343, 18595518, 18439151, 18467264, 18696970, 19096710, 18994369, 18967172, 18977908, 19277650, 19534234, 19736695, 19772637, 19957898, 20087456, 20224304, 20586051, 20719181, 20848769, 20865278, 20992616, 21448350, 21752861, 21980201, 22050579, 22402176, 22504852, 22661477, 23158524, 23494051, 24137990, 24888161, 25578352, 25860304]
4364B5860304J506498P13020P99389J325512J633670J251186J263469J445354
4356C5798402K344890J741508J761673K026727K058296J975312K164088J753020
4348E1623916J768536J907732J992312J421690J371207J498110O92547L46238
4340F2622288P37816N18942J48123J23657k21729J57754p22192j086753o31395
4331F1646511n90991r42606r46331j089048r13935k18203p69662n35185r9249
4322E5541301l88316m79808p2768M49994l9319K91627k49251L00977j3776l73839
4312E4966822M38172R5221n04082j73433n46228q58934j60948k88187k25101j002620
4302E1740682p08191j009575l07116q48823o20504q34627r43296o81967q89023
$$ y = [25860304, 27366802, 28079822, 28879211, 30204723, 31838393, 33089579, 34353048, 35798402, 38143292, 39884800, 41646473, 43673200, 45731496, 47706808, 49870896, 51623916, 53392452, 55300184, 57292496, 58714186, 60085393, 61583503, 62276050, 62622288, 63360104, 63879046, 64027169, 64150826, 63929097, 64086851, 63364659, 62277906, 61646511, 61055520, 60112914, 59166583, 58077535, 57163600, 56945397, 56175735, 55640550, 55541301, 55152985, 54673177, 54600409, 55050403, 55011084, 55302711, 55053460, 55354437, 55340661, 54966822, 55404994, 55500215, 54996133, 54822700, 54276472, 53417538, 53256590, 52968403, 52743302, 51740682, 51032491, 50022916, 49715800, 48866977, 48246473, 47411846, 46468550, 45786583, 44897560]
4293D4897560q24179o42689n35244j063536j344285r09081r54966j896651j310576
4284C5416353j582829j336938j415903j166144j373715j360139r96481r55461
4276B5228743q81769l38457n68187l20752n47174r55090r5640k84479l79542k68394
4266B0589259m12614k18364p2525l11149j74210m65492k35919j85428j40490k6263
4256A8346805p75623j59444l31212j62224j96950N9834k70593o489l27592m2166
4246A6134346M01646j49284K29056q1642n88313k65900L95230J14031m5039k70413
4236A5873718l84404n1354l44533j4321J54141o7884M3967q22987j06848N7099
4226A4336594p3246n69980k20116J01824M4472r9647K66578p3071Q200N29180
$$ y = [44897560, 44073381, 43430692, 42895448, 41831912, 40487627, 39578546, 38623580, 36726929, 35416353, 33833524, 32496586, 31080683, 29914539, 28540824, 27180685, 26184204, 25228743, 24346974, 24008517, 23440330, 23119578, 22572404, 21617314, 21521674, 21237195, 20857653, 20589259, 20176645, 19958281, 19885756, 19574607, 19400397, 18934905, 18698986, 18513558, 18373068, 18346805, 17571182, 17411738, 17080526, 16918302, 16721352, 16781186, 16510593, 16504104, 16176512, 16134346, 16535992, 16386708, 16615764, 16534122, 15945809, 15679909, 16075139, 16189170, 16144131, 15873718, 15489314, 15437960, 15093427, 15079106, 15233247, 15165363, 15209330, 14386343, 14279495, 14336594, 14263348, 13693368, 13473252, 13575076, 13619548, 13519901, 13786479, 13713408, 13721608, 14250788]
4216A4250788k76407J13407J94117n4571K0898L01672J25109K45425L29495J83403
4206A5433336j23373M94259N6962j90471O2388M15461K98512J01688l5514M2367
4196A6555615M30705L36053J64428L12463k18831j11360J55050M48179Q22656
4187A8894958m7331K33762L67405L66933L50457Q1825K16602j36604M30916K09043
4177B0967966o9966M88674K70072K43673M32617K84316k13386N70415L59301K294
4167B3335976k8140K5979M2648k18556M33130K32650J35240N13851J96747P75238
4157B5444763N0902K37649l177K73046O93692N1220K76195K10882J210466L95697
4147B8841335Q87252N78463P36966R17746J004897J210907N68820O65219L4407
$$ y = [14250788, 13974381, 14087788, 14281905, 14227334, 14248232, 14549904, 14675013, 14920438, 15249933, 15433336, 15309963, 15804222, 15861184, 15670713, 15733101, 16148562, 16447074, 16548762, 16513248, 16555615, 16986320, 17322373, 17486801, 17799264, 17580433, 17469073, 17624123, 18072302, 18894958, 18847627, 19081389, 19448794, 19815727, 20166184, 20248009, 20464611, 20328007, 20758923, 20967966, 20898000, 21386674, 21656746, 21900419, 22333036, 22617352, 22403966, 22974381, 23333682, 23335976, 23307836, 23333815, 23376463, 23157907, 23591037, 23823687, 23958927, 24472778, 24669525, 25444763, 25495665, 25733314, 25730137, 26003183, 26696875, 26748095, 27024290, 27235172, 28445638, 28841335, 29728587, 30307050, 31044016, 31961762, 32966659, 34177566, 34746386, 35411605, 35446012]
4138C5446012N77884J261627L93498O9867M54442O65699P57935O32465P85975
4129D1045404R46690Q31861J121498J243923J585455J212106J553102J806349
4121E1346388J731002K082913J826625K620557K580845K791001K516433L272600
4113G0768364L099587L514196L689703M489673M587818N427149O094369O643980
4105A08314839P582379P889872Q338711J0031066J0896660J1059114J1852818
4098A75965459J2760788J2614690J2777771J2728457J0439366R110795O250855
4091B52648181K019543j286809n782642r336695j1462175j2349627j2211974j1337656
4083A90900146j0137923q916535p264702n868456m860759m499063l669244l500180
$$ y = [35446012, 36023896, 37285523, 37679021, 37748888, 38203330, 38869029, 39626964, 40259429, 41045404, 41992094, 42823955, 43945453, 45189376, 46774831, 47986937, 49540039, 51346388, 53077390, 55160303, 56986928, 59607485, 62188330, 64979331, 67495764, 70768364, 73867951, 77382147, 81071850, 85561523, 90149341, 95576490, 101670859, 108314839, 115897218, 123787090, 132125801, 142156867, 153053527, 164112641, 175965459, 188726247, 201340937, 214118708, 226847165, 237286531, 246397326, 252648181, 254667724, 253380915, 247598273, 238261578, 226799403, 214449776, 202237802, 190900146, 180762223, 171845688, 164580986, 158712530, 153851771, 149352708, 145683464, 142183284]
4075A42183284l428520l452821m567193o001826o327481n963526n605007m919185
4067A01917725l529014l483062k924172k343173k301348k358688j723240j632392
4059H1622636j915844k025078j595753j152010j535864j102315o46663j012249
4051G0636860p22929r18141m49795r24207p08959p94043j119581r72818j347993
4042F2678394j043187j034062j008272j257632p22068r03067q89982o78210j048295
4033E4093619q47876j510355q79673j210887j332109j321068j582304j363291
4025D4046056j065767j046645j388008j331061q90799j211850j132370j073845
4017C4905711r75579q14977j229374r63672j349620r65183m57725j417602o78235
$$ y = [142183284, 138754764, 135301943, 130734750, 124732924, 118405443, 112441917, 106836910, 101917725, 98388711, 94905649, 91981477, 89638304, 87336956, 84978268, 83255028, 81622636, 79706792, 77681714, 76085961, 74933951, 73398087, 72295772, 71649109, 70636860, 69913931, 68995790, 68545995, 67621788, 66912829, 66118786, 64999205, 64026387, 62678394, 61635207, 60601145, 59592873, 58335241, 57613173, 56710106, 55820124, 55141914, 54093619, 53245743, 51735388, 50855715, 49644828, 48312719, 46991651, 45409347, 44046056, 42980289, 41933644, 40545636, 39214575, 38323776, 37111926, 35979556, 34905711, 33930132, 33115155, 31885781, 30922109, 29572489, 28607306, 28149581, 26731979, 26053744]
4008B6053744p97831q74400p52725n08139o34303r35334m97678p14834l15009
3999B0023491j46229n83740p74377k88813k56356o87021n76345m34538j66371
3990A6109701k57413n33894o53487m3110j31238J7248j07025o76683K30859k14103
3980A3740855l328m42030j05563j23744p1041m22975l24883n21604j48155l00190
3970A1277342j22393j58336l762L03578n5840k39733l32567j98424j46071K29760
3960A0553554K98764l60356q6760M32378l1393n4549l33814K23871L6790O4380
3950A0742865L02173j55709M05110J08167l18160N29816K78419k8615M7094J894
3940A1913054K34541O7517L08816J20636K21405J45170j97377M380j74360n60757
$$ y = [26053744, 25255913, 24381513, 23628788, 23120649, 22486346, 21551012, 21053334, 20338500, 20023491, 19877262, 19293522, 18519145, 18230332, 17973976, 17286955, 16710610, 16276072, 16109701, 15852288, 15318394, 14664907, 14621797, 14490559, 14507807, 14400782, 13724099, 13954958, 13740855, 13737527, 13295497, 13189934, 13066190, 12995149, 12572174, 12247291, 11725687, 11577532, 11277342, 11154949, 10996613, 10992851, 11296429, 11240589, 11000856, 10668289, 10469865, 10323794, 10553554, 10852318, 10491962, 10405202, 10837580, 10806187, 10751638, 10417824, 10641695, 10678485, 10742865, 11045038, 10889329, 11294439, 11402606, 11084446, 11614262, 11892681, 11864066, 11911160, 11913054, 12147595, 12215112, 12523928, 12644564, 12865969, 13011139, 12813762, 12818142, 12643782, 12083025]
3930A2083025j0806n97107p556j84829k38329j87285j86202J33658J20578l46511
3920A0578636L40443K99611l91901n92009k76368P4853L87312L6636j57544J47913
3910A0447582J87127O57281l40704K96781J9403n6347J69228K37805q9402K6118
3900A1554872m6546M4361l2490k4126K0698J87210l1346l18448R5447J09074k57024
3889A1301682k41828K83798r041j73423l8157M02877M5829J98375K4342k75781
3879A1518673L86330m07609L49675J41122O8014p245k3452k62060l47759P4539
3869A1490228M99060K18599j37571R2790j93200L08374M71176J66343J66936L31896
3859A3414631k27291J95563O7355p9944L38362j0827p7460K7980L03362J13280
$$ y = [12083025, 12072219, 11475112, 11467556, 11282727, 11044398, 10857113, 10670911, 10804569, 10925147, 10578636, 10919079, 11218690, 10826789, 10234780, 9958412, 10033265, 10420577, 10457213, 10299669, 10447582, 10634709, 11291990, 10951286, 11248067, 11267470, 11211123, 11380351, 11618156, 11528754, 11554872, 11508326, 11552687, 11520197, 11496071, 11516769, 11703979, 11672633, 11354185, 11449632, 11558706, 11301682, 11059854, 11343652, 11334611, 11161188, 11123031, 11525908, 11571737, 11770112, 11794454, 11518673, 11905003, 11497394, 11847069, 11988191, 12056205, 12048960, 12025508, 11763448, 11415689, 11490228, 11989288, 12207887, 12070316, 12163106, 11969906, 12278280, 12749456, 12915799, 13082735, 13414631, 13187340, 13382903, 13450258, 13370314, 13708676, 13697849, 13620389, 13648369, 13951731, 14065011]
3849A4065011M07800J06984J27369j03469L09215k35040K11879M9690M72145M67530
3839A5879114P5312l115K92814O68146k12120J63024M46572J12984q3312L64473
3829A7703892P7088k79924K6260N25137K61363K97880J44301K64015J39374j70363
3819A8989023O75097K19345L91400Q12937L79179P30434K46449O69351Q29075
3810B3942290O75658O12596J003931O30039O93668Q20396O67284J116873R58570
3801C1121305J247320P55228J108314J382659J024009R42642J152283J425089
3793D0158849J011017R11024J240633J295586J042582J549965R35017J092358
3785D9237031J572001J818381J367455J295564J527544J285884J558900J422608
$$ y = [14065011, 14472811, 14579795, 14707164, 14603695, 14912910, 14677870, 14889749, 14939439, 15411584, 15879114, 15954426, 15951311, 16244125, 16912271, 16700151, 16863175, 17309747, 17422731, 17339419, 17703892, 17780980, 17501056, 17527316, 18052453, 18313816, 18611696, 18755997, 19020012, 19159386, 18989023, 19664120, 19883465, 20274865, 21087802, 21466981, 22197415, 22443864, 23113215, 23942290, 24617948, 25230544, 26234475, 26864514, 27558182, 28378578, 29045862, 30162735, 31121305, 32368625, 33123853, 34232167, 35614826, 36638835, 37581477, 38733760, 40158849, 41169866, 42080890, 43321523, 44617109, 45659691, 47209656, 48144673, 49237031, 50809032, 52627413, 53994868, 55290432, 56817976, 58103860, 59662760, 61085368]
3777F1085368R67211J407963J526493J532617J784822J600493K135435J790348
3769G3830750J555628K234942J745018J620065K082666J995755J280308J481878
3761H7827010J929736K020401J872859K151987J672592K030357K144638J989835
3753A03639415J838393K020963J184159N59096L67068K97621L60178R1088p32049
3744A09625932j054991j328809j109319j113807j236477j497571j818609j912313
3736I8554036j396316j624268j920168k256842k661741k139676k688108l408911
3728H0458006l022662k318290k680353k957062k844980k690310k939349k356451
3720E8648549k026309j882423j958108k023733j765727j344553p75544j242687
$$ y = [61085368, 62052579, 63460542, 64987035, 66519652, 68304474, 69904967, 72040402, 73830750, 75386378, 77621320, 79366338, 80986403, 83069069, 85064824, 86345132, 87827010, 89756746, 91777147, 93650006, 95801993, 97474585, 99504942, 101649580, 103639415, 105477808, 107498771, 108682930, 109242026, 109609094, 109906715, 110266893, 110357981, 109625932, 108570941, 107242132, 106132813, 105019006, 103782529, 102284958, 100466349, 98554036, 97157720, 95533452, 93613284, 91356442, 88694701, 86555025, 83866917, 80458006, 77435344, 75117054, 72436701, 69479639, 66634659, 63944349, 61005000, 58648549, 56622240, 54739817, 52781709, 50757976, 48992249, 47647696, 46872152, 45629465]
3712D5629465j674861j395858p70366j510959j584510o88702p30413q53527q96370
3703C5523899n31566o19584j66539l16646m99692p07347r49620j113491K30628
3694C0850042o61702j90847m04133p24151O0502l91795n49631k48288m50243j49006
3684B7140748m99719k8868j85365l55281l27635o04715p480k86538Q2886L70524
3674B5298557k15637k77137o09283k38426L11015n3528R0404L65223j30691o1113
3664B4479384l00046J09813q2052r8807j12K72586K04239J04564J78362N74084
3654B5442015N32224P5394m2956L28556J59127N24028N02043M12288P54122N48664
3644B9235505N25703R06114M35176L60580P63301L34208Q17528P60554J007671
$$ y = [45629465, 43954604, 42558746, 41788380, 40277421, 38692911, 38004209, 37273796, 36420269, 35523899, 34992333, 34372749, 34206210, 33889564, 33389872, 32682525, 31732905, 30619414, 30850042, 30188340, 29997493, 29593360, 28869209, 28929711, 28537916, 27988285, 27739997, 27289754, 27140748, 26641029, 26612161, 26426796, 26071515, 25743880, 25139165, 25131685, 24845147, 24928033, 25298557, 25082920, 24805783, 24196500, 23958074, 24269089, 24215561, 24305965, 24671188, 24540497, 24479384, 24179338, 24289151, 24207099, 24108292, 24108180, 24380766, 24585005, 24689569, 24867931, 25442015, 25974239, 26049633, 26006677, 26335233, 26494360, 27018388, 27520431, 27932719, 28686841, 29235505, 29761208, 30667322, 31102498, 31463078, 32226379, 32560587, 33378115, 34138669, 35146340]
3635C5146340J036646Q37593Q78514J189884J506828J644944J254741J576957
3627D5072447J521613K045293J881799K250366J773006K253433J788340K862819
3619F1449116K451888K253117K076734K065674K253359K304027K466708J638268
3611G8958891J729003K138265K052025J486602J063806R37787R85105R45165Q82416
3602I1179065L12973J99097J185339R84527P97425J162009R91313J763957J953859
3593A00529564J874257J779025J933237J931905K316200K323430J473556J810804
3585A15971978K303332J693929J308442J755134J464081J372753J497154J643620
3577A29010423J766054K599590K676697K255947K290070J995515K471668K493651
$$ y = [35146340, 36182986, 37020579, 37899093, 39088977, 40595805, 42240749, 43495490, 45072447, 46594060, 48639353, 50521152, 52771518, 54544524, 56797957, 58586297, 61449116, 63901004, 66154121, 68230855, 70296529, 72549888, 74853915, 77320623, 78958891, 80687894, 82826159, 84878184, 86364786, 87428592, 88366379, 89351484, 90296649, 91179065, 91492038, 91691135, 92876474, 93861001, 94658426, 95820435, 96811748, 98575705, 100529564, 102403821, 104182846, 106116083, 108047988, 110364188, 112687618, 114161174, 115971978, 118275310, 119969239, 121277681, 123032815, 124496896, 125869649, 127366803, 129010423, 130776477, 133376067, 136052764, 138308711, 140598781, 142594296, 145065964, 147559615]
3569A47559615K162506J700373J204103J193079N21461K58151P0134j129922j075904
3560A52463596j079589k000700j774803k130849k741832k654584l214014l258350
3552A33608875l565494l703069m113428m186802m146112m210378m174226m034098
3544A01475268m330935m108210l903790l701059l446444l510813l105906k683540
3536G2684571k922078k722673k156543k057000k329536k316328j858426j475526
3528E4846461j555937j687244j379599j375045j197524j288043j761572j030100
3520D3571397p91305r45443j076563q40166j314457r86033r68926j143266J03002
3511C5608240N918q77791k88793j40689p02486l52304o35356m22315O2157j54570
$$ y = [147559615, 149722121, 151422494, 152626597, 153819676, 154341137, 154599288, 154669422, 153539500, 152463596, 151384007, 149383307, 147608504, 145477655, 142735823, 140081239, 136867225, 133608875, 130043381, 126340312, 122226884, 118040082, 113893970, 109683592, 105509366, 101475268, 97144333, 93036123, 89132333, 85431274, 81984830, 78474017, 75368111, 72684571, 69762493, 67039820, 64883277, 62826277, 60496741, 58180413, 56321987, 54846461, 53290524, 51603280, 50223681, 48848636, 47651112, 46363069, 44601497, 43571397, 42780092, 41834649, 40758086, 39917920, 38603463, 37617430, 36648504, 35505238, 35608240, 35614158, 34736367, 34447574, 34306885, 33604399, 33252095, 32616739, 32194424, 32256581, 32102011]
3501C2102011n15117l58883m49977k29715m38759l02446o27516q49755q23566
3492B7506277q78462q99215m1354n84598l74640p06093o82024o0245o68701q59396
3482B1751549m84471l41499o83454q2542r7835m19373l89092j95385l82375k36596
3472A8438927p86407k91473L39360m07359k2575j4276o31854l74841K2889J58040
3462A6430431m09235n30545l0970J63214m09611J18326j59984l87027j32875L30105
3452A4981829o9148n2190J16626k69590j99809j6877J92001M10597k66986k79544
3442A4546909j51908j91757J26678J92327K42698M00052l13404k41028K15335
3433A4825902M6199L94308L84045k42258L16701L83828L1646k92959L03911K66737
$$ y = [32102011, 31586894, 31228011, 30778034, 30548319, 30109560, 29807114, 29179598, 28329843, 27506277, 26627815, 25728600, 25687246, 25102648, 24728008, 24021915, 23339891, 23279646, 22610945, 21751549, 21267078, 20925579, 20242125, 20159583, 20061748, 19642375, 19253283, 19057898, 18675523, 18438927, 17652520, 17361047, 17700407, 17293048, 17270473, 17256197, 16624343, 16249502, 16272391, 16430431, 16021196, 15490651, 15459681, 15622895, 15213284, 15331610, 15171626, 14784599, 14651724, 14981829, 14912681, 14860491, 14977117, 14707527, 14507718, 14490841, 14682842, 15093439, 14826453, 14546909, 14395001, 14203244, 14329922, 14522249, 14764947, 15164999, 14851595, 14610567, 14825902, 14872101, 15266409, 15650454, 15408196, 15724897, 16108725, 16140371, 15847412, 16151323, 16418060]
3423A6418060L41043K48294K52251L14304L84237L41553J48096N42046O41549
3414A9631433K58580J55945n2435K90017J144376N46557N28544j18509L53715
3405B2738223P65367N98675M16374M60927N22301R12066N59781J72829Q29123
3396B7975666Q57758M61577M85926Q17248O11055P90783Q52631N51007M00780
3387C3804431O42129J158816K85466N78679J52993P20837O91969J39022M44353
3378C8618695O69026M03338M36658K2704N78471M58896Q88172N13651N57642N36545
3368D3683798L96824N23831R79463J008055J157705O99348R01319J103296J219244
3359E1672883O21431J246924J507105J166443J562302J010922K242214J669545
$$ y = [16418060, 16759103, 17007397, 17259648, 17573952, 17958189, 18299742, 18447838, 18989884, 19631433, 19890013, 20045958, 19993523, 20283540, 21427916, 21974473, 22503017, 22384508, 22738223, 23503590, 24102265, 24518639, 24979566, 25501867, 26413933, 26973714, 27146543, 27975666, 28833424, 29295001, 29780927, 30598175, 31209230, 32000013, 32852644, 33403651, 33804431, 34446560, 35605376, 35890842, 36469521, 36622514, 37343351, 38035320, 38174342, 38618695, 39287721, 39691059, 40127717, 40150421, 40728892, 41187788, 42075960, 42589611, 43147253, 43683798, 44080622, 44604453, 45583916, 46591971, 47749676, 48449024, 49350343, 50453639, 51672883, 52294314, 53541238, 55048343, 56214786, 57777088, 58788010, 61030224, 62699769]
3351F2699769J321457J570305K425510J996942J822865K320727K423776J963397
3343G8544748K583605K616050K703576K689922K941076L158692K285353K852740
3335A00375762L298991L420017L239671K855530K876777K686328K276942K223528
3327A23253546K159940K036900J777920J370768J120714Q16495J074153J052590
3319A34663026J016800P28503P42059P30988P04264O26376P40643J34722M54718
3310A40542099J20978k55118l35526n17871p26199j387675j192287j063247j551899
3301A33633255j528224k013506j820759k060277j824546j703883j900479k340940
3293A18440641k417826k044421k754862k167800k914240k863334l052924l445755
$$ y = [62699769, 64021226, 65591531, 68017041, 70013983, 71836848, 74157575, 76581351, 78544748, 81128353, 83744403, 86447979, 89137901, 92078977, 95237669, 97523022, 100375762, 103674753, 107094770, 110334441, 113189971, 116066748, 118753076, 121030018, 123253546, 125413486, 127450386, 129228306, 130599074, 131719788, 132536283, 133610436, 134663026, 135679826, 136408329, 137150388, 137881376, 138585640, 139212016, 139952659, 140087381, 140542099, 140663077, 140407959, 140072433, 139554562, 138828363, 137440688, 136248401, 135185154, 133633255, 132105031, 130091525, 128270766, 126210489, 124385943, 122682060, 120781581, 118440641, 116022815, 113978394, 111223532, 109055732, 106141492, 103278158, 100225234, 96779479]
3285I6779479k970000l597098l770467l205715l100441l587176l523730k917905
3277G0106947l100645k572443k268778k024008k145631j989352j538572j529457
3269E2938061j584308j292858p81005j416934p19022p38879j005717o47497o30602
3260D4121239q26417l23310o32659k48292K7775m89240l03564K52200k58815l04397
3250D1014520K01939l7768j24980m60783j55316l4980j08293m18439k08716M42440
3240D0109624n96623p13613n98997k46790l82862o24844j60879j82205l42007
3231C6260804j265888m75631l04920r77472q73916p46471q55596n67286l74953
3222B9818671j64421o26561n00363j54627n05556m99049j57412l36836O3476l81353
$$ y = [96779479, 93809479, 90212381, 86441914, 83236199, 80135758, 76548582, 73024852, 70106947, 67006302, 64433859, 62165081, 60141073, 57995442, 56006090, 54467518, 52938061, 51353753, 50060895, 49279890, 47862956, 47143934, 46405055, 45399338, 44751841, 44121239, 43294822, 42971512, 42338853, 42090561, 42118336, 41629096, 41325532, 41577732, 41318917, 41014520, 41216459, 41178691, 41053711, 40592928, 40437612, 40402632, 40294339, 39875900, 39667184, 40109624, 39513001, 38799388, 38200391, 37953601, 37570739, 36945895, 36785016, 36602811, 36260804, 34994916, 34519285, 34214365, 33236893, 32362977, 31616506, 30760910, 30193624, 29818671, 29654250, 29027689, 28527326, 28372699, 27867143, 27368094, 27210682, 26873846, 26937322, 26555969]
3212B6555969m98350Q8823K19256K07763l50568J3875m06851K01322N0958K73417
3202B6355614M07002M37096O48717j00968K40352K08045R05056N10651M80114
3193C0091679Q53552P24263J077547O61541J142683J215434R98475J180070J440803
3184C9386047J715783J714856J633915J929612K025703J225578J827658J799523
3176E3258675K023258J958107K002715K096443K041847J852505J795516K294536
3168F9323602K681644J836144K466035K439419K389348L085062L585621L352469
3160I1159344L385054L521998L554087L298264L394025L954122L177331K689067
3152A18133292K113059J840039O60098J39224n5305j030831k478859k838747l215291
$$ y = [26555969, 26057619, 26146442, 26365698, 26573461, 26222893, 26236768, 25829917, 26031239, 26082197, 26355614, 26762616, 27199712, 27848429, 27747461, 27987813, 28195858, 29100914, 29611565, 30091679, 30945231, 31669494, 32747041, 33408582, 34551265, 35766699, 36765174, 37945244, 39386047, 41101830, 42816686, 44450601, 46380213, 48405916, 49631494, 51459152, 53258675, 55281933, 57240040, 59242755, 61339198, 63381045, 65233550, 67029066, 69323602, 72005246, 73841390, 76307425, 78746844, 81136192, 84221254, 87806875, 91159344, 94544398, 98066396, 101620483, 104918747, 108312772, 112266894, 115444225, 118133292, 120246351, 122086390, 122746488, 122885712, 122830407, 121799576, 119320717, 116481970, 113266679]
3143A13266679m247935m954822m748970n093953m731982n134991m834888m853549
3135G4665589m740669l975094m129084l509805k945811l215042l177832k281116
3127D6691136k494295k277670k084576j932451j530102j924855j518022j084882
3119C1844283j322483o01041j110847j548677j064438j318184q37490q48024j23402
3110B3069697n33903q45388o09670q60855l41443l99385k19292l20018n75832
3101A8363911k45887k77572p13981l55299j3939M6072m80270m60296r3467O2930
3091A5832202o06692o9090k40960l59833j54641l52519m73490n1987j96063m51575
3081A2875352j94974l41180l36646J92305j26232Q212L3309n75269m24323l40835
$$ y = [113266679, 109018744, 104063922, 99314952, 94220999, 89489017, 84354026, 79519138, 74665589, 69924920, 65949826, 61820742, 58310937, 55365126, 52150084, 48972252, 46691136, 44196841, 41919171, 39834595, 37902144, 36372042, 34447187, 32929165, 31844283, 30521800, 29920759, 28809912, 27261235, 26196797, 24878613, 24041123, 23193099, 23069697, 22535794, 21690406, 21080736, 20219881, 19878438, 19479053, 19259761, 18939743, 18363911, 18118024, 17840452, 17126471, 16771172, 16757233, 16803305, 16323035, 15862739, 15769272, 15832202, 15225510, 15156420, 14915460, 14555627, 14400986, 14048467, 13574977, 13522990, 13326927, 12875352, 12680378, 12339198, 12002552, 12194857, 12068625, 12076837, 12110146, 11534877, 11110554, 10769719]
3071A0769719K893l3775J09892k11809l60728R119m650j74907j73180n854L75239
3060A0301959j83380P7267l34841l28898J78645J86414n24026j70118J53428l00733
3050I055717J41419R2402l53022M2352K47753Q7757k07366J57096J32859J2344
3040I409311k97624j35159J46375o6293K03499K22035L70439j06675l80224l95878
3030H969806J9228M43205l65804l9049j30879J08913M3881J18223l55532j1748
3020H800244J61786N5830K9243M4288J04087L9269k03506l51972L90651J16004
3010I185924K649L86014J12204j93483l27317L20624O3109o6160L76998J09787
3000I970349l26564j75260J58083j01231L29005J16689J09806M51525P4777j78367
$$ y = [10769719, 10772612, 10738837, 10848729, 10636920, 10276192, 10285311, 10280661, 10105754, 9932574, 9926720, 10301959, 10118579, 10195846, 9861005, 9532107, 9710752, 9897166, 9373140, 9203022, 9356450, 9055717, 9197136, 9289538, 8936516, 8978868, 9226621, 9314378, 9107012, 9264108, 9396967, 9409311, 9111687, 8976528, 9122903, 9056610, 9260109, 9482144, 9852583, 9745908, 9365684, 8969806, 8989034, 9432239, 9066435, 9027386, 8896507, 9005420, 9049301, 9167524, 8811992, 8800244, 8962030, 9017860, 9047103, 9091391, 9195478, 9234747, 9031241, 8679269, 9069920, 9185924, 9188573, 9574587, 9686791, 9493308, 9165991, 9486615, 9549724, 9483564, 9860562, 9970349, 9643785, 9468525, 9626608, 9525377, 9854382, 9971071, 10080877, 10532402, 10607179, 10428812]
2990A0428812j52942K64824M80308p0746K68709j45641L99588j67759L99432J02190
2980A1806775m0232N06344L74107M29572J62574n5O32385N37051N02962K49217
2970A5160700J02596j27049N69893M25448J01665K80179J87604N47348Q62333
2961A8110717r6891O47257P55103P5212K76867M74715P53942N68362P46902O76816
2951B2989002O66314N50320O96998M46114P21744P94852P52566O94583P42592
2942B9055085J165898Q87301L73532P94225J074545Q97864Q22887J001778J200916
2933C7274031J075624J421934J510174R20565J493359J840492J616833J406187
2925D8559199J307875K037467J928323K551028K230276J789678K807887K503743
$$ y = [10428812, 10275870, 10540694, 11021002, 10950256, 11218965, 11073324, 11472912, 11305153, 11704585, 11806775, 11766543, 12272887, 12646994, 13076566, 13239140, 13239085, 13871470, 14408521, 14911483, 15160700, 15263296, 15136247, 15706140, 16131588, 16233253, 16513432, 16701036, 17248384, 18110717, 18013826, 18661083, 19416186, 19491398, 19768265, 20242980, 20996922, 21565284, 22312186, 22989002, 23655316, 24205636, 24902634, 25348748, 26070492, 26865344, 27617910, 28312493, 29055085, 30220983, 31108284, 31481816, 32276041, 33350586, 34248450, 35071337, 36073115, 37274031, 38349655, 39771589, 41281763, 42202328, 43695687, 45536179, 47153012, 48559199, 49867074, 51904541, 53832864, 56383892, 58614168, 60403846, 63211733, 65715476]
2917F5715476K954222L015663L342651L790380M374405M009618N038816N909388
2909I8150619N908228N723429O430145O907413P208314P521883P353562P603882
2901A52807475P193350O719991N481642M295161L112509K465105K414997L360653
2893A87850883M368716N543057P245427Q377951J0076857J1314683J3002660J4737112
2885B62517346J5739083J7328087J8132190J8470905J9030635J8305433J6422327
2878C85946006J3159775R810371O194027L144985q26547n552785j0211337j4696254
2870C86968241j8998979k1683347k2981411k2809178k1923661k1104140j9350508
2863B38117017j7231979j6146526j4659485j3508896j2366810j0952423r674094
$$ y = [65715476, 68669698, 71685361, 75028012, 78818392, 83192797, 87202415, 92241231, 98150619, 104058847, 109782276, 116212421, 123119834, 130328148, 137850031, 145203593, 152807475, 160000825, 166720816, 172202458, 176497619, 179610128, 182075233, 184490230, 187850883, 192219599, 197762656, 205008083, 213386034, 223462891, 234777574, 247780234, 262517346, 278256429, 295584516, 313716706, 332187611, 351218246, 369523679, 385946006, 399105781, 408916152, 415110179, 418255164, 417428617, 411875832, 401664495, 386968241, 367969262, 346285915, 323304504, 300495326, 278571665, 257467525, 238117017, 220885038, 204738512, 190079027, 176570131, 164203321, 153250898, 143576804]
2856A43576804r058318q082800p386592o971108n692359n560758m805502m842946
2848I1176421m575006m380233l796941l320457l706679k996884k543082k849916
2840F3007223k964882k551533j865784k493902j736591k261945k097670j563612
2832D5471304j470739j385164j164817j489329j325745j476473j005242o95399
2824C5458396j019551r22357j367144r54976j077505n16646q39645q10576l39225
2815B7610771p34696o93071p90740o39980o03199m26904p66226n93831o58263
2806B1703861m92455p31191n86646n73639m67816k30251m09468m48027j89910
2797A7574458m09358n23226m32551n99910j08802m01352J6855k28831l15394p73374
$$ y = [143576804, 134518486, 126435686, 119049094, 112077986, 106385627, 100824869, 96019367, 91176421, 86601415, 82221182, 78424241, 75103784, 71397105, 68400221, 65857139, 63007223, 60042341, 57490808, 55625024, 53131122, 51394531, 49132586, 47034916, 45471304, 44000565, 42615401, 41450584, 39961255, 38635510, 37159037, 36153795, 35458396, 34438845, 33516488, 32149344, 31194368, 30116863, 29600217, 28760572, 27949996, 27610771, 26876075, 26183004, 25392264, 24752284, 24149085, 23722181, 22955955, 22362124, 21703861, 21211406, 20480215, 19893569, 19319930, 18852114, 18621863, 18212395, 17764368, 17574458, 17165100, 16641874, 16209323, 15609413, 15500611, 15099259, 15116114, 14887283, 14571889, 13798515]
2787A3798515J4663n7422n36343m26185j34137m39907N5353k69549n26171l7882
2777A1440935o42813p1875k60427r9060k83495m72067k5503j80127l13894p0687
2767I020987m42684k76865J68156m7783l30635O7461j2706l19211j80718j52657
2757G493345K05308q5340l92603k27574L06261n30878j39516k28073J23218j12848
2747F411300n38455J90551k16216j65428J57647R6072k14089L2432j29863l60028
2737E263923J87811q0365k87612l61447j89486K6651q3083k74997k56902q1780
2727C862713n88829j67718J80461J87091N9074P8590l21365N1816m07876j91356
2717B742601K19860J10020j39711o605r8488j55163J36530m69393j02228L2723
$$ y = [13798515, 13813178, 13755756, 13219413, 12793228, 12659091, 12219184, 12274537, 12004988, 11478817, 11440935, 10798122, 10726247, 10465820, 10366760, 10083265, 9611198, 9585695, 9405568, 9091674, 9020987, 8578303, 8301438, 8469594, 8421811, 8091176, 8158637, 8145931, 7826720, 7646002, 7493345, 7698653, 7613313, 7220710, 6993136, 7299397, 6768519, 6629003, 6400930, 6524148, 6411300, 5872845, 6063396, 5847180, 5681752, 5839399, 5935471, 5721382, 5753814, 5623951, 5263923, 5451734, 5371369, 5083757, 4722310, 4532824, 4559475, 4476392, 4201395, 3944493, 3862713, 3273884, 3106166, 3286627, 3473718, 3532792, 3611382, 3290017, 3341833, 2933957, 2742601, 2962461, 3072481, 2932770, 2926165, 2827677, 2672514, 2809044, 2339651, 2237423, 2270146]
2707B270146k4624R5189Q5745R7830O8481m5307m77082K60390N03502k48027k325
2696B583918k07589q2671k35491j46454o6041j44475J00637N59483m315j98387
2686B158615k13995l52395l275o2515r4J37020J84253Q0999l96693P8582M63990
2675B074492l55141m69000l367K17035O5178l91303N3713O56017K9475o0305p7953
2664A738841k40949k65224m8991L6244J56424J93568j35539J79050j19804k53827
2654A239793m15066l4370R24901O8358l65667l15026L41928j94409K95961J25657
2644A672060l21188N0824J39117J23194k62974o416j35465J56777r9734j61752
2634A154443J13861j64833r9870O2674m59928M80762L40852J56785J62483k17512
$$ y = [2270146, 2245522, 2340711, 2426456, 2524286, 2592767, 2547460, 2070378, 2330768, 2834270, 2586243, 2583918, 2376329, 2293658, 2058167, 1911713, 1845672, 1701197, 1801834, 2361317, 2357002, 2158615, 1944620, 1592225, 1588950, 1526435, 1526341, 1663361, 1847614, 1928613, 1531920, 1610502, 2074492, 1719351, 1250351, 1246984, 1464019, 1529197, 1137894, 1191607, 1847624, 1877099, 1816794, 1738841, 1497892, 1232668, 1183677, 1219921, 1376345, 1569913, 1434374, 1613424, 1493620, 1239793, 824727, 790357, 1715258, 1783616, 1417949, 1102923, 1444851, 1250442, 1546403, 1672060, 1350872, 1401696, 1540813, 1664007, 1401033, 1394617, 1259152, 1415929, 1316195, 1154443, 1268304, 1103471, 1003601, 1066275, 606347, 1087109, 1427961, 1584746, 1747229, 1529717]
2624A529717l04940k10830K74105K682K54214k66117K77227O2638n01479l24837
2614G92380J48383L38369M22195j97583k36632Q0709j45839n9945K61586N10714
2604A914337o9440m2575Q6747J77949K40762j12101q416K75522L696p4403K21541
2593B613619m1886M70089l28796k11752J58773R3527m77094j17328j22860l31338
2583A704954L80728q7850n14396k92526K73860l74223J28354q4003M38573m98539
2573A074932k78546n4744j62944m29847K23169J28699K7596J29849K14676J44802
2563A017642k96609n0941l62724L32922R0353M5273k69265j50325J68530K3103
2553E47959L88718K0713m85042J34949o1171L16331J66379k88452j07205J31043
$$ y = [1529717, 1224777, 1013947, 1288052, 1290734, 1544948, 1278831, 1556058, 1618696, 1117217, 792380, 940763, 1279132, 1701327, 1503744, 1267112, 1347821, 1201982, 1142037, 1403623, 1914337, 1844897, 1802322, 1889069, 2067018, 2307780, 2195679, 2187263, 2462785, 2466481, 2392078, 2613619, 2571733, 3041822, 2713026, 2501274, 2660047, 2753574, 2276480, 2159152, 2036292, 1704954, 2085682, 1997832, 1483436, 1190910, 1464770, 1090547, 1218901, 1134898, 1573471, 1074932, 796386, 741642, 578698, 148851, 372020, 500719, 528315, 658164, 872840, 1017642, 721033, 670092, 307368, 640290, 730643, 775916, 506651, 356326, 524856, 547959, 936677, 957390, 472348, 607297, 546126, 862457, 1028836, 740384, 633179, 764222]
2543G64222J91569n9536J93233l83636j7983j78353n43077M0330K8109L11207
2533C46085J94721o0356K03320j91775j51492K2700O5021k23514n4736N3748K46684
2522D50406J02419l66674m255P1326K26398l8431k87009K82814M2217k79882k6619
2511A72710O286L6785K07943k46863K12690K72492k89274o89010q0528N4903J54081
2500a87785P3599N36156n8779N362J07888l54817j89118J3711k6966L42817J24046
2489C86114J90245J97941k62251k04522n27006J67584K00530N47643P3515j96930
2479E72863l55729m66859K79378O12109n36504K27001O3973j14493j74345K16747
2469C24141j67594L7704L03132Q9883k28674j44191J66020K1556q1088p3237k67876
$$ y = [764222, 955791, 896255, 1089488, 705852, 687869, 509516, -33561, 6769, 34878, 346085, 540806, 480450, 683770, 491995, 340503, 363203, 428224, 204710, 149974, 203722, 450406, 552825, 186151, 181896, 253222, 479620, 441189, 154180, 436994, 479211, 199329, 172710, 178996, 215781, 423724, 176861, 389551, 662043, 372769, -316241, -396769, -341866, -187785, -114186, 421970, 363191, 368553, 476441, 121624, -67494, -53783, -80749, 262068, 386114, 576359, 774300, 512049, 307527, -219479, -51895, 148635, 696278, 769793, 572863, 217134, -249725, 29653, 641762, 105258, 332259, 396232, 281739, 107394, 324141, 156547, 194251, 497383, 587266, 358592, 214401, 380421, 401977, 320889, 247652, -20224]
2458b0224J38949O3678r1926k3728J20966L64668p1166l17313j34515L15967K34763
2447E80119l57807j97785J30370J17508k42516o148J54774L86313K02158l41770
2437D25216k98228L82757M79135m3614j80452j26322k56679k27991M23430j05827
2427D71425m05164J85175j7598j16489K31544n3919k65267J00746N4231j63149
2417B1535O1372L24435m6906r3972j32978K34670j16632j68832J95863k97112
2407a8557m74059K36585L05216L6888M58065k71845L54201L05154p649M346j48605
2396G79740p7923L43370j3364N50222m6942o63000L62460k05136l22194J79613
2386H86846J2604j28959m90782J01881L21710P8917k45269j89379M51613k38907
$$ y = [-20224, 118725, 182403, 90477, 66749, 187715, 552383, 481217, 163904, 29389, 345356, 580119, 222312, 24527, 154897, 272405, 29889, 23741, 178515, 564828, 766986, 425216, 126988, 509745, 988880, 945266, 764814, 638492, 381813, 153822, 577252, 471425, 66261, 251436, 233838, 117349, 348893, 294974, 29707, 130453, 184684, 21535, 82907, 407342, 360436, 266464, 133486, 368156, 251524, 82692, 278555, -18557, -492616, -256031, 49185, 86073, 544138, 272293, 626494, 931648, 923999, 928345, 779740, 701817, 1045187, 1031823, 1582045, 1535103, 872103, 1234563, 1029427, 707233, 886846, 899450, 770491, 279709, 381590, 703300, 782217, 536948, 347569, 799182, 560275]
2376E60275r444q7783M3948k0955M2388K05316r1647k2137m22958J48420N0303
2365C95726q9341K01012n1434j34893q8415k56267J03371l54402l0690J79591
2355a25742L50078J80005k39337P7397l3140j05191l03398p4488O7249K72424
2345F5857M66084j0737N01534l40045p2634k61419Q6845M25798j54557m08750
2335B97976j40341L11168J34720n21078L25022Q5251K9404J71369m79048p5362
2325A39081K4437p0842M88151K42759k20192m70609j66122K79264J18496J137
2315C65560j62955L8823j40477N4964J21919M40813J1726j44031l6230k05380
2305C44732j67574M30746j60795L57037r4368j79193j14559L69907K08235n7774
$$ y = [560275, 550831, 463048, 506996, 486041, 528429, 733745, 642098, 619961, 197003, 345423, 395726, 306385, 507397, 455963, 321070, 232655, -23612, 79759, -274643, -305333, -125742, 224336, 404341, 165004, 242401, 209261, 104070, -199328, -273816, -206567, 65857, 531941, 521204, 1022738, 682693, 610059, 348640, 435485, 861283, 706726, 297976, 157635, 468803, 603523, 82445, 407467, 492718, 522122, 693491, 214443, 139081, 163518, 92676, 580827, 823586, 603394, 132785, -33337, 245927, 364423, 365560, 202605, 241428, 100951, 155915, 277834, 718647, 730373, 586342, 550112, 344732, 177158, 607904, 447109, 804146, 709778, 530585, 416026, 785933, 994168, 936394]
2295I36394J07981l65597J20160J19509R3871k47592k07577J73310L11272n3824
2285I87907Q3257J30118j52064m07532P1929q3646L21278K35526r4037J75869
2275A268605j01773j53327K59969M3103K42393k63962l94085q6291k17014K56861
2265H54479J73259J40863o0497J97918n67196k52054k55473M47164J05347R5314
2255H79124P7625J46020K67288k07467N7110n4132k33902L12706j23676J35403
2245A256099J41782L36413l32892l49675j9002L50382K26442l6663m41002J42751
2235A274635j69795j95456M82493J84689l79777j88053K76185O03783K05466j14107
2225A980063J74133M432l78911K4167N11834J95361K35964l340k12924j06917
$$ y = [936394, 1044375, 678778, 798938, 918447, 1012318, 764726, 557149, 730459, 1041731, 987907, 1071164, 1201282, 1049218, 641686, 713615, 629969, 951247, 1186773, 1092736, 1268605, 1166832, 1013505, 1273474, 1316577, 1558970, 1295008, 900923, 814632, 597618, 854479, 1027738, 1168601, 1108104, 1306022, 738826, 486772, 231299, 678463, 783810, 879124, 956749, 1102769, 1370057, 1162590, 1219700, 1165568, 931666, 1244372, 1120696, 1256099, 1397881, 1734294, 1401402, 1051727, 1032725, 1383107, 1609549, 1572886, 1131884, 1274635, 1104840, 909384, 1391877, 1576566, 1196789, 1008736, 1284921, 1888704, 2094170, 1980063, 2154196, 2158628, 1779717, 1803884, 2315718, 2511079, 2747043, 2743703, 2530779, 2423862]
2215B423862K59416J3340l98369P5793L98094O5562L5856l63774Q27678K08998
2205C546456j82879J22735K69256l2691k48407J52864N42906J51195P9790J00274
2195D501499M6002J351L36908R5077k84650o4858K61099J62928J42383O7092N48420
2184E813251K79681J59855O03980j37108J79949j63283J12682K4013j38272R07749
2174G642497M11492M6023J58672L32315J00740L54003L28411M97308K51926K22612
2164A0345999K03114N18804j77270O84898Q30923K39695M61302N12878P54804
2155A4375147N45947M64835J264288Q83214J079995O11422O57716J590267J876528
2146B3349359J852005Q84581J387236K091554K397239K458791K825341L193001
$$ y = [2423862, 2683278, 2696618, 2298249, 2374042, 2772136, 2837698, 2873554, 2509780, 3337458, 3546456, 3363577, 3486312, 3755568, 3722877, 3474470, 3627334, 4170240, 4321435, 4401225, 4501499, 4547501, 4548852, 4885760, 4980837, 4696187, 4631329, 4892428, 5055356, 5197739, 5264831, 5813251, 6092932, 6252787, 6856767, 6719659, 6899608, 6736325, 6849007, 6873020, 6734748, 7642497, 8053989, 8100012, 8258684, 8590999, 8691739, 9045742, 9374153, 9871461, 10123387, 10345999, 10549113, 11067917, 10890647, 11575545, 12406468, 12646163, 13107465, 13620343, 14375147, 14921094, 15385929, 16650217, 17533431, 18613426, 19224848, 19882564, 21472831, 23349359, 25201364, 26085945, 27473181, 29564735, 31961974, 34420765, 37246106, 40439107]
2138D0439107K655423L417376L975483M269311O164156O266044O924677P850029
2130H1961606P468306Q063870Q895911R568455R030517Q483745Q422131N500828
2122A47395369l30208p261812j3682310j6007506j4835047j2825770r641728q037299
2114F4773689o676683n343804m747063m226420l132934k845639k445709j872298
2106C3483139k560938k256940j983641j595977j555422j348506j091528j398042
2098A9692145p04225j281814q43973p15225o64949r30259o87000p33048r90917
2089A2140735p11023p13753l59932n71602p58834k71239J9747k50850J7231m74881
2079H065599n27389M8627o2050l71908k4631Q373n81438m97462P2704l0676p1380
$$ y = [40439107, 43094530, 46511906, 50487389, 54756700, 60920856, 67186900, 74111577, 81961606, 89429912, 97493782, 106389693, 115958148, 124988665, 133472410, 141894541, 147395369, 147065161, 139803349, 126121039, 110113533, 95278486, 82452716, 72810988, 64773689, 58097006, 52753202, 48006139, 43779719, 40646785, 37801146, 35355437, 33483139, 30922201, 28665261, 26681620, 25085643, 23530221, 22181715, 21090187, 19692145, 18987920, 17706106, 16862133, 16146908, 15481959, 14551700, 13864700, 13131652, 12140735, 11429712, 10715959, 10356027, 9784425, 9025591, 8754352, 8774099, 8523249, 8540480, 8065599, 7538210, 7586837, 7524787, 7152879, 7128248, 7136621, 6555183, 6057721, 6130425, 6099749, 6028369]
2068F028369j35839k22826n4393l42760n07742j87072j38050j94307r2305L16441
2058D469516r5157j87732O19751j96112m59726j33641O7538j95935j45367k77447
2048C465688K72777l28335j8512j27397l82650J62071J12415K15362k15694J53533
2038C309258K7439k68749j73244Q3964l22288r1225K32254J45939m35660n07526
2028B000162r5070L18601L90009k99209m32344m9675N33936n48127k43662j63843
2018A410778N3721M8465p0485J36222J31121n3771k57145N8785j72369K67031
2008A552353J26583k20045j06122L69506j24073r4664K00626m37200P2058l4621
1998A304401R5284m3355k21945M70701L48479k74093j04142R3161l98301j11319
$$ y = [6028369, 5892530, 5669704, 5615311, 5272551, 4764809, 4577737, 4439687, 4245380, 4153075, 4469516, 4374359, 4186627, 4806378, 4610266, 4150540, 4016899, 4084437, 3888502, 3743135, 3465688, 3738465, 3410130, 3391618, 3264221, 2881571, 3043642, 3156057, 3371419, 3155725, 3309258, 3336697, 3067948, 2894704, 2978668, 2656380, 2565155, 2797409, 2943348, 2507688, 2000162, 1905092, 2223693, 2613702, 2314493, 1882149, 1832474, 2366410, 1818283, 1574621, 1410778, 1464499, 1512964, 1442479, 1578701, 1709822, 1656051, 1398906, 1457691, 1285322, 1552353, 1678936, 1458891, 1352769, 1722275, 1598202, 1503538, 1704164, 1266964, 1339022, 1304401, 1399685, 1356330, 1134385, 1605086, 1953565, 1679472, 1575330, 1668491, 1270190, 1158871]
1988A158871l41218L9586K04446k85135J67034Q0799j94342O4543M08114k49780
1978A052918n2606r7941j86241k20845K83303k1507k59892K47391J32077k7019
1968H49638n30785k80991j73622K99784m6931k62135J28697L00951K66415q2021
1958D69000j90828j18867N5640K22701l10600Q7591J61371j64257j30375K55980
1948C37356k87911j13140J23873J60970K9332J79620N1504N8723j87914k0741
1938C31672n4646M45617k75081l21738J24704K6414n33126M09355J82312j58509
1928A76974R4540l70803j58647L74824J2512k27827K91477m901M1365l58149j25726
1917b54361o1190M85305k3961j81948J37080k51009J06354P1110l66252L38959
$$ y = [1158871, 817653, 857239, 1061685, 776550, 943584, 1024383, 830041, 894584, 1302698, 1052918, 1000312, 902371, 716130, 495285, 778588, 757081, 497189, 744580, 876657, 849638, 318853, 37862, -135760, 164024, 117093, -145042, -16345, 284606, 551021, 469000, 278172, 159305, 214945, 437646, 127046, 214637, 376008, 211751, 81376, 337356, 49445, -63695, 60178, 221148, 250480, 430100, 481604, 540327, 352413, 331672, 277026, 722643, 447562, 125824, 250528, 276942, -256184, 153171, 335483, 176974, 271514, -99289, -257936, 116888, 129400, -98427, 193050, 188149, 229514, -128635, -254361, -315551, 169754, 145793, -36155, 100925, -150084, -43730, 27380, -338872, 87]
1907H7L78264K77148k83875l4276L03046l19712j1966J74898l1874p36594K28696
1896e6158l9971j59104K28748l5904J24182J88003L25748K55530l00671l84316
1886A46087o8091K08392p2080l14605n8317J26107Q1958n99951K90608N64564
1876C04672Q2408n81189M74481J95725k97260K26686J47713m63001k77447K6915
1866a60297J62681L02017K85821q8277k28368j71926m3242j32512K97976J65819
1856C89692j38274O1705K19697L6427L31075o7766k5440J20777n7359k16419j93538
1845D60577l15211m186K64976l60340k21829N56356k14132k89468M37121j77466
1835A36398p353j32551j30576J02540L040k46096j5968j29083l609Q9016Q9325
$$ y = [87, 378351, 655499, 371624, 337348, 640394, 320682, 308716, 483614, 451740, -284854, -56158, -96129, -255233, -26485, -62389, 61793, 249796, 575544, 831074, 530403, 146087, 77996, 286388, 214308, -100297, -158614, -32507, 49451, -550500, -259892, 304672, 387080, -194109, 280372, 476097, 178837, 405523, 553236, 90235, -187212, -160297, 2384, 304401, 590222, 501945, 273577, 101651, 58409, -74103, 223873, 389692, 251418, 313123, 532820, 569247, 900322, 832556, 807116, 927893, 870534, 654115, 460577, 145366, 141180, 406156, 45816, -176013, 380343, 166211, -123257, 313864, 136398, 129045, -3506, -134082, -31542, -28502, -274598, -290566, -419649, -423258, -334242, -244917]
1824b44917l25185r7245J66383K14955J26724K85073K21332q10359K37931M97348
1814B72040m1923K8596j01230K86745k98360k77362J7794k73100O5972M58817
1804A37989j99713j83216L6480M33987j2205m6694J61677p2906K46782k60215
1794B41966j63649K7827K06608n023k77011m3228k30600L8027K51000K56825m77
1783C02265l65981L28336j22051K0345L48424k6368l89291j5403m83704k9663
1773d33091N78930r2603j41243j29593O0109J58036l18774Q3011N60806j55828
1763A69760k12118k96722J04764Q0756p4267k42293J726M32442K3093j10066q6859
1752b09784K54677L20969l1520k99539m5763k5003j20273J04189k2407k45496
$$ y = [-244917, -570102, -667347, -500964, -286009, -159285, 125788, 347120, -463239, -225308, 272040, 230117, 258713, 157483, 444228, 145868, -131494, -113700, -386800, -320828, 137989, -61724, -244940, -208460, 225527, 213322, 166628, 328305, 255399, 502181, 241966, 78317, 106144, 312752, 307729, 30718, -12510, -243110, -205083, 45917, 302742, 302265, -63716, 264620, 142569, 162914, 511338, 484970, 95679, 80276, -403428, -433091, 145839, 53236, -88007, -217600, -157491, 545, -318229, -235218, 325588, 169760, -42358, -339080, -234316, -153560, -227827, -470120, -468394, -35952, -12859, -122925, -209784, 44893, 365862, 334342, 34803, -10960, -35963, -156236, -52047, -74454, -319950]
1742c19950k46950j60123L39571J07271J93409k38409k89377J99602j01119J56176
1732c59899R1297J72594Q6855j21437l23972m3639j80537J81849K86852L00938
1722I0901k3627j02846N382L16570l5638j06341K9195l5813o43047J10272L319
1711c91673J52128K89082K18945p48312K03542N46400j20310k02383j04706n312
1701a62599j77597L53361k8210J60480L17144j85283j80650k12099R9182J74508
1691A58237K31993k24188m72300K95985k30107Q4617l12263M08370k7027m05604
1681d92287k09434K84643J46733p5583R9438N00680j16994M1646J64073j01800
1671B41115P5883j09614K07599k59039o2538R3371m45059k78796K75050M10239
$$ y = [-319950, -566900, -727023, -387452, -280181, -86772, -325181, -614558, -414956, -516075, -359899, -268602, -96008, -9153, -130590, -454562, -498201, -678738, -496889, -210037, 90901, 67274, -35572, -30190, 286380, 250742, 144401, 173596, 137783, -505264, -394992, -391673, -239545, 49537, 268482, -479830, -276288, 270112, 149802, -52581, -157287, -162599, -340196, 13165, -15045, 145435, 462579, 277296, 96646, -115453, -16271, 158237, 390230, 166042, -306258, -10273, -240380, -155763, -468026, -59656, -86683, -492287, -701721, -417078, -270345, -345928, -246490, 254190, 137196, 178842, 342915, 241115, 316998, 207384, 414983, 155944, 93406, 186777, -258282, -537078, -262028, 148211]
1661A48211p9439n9698k70156n91318L92690J97391J33642L29076K3695n0279
1651A73815K7564j03710l23040J56674p6609J83002j23321j88819K5771K2131
1641b26542L7691j9992L62304j54524m05662L72867J03050k86790k5017J5996
1631b26619P8221L00713j68281j78004j72150k40109k84983L51551K73558J78770
1621h7333l04133l8408J74861j82143p4151M1119M05510p3967L6564j32105J49083
1610h5103r7215q063N62295l02414p0149N46208l38611k23873L12269m8217k1972
1599B25155L78316m14527k94558q3669L82636j08871k46983j76382k04428R8951
1589d44360K2886O7313K45879K7674M98954n76182k34408K87051j06214J98368
$$ y = [148211, 68772, 9074, -261082, -852400, -459710, -262319, -128677, 200399, 224094, 173815, 201379, 97669, -225371, -68697, -145306, 37696, -85625, -274444, -248673, -226542, -188851, -208843, 153461, -1063, -406725, -33858, 69192, -217598, -242615, -226619, -148398, 152315, -15966, -193970, -366120, -606229, -891212, -539661, -266103, -87333, -391466, -429874, -255013, -437156, -511307, -470188, -64678, -138645, -102081, -234186, -85103, -182318, -190381, 371914, 69500, -649, 545559, 206948, -16925, 295344, 247127, 225155, 603471, 188944, -105614, -189283, 193353, 84482, -162501, -338883, -543311, -444360, -421474, -354161, -108282, -80608, 418346, -157836, -392244, -105193, -211407, -13039]
1579a3039l55093K82239j42323j64766J09227K90391K120J79616M0870L8834r1607
1568A76469k81081l02346l0235k42888P6171K90516J20653l31775K75616J98986
1558d9914r9392j28378J04961N17145K01367k80468m20195L635K2396q5196j3953
1547b27992K62532o03897K2358K02735R3376J2799L95815L30740J1541m98098
1537A909k23931L84657o4645o5110J41758j20710j4689n0837l26129j28940q8585
1526e55252J36760K66802O7314k11384K12857l795k94627J49758J77016k59692
1516c14243J3112p5358P9548R2081L43727J02923r6832j47509k18606J04194j53003
1505b69966n7724J74590K92613J07296k29255j89013J49800K59069j63058l31889
$$ y = [-13039, -368132, -85893, -228216, -392982, -283755, 6636, 8756, 188372, 229242, 268076, 176469, -104612, -406958, -437193, -680081, -603910, -313394, -192741, -524516, -248900, -49914, -149306, -277684, -172723, 344422, 545789, 265321, -154874, -151239, -128843, -214039, -227992, 34540, -569357, -546999, -344264, -250888, -238089, 157726, 488466, 500007, 1909, -222022, 162635, 97990, 32880, 174638, 53928, 39239, -11598, -337727, -466667, -555252, -418492, -151690, -84376, -295760, -82903, -86698, -381325, -231567, -54551, -314243, -301131, -376489, -296941, -204860, 138867, 241790, 144958, -2551, -221157, -116963, -269966, -327690, -153100, 139513, 246809, 17554, -171459, -21659, 237410, 74352, -257537]
1495b57537J61567R5260J10611Q9045k20316J27588R719k44197r9555N2929M04522
1484B29636l38342k51585J66469J47209J14206j09652O0924L23974M7349k16548
1474A73640m63666o700K85090k46652j16815j71245J45404J39930K63740L62780
1464C65506N1208N0931n89531k52170N8609N23600o4692m04466K08467M29878
1454C77340n92205J30418J15070j74684K12182K51162P2997o7652j21222k64914
1444f1508M44265j9203l00607L31995m8927k95821l06984l48244L88518M04829
1434A88313K16844k36130k82579j18099N9678J48133j34706k08846P2692m7711
1424c42411q9714L97364M1503l85450j95918k2187N2355J07481L98797J95286
$$ y = [-257537, -95970, -710, 109901, 198946, -21370, 106218, 115937, -128260, -227815, -174886, 229636, -108706, -360291, -193822, -46613, 67593, -42059, 18865, 342839, 390188, 173640, -290026, -296726, -11636, -258288, -375103, -546348, -400944, -261014, 2726, 365506, 416714, 467645, -121886, -374056, -315447, 208153, 143461, -261005, -52538, 377340, -214865, -84447, 30623, -144061, 68121, 319283, 392280, 324628, 203406, -61508, 382757, 363554, 62947, 394942, 346015, 50194, -256790, -605034, -216516, 188313, 405157, 169027, -113552, -231651, -171973, -23840, -158546, -367392, -294700, -342411, -432125, -34761, 6742, -378708, -574626, -596813, -544458, -436977, -38180, 157106]
1414A57106k95067q3400J08994L3406K64812k5059p6818J08046k87638K29442
1404A33824n529k06514L3010q0044m6309m0810l180R3658j3584n2617N77445l2922
1392C56428l40693k11390l85480J9455L42702j20922K29339p3701J77930N3714
1382D7382j07091j4025J52613j40185K34971l13321N4759n5115L7554k1514j795
1371a25767J60239l09158K17445J00578J26248K5103m09625j50603K54378k22263
1361c33425k49373J70183J0982m5493J21505K82364M58374k45428l71034l9910
1351b41255L21472L38720L1742j07439k69690N390M9311k26052K96956m96120
1341b96965J2730j84660m4288M05278k817k28658m59684O10908N3980k02577j11367
$$ y = [157106, -137961, -221361, -112367, -78961, 185851, 160792, 83974, 192020, -95618, 133824, 128295, -78219, -45209, -125253, -171562, -212372, -215552, -121894, -135478, -188095, 389350, 356428, 15735, -195655, -581135, -561680, -218978, -339900, -110561, -184262, -6332, 47382, -59709, -73734, 78879, -61306, 173665, -139656, -84897, -140012, -102458, -123972, -125767, 34472, -274686, -57241, 43337, 169585, 194688, -214937, -365540, -111162, -333425, -582798, -412615, -401633, -447126, -325621, -43257, 415117, 169689, -201345, -241255, 80217, 418937, 450679, 343240, 73550, 78940, 128251, -97801, 199155, -296965, -284235, -468895, -513183, -107905, -110722, -339380, -799064, -188156, -134176, -336753, -448120]
1330d48120K05267J34356K03929j3818k57165L01933K910K6780K14785l4824p92388
1319d56355J22542K30957q3640K02821j98205J79391J76273J42581o6814l14434
1309f4883j04698O1187K19317j14525l86478k19095L02954N20167j05414l43856
1299b35324K6923Q3073m8128j75996L17681J44692j3906l4133K16070k42357J91786
1288B30381n42638J67450L60676M00917l06064m47220K87744k84470K8935J31092
1278B6803K36552j06569J50233l73999J18415j4099j86836J1166m9263j70572
1268c58169P5088m160K51232k63546q9086o1995J6812K85992J28246P1739o6764
1257a4611K86166q5562j42508K17022k84789K78957k43157K5387R2537K9966j17893
$$ y = [-448120, -242853, -108497, 95432, 81614, -175551, 126382, 129292, 156072, 370857, 336033, -456355, -333813, -102856, -186496, 16325, -181880, -2489, 173784, 316365, 249551, -64883, -169581, -108394, 110923, -3602, -390080, -609175, -306221, 213946, 108532, -235324, -208401, -125328, -173456, -349452, -31771, 112921, 99015, 64882, 280952, 38595, 230381, -312257, -144807, 215869, 616786, 310722, -136498, 151246, -133224, -104289, 26803, 263355, 156786, 307019, -66980, 51435, 37336, -149500, -138334, -187597, -358169, -283081, -287241, -36009, -299555, -388641, -450636, -433824, -147832, -19586, 52153, -14611, 271555, 185993, 43485, 260507, -24282, 254675, 11518, 36905, 129442, 159408, 41515]
1246D1515k15068L10530P7851l46344M4061K53262l88884p1151N07451O0589n39283
1235b65471K49481l30522K03797k35828L58756K17140K3902o509k69267l14711
1225c69232L88875K02584k27941k08435l45509j13910L28608M77577p2765k95977
1215b36125M62810K87546j69639m88576m24679m7386N52620L95287j47799k90300
1205a06241l61566k14533L50169O63730k43631j59785J62851L95333l45181l19974
1195a78828j05274O534O930K1832K38681J85l1456o0952m299j49419j1267R5023
1183a72310L19396k35685L2726J51399p2941k71173Q2843L79307Q3151J32106
1173D28819o08098k68342K00056L49858k48017j91502J64055L40303J59087r8885
$$ y = [41515, -173553, 136977, 214828, -131516, -87455, 165807, -223077, -294228, 213223, 273812, -265471, -15990, -346512, -142715, -378543, -19787, 197353, 221255, 214746, -54521, -369232, 19643, 222227, -5714, -214149, -559658, -673568, -344960, 132617, 59852, -236125, 226685, 514231, 344592, -143984, -568663, -616049, -63429, 331858, 184059, -106241, -467807, -682340, -332171, 331559, 87928, -71857, 90994, 486327, 141146, -178828, -284102, -277568, -270638, -248806, -10125, -9940, -41396, -102348, -106647, -256066, -267333, -172310, 147086, -88599, -55873, 95526, 22585, -248588, -165745, 213562, 296713, 428819, -179279, -447621, -247565, 102293, -145724, -337226, -173171, 167132, 326219, 227334]
1163B27334l86423p30978P70499K37391k20197n170o61434L43223J70201J29185
1153a26369j27310L61827K57109o8335k54974J41596o8919j7092j88957R1984
1143E60k24275j42116r5815Q4741j09296k25879L34014K47098j30611l81024o4653
1132g07256K77376L86430k48145k32742J93826L328P9944J71606k6122m718K23
1121a06250k63995j9948K00648L08274k05223q7743m2728p2461K89873Q6523k49684
1110a62714K21025j85675L52652R1795m50571J10211L06516K38228n72933j23284
1100a74750K57669K14096m68374P503n962J54945J84263n58268J52376K06249
1090c0253J9428J58412m18786K30801J98443o1314l60029o245J79644N78J4762
$$ y = [227334, -159089, -890067, -119568, 117823, -102374, -107544, -768978, -425755, -255554, -126369, -253679, 108148, 365257, 296922, 41948, 183544, 114625, 97533, -91424, 560, -223715, -365831, -461646, -376905, -486201, -712080, -378066, -130968, -261579, -642603, -707256, -429880, -43450, -291595, -524337, -330511, -327183, -247239, -75633, -101755, -106473, -106250, -370245, -390193, -189545, 118729, -86494, -174237, -216965, -289426, 447, 86970, -162714, 58311, -127364, 225288, 317083, -133488, -23277, 283239, 521467, -51466, -174750, 82919, 297015, -171359, -163856, -169818, -14873, 169390, -388878, -236502, -30253, -10825, 147587, -271199, -40398, 158045, 96731, -263298, -269543, -89899, -89321, -74559]
1079g4559l840N0478J96763n60755K09491J0412Q8293j69299k88159L20583L62005
1068A41413J71147k04556j50299r8718J49106j34617L43468M4599k91839l00039
1058c30335K57749O3789L45807K10294n07034J81883K67254l13644k35901M80525
1048D20387K0813m9181j86026m09582j7290J17532Q7391K09478l93908m7738K32909
1037a5215j53241j19236M24576k0867K5485q6262M11715K06156k4081q0815l89383
1026A78832l31048K32945K56067l95723J23590K51294n35198J11177J52938K30456
1016B75330j15774j61588m0471k6868n0970l06072L82347j3573K68575m1808q8564
1005H0564J02993l0424o6335j94373K95314K43704n66137j27246o7596K19739
$$ y = [-74559, -78399, -27921, 168842, -391913, -182422, -172010, -83717, -253016, -541175, -220592, 141413, 312560, 108004, -42295, -141013, 8093, -126524, 216944, 261543, -30296, -330335, -72586, -8797, 337010, 547304, 40270, 222153, 489407, 175763, -60138, 420387, 441200, 392019, 205993, -203589, -220879, -103347, -15956, 193522, -200386, -248124, -15215, -168456, -287692, 136884, 116017, 141502, 55240, 466955, 673111, 649030, 568215, 178832, -152216, 80729, 336796, -58927, 64663, 315957, -219241, -108064, 44874, 275330, 159556, -2032, -42503, -69371, -120341, -426413, -44066, -57639, 210936, 169128, 80564, 183557, 153133, 86798, -107575, 187739, 431443, -134694, -261940, -329536, -109797]
995a09797k6947J9538k7961k34604L12634J14567J21307j79658l03430j60196
985d74547J44033J14118n9801J98081P4440L508J37103o48j29029k34207m02576
974f29525L27140K54978r6094J11155M37205l58260q3675k77863q6279O95453
964B94235k3429J00792j79656k46503J75608l48656j27611Q1773M5713K65512
954C7778K80184l26390j99928K22317j70822q0145K53040L4030J4662J28281M177
943A97184k86909p7736K13735r513k61322L36485o4603p4118Q2863K15374J8822
932B90262j50908n62449J08559J06523K41970q3217J39342O4362o925J48084r0831
921B04772k52653L169j25494J26489J21559k28314P84781k7972p91634j338K52146
$$ y = [-109797, -136744, -117206, -145167, -379771, -67137, 47430, 168737, -10921, -314351, -474547, -330514, -216396, -276197, -78116, -3676, -168, 136935, 136287, 7258, -226949, -629525, -302385, -47407, -143501, -32346, 404859, 46599, -37076, -314939, -401218, 294235, 270806, 371598, 191942, -54561, 121047, -227609, -355220, -273447, -227734, 37778, 317962, -8428, -208356, 13961, -156861, -237006, 16034, 50064, 64726, 193007, 197184, -89725, -167461, 46274, 36761, -224561, 111924, 47321, -26797, 56066, 271440, 290262, 139354, -423095, -314536, -208013, 33957, -49260, 90082, 154444, 147519, 295603, 204772, -47881, -44712, -170206, -43717, 77842, -150472, 634309, 606337, -185297, -186635, 65511]
910F5511J00444Q5917m56685J01799N4411k97959K67601J29358P8435K01833N8926
899C89591l86621j38546L6204L7859L05962p3264k06147l28178L76095m9977N7970
888B0948j2524K09368j13343J67003n75019j57297L17817Q9191k52851m5881J56565
877a96023K84672Q2039j59881O6977M860k75261j50929K16544k55808Q5088p0257
866c67979N6475M51130k70754r8962J88477o3927J5510N14217l05268o4591l12170
855b57842R1241L18569k56018K9059n0202K9347j31960L82366q1658o49047j63250
844g39395K67676L12939K24702k37114J54293k3958J46073J29739O8272j42549
834A60678j29382L0184J95405j98417j14363j16068R7683K2145J56881k21172
$$ y = [65511, 165955, 251872, -204813, -103014, -48603, -346562, -78961, 50397, 128832, 330665, 389591, 2970, -135576, -99372, -61513, 244449, 171185, -34962, -363140, 12955, -37022, 20948, 8424, 217792, 104449, 271452, -303567, -460864, -143047, -53856, -306707, -352588, -196023, 88649, 170688, 10807, 77784, 82644, -192617, -343546, -127002, -382810, -297722, -367979, -311504, 139626, -131128, -230090, -41613, -105540, -90030, 424187, 118919, 54328, -257842, -166601, 151968, -104050, -74991, -125193, -95846, -227806, 154560, 72902, -576145, -739395, -471719, -158780, 65922, -171192, -16899, -40857, 105216, 234955, 303227, 160678, 31296, 61480, 256885, 58468, -55895, -171963, -74280, -52135, 104746, -116426]
824a16426m3686M40250m72922J03294N7858K10356R097m02563J67065J62736K04183
813C19242m88892j89612L34269k86042L72057j72792j4310R7616J83429p6633
803G8332J00970j15726K54861P7352j42994o6991O7403K1952j43503K56023k91044
792I6635k07463L84840m51645k78194J44750K18752K3006j87117p3010N4829K43853
781c0764j93158J2082J16881J48261p2917J77747j32590K66479J81247p758o60470
770a94960q4157K54173K5222J93766J49183n4150l29195j73200K12475P1769j08232
759c7306J65053l0545o20433O82674L90462l60013q3462K54876J9398j17869J12770
748C75605j93601k50268l1617J37601J65183m33902j24316J44370J96069J22649
$$ y = [-116426, -160112, 280138, -192784, -89490, -31632, 178724, 187821, -214742, -47677, 115059, 319242, -169650, -359262, -24993, -311035, 61022, -111770, -126080, -28464, 154965, 78332, 179302, 63576, 318437, 395789, 252795, 185804, 253207, 275159, 131656, 387679, 96635, -110828, 274012, -177633, -455827, -311077, -92325, -69319, -256436, -329446, -274617, -30764, -223922, -211840, -94959, 53302, -19615, 158132, 25542, 292021, 473268, 465510, -194960, -279117, -24944, 278, 194044, 343227, 289077, -40118, -213318, -843, 70926, -37306, 127747, 97202, -523231, 159443, 549905, 189892, 106430, 361306, 380704, 262835, 375605, 182004, -68264, -99881, 37720, 202903, -230999, -355315, -210945, -14876, 107773]
738A07773M3373P4759n06486j2125N3212L4045M5122Q1126L18559l01230K0765
727d1107K54235K08767N7920k35140k76931P4411J90336l45018j40970K3717M78992
716B49212M0135l35561k80059O1032P0280J09404k36568R9823P7257j4153j45403
705c04601n9064L90981o5146o2954l72904J52120N64774k07322N5035j27348n4970
694i1399J58010k61618J42431K95861m84017L04530L84571m15998M7224J9020
684I8615k60060P0356K22178K8110k69896j22412j07079j5720J91608L7352K71448
673A44500k32224J64207J52645J47300m56914l30509L39890K04584j27462Q3310
663H9327J38344l73507j25013N073J63304K70168n2972k72241L95133k87998k16606
$$ y = [107773, 151146, 225905, -280581, -292706, -239494, -205449, -160327, -79201, 239358, -61872, -41107, 213128, 421895, 479815, 244675, -32256, 42155, 232491, -112527, -253497, -229780, 249212, 289347, -46214, -326273, -265241, -194961, -85557, -322125, -222302, -145045, -159198, -304601, -363665, 27316, -37830, -100784, -473688, -321568, 243206, 35884, 90919, -36429, -91399, 66611, -195007, -52576, 243285, -240732, 63798, 448369, 32371, 79595, 98615, -161445, -91089, 131089, 159199, -110697, -233109, -340188, -355908, -164300, -126948, 144500, -87724, 76483, 229128, 376428, -80486, -410995, -71105, 133479, 6017, 89327, 227671, -145836, -270849, -265776, -102472, 167696, 114724, -157517, 237616, -50382, -266988]
652b66988M1974J88332o3447j86053m6047L5899L20265K17874j64769r20k02470
641a26350L22558l2622l96480K47613j89067M37846o5820k53142j71823M33857
631B06570k28471j71889J40445O3965K2924l7975j33530j36958N08026R0658j34588
620A89177k24059J3398k43485J8310k41810J74772K86058M32150k78174q08705
610f82368Q3190L08700J63694r1071J56040K35043k35436N08732L29135n02346
600B73313l67014j94107O00044l5166l99197N05752j1094j60331N4163j37537
590A28826L41246j77422m22176Q6093N35454R097k15961m01589m15530J72063
580c59899K07920K96959L9601l02977k64575P08878K08662n21502M77064l10869
$$ y = [-266988, -225014, -36682, -100129, -286182, -332229, -296330, 23935, 241809, 77040, 76120, -126350, 196208, 163586, -232894, 14719, -174348, 263498, 197678, -55464, -227287, 206570, -21901, -193790, -53345, 10620, 33544, -4431, -137961, -274919, 233107, 323765, 189177, -34882, -21484, -264969, -246659, -488469, -313697, -27639, 404511, 126337, -682368, -599178, -290478, -126784, -217855, -61815, 173228, -62208, 446524, 775659, 273313, -93701, -287808, 312236, 277070, -122127, 383625, 372531, 212200, 266363, 128826, 470072, 292650, -129526, -43433, 492021, 501118, 285157, -116432, -531962, -359899, -151979, 144980, 184581, -118396, -382971, 325907, 534569, 13067, 490131, 179262]
570A79262k65468j48827l61316P6720O95188J71936l60272N94897j74694j57896
560B49530K44493k16187j44743k55192L67968j25825l49518k97078K51206j76314
550d51660K31963M57866l68155j24959l26503K96245j15617Q7835M5034K22713
540d5238N37462J00090n9121k971m12517L1217L3119l67654J37917L82625m7331
529B87598l04744R2978P319J46425P0743N2416j07557m68627k2498N88596l09117
518C3532j36364j7575Q4048K45462Q8824J7409o0614L13919J89571l88217n30902
507a60907J26925j6251K09215P2904J38114k68199k70635L8707M179K29482P9407
496A82941m46390K64891j10556M12220L13108o46195k91308M82308K50419j94452
$$ y = [179262, -86206, -235033, -596349, -519629, 175559, 347495, -12777, 582120, 407426, 249530, 494023, 277836, 133093, -122099, 245869, 120044, -229474, -526552, -275346, -451660, -219697, 238169, -129986, -254945, -581448, -285203, -400820, -312985, -267951, -45238, 492224, 592314, 533193, 530222, 117705, 148922, 182041, -185613, -47696, 334929, 287598, -17146, 75832, 83151, 229576, 300319, 352735, 245178, -223449, -245947, 342649, 33532, -102832, -120407, -36359, 209103, 297927, 315336, 254722, 568641, 758212, 369995, -160907, -33982, -50233, 158982, 231886, 370000, 101801, -168834, -130127, -125948, 103534, 182941, -263449, 1442, -109114, 303106, 616214, -29981, -321289, 161019, 411438, 216986]
486B16986O8273j80468l6338k29738L44173J45295j17669P0684k66300K76766
476B91664M3295k37937J04154J96643k56382r4622K0551m9160l99636K23597L54674
465A96841M6661L70230j30591k18580l74907L9641J38071K14283L41103k7692
455E95060m25162k77425J97323L27969m1310m788j10596k7609p6955l47729k34939
444d26161K41560K74118J53399k33519M96458j36395j09657Q6073r9290n6584
434A90002q6171j11811j36563M5349Q3119K54997N92474l89027L15011o4593n09490
423A83297Q0966k15950j3235L77549r3059j55246M28593l27520k35236o0779K82696
412B52076K95254o55195k84521r970j94673O3835M36263J0035o3219J42383K8690
$$ y = [216986, 285259, 104791, 68453, -161285, 182888, 328183, 210514, 281198, 14898, 291664, 334959, 97022, 201176, 397819, 141437, 46815, 67366, 18206, -381430, -157833, 196841, 243502, 613732, 483141, 264561, -110346, -70705, 67366, 281649, 622752, 595060, 169898, -107527, 89796, 417765, 376455, 371667, 261071, 233462, 156507, -191222, -426161, -184601, 89517, 242916, 9397, 505855, 369460, 259803, 345876, 246586, 190002, 103831, -7980, -144543, -99194, -16075, 238922, 831396, 442369, 757380, 692787, 183297, 264263, 48313, 35078, 412627, 319568, 164322, 592915, 265395, 30159, -30620, 252076, 547330, -107865, -392386, -402356, -597029, -533194, -96931, -86896, -150115, -7732, 20958]
401B0958K31062j02406J03994Q315m9796l93810K94275O2343q830J1109L8401
390B15615l33727R8078L1819j08951Q0649J73212K24212l91965k59534J8683n1559
379c03468j32306Q0424M73999k78756j48507J38953Q9226M5715j43789k31204
369d09713k08693L84135K03387J19215l73296m2068M0050m2871L92253j02508
359d0109P616j6213p2829M9162l35550L01662K42559j20466l75891M21245J71867
348B33053k19882K60223m5579k25330j42617M99140o36625r3412O18849j8693
338B29127j61521p5434J6498j29835K77494l5376o4174K79569J7748j84816J96154
327C65434R9522L1972k88853j76377k65156J48110j27798j29144K39040o0980
$$ y = [20958, 252020, 149614, 253608, 261923, 212127, -181683, 112592, 174935, 166105, 177214, 215615, -118112, -20034, 11785, -97166, -16517, 156695, 380907, -11058, -270592, -251909, -303468, -435774, -355350, 118649, -160107, -308614, -169661, -80435, -34720, -178509, -409713, -618406, -234271, -30884, 88331, -284965, -327033, -286983, -329854, 62399, -40109, -32493, -48706, -121535, -72373, -407923, -106261, 136298, 15832, -360059, 61186, 233053, 13171, 273394, 227815, 2485, -140132, 359008, -277617, -371029, 247820, 229127, 67606, -7828, 8670, -121165, 156329, 120953, 56779, 336348, 354096, 169280, 365434, 464956, 496928, 208075, 31698, -233458, -85348, -213146, -342290, -103250, -164230]
317a64230Q2155j73266J24251J09071n0593K17616j47525J50008M93838l43150
307B98175k94618Q9560O077k13044Q6044j57187K10927k0625q4388J01100l22799
296c00778q2158P47053j92801l468j32234j03494l32080K69492O96357k41993
286C23896k59225k90686J59258J29718m6479M2697j91134j05808L8863L07838
276A08938K23116J72633k39105l03415q0516J24503k81878j84150k20917M48183
266b32608M52999k05490j73743R9965K57206l33365O2561k95105m5386L27903
256h5063k24995k4305J31901q4414L91123j09359q6702k1357k28022p4175J34544
245b80824k2239L07561M54775j48962J3705j43896n22518j57895l7789l995p3812
$$ y = [-164230, -82075, -255341, -131090, -22019, -72612, 145004, -2521, 147487, 641325, 298175, 3557, 93117, 99194, -113850, -27806, -184993, 25934, 5309, -79079, 22021, -300778, -382936, 364117, 171316, 167848, 35614, -67880, -399960, -130468, 565889, 323896, 64671, -226015, -66757, 62961, 16482, 59179, -131955, -237763, -198900, 108938, 332054, 504687, 265582, -37833, -118349, 6154, -275724, -459874, -680791, -232608, 220391, 14901, -158842, -58877, 198329, -135036, -72475, -367580, -412966, -85063, -310058, -334363, -202462, -286876, 104247, -5112, -91814, -113171, -341193, -415368, -280824, -303063, 4498, 459273, 310311, 324016, 180120, -342398, -500293, -538082, -542077, -615889]
234f15889J62360L0223L54201p6059J06529l9242N92406j34887j73423m93588
224b87369K30140L8335l41666j67624K89367M18050J76645m87777J95530K95916
214C59547J52339k051k58900j99359K07016l01142K27340L03m44735N06544k97657
203e0755j6607r07j09633K64665P8359j67882j41422o4729K16782j04527j84376
192b81032O5212L41480K78521m5518n88007L16377J79834m6244m88332j89932
182d57641M31627m19637K62695M57023J38513K4444k24521o8306k49453M86070
172C80814J05811l06205j12882r384o3790N03527K0370o5131n20565Q8109m7865
161b7191Q8962k73694R986j08633J98893J19657J07885J42961j77345o7716J64574
$$ y = [-615889, -453529, -423306, -69105, -145164, -38635, -77877, 514529, 379642, 206219, -287369, -57229, -18894, -360560, -528184, -238817, 179233, 355878, -131899, 63631, 359547, 511886, 509835, 250935, 51576, 258592, -42550, 184790, 185093, -259642, 246902, -50755, -67362, -68269, -177902, 86763, 165122, -2760, -144182, -208911, 7871, -96656, -281032, -215820, 125660, 404181, 358663, -229344, 87033, 266867, 220623, -267709, -457641, -26014, -445651, -182956, 274067, 412580, 437024, 212503, 144197, -105256, 380814, 486625, 180420, 67538, 58154, -5636, 497891, 518261, 453130, -67435, 20674, -27191, 61771, -211923, -201937, -310570, -111677, 7980, 115865, 258826, 81481, 13765, 178339]
150A78339R5715q3913n0695j19930j0123m9357j39899K18191j04833j49634J98321
139a7818j69343j76844K49818K86520L53146j29400m41586j17651K26907J86201
129B49950r9732J59601R8645j5751M5891P2601N5778j61837K35377k5975k35845
118C78703k12938j62032L7740p7272J79584m63732j41386J12846j7237L4847K2354
107c08523K16951R4015k30412k89226J33297L20011j54153J2253j3882k6526K1730
96b24465L52416O7948k5159l22932K15383N6875K0528q9279k43003P4562K50803
85A33677R9085l65065K79878J57986j02163j67032o3931L03204J35808l56050
75E5397m11134L80835O1177k9509O0794J69520k89579k18463J49308j38393K68077
$$ y = [178339, 274054, 190141, 139446, 19516, 9393, -39964, -179863, 38328, -66505, -216139, -17818, -187161, -364005, -114187, 172333, 525479, 396079, -45507, -163158, 63749, 249950, 150218, 309819, 408464, 392713, 438604, 511205, 566983, 405146, 640523, 614548, 378703, 165765, 3733, 41473, -35799, 143785, -319947, -461333, -348487, -365724, -330877, -308523, -91572, 2443, -227969, -517195, -383898, -63887, -218040, -205787, -219669, -246195, -224465, 127951, 195899, 170740, -152192, 63191, 120066, 140594, 51315, -191688, -117126, 133677, 232762, -132303, 147575, 305561, 203398, 36366, -27565, 275639, 411447, 55397, -355737, 25098, 86275, 56766, 117560, 287080, -2499, -220962, -71654, -210047, 58030]
64E8030R6251j71277K23321m6092k24311j22338K79766k38033J27414M97068k64425
53B15374l6211j69520j37844J8496K77960J8214j49960K937j0375N9116M9168
42A37355L0738q8925K6619r4882L9542L1867J22302j35356k54217L11822P558
31A34423K2354J14139l12844k22239k756J79016J68411R727k01443L1064J13439
20C3291O5209k26195K02778l7050J48913n4106j62849J36914K95796j12315m51057
9a60671L48440l7067l603j38566O7711J65029n8187L9259j23409
0I8936
$$ y = [58030, 154281, -16996, 206325, 160233, -64078, -186416, 93350, -144683, -17269, 479799, 215374, 179163, 9643, -128201, -109705, 168255, 186469, 36509, 39446, 29071, 88187, 137355, 168093, 79168, 105787, 10905, 50447, 82314, 204616, 69260, -184957, 126865, 134423, 156777, 270916, -41928, -264167, -266923, -87907, 80504, 90231, -111212, -80148, 33291, 98500, -127695, 75083, 38033, 186946, 132840, -30009, 106905, 402701, 290386, -160671, 187769, 150702, 147099, 8533, 76244, 241273, 183086, 222345, 98936]
$$ Imaginary data points
##PAGE= N=2
##DATA TABLE= (X++(I..I)), XYDATA
16383c117716L3656K27139k53494J88017L50539j23766j03408J98829L4672j14421
16373b679953k2576J58350j4121r1434o1634L03017P3689J49662j6997J9266j78802
16362b361533j42659K28912j11313L32016J18896n5241N5171J72773J38724r7782
16352a722036J22369J3043J16118M2851p6020j91437J72612j16787l9954Q2820
16342a596421J46804K97449j93110N4905J10501J97350Q9302J45876L9494k02350
16332i10200J21659M086j33510K20215J28525N1201j40778K9634l5875J23338
16322e41705K2767K11869j54100j76164j7355K54116M7875j71311R8101K69323
16312a56584K05572k68962J4736K8829J3475Q3272j15510J03563K21592M8056
$$ y = [-3117716, -3084060, -2856921, -3110415, -2922398, -2571859, -2695625, -2799033, -2600204, -2565532, -2679953, -2702529, -2544179, -2558300, -2649734, -2711368, -2408351, -2334662, -2185000, -2201997, -2182731, -2361533, -2504192, -2275280, -2386593, -2054577, -1935681, -1990922, -1935751, -1762978, -1624254, -1722036, -1599667, -1586624, -1470506, -1427655, -1503675, -1695112, -1522500, -1639287, -1679241, -1596421, -1449617, -1152168, -1345278, -1290373, -1179872, -982522, -893220, -747344, -707850, -910200, -788541, -784455, -917965, -697750, -569225, -518024, -658802, -629168, -665043, -541705, -518938, -307069, -461169, -637333, -654688, -400572, -352697, -524008, -425907, -156584, 48988, -219974, -205238, -176409, -162934, -79662, -195172, -91609, 129983, 178039]
16302A78039L79879k05572j63523j78733j15639J21832M43678Q2798J69085j25842
16292E86002j61079M50270J89270l06897m81944J97688J94427J1325k90587R3484
16282D81959J45808K59709j26075m04513K34389O05065K78870n63275q9170M71318
16272A294085j8592J29359J20483j45080k76628p407k98615J15011J38461m9961
$$ y = [178039, 557918, 352346, 188823, 10090, -105549, 16283, 459961, 542759, 711844, 586002, 424923, 875193, 1064463, 757566, 275622, 473310, 667737, 679062, 388475, 481959, 627767, 887476, 761401, 356888, 591277, 1196342, 1475212, 911937, 822767, 1294085, 1275493, 1404852, 1525335, 1380255, 1103627, 1096220, 797605, 912616, 1051077, 1001116]
$$ [...]
##END NTUPLES=NMR SPECTRUM
##END=
