##TITLE=1H_CG-1150-D9
 CDCl3,8 sc, 
 3.9.2021
##JCAMPDX= 6.0         $$ Bruker NMR JCAMP-DX V2.0
##DATA TYPE= NMR SPECTRUM
##DATA CLASS= NTUPLES
##ORIGIN= UXNMR, Bruker Analytische Messtechnik GmbH
##OWNER= root
$$ XWIN-NMR		Version 3.5
$$ Fri Sep  3 10:54:05 2021 Russian Standard Time (UT+4h)  she@DPX200
##.OBSERVE FREQUENCY= 200.1314
##.OBSERVE NUCLEUS= ^1H
##.ACQUISITION MODE= SIMULTANEOUS
##.ACQUISITION SCHEME= undefined
##.AVERAGES= 8
##.DIGITISER RES= 18
##SPECTROMETER/DATA SYSTEM= spect
##.PULSE SEQUENCE= zg30
##.SOLVENT NAME= CDCl3
##.SHIFT REFERENCE= (INTERNAL, CDCl3, 0, 16.9741)
##AUDIT TRAIL= $$ (NUMBER, WHEN, WHO, WHERE, WHAT)
$$ ##TITLE= Audit trail, XWIN-NMR		Version 3.5
$$ ##JCAMPDX= 5.01
$$ ##ORIGIN= Bruker BioSpin GmbH
$$ ##OWNER= she
$$ F:/spectra/data/she/nmr/H-F/1/pdata/1/auditp.txt
$$ ##AUDIT TRAIL=  $$ (NUMBER, WHEN, WHO, WHERE, WHAT)
(   1,<2021-09-03 10:52:24.68 +0400>,<she>,<DPX200>,
      <created by zg, POWCHK disabled, PULCHK disabled
       configuration hash MD5:
       00 E9 B6 7A A2 85 ED C7 34 08 36 98 17 FE 4E 26
       data hash MD5: 16K
       5F D2 5D 50 FC A0 5E 00 0C A6 D6 FD DA 5E A2 06>)
(   2,<2021-09-03 10:52:27.23 +0400>,<she>,<DPX200>,
      <Start of raw data processing
       efp BC_mod = 2 LB = 0.24 FT_mod = 6 PKNL = 1 PHC0 = -13711.5 PHC1 = 14.00097 SI = 16K 
       data hash MD5: 16K
       A4 54 9F 9A 57 C1 E0 A3 21 6E 75 96 80 38 E6 D5>)
(   3,<2021-09-03 10:52:35.53 +0400>,<she>,<DPX200>,
      <abs ABSG = 5 
       data hash MD5: 16K
       52 86 09 CB 54 CC CE 21 71 5D 85 93 56 EA BC 07>)
(   4,<2021-09-03 10:52:58.56 +0400>,<she>,<DPX200>,
      <pk PHC0 = -9.944777 PHC1 = 9.000001 
       data hash MD5: 16K
       12 50 83 9E 0C 23 1F A5 23 B0 BC 9A 47 47 1C 85>)
(   5,<2021-09-03 10:53:01.84 +0400>,<she>,<DPX200>,
      <abs ABSG = 5 
       data hash MD5: 16K
       4E 47 74 8A CC FE 35 1B 9E 38 4D 35 47 93 09 A1>)
$$ ##END=
$$ 
$$ hash MD5
$$ 0A 16 F3 DC A6 7E FE 6A CE BD 30 CE 51 C7 84 1A
##$RELAX= 
##$RELAX= 
##$RELAX= 
##$RELAX= 
##$RELAX= 
##$RELAX= 
$$ Bruker specific parameters
$$ --------------------------
##$DU= <F:/spectra>
##$EXPNO= 1
##$NAME= <H-F>
##$PROCNO= 1
##$TYPE= <nmr>
##$USER= <she>
##$AMP= (0..31)
100 100 100 100 100 100 100 100 100 100 100 100 100 100 100 100 100 100 
100 100 100 100 100 100 100 100 100 100 100 100 100 100 
##$AQSEQ= 0
##$AQ_mod= 1
##$AUNM= <au_zg>
##$AUTOPOS= <>
##$BF1= 200.13
##$BF2= 200.13
##$BF3= 200.13
##$BF4= 200.13
##$BF5= 200.13
##$BF6= 200.13
##$BF7= 200.13
##$BF8= 200.13
##$BYTORDA= 1
##$CFDGTYP= 0
##$CFRGTYP= 5
##$CHEMSTR= <none>
##$CNST= (0..31)
1 1 145 1 1 1 1 1 1 1 1 1 1 1 1 1 1 1 1 1 1 1 1 1 1 1 1 1 1 1 1 1 
##$CPDPRG= <>
##$CPDPRG1= <>
##$CPDPRG2= <>
##$CPDPRG3= <>
##$CPDPRG4= <mlev>
##$CPDPRG5= <mlev>
##$CPDPRG6= <mlev>
##$CPDPRG7= <mlev>
##$CPDPRG8= <mlev>
##$CPDPRGB= <>
##$CPDPRGT= <>
##$D= (0..31)
0 1.2 0 0 0 0 0 0 0 0.06 0 0.03 0 0 0 0 0.0002 0 0 0 0 0 0 0 0 0 0 0 0 
0 0 0 
##$DATE= 1630651944
##$DBL= (0..7)
$$ [...]
##$SUBNAM3= <"">
##$SUBNAM4= <"">
##$SUBNAM5= <"">
##$SUBNAM6= <"">
##$SUBNAM7= <"">
##$SUBNAM8= <"">
##$SUBNAM9= <"">
##$SW= 20.0188988654967
##$SWIBOX= (0..15)
0 0 2 0 0 0 0 0 0 0 0 0 0 0 0 0 
##$SW_h= 4006.41025641026
##$TD= 16384
##$TD0= 1
##$TE= 0
##$TE2= 300
##$TE3= 300
##$TEG= 300
##$TL= (0..7)
0 120 120 120 120 120 120 120 
##$TP= (0..7)
150 150 150 150 150 150 150 150 
##$TP07= 0
##$TPNAME0= <>
##$TPNAME1= <>
##$TPNAME2= <>
##$TPNAME3= <>
##$TPNAME4= <>
##$TPNAME5= <>
##$TPNAME6= <>
##$TPNAME7= <>
##$TPOAL= (0..7)
0.5 0.5 0.5 0.5 0.5 0.5 0.5 0.5 
##$TPOFFS= (0..7)
0 0 0 0 0 0 0 0 
##$TUNHIN= 0
##$TUNHOUT= 0
##$TUNXOUT= 0
##$USERA1= <user>
##$USERA2= <user>
##$USERA3= <user>
##$USERA4= <user>
##$USERA5= <user>
##$V9= 5
##$VALIST= <valist>
##$VCLIST= <CCCCCCCCCCCCCCC>
##$VD= 0
##$VDLIST= <DDDDDDDDDDDDDDD>
##$VPLIST= <PPPPPPPPPPPPPPP>
##$VTLIST= <TTTTTTTTTTTTTTT>
##$WBST= 1024
##$WBSW= 4
##$XGAIN= (0..3)
0 0 0 0 
##$XL= 0
##$YL= 0
##$YMAX_a= 695159
##$YMIN_a= -848610
##$ZGOPTNS= <>
##$ZL1= 120
##$ZL2= 120
##$ZL3= 120
##$ZL4= 120
##$ABSF1= 16.99486
##$ABSF2= -3.024179
##$ABSG= 5
##$ABSL= 3
##$ALPHA= 0
##$AQORDER= 0
##$ASSFAC= 0
##$ASSFACI= 0
##$ASSFACX= 0
##$ASSWID= 0
##$AUNMP= <proc_1d>
##$AZFE= 0.1
##$AZFW= 0.1
##$BCFW= 0
##$BC_mod= 2
##$BYTORDP= 0
##$COROFFS= 0
##$CY= -3
##$DATMOD= 1
##$DC= 0
##$DFILT= <>
##$DTYPP= 0
##$F1P= 0
##$F2P= 0
##$FCOR= 1
##$FTSIZE= 16384
##$FT_mod= 6
##$GAMMA= 0
##$GB= 0
##$INTBC= 1
##$INTSCL= 1.334414e-10
##$ISEN= 128
##$LB= 0.24
##$LEV0= 0
##$LPBIN= 0
##$MAXI= 10000
##$MC2= 0
##$MEAN= 0
##$ME_mod= 0
##$MI= 1.114404
##$NCOEF= 0
##$NC_proc= -6
##$NLEV= 6
##$NOISF1= 3.799351
##$NOISF2= 2.8
##$NSP= 0
##$NTH_PI= 0
##$NZP= 0
##$OFFSET= 16.97415
##$PC= 1
##$PHC0= -13721.44
##$PHC1= 23.00097
##$PH_mod= 1
##$PKNL= yes
##$PPARMOD= 0
##$PSCAL= 0
##$PSIGN= 0
##$REVERSE= no
##$SF= 200.13000616858
##$SI= 16384
##$SIGF1= 3
##$SIGF2= 2
##$SINO= 5.538805
##$SIOLD= 16384
##$SREGLST= <1H.CDCl3>
##$SSB= 0
##$STSI= 16384
##$STSR= 0
##$SW_p= 4006.41025641027
##$SYMM= 0
##$S_DEV= 0
##$TDeff= 16384
##$TDoff= 0
##$TI= <>
##$TILT= no
##$TM1= 0
##$TM2= 0
##$TOPLEV= 0
##$USERP1= <user>
##$USERP2= <user>
##$USERP3= <user>
##$USERP4= <user>
##$USERP5= <user>
##$WDW= 1
##$XDIM= 16384
##$YMAX_p= 472777263
##$YMIN_p= -673779
$$ End of Bruker specific parameters
$$ ---------------------------------
##NTUPLES= NMR SPECTRUM
##VAR_NAME=  FREQUENCY,     SPECTRUM/REAL,   SPECTRUM/IMAG
##SYMBOL=    X,             R,               I
##VAR_TYPE=  INDEPENDENT,   DEPENDENT,       DEPENDENT
##VAR_FORM=  AFFN,          ASDF,            ASDF
##VAR_DIM=   16384,         16384,           16384
##UNITS=     HZ,            ARBITRARY UNITS, ARBITRARY UNITS
##FACTOR=    0.244546801953871, 1,           1
##FIRST=     3397.03668496382, 0,            0
##LAST=      -609.373571446454, 0,           0
##MIN=       -609.373571446454, -673779,     0
##MAX=       3397.03668496382, 472777263,    0
$$ Real data points
##PAGE= N=1
##DATA TABLE= (X++(R..R)), XYDATA
$$ [...]
8140 1002829 1257610 1087317 983463 878376 984740 907007 628242 838329 978736 864831
8130 864831 870226 927319 841582 979473 909656 852528 877124 889832 775808 858445 743190
8119 743190 701865 731160 841518 812676 782146 722151 587599 586115 646631 761429 688228
8108 688228 681116 497753 664660 627220 660836 574113 380088 396968 481079 585959 458946
8097 458946 377780 435790 440294 532910 612472 518319 496604 474024 433548 449019 497292 587876
8085 587876 490024 526056 608871 463317 328966 471917 528225 362711 290323 370750 513075
8074 513075 639471 667174 508665 481630 651316 561399 643674 524040 487478 426652 541814
8063 541814 515482 388452 506889 544640 575115 696198 829426 716677 568497 446418
8053 446418 622189 640740 753645 660411 744700 696749 695833 884443 922386 765698 819662
8042 819662 743357 768491 819435 971600 970363 713847 826303 810732 811110 581045 608173
8031 608173 722525 804681 818692 711685 704511 818037 901440 819235 671684 592879 724453
8020 724453 737816 889310 1108859 979246 1024829 947353 910714 970959 845758 797320 796228
8009 796228 955732 674613 656249 543989 586077 600294 591742 499605 443016 345888 472680
7998 472680 482030 486209 500442 378280 397242 481522 310544 438345 581455 393181 302755
7987 302755 302386 315723 381227 388096 141170 198944 263503 484154 480771 317083 255130 153646
7975 153646 49815 254810 302100 169532 7982 203516 158105 73118 28949 150799
7965 150799 189980 192665 -27133 122788 -22053 -144090 45494 -16639 131796 -4083
7955 -4083 14304 -25771 101876 56863 -12017 -270006 -168878 -104074 -203062 -57681 -109285
7944 -109285 -204230 -132425 848 -164993 -40238 141654 27458 -98890 -133593 -42747
7934 -42747 -102685 -56378 -129554 -106782 59074 -132435 -111538 -59053 -22878 -125084 -246186
7923 -246186 -35483 196953 62179 78924 -120071 -259821 -275976 -183437 -34920 -196926
7913 -196926 -97718 -102869 -111980 -135734 -268365 -285106 -220466 -115452 -44282 -213310 -312802
7902 -312802 -242175 -126524 -66434 -255955 -198117 -180121 -287923 -202115 -109437 -136962 -137258
7891 -137258 -337241 -273838 -175536 -58849 -155329 -165058 -94960 -133953 -261332 -236811 -52089
7880 -52089 -84584 -75314 -206714 -144817 -147108 -142201 -168152 -1996 -157210 -235384 -171787 -145616
7868 -145616 -21961 50405 -54734 -266182 -271970 -307925 -70484 12670 6115 -123580 -79067
7857 -79067 -265001 -239494 -20258 123734 -99450 -318857 -228291 -240343 -185863 -259363 -276335
7846 -276335 -422466 -335680 -342609 -268878 96454 -226316 -340571 -436373 -304447 -352886 -455218
7835 -455218 -423461 -261174 -317238 -415893 -303191 -405335 -255874 -164962 -307950 -411838
7825 -411838 -159971 -105369 -88315 -333811 -318793 -418759 -415401 -357447 -307276 -210669 -55841
7814 -55841 -268501 -165632 -189009 -92913 -152950 -339024 -405446 -308081 -281838 -418337 -389552
7803 -389552 -431729 -302877 -296151 -281849 -563128 -438640 -304590 -329540 -114240 -82210 -189144
7792 -189144 -98533 -130281 -197197 -179140 -340430 -163575 -213682 25828 -49232 -247360 -265856
7781 -265856 -163991 -124011 -145187 -380318 -370012 -270184 -261755 -232266 -247262 -139376 -184508
7770 -184508 -107610 -109735 -175864 -507432 -507959 -346797 -154405 -3917 -372040 -347271 -74155
7759 -74155 -160267 -147693 -269223 -168040 -244187 -418141 -483285 -486969 -334449 -310611 -302115
7748 -302115 -212416 -264528 -200374 -126420 -185686 -168106 -134665 -124469 -158192 -11815 38055
7737 38055 -106768 -196941 -221010 -317743 -429713 -313279 -421186 -361190 -225682 -219294 -184080
7726 -184080 -178965 -158557 -215464 -341541 -400006 -152876 -24220 -173979 -214495 -425895 -126765
7715 -126765 -90701 -173872 -128425 -81547 -156189 -104909 17709 -33920 -219854 -139638 -195205
7704 -195205 -244762 -191498 -178057 -61699 -247924 -280060 -322638 -352442 -370746 -382186 -362596
7693 -362596 -390907 -323734 -162500 -189085 -202374 -211533 -263403 -209584 -192870 -231110 -398273
7682 -398273 -451289 -428184 -359383 -253594 -219906 -284529 -173347 -38119 -211912 -233231 -244405
7671 -244405 -185042 -207107 -252415 -295099 -281431 -304472 -373008 -192460 -29267 -57886 -165826
7660 -165826 -195738 -147481 -198340 -205403 -265715 -333541 -272575 -203756 -236742 -425258 -433885 -305194
7648 -305194 -183591 -247803 -147187 -221682 -212969 -221693 -209209 -161422 -201477 -273000 -316355 -59887
7636 -59887 -162191 2243 -69313 -76946 -250918 -235371 -312549 -352281 -126133 -173726 -177604
7625 -177604 -134697 -88257 -60913 -83359 -257937 -411592 -457386 -340510 -228415 -342483 -361818
7614 -361818 -211793 -390580 -270846 -25876 -209340 -163812 -193753 -362032 -251841 -270463
7604 -270463 -367261 -240351 -170856 -255445 -241786 -74627 -331312 -378855 -188517 -97375 -65732
7593 -65732 -214105 -413077 -460472 -521005 -500314 -91568 -216587 -239208 -72227 30989 -110865
7582 -110865 -197206 -230109 -204919 -125664 -76188 -168917 -305755 -179214 -165869 -167201 -93598
7571 -93598 -395133 -282898 -249951 -296533 -144370 -239672 -106202 -46838 -136214 -233710 -183522
7560 -183522 -186521 -6596 -186330 -147103 -170576 -203091 -25034 -45826 -100345 -170470 -381100
7549 -381100 -255093 -29039 -119109 -137554 24418 -100803 -84701 -68434 -154811 63516 187585
7538 187585 63279 -71057 -70748 -24863 -19987 64111 -24268 29912 160906 146323 117398 22322
7526 22322 15355 -140277 -168037 -226595 -300912 -22531 -4959 -12046 192202 77997 54388
7515 54388 -88382 -253970 -167420 -164949 -252326 9947 -108872 -179952 -71518 -105501 -163220
7504 -163220 -244589 -108852 -17522 -62396 -96403 -176096 -95150 -136811 -147911 -178865 -99848
7493 -99848 -93218 -93063 -131817 3092 -107052 -216549 -111971 -91049 -31708 -49092 68112
7482 68112 -110750 -116316 58901 -149607 -195971 -93631 148946 188274 117062 238046 276687
7471 276687 128045 74976 102569 60906 -51266 -26272 -254482 -325021 -164488 -180313 -59505
7460 -59505 -47135 36411 87193 -77186 30320 3099 -146388 -53052 -35014 133853 143360
7449 143360 149841 72668 12305 180584 247494 160894 130889 149976 128917 22293 203
7438 203 143909 38549 116460 107200 36048 171817 187678 162394 47405 403561 74420
7427 74420 269878 409417 371599 339550 177001 200100 144685 333051 320577 95921 -30584
7416 -30584 59767 132538 278027 290457 141588 218115 307074 309858 225363 170977 270229 303404
7404 303404 172518 359394 188931 250447 336350 358091 560406 530641 561806 343039 304964
7393 304964 398096 415524 392624 329496 252364 568467 513856 421887 554805 497544 304764
7382 304764 382915 457485 517123 584183 491806 456053 651416 620716 666074 504563 505750
7371 505750 550227 435988 716283 722675 706121 701268 457963 505530 724967 668998 679748
7360 679748 704356 786095 658840 717298 770152 752991 816018 681607 815641 969683 819380
7349 819380 708312 719501 717907 949961 918317 955795 812558 979501 990259 1021381 1054064
7338 1054064 900679 966371 881260 946433 890877 931618 1036519 1186225 1061855 1100187 1202011
7327 1202011 1190974 1111083 1264148 1328948 1159962 1230894 1376810 1335011 1333011 1353864 1292436
7316 1292436 1385689 1168773 1265522 1335541 1391281 1512418 1450390 1538058 1354158 1425558 1530655
7305 1530655 1586661 1627968 1634958 1703887 1776219 1799773 1778675 1846157 1993730 1997438 1954449 2049190
7293 2049190 1958579 2008448 2058574 1910961 2131309 2109013 2208748 2309522 2301517 2288675 2520238
7282 2520238 2640209 2631631 2774295 2746648 2739201 2739471 2766878 2740094 2724192 2823158 2813983 2981521
7270 2981521 3184379 3191057 3191498 3307072 3352057 3309099 3434904 3594580 3593950 3584740 3699258 3667588
7258 3667588 3776996 3856730 3862614 4049267 4168659 4088248 4327032 4639000 4709188 4726754 4846258
7247 4846258 4866311 4904640 4937856 5106898 5158826 5352654 5517372 5551799 5816135 5913659 5970552
7236 5970552 6226306 6349338 6383190 6501500 6626743 6920308 7186032 7062912 7334791 7738951
7226 7738951 7846259 7933198 8330333 8573531 8718934 8848726 9044112 9314456 9676407 9966058
7216 9966058 10220230 10624342 10919200 11225423 11637794 12184910 12566671 12849219 13412499 13863985
7206 13863985 14364396 14933292 15315772 15776038 16155814 16776315 17206117 17491034 17917911
7197 17917911 18388049 18567190 18693837 18748678 19099362 19254290 19215141 19514113 19418627 19659697
7187 19659697 19918620 20376804 20720110 21129431 21397474 21622959 22194971 22632296 23113421
7178 23113421 23529105 23991593 24692376 25359527 25894268 26570911 27161962 27873908 28342914
7169 28342914 29179843 30033416 30842999 31648850 32441638 33403009 34443248 35167540 35947941
7160 35947941 36756827 37404993 38071849 38651889 38940356 39042738 39132772 38957955 38694253 38257686
7150 38257686 37598745 36836983 35580414 34505911 33306134 32077760 30648861 29377150
7142 29377150 27996966 26586571 25181443 23883040 22753043 21516050 20263422 19333340
7134 19333340 18566344 17629760 16756022 15782829 14895893 14087727 13625939 12931271 12293809
7125 12293809 11816458 11300148 10634249 10320798 10003727 9719876 9301558 8742248 8330596
7116 8330596 8046850 7848121 7557267 7269329 6885742 6573441 6347281 6232148 6208328 5824635
7106 5824635 5539707 5460400 5316596 5119704 4918092 4727700 4566991 4579448 4410044 4055630
7096 4055630 3974719 3841809 3949272 3973724 3804279 3551969 3436724 3462306 3420278 3390359
7086 3390359 3448379 3123847 3017531 3013670 2938616 2963093 2986623 2908500 2776513 2872184 2724182
7075 2724182 2512671 2477563 2423685 2335399 2376039 2408917 2470964 2522358 2473549 2348034 2123418
7064 2123418 2149091 2220684 2162542 1943602 2101915 2106587 2103008 2084884 1975090 1845583 1775537
7053 1775537 1845253 2126474 2009007 1913360 2031653 1764488 1865806 1744261 1749645 1751576 1657402
7042 1657402 1719967 1692260 1613689 1741527 1784731 1797676 1809026 1838716 1772195 1900665 1757742
7031 1757742 1775554 1854354 1881499 1912059 1863998 1716258 1733879 1835334 1914738 2002544 1962897
7020 1962897 2014376 2263626 2159954 2211560 2264457 2262402 2414310 2311756 2434260 2576526
7010 2576526 2768999 2680258 2631802 2790114 2875618 3246933 3274438 3387466 3628399 3783408
7000 3783408 3889791 4014327 4177890 4536029 4657409 4950728 5230162 5492751 5734958 5995801
6990 5995801 6180882 6456319 6441280 6369168 6242085 5962918 5824021 5496818 5296996 4828810
6980 4828810 4404203 4119537 3753579 3422483 3306379 3120693 3005302 2648924 2491632 2291338
6970 2291338 2328124 2214565 2048168 2069219 2039477 1752392 1602317 1632086 1658489 1699780 1555614
6959 1555614 1292994 1289001 1270526 1226670 1163676 1018673 995891 1046731 1295520 1300403 1104201
6948 1104201 1058898 867665 767799 707811 871793 790614 791664 964323 962878 696316 669605
6937 669605 738263 941474 849957 590262 562008 454018 624259 442581 372989 549058
6927 549058 565479 501399 514707 406668 353361 199251 225285 312564 421591 545041 428467
6916 428467 373335 296986 423685 182812 160046 79420 -14280 304919 292386 188375 331713
6905 331713 298370 194287 379979 353110 228440 305792 296647 266422 238811 89493 97043
6894 97043 123617 132559 -31568 48155 74228 26336 61457 147809 81418 97923 16980 121806
6882 121806 146839 161647 96407 -29863 -26558 140035 216069 42145 25467 -48739 -25417
6871 -25417 91010 46181 -4848 80367 111144 231773 158342 132517 101537 102600 98576 -146190
6859 -146190 -41367 75311 10248 226635 143927 129789 -1500 -142463 -71257 166143
6849 166143 369122 252914 160611 148265 181648 174716 255060 378463 377669 313259 238964 299161
6837 299161 359287 462033 444477 283405 470254 377120 341161 452068 285919 165220
6827 165220 382815 298867 420945 419948 316687 411929 566954 682325 581552 333128 270212
6816 270212 413920 448387 390178 461896 486224 441343 436402 435750 453634 400022 501763 494025
6804 494025 407814 256218 280304 273310 442087 356047 312707 366276 209455 163414 88377
6793 88377 124937 129684 76221 129830 223893 37372 18374 69748 135787 141424 280153 211521
6781 211521 84427 169313 215277 233328 268620 275070 273568 253334 174921 194457 221146 287986
6769 287986 283130 208736 323733 370530 288099 236973 403678 330564 163326 380684 420050
6758 420050 539614 449102 407328 276160 217580 330162 203419 157487 197266 193270 342062
6747 342062 249227 339678 147400 65003 -36585 8158 7021 -133979 97634 260293 90649
6736 90649 46320 47084 -84140 184370 215603 42565 -93911 3191 64619 -19136 51789
6725 51789 145192 126181 -15352 53042 181106 -57601 85291 267018 189436 139706 180321
6714 180321 106113 -110499 -30049 15505 127131 33122 49114 161399 143359 79893 -159092
6703 -159092 -10731 1762 80216 111268 124779 16640 -63742 -118088 -110356 -89018 -160360
6692 -160360 -110190 3108 120444 70283 92143 141503 65398 84135 171063 -16849 -64508
6681 -64508 -39093 38413 -37682 8734 63580 673 -87307 -71336 -15777 -58455 76370 63414
6669 63414 -29063 6257 7109 -149272 -259492 -184832 -334696 -314395 -328352 -191884 -181852
6658 -181852 -205010 23765 -38087 -49369 -50054 -217242 -371592 -244172 -206174 -211135 -324051
6647 -324051 -407719 -344190 -417818 -305615 -251439 -109817 -137418 -147963 -43681 -229393 -279945
6636 -279945 -214446 -279979 -468218 -389721 -245389 -202897 -163554 -223642 -361002 -414461 -392068
6625 -392068 -249430 -338188 -294281 -287172 -88038 -242396 -174262 -195543 -161238 -283593 -433465
6614 -433465 -286746 -195560 -137791 -52953 -143925 -222070 -102543 -112417 -239450 -269340 -170168
6603 -170168 -292401 -329050 -526410 -468247 -355970 -323343 -194311 -270032 -365442 -246873 -403828
6592 -403828 -419067 -382313 -372584 -279514 -269277 -429051 -604127 -320413 -186239 -423348 -595022
6581 -595022 -503047 -280181 -147561 -153376 -532836 -481389 -376014 -363879 -331263 -220986 -301456
6570 -301456 -273765 -207350 -363842 -396082 -543827 -384799 -274830 -362322 -473440 -356285
6560 -356285 -186952 -228954 -288352 -356354 -278142 -295118 -304429 -338302 -442741 -344669 -403922
6549 -403922 -373232 -300145 -182455 -476761 -447599 -169151 -255384 -262548 -204280 -192809 -265734
6538 -265734 -236192 -291563 -304884 -280902 -272750 -328730 -471463 -235897 -240571 -351402 -361606
6527 -361606 -338119 -223388 -303434 -374716 -334207 -258366 -451939 -329676 -151543 -148261 -78317
6516 -78317 -254645 -319585 -231065 -392081 -425217 -457636 -450626 -315664 -428655 -425312 -207210
6505 -207210 -344921 -302001 -284662 -291636 -374564 -282628 -233840 -395770 -358619 -427891 -419803 -305122
6493 -305122 -322651 -467628 -488812 -395941 -382407 -406629 -530196 -415995 -416102 -279489 -228609
6482 -228609 -290490 -496511 -588964 -673779 -661876 -362598 -383596 -413559 -422290 -400885 -425302
6471 -425302 -312705 -481238 -498540 -474082 -475602 -236340 -464349 -398753 -292195 -369112 -287303
6460 -287303 -303553 -208431 -182037 -320600 -490649 -454222 -475473 -372145 -162740 -227599 -328704
6449 -328704 -399957 -291255 -226958 -319244 -517022 -561832 -411152 -315960 -257114 -270464 -299119
6438 -299119 -428496 -624684 -646861 -609375 -572517 -482376 -373491 -367995 -468124 -471878 -637514
6427 -637514 -460688 -427625 -515036 -394206 -357417 -337235 -351551 -313354 -295953 -262240 -290646
6416 -290646 -415561 -398264 -287903 -394443 -444346 -489620 -313519 -134751 -228187 -324637 -375636
6405 -375636 -290854 -310995 -351431 -511573 -291664 -233497 -291601 -389737 -179855 -236269 -370439
6394 -370439 -279585 -231138 -247938 -273656 -201728 -313949 -311484 -341081 -432064 -365474 -313881 -412496
6382 -412496 -553825 -534708 -437037 -210373 -164502 -100898 -384147 -396627 -197362 -212000 -207582
6371 -207582 -153564 -168992 -237340 -319072 -494701 -398742 -356850 -335841 -255743 -212765 -311415
6360 -311415 -405020 -422884 -259854 -328983 -422476 -344182 -473344 -534653 -265104 -268608 -259265
6349 -259265 -314239 -273974 -335211 -341558 -147160 -176731 -274516 -355751 -285639 -218492 -351000
6338 -351000 -313948 -325540 -183950 -263673 -152294 -309859 -362761 -223554 -318913 -434404 -560954
6327 -560954 -439160 -332561 -142988 -149272 -192137 -231525 -164541 -182387 -246230 -354611 -295676
6316 -295676 -331219 -136986 -195760 -80186 -241350 -401636 -292807 -261173 -296858 -309594 -305915
6305 -305915 -327282 -301637 -367492 -256818 -207591 -365435 -447590 -283466 -172271 -64230 -185004
6294 -185004 -81405 -162029 -185329 -177145 -230182 -265331 -340783 -361872 -174515 -163311 -105323
6283 -105323 -171961 -212494 -218655 -166980 143339 7197 -291546 -156013 -199513 -130570 -164664
6272 -164664 -119120 -258762 -165503 -123580 -368127 -426653 -359017 -256624 -88955 -19385 -7051
6261 -7051 -183760 -258458 -281776 -84165 -236215 -224518 -195971 -244119 -210793 -196792 -180390
6250 -180390 -258746 -105833 -255714 -270452 -175676 -196905 -316252 -75895 -29865 -71559 -128203
6239 -128203 -133351 -123028 -190599 -236171 -198221 -281192 -133458 -244444 -101046 -233366 -218545
6228 -218545 -215922 -263331 -272073 -486535 -478117 -319653 -368649 -99549 -139270 -437197 -311352
6217 -311352 -216116 -262115 -341466 -243841 -311215 -178379 -190631 -144160 -175178 -154480 18193
6206 18193 -125647 -8042 -103891 -233965 -102857 137397 147384 -74307 -46662 -23222 -132583
6195 -132583 -104233 -87874 80969 205997 -14280 -243348 -64689 -4268 -98932 -202685
6185 -202685 -160587 -231052 -58053 17476 20237 -233312 -251273 -131265 -160928 -131741 -188188
6174 -188188 -126986 -165620 -40541 -71135 -268765 -236471 -100989 -200782 -145147 5249 11261
6163 11261 -67938 -148638 -234572 -77183 -92923 -168353 -138453 -93686 -229247 -218232 -263439
6152 -263439 -199982 -54020 -137302 -93021 -112297 30180 -31523 -189110 -236033 -332145 -115740
6141 -115740 -124595 -175699 -85475 -16622 -73213 -230830 -312444 -258979 -309960 -226267 -240505 -358495
6129 -358495 -383316 -341229 -156016 -197740 -113614 -94347 -79619 -156751 -336428 -263316 -226557
6118 -226557 -131137 -326602 -241750 -104301 -118176 -96581 -303818 -402996 -357523 -330381 -302420
6107 -302420 -497474 -250681 -163652 -268421 -161209 -57244 -113823 -437 -14480 -283812
6097 -283812 -355421 -334117 -184554 -131057 -113373 -258144 -393238 -356167 -333379 -431803 -261341
6086 -261341 -198739 -370464 -161591 -180430 -91549 -67711 -254116 -191799 -128190 -170967 -109389
6075 -109389 -34741 -66217 -74362 -234029 -147830 -208917 -326360 -122426 -211631 -288957 -134712
6064 -134712 -236826 -196930 -178995 -166507 -309806 -289868 -284189 -278077 -304517 -377414 -211664
6053 -211664 -151977 -16171 -133924 -97091 -61668 -85762 -254609 6308 -213216 -254084 -88415
6042 -88415 -69769 -143987 -253108 -54494 -200760 -300129 -236471 -228319 -193831 75307 -118878
6031 -118878 -29952 -40393 -72471 51080 84111 22601 -135062 -142073 -14536 -110155 188940
6020 188940 157692 -38745 72090 274969 278582 171281 148658 356978 232007 119407
6010 119407 143481 150126 282849 79115 266326 382238 380417 174871 8328 99712 186929
5999 186929 223189 138085 112793 67000 12517 139984 145000 148883 112357 176648 250323 350315
5987 350315 353077 286965 290784 468852 757919 656822 645687 695630 728706 530510 449060
5976 449060 538476 527549 387363 559793 462970 436863 580391 561626 505052 641593 734130
5965 734130 737020 672782 509168 512879 477404 395715 500768 534434 609554 607717 684843 891120
5953 891120 894113 982028 1005710 984227 728367 693393 772193 903527 832780 710655 706312
5942 706312 748789 873439 928984 842338 792663 808554 880342 718988 773796 663509 605324
5931 605324 623948 722755 833889 866651 846447 744493 812933 872355 867438 776506 881760
5920 881760 938024 861175 805705 834389 851619 769201 942599 944321 984455 1060615 1153647 1265480
5908 1265480 1134302 982850 1066554 1140389 1092290 1261380 1214624 1002733 1150673 1216548
5898 1216548 1345293 1552306 1237791 1187111 1218170 1146792 1141509 1255470 1394221 1289100
5888 1289100 1473201 1701177 1707053 1710039 1730747 1637184 1702035 1815107 1838639 1849875 1808244
5877 1808244 1921144 1760310 1783144 1802264 1969058 1842891 1935878 2176552 2264849 2356844
5867 2356844 2272722 2340989 2405956 2435267 2399517 2413642 2663279 3042242 2930654 2950800 3019478
5856 3019478 3237567 3360783 3465228 3372510 3426360 3662728 3885977 4117443 4232771 4594176
5846 4594176 5013084 5366572 5742965 6020533 6355479 6896052 7345770 7757610 8114316 8691305
5836 8691305 9094586 9628102 10406806 11156048 12399025 14042810 15344401 16505067 17972970
5827 17972970 19995653 22200067 24321549 26642995 27847486 27092282 24492643 21515989
5819 21515989 19012341 16447944 13891097 11665815 10325197 9337534 8610185 8137145 8026457
5810 8026457 7834188 7461592 7241269 6946342 6641611 6396404 6393276 6374300 6331265 6300571
5800 6300571 6389573 6392059 6189845 6019968 5614434 5191056 4820357 4333474 3655208 3220651
5790 3220651 3037028 3060321 2719474 2592255 2573981 2525463 2340410 2205773 2386273 2161515
5780 2161515 2164935 2048455 2102468 2030763 1956654 1907610 1879192 1731810 1726945 1865847 1904257
5769 1904257 1945371 2032633 2035228 1825481 1820857 2048043 2042432 2001403 1949756 2068402 2080664
5758 2080664 2027211 2360008 2401586 2273759 2159047 2530278 2393453 2382263 2593594 2724690
5748 2724690 2935101 2854924 2802164 2640042 2722631 2773350 2712921 2659909 2723258 2679555 2719974
5737 2719974 2801653 2760902 2652650 2604614 2622863 2746843 2985199 3186335 3302352 3280382
5727 3280382 3308963 3361950 3618339 3541066 3505849 3670200 3925623 3978807 4294497 4395435
5717 4395435 4456873 4767029 4669227 4656008 4719218 4624835 4617863 4382393 4142839 3806782 3571089
5706 3571089 3574303 3262295 3233806 3215257 3223676 3223295 3275872 3243994 3207131 3247118 3143719 3164522
5694 3164522 3104189 3153451 3082102 3331496 3528696 3428206 3259303 3453655 3717501 3695479
5684 3695479 3637903 3591055 3959221 3936541 4052563 3986663 4134241 3951572 3788410 3726960
5674 3726960 3870691 4027797 4061497 3982626 3806808 3684098 3646577 3644129 3472964 3420392 3327835
5663 3327835 3367502 3394109 3341773 3472019 3335037 3237471 3301381 3130028 3187088 3296736 3617352
5652 3617352 3624427 3564462 3465139 3636117 3761509 3659060 3859256 4027545 3964624 4183239
5642 4183239 4476705 4324158 4581544 4810397 5043785 5002246 5204023 5413301 5306176 5554462
5632 5554462 5601469 5906079 6126563 6164115 6285615 6619124 6851915 6867767 7006708 7382066
5622 7382066 7693160 8100426 8313210 8805514 9225032 9914571 10673018 11227881 11905872 12301128
5612 12301128 13077644 13890094 14573861 15216837 15893246 16882791 18401073 20064901 22246422
5603 22246422 24462137 26602491 28859995 31343254 34639713 37929442 41490840 45017295
5595 45017295 47047046 45991320 42304248 38028213 34179771 30478704 26548485 23374720
5587 23374720 21252503 19512874 18410353 17713274 16991114 16562570 15973185 15690513 15627861
5578 15627861 15657096 15791487 15953093 16315619 16713557 17349238 17946275 18431208 18968738 19109267
5568 19109267 18576355 17847756 17114577 16205940 15128983 14172573 13214754 12509311 11811460
5559 11811460 10965291 10592822 10027210 9754417 9574041 9268682 8990989 9012929 8689791 8742620
5549 8742620 8700313 8483640 8498502 8240537 8335497 8258288 7956923 7421673 6847634 6526608
5539 6526608 6249587 5688853 5331843 5153268 4920359 4719302 4537863 4273058 4049142 3805516
5529 3805516 3651958 3564381 3444463 3440963 3316684 3236599 3239437 3144481 3028154 3166581 3345094
5518 3345094 3116924 3260970 3254736 3344487 3406155 3561416 3528949 3638491 3465991 3474894 3468623
5507 3468623 3166100 3091781 2829673 2574839 2688969 2605857 2573169 2592461 2206446 2238413
5497 2238413 2279854 2310236 2300100 2388396 2328702 2297139 2439033 2553652 2591434 2555073 2657773
5486 2657773 2828542 2851809 3050954 3180799 3417885 3289973 2977799 2747308 2543941 2188974
5476 2188974 2118254 2052799 1911413 1795911 1836133 1910688 1827276 1721527 1784585 1707735 1888529
5465 1888529 2016278 1750866 1584521 1529268 1844230 1828776 1771387 1751690 1918159 1908296 1845619
5454 1845619 1871043 1887998 1906444 1684628 1783319 1697861 1572897 1668969 1542558 1288647 1290674
5443 1290674 1352429 1398029 1542779 1516882 1568053 1304880 1117474 1187925 1160226 1147229 1214157
5432 1214157 1233386 1197564 1186332 1228343 1193094 1137321 1095609 994659 1052705 1181190 1364487
5421 1364487 1132489 1139697 1276223 1305293 1147814 893843 942171 1110868 1282501 1276095 1330628
5410 1330628 1225677 1159951 1169279 1070603 1153175 1350430 1239582 1166670 1223327 1171363 1011487
5399 1011487 1224486 1149112 1056676 1034778 1030340 1049800 1086752 1176004 1126440 1107766 1177686
5388 1177686 990471 1151353 1377507 1346438 1279284 1300099 1473406 1447472 1226915 1154227
5378 1154227 1154140 1116718 1212303 1227137 1287264 1326774 1378724 1441731 1352198 1283236 1295240 1223748
5366 1223748 1312910 1343448 1447411 1401740 1392078 1293993 1395572 1470862 1294404 1297168 1264178
5355 1264178 1298848 1388552 1476851 1589838 1613454 1690325 1539809 1573182 1490410 1755416 1779514
5344 1779514 1666445 1735345 1653394 1598077 1492055 1546926 1549383 1538461 1623053 1570107 1610970
5333 1610970 1728641 1887620 1844513 1871947 2056201 1873426 2083752 2085258 2142578 2232252 2293839
5322 2293839 2620134 2710099 2645219 2825458 3026058 3180387 3503275 3834146 4114608 4345125
5312 4345125 4569065 5047010 5534262 5920138 6569310 7258333 7102953 6816165 6261686 5607562
5302 5607562 4993902 4385675 3748598 3279126 2886838 2605803 2609534 2587243 2682871 2335293
5292 2335293 2362253 2504612 2425955 2411710 2317134 2472285 2734321 2724585 2692227 2467526 2366995
5281 2366995 2347850 2038397 2062826 2017692 1737425 1671096 1490615 1503243 1421769 1255371 1292213
5270 1292213 1304223 1113465 1132472 1342447 1047666 1061128 1230652 1154508 1048287 1065661
5260 1065661 1062049 876082 1015090 1078182 1095907 1087659 902296 919417 986625 1010277 1108415
5249 1108415 924704 846086 978697 1056013 1136780 1180535 1422897 1541687 1546063 1385570 1296584
5238 1296584 1365366 1269836 1215298 1311155 1239679 1362838 1320651 1269164 1375728 1323229 1449338
5227 1449338 1501304 1482407 1531475 1484585 1567945 1685617 1761579 1788544 1964370 2036348 1962299
5216 1962299 2166050 2175800 2483127 2640005 2549641 2739174 2947962 3082388 3429758 3764582
5206 3764582 3938923 3958349 4040800 4382179 4636424 4840119 5113704 5175567 4975915 4695793
5196 4695793 4628275 4418864 4306622 4306590 3945005 4019148 4144975 4238804 4223107 4254663 4363319
5185 4363319 4617242 4833877 4741784 4976217 5176237 4916686 4898873 4745630 4592257 4530749
5175 4530749 4384834 4246753 4260888 4054387 4173089 4318051 4427945 4573771 4577819 4697837
5165 4697837 4538787 4607018 4578338 4459726 4460000 4492638 4276961 4155101 4124914 4043453 3969942
5154 3969942 3912055 4032265 4019950 3784567 3828609 3853236 3872152 3858382 3735722 3615575 3621696
5143 3621696 3526016 3294513 3077288 2996278 2843357 2588190 2050697 1894418 1790741 1577401
5133 1577401 1573921 1450499 1164988 1054475 1055800 1073789 1015166 697852 556668 523451 627589
5122 627589 596629 593124 629229 700864 702428 541518 624141 611274 550957 384208 240107
5111 240107 357235 428235 319812 345020 485504 435745 338306 248381 102169 114341 270557
5100 270557 396439 215797 111266 270938 324046 298952 125008 163428 314354 305290 327190
5089 327190 201764 117611 91867 60310 61396 -130864 -127549 72991 58849 -138736 -46130
5078 -46130 210351 -2354 20095 54644 -77636 -5045 -173530 99010 125857 -22002 -8491
5067 -8491 -6102 75888 42788 -145716 -81018 58222 44148 -20739 -22147 -126533 -90597 -85570
5055 -85570 -96990 -28187 -11338 143386 46150 -47314 108417 83841 -43424 -72586 21928
5044 21928 50080 -99181 -8998 193683 103685 117092 41235 47664 49635 15787 88988 259249
5032 259249 193015 132426 191037 181173 267462 175729 211390 151031 257494 344192 388493 515733
5020 515733 437475 571569 651564 442573 413864 343191 399349 477202 357124 234636 531640
5009 531640 555224 408533 395334 330946 456242 481919 560527 487430 383905 323624 323901
4998 323901 296611 241553 440095 531808 451173 609416 514269 539708 751699 617236 537497
4987 537497 482293 274283 429723 606833 625233 477279 479282 646445 699705 850123 964367
4976 964367 882063 777546 749119 650535 892419 973314 937127 712574 796281 869703 764272
4965 764272 797944 847539 859367 833608 874796 982677 982268 1125085 1218162 1231070 1126909
4954 1126909 934863 1153367 1079533 944591 849027 947842 1058575 1139451 1385717 1350128
4944 1350128 1212255 1075282 1112837 1161802 1166296 1247527 1521911 1471488 1376390 1483057 1569258
4933 1569258 1590498 1711397 1818684 1855245 1797069 1865272 1967204 1916075 1966546 2087187 2211721
4922 2211721 2148609 2100927 2345440 2277307 2350927 2425926 2532266 2866979 2847488 2785418 2979899
4911 2979899 3266377 3190556 3183204 3150241 3070597 3021768 2890935 2872298 2934350 2976535 3096770
4900 3096770 3092976 3093790 3150968 3277910 3592811 3804329 3945193 4417506 4694697 4897792 5037404
4889 5037404 5397083 5825557 6065591 6223319 6222069 5831732 5401733 4855336 4318717 3827661
4879 3827661 3635099 3551874 3183315 2875750 2520496 2356658 2640842 2449474 2216884 2115323
4869 2115323 2193448 2290680 2267483 2415096 2111418 2085268 2183706 2229973 2175334 2224165 2196890
4858 2196890 2117314 2065999 2216501 2300251 2149721 2245531 2259753 2326013 2378112 2429937 2377828
4847 2377828 2339680 2451052 2309585 2224896 2301359 2577892 2647034 2606524 2842055 3067620
4837 3067620 3038453 3071588 3046709 3053635 3082232 3327996 3457946 3577201 3765629 4014465 4315953
4826 4315953 4698095 4966258 5186148 5578186 5918259 6188613 6133119 6048613 5823325 5591912
4816 5591912 5053791 4723192 4468882 4022724 3848868 3801595 3767216 3511150 3276522 3340813
4806 3340813 3259429 2977591 2967299 3013358 3005023 2913280 2841510 2980383 3025526 3137679 3008768
4795 3008768 2992882 3120703 3021685 3107616 3246566 3328794 3632916 3617266 3602353 3746893 3845213
4784 3845213 3756776 3670316 3608278 3578912 3722191 3688244 3755839 3892676 4125460 4129907 4242934
4773 4242934 4410025 4394982 4741568 4813307 4757230 5024809 5346728 5374805 5605574 5846466
4763 5846466 6186090 6429936 6630749 6925945 6996123 7214065 7582059 7610556 7445625 7580678
4753 7580678 7647578 7613123 7497371 7258946 6932261 6910024 6688189 6570139 6425958 6442206
4743 6442206 6414834 6274782 6204281 6221235 6293098 6309882 6281343 6250431 6232929 6339152 6409574
4732 6409574 6537783 6766177 6797792 6928606 7125141 7375899 7442807 7605627 7761286 7868066
4722 7868066 7835685 7668900 7743823 7658687 7500927 7230733 7198878 7110372 6739771 6521264
4712 6521264 6276156 6023133 5732649 5549722 5527165 5318424 5114558 4840738 4759358 4707048
4702 4707048 4688062 4611607 4487441 4417272 4210432 4200907 4222014 4208599 4158035 4205161 4178440
4691 4178440 4242667 4166246 4136167 4215336 4189539 4367066 4438133 4173838 4171334 4382748 4271725
4680 4271725 4353769 4364670 4364183 4302460 4293829 4455498 4680725 4654630 4601414 4758451 4992089
4669 4992089 4901656 4894020 5018265 5068255 5209462 5306525 5198005 5158242 5383652 5293873 5414310
4658 5414310 5542801 5486283 5609305 5701894 5710938 5870255 5982677 6018468 6016183 6242273 6231875
4647 6231875 6485061 6334440 6551638 6814753 7008079 7071610 7295413 7300489 7383345 7493947
4637 7493947 7701502 7914948 8001429 8121170 8302655 8501377 8584083 8807867 8770687 9155810
4627 9155810 9467583 9524128 9733301 10026700 10251153 10579222 10861760 11011885 11114135 11284747
4617 11284747 11658535 11805407 11967523 12391757 12664632 12847502 13003091 13282995 13848316
4608 13848316 14373207 14608087 14989335 15504555 16024274 16311582 17037059 17437787 18148748
4599 18148748 18885101 19723801 20398736 21223056 22142052 22888831 23762386 24862528 25998529
4590 25998529 27143359 28609623 30036122 31533774 33170060 35049875 36888556 39014761
4582 39014761 41382246 43548595 45397788 46439527 46735213 46915948 47187625 47227160 47545450
4573 47545450 47852388 48206866 48653362 49251690 50023680 50749609 51409615 51992510 52862479
4564 52862479 53724152 54646325 55529373 56367430 57350527 58312982 59191833 59784560 60133823
4555 60133823 60728774 61053614 61139392 61310967 61425175 61382659 61559821 61744727 61914115 62082618
4545 62082618 62261808 62375054 62665118 63179809 63593811 64103460 64441714 64738664 65151173
4536 65151173 65123158 64990763 65074127 64666351 64150931 63764033 63089576 62477699 61759873 60843613
4526 60843613 59809337 58829318 57692836 56322088 54773670 53230456 51568321 49507788
4518 49507788 47520087 45750406 43909297 42157816 40543011 39063735 37569726 36422530
4510 36422530 35268946 33958327 32756470 31935349 31164060 30519842 29845663 29320754 28981893
4501 28981893 28781397 28248478 27929694 27572067 27112596 26943600 26871800 26745424 26575597 26558712
4491 26558712 26662508 26814999 27026482 27256140 27389665 27784788 28047604 28356716 28686488
4482 28686488 29260945 29556858 30089438 30446464 30898247 31388864 31931106 32649857 33385068
4473 33385068 34113969 35050326 35895703 37027959 38274746 39351354 40661290 42056855 43727287
4464 43727287 45135306 46691744 48434482 50143021 52105524 53969478 55685895 57316419
4456 57316419 59077467 60615419 61918636 62976984 63998185 64638385 65321604 65890199 65973169
4447 65973169 66084209 65943322 65556286 65280784 65190433 64956602 64638236 64324321 63929430 63471570
4437 63471570 62850461 62306071 61862275 61371368 60965612 60412715 59912899 59812595 59825317 59646083
4427 59646083 59452383 59230275 59036255 59199747 58945067 58786167 58647317 57962174 57598507
4418 57598507 56928429 56171427 55283450 54417134 53286762 52043846 50954169 49765763 48619084
4409 48619084 47596689 46649658 45603389 44677572 43875337 42930916 42086755 41335860 40368046
4400 40368046 39468200 38353030 37314376 36272004 35149869 34295111 33346162 32665934 31611800
4391 31611800 30826340 30198660 29490402 28996833 28303258 27934439 27642731 27147804 26849200
4382 26849200 26305553 25966974 25680849 25653000 25470038 25304698 25222802 25149204 25141775 25286943
4372 25286943 25503994 25350734 25400578 25455388 25309115 25371992 25249694 25168246 25117563 25219850
4362 25219850 25435229 25527028 25855121 26169252 26398688 26651516 26974339 27235116 27545105 27891282
4352 27891282 28220169 28492939 28576802 28495831 28470667 28398539 28314741 27961951 27565357 27348312
4342 27348312 27347370 27258686 27346405 27427394 27518400 27738096 27915313 28009688 28246645 28283446 28812878
4331 28812878 29071289 29079691 29171831 29126988 28956944 29070953 29147900 29125280 28886723 28677830
4321 28677830 28864066 28874285 29087746 29118154 29299406 29489193 29727416 30006492 30042083 30049968
4311 30049968 30135694 30105887 30266652 30349607 30192524 30244389 30312643 30474128 30458941 30492497 30733315
4300 30733315 31019534 31158166 31532415 31834349 32176251 32595371 32880270 33295363 33601125
4291 33601125 33967345 34499745 34839319 35144741 35575655 35948715 36341554 36733070 37171787
4282 37171787 37623944 38011520 38520933 39158260 39581795 40138083 40901940 41675101 42834164
4273 42834164 43941383 44898498 45951634 47240803 48654701 50160496 51742549 53146518
4265 53146518 54694020 56426018 58207989 60020344 62017336 64316820 66905289 69850695
4257 69850695 72891511 76276362 80099637 83881934 87905554 92333792 96546975 100063360
4249 100063360 102763049 104168176 104484057 103941722 102839206 101615594 100945182 100567999 101002410
4240 101002410 101914893 103365385 105581572 108172373 111138108 114482175 117903738 121421567
4232 121421567 125620842 130130218 134703356 139591670 144687827 149684310 154620918 159596361
4224 159596361 164176037 168583779 173081508 177375197 181822986 186898050 192355429 198486638
4216 198486638 205185554 212263891 219651162 227549367 235545845 243589156 251023812 256999722
4208 256999722 260413561 260296624 255939130 247184947 235180475 220978364 206010954 191037348
4200 191037348 176820544 163848314 152435054 142582789 133809609 126071659 119128537 112877439
4192 112877439 107051379 101827501 97116077 92539647 88176234 84081307 80424104 76893579
4184 76893579 73539399 70435193 67645653 65059160 62469148 60149438 57825352 55498727
4176 55498727 53441546 51337071 49224545 47392856 45688417 44120835 42803988 41248562
4168 41248562 39873360 38497819 37367056 36127589 34962194 34121912 33286227 32481586 31639103
4159 31639103 30722086 29886255 29245935 28738099 28173974 27813633 27386033 26924415 26347443
4150 26347443 25836254 25505597 25092943 24593205 24155224 24128136 23724237 23281166 23218601 23147030
4140 23147030 22857968 22431228 22084822 22034956 22124590 22075358 22116446 21859491 21656823 21610228
4130 21610228 21659051 21679269 21813037 21742622 21515611 21479209 21595076 21300984 21055870 21069030
4120 21069030 20985813 20903739 21035488 21068246 20938195 21037492 21130152 21111159 21085139 21400482 21374327
4109 21374327 21202929 21224073 21094124 21071923 20930746 20864288 20751343 20361477 19956365 19650133
4099 19650133 19502206 19371519 18986757 18594986 18088098 17807882 17605326 17413393 17454155 17245372
4089 17245372 17044441 16984824 16810051 16675277 16611969 16488825 16354435 16205619 16278018 16399585
4079 16399585 16200778 15946058 16060167 15879015 15882544 15968928 15933394 15694248 15699344 15770550 15440003
4068 15440003 15300153 15553034 15541281 15432843 15292256 15376161 15133866 15110835 14920093 14945013
4058 14945013 15199117 15231449 15252882 15268026 15367412 15321592 15565924 15953084 15865876 15938356 16114049
4047 16114049 16051875 16105217 16098212 15910116 15925311 15946020 15823068 15875584 16018717 16073053 16115008
4036 16115008 16309388 16372245 16475625 16595246 16815388 16883705 17018385 17008299 17101065 17256319
4026 17256319 17490100 17681002 17681662 17764544 17892093 18022980 18182655 18426415 18670005 18778203
4016 18778203 18917677 18972862 19330647 19508210 19578317 19822027 20031476 20131341 20060627 20393044
4006 20393044 20738043 21049655 21189934 21298148 21381847 21419616 21573981 21926421 22024731 22289802
3996 22289802 22660072 22869349 23285830 23794846 24133117 24448276 24853739 25398728 26036793
3987 26036793 26407766 27133810 27718093 28444688 29094870 29632339 30353378 31303100 32387461
3978 32387461 33395169 34333228 35344929 36507516 37764278 39192164 40808799 42540254
3970 42540254 44111253 45645882 47417651 49236163 51060702 52464807 54099621 55647714
3962 55647714 56958384 58323603 59392470 60358585 61275245 62254457 63037069 63908070 64629964
3953 64629964 65592229 66619889 67635878 68468707 69515032 70488478 71466119 72504920 73592972
3944 73592972 74755676 76039037 77661561 79346598 81233460 83412317 86025707 88618178
3936 88618178 91452279 94653117 97666682 100350665 103123167 105224548 106941454 108124657
3928 108124657 108740904 108944342 108714282 108036085 107102212 106021713 104663127 103264675 101861930
3919 101861930 100267081 98443019 96155509 93517110 90665189 87464407 83572959 79622740
3911 79622740 75445158 71335160 67283426 63469116 59956102 56551990 53699655 50857264
3903 50857264 48414386 46290179 44272213 42473046 40811899 39237228 37858154 36816618
3895 36816618 35889451 34985258 34081797 33196050 32670179 31989029 31355772 30957520 30323087
3886 30323087 29923955 29482865 29029058 28944531 28741601 28498289 28270295 28156090 28025460 27994349
3876 27994349 27967098 27881723 27769964 27730777 27752100 27942795 27940390 28064221 28154665 28470699 28658262
3865 28658262 28842801 29038007 29270332 29511982 29820122 30096599 30487862 30555611 30762991 31079994
3855 31079994 31375897 31654413 31919950 32657930 32871336 33256382 33636231 33949978 34382762
3846 34382762 34875020 35335076 35736689 36071059 36584196 37133524 37628787 38354474 39074431
3837 39074431 39701407 40458366 41230655 41923437 42807359 43906687 44959068 45941945 47249520
3828 47249520 48568911 49911265 51615599 53334060 55081771 57190926 59354302 61774044
3820 61774044 64354219 66962770 69698237 72561812 75765288 78907422 82042384 85333240
3812 85333240 88594646 92078058 95387610 98790039 102083557 105118597 108070259 110661754
3804 110661754 113182636 115012045 116301089 116957998 116923744 116212478 114815153 112681697 110157342
3795 110157342 107649577 105127877 102459812 100004116 97902042 96273596 95174800 94361791
3787 94361791 93937689 94012847 94714420 95966178 97520572 99539739 101741149 104678140 108079705
3778 108079705 111631149 115821383 120500999 125675050 131301873 137125436 143508012 150222939
3770 150222939 156873131 163699530 170404787 176465151 182312212 187389317 191077583 194167819
3762 194167819 196166006 196988990 196751946 195716475 193987898 191570220 188604295 184996922
3754 184996922 181181505 176730631 171790888 166362653 160428969 154350242 147767986 141289946
3746 141289946 134207035 127273604 120446217 113619131 106966343 100553878 94666090 89041491
3738 89041491 83936254 79103474 74635150 70522516 67100362 63969215 60972525 58178968
3730 58178968 55852335 53754741 51749097 50156737 48747765 47423620 46050876 44833960
3722 44833960 43960707 43013508 42132205 41241780 40931262 40453639 39940879 39516484 39307836
3713 39307836 39317158 39062609 38916862 38819020 38735016 38480374 38450449 38530850 38403418 38174600
3703 38174600 37820058 37378065 36923117 36288278 35516347 34518766 33765772 32980600 32342074
3694 32342074 31452686 30694828 30042377 29272207 28762220 28211009 27762894 27458651 26989159
3685 26989159 26558650 26226933 26101738 26018744 25883924 25672004 25446201 25542976 25349866 25503168
3675 25503168 25479470 25532875 25611960 25683900 25730209 25872041 26070855 26189342 26589833 26785955
3665 26785955 26971779 27223567 27680281 28092710 28306543 28687590 29096052 29520493 29825140
3656 29825140 30079818 30172115 30320305 30688381 30596442 30802105 31092106 31203144 31174653 31293994
3646 31293994 31745049 32086060 32131847 32702127 33026920 33327062 33717842 34370386 34915519 35329898
3636 35329898 36045226 36580190 37259584 37861252 38639250 39021283 39483364 40358885 41162833
3627 41162833 41974471 42654566 43412420 44179621 45136482 45769394 46876175 48038879 48893841
3618 48893841 49993214 51051106 52346371 53575253 54684201 55945544 57107401 58223751
3610 58223751 59235052 59968630 60932980 61662207 62331555 62624481 62927760 63583359 64109020
3601 64109020 64517264 65100827 65701272 66337920 67232670 68001403 69002141 70024986 71007582
3592 71007582 71984830 73143937 74589314 76057024 77789447 79531631 81251659 82958696
3584 82958696 85012277 87027732 89023710 90973751 93014407 95054419 97019577 99312336
3576 99312336 101785444 104157795 106720105 109642947 112797299 116113975 119595211 123403678
3568 123403678 127196831 131250782 135768390 140229446 144797548 149597932 154311938 158672373
3560 158672373 162938826 167072572 170949197 174122738 177087655 179557664 181774910 183834926
3552 183834926 185569517 187426296 189227497 190946585 192587308 193745862 194639942 195258176
3544 195258176 195033241 194289234 192991834 191037861 188638145 185745154 182217652 178530437
3536 178530437 174620131 170719041 166615184 162532642 158531671 154667380 150611608 146605017
3528 146605017 142624959 138656319 134336892 129940882 125378565 120801346 116277116 111610347
3520 111610347 106964034 102378189 98134198 94072191 90194905 86606422 83560431 80444827
3512 80444827 77785144 75608336 73553297 71840193 70574018 69265164 68297269 67561367
3504 67561367 66634097 65849467 65275967 64544392 64165650 63697883 63404796 63032654 62877579
3495 62877579 62949477 62936903 63071579 63279166 63367124 63214133 63120515 62988845 62757811 62486161
3485 62486161 62479313 62208673 61755201 61265939 61104545 60897566 60987480 61075688 60810069 60737140
3475 60737140 60587063 60334660 59927063 59388002 59042340 58426695 57862914 57553748 57466334 57231630
3465 57231630 56962908 56896851 56977872 56975921 56856661 56917597 57059830 57046068 57019496 57072767 56867042
3454 56867042 56677846 56694066 56615433 56499467 56452028 56493748 56427942 56287229 56155558 56015591
3444 56015591 55612968 55390581 55256923 55276397 55162646 55402915 55714785 56132284 56636383 57277535
3434 57277535 58406320 59420244 60572549 61978980 63443609 65149897 67133783 69320839
3426 69320839 71602931 74044984 76703846 79520864 82331925 85247704 88207007 91072424
3418 91072424 93679335 96400360 98949949 101283320 103601718 105578451 107504841 109355149
3410 109355149 111507115 113838819 116376922 118961845 122168776 125482595 129157951 132835145
3402 132835145 136414357 139719094 142336281 144136371 144932432 144521004 143002490 139935098
3394 139935098 135655295 130142962 123773922 116829607 109704261 102430026 95230229 88446461
3386 88446461 82272622 76580397 71366563 66789870 62661937 58877362 55513391 52588114
3378 52588114 50100774 47638253 45448529 43587642 41967578 40342119 39003938 37853500
3370 37853500 36654763 35677222 34634351 33733638 32720936 32001271 31036403 30262408 29658191
3361 29658191 29073921 28572887 27857298 27300339 26814785 26226542 25655504 25345379 25021338
3352 25021338 24415156 24046011 23886979 23660702 23316964 22990483 22667675 22400062 22269005
3343 22269005 22084428 21804691 21640915 21560840 21470120 21283133 21260618 20988386 20866014 20973743
3333 20973743 20877444 20996334 21120602 21137536 21272449 21170168 21336526 21886350 21953105 22043738
3323 22043738 22376455 22324457 22638681 22981712 23413180 23743777 24259962 24716170 25014548 25353153
3313 25353153 25696166 25992567 26412912 26663017 26840828 27009869 26863784 26795561 26750048 26855498
3303 26855498 26635348 26370696 26002386 25585581 25263949 24803635 24320535 23732038 23243395
3294 23243395 23007868 22739560 22296029 21929581 21718387 21702927 21467436 21418188 21377057 21144290
3284 21144290 21184635 21222254 21098625 21082761 21292797 21444572 21519483 21461069 21644069 21633663
3274 21633663 21807237 22083687 22230200 22334034 22645625 22905257 23131308 23588412 23776961
3265 23776961 24101611 24362297 24576239 24862715 25121391 25400426 25595362 25928045 26088221
3256 26088221 26326026 26551381 26759000 27094120 27334084 27682348 28086359 28353865 28588594
3247 28588594 28921818 29320832 29719571 30177169 30652554 31076677 31434861 31962559 32334805
3238 32334805 32893882 33452456 33825205 34256394 34798570 35296281 35792703 36207141 36879705
3229 36879705 37326964 37957840 38723367 39328752 40098480 40783097 41657818 42518242 43437779
3220 43437779 44278369 45266366 46452570 47665618 48668482 49929821 51114409 52262731
3212 52262731 53532987 54868881 56138372 57715828 59138116 60461030 61870267 63542492
3204 63542492 65316432 67116352 69210726 71598149 74162729 76903316 79485640 82287907
3196 82287907 85266600 88479745 92065929 95730968 99473132 103251886 107582215 111909784
3188 111909784 116422841 121180418 126151674 131474795 137238913 143428449 150386494 158283218
3180 158283218 167306629 177401866 188514056 200550903 213331507 226682446 241292087
3173 241292087 256349282 271514806 286126921 298837682 308098455 312954630 314788463
3166 314788463 315235924 316139119 318443562 323482452 331601224 342697972 356714053 372704194
3158 372704194 390632810 409891535 429805883 448453532 463878636 472777263 472220567
3151 472220567 460227642 437944083 408804215 375561736 341437649 308452332 277814418
3144 277814418 250858460 227910550 208353852 191669194 177020851 164217532 152882696
3137 152882696 142711841 133607278 125426012 118465638 112166624 106410310 101177106 96371332
3129 96371332 92230970 88161636 84461702 81001750 77830898 74892863 72266138 69979351
3121 69979351 67794407 65665172 63835255 62036837 60271288 58593216 57175859 55818193
3113 55818193 54581929 53368274 52317674 51471780 50538797 49675552 49023828 48354767 47878385
3104 47878385 47694236 47554461 47220940 46913706 46817567 47073408 47206990 47368404 47706153 47990591
3094 47990591 48455611 49013820 49539122 50130436 51069797 52119352 52989038 54568321 56144881
3085 56144881 57752026 59415090 61035068 62639226 64109926 65505055 66390767 66430879 65535195
3076 65535195 63527895 60737959 57712178 54530616 51320699 48082577 44914647 41907333
3068 41907333 39612701 37573761 35687735 33701896 32046176 30787628 29672124 28659852
3060 28659852 27588735 26809902 26029395 25195991 24312283 23640763 22920397 22387379 21717601
3051 21717601 21189703 20933486 20303722 19597582 19206817 18796315 18304392 18116167 17779400
3042 17779400 17133873 16618569 16343137 15813437 15428316 15189520 14999964 14663974 14614550 14497884
3032 14497884 14480725 14343116 13980573 13628365 13359623 13152417 12859047 12635766 12703217 12438980
3022 12438980 12203724 11916427 11730063 11523825 11514273 11304502 11161335 11187018 10892675 10678467
3012 10678467 10616257 10455743 10247189 10094321 10033069 9931556 9752761 9894883 10078604 9949202
3002 9949202 9804097 9738023 9852870 9731197 9733626 9637648 9523100 9436738 9431308 9539665 9367656
2991 9367656 9316447 9304676 9253403 9118144 8911718 8865794 8763658 8794358 8675336 8583794 8420945
2980 8420945 8362846 8246910 8122936 8255986 8091955 8027079 7779031 7615435 7675769 7732557
2970 7732557 7536251 7429635 7494046 7618628 7428966 7341554 7118477 7103407 7074053 6895590
2960 6895590 6791804 6929569 6708280 6696636 6661130 6563745 6634340 6813570 6809598 6610397 6531801
2949 6531801 6491027 6589087 6585011 6483445 6519027 6535827 6447111 6532256 6592774 6591352 6510260 6519082
2937 6519082 6569844 6401407 6445060 6427198 6554836 6507672 6513684 6567629 6890761 6956907 6740008
2926 6740008 6587231 6610026 6718183 6667446 6625755 6665369 6826134 6843779 6528557 6689319
2916 6689319 6863678 6681329 6764980 6863817 6761905 6880483 6834053 6681222 6591689 6576381
2906 6576381 6559221 6639232 6744376 6466912 6448100 6531164 6747639 6982232 7124727 6853036
2896 6853036 6802831 6736459 6445060 6315741 6104947 5816289 5764884 5546599 5326109 5262801
2886 5262801 4956088 4799604 4705682 4600542 4497616 4337570 4248325 4017320 4085434 3862406
2876 3862406 3844960 3883218 3689864 3515911 3583106 3506311 3465884 3274435 3165006 3169473 3097161
2865 3097161 2953522 3075575 3070294 3033174 2930036 3037644 3134017 2945166 2722016 2643706
2855 2643706 2647368 2603550 2697540 2865565 2851594 2662075 2632980 2630578 2817238 2719089 2626197
2844 2626197 2669113 2744735 2711965 2807738 2701377 2664401 2764883 2747675 2692096 2822336 2603094
2833 2603094 2425960 2707931 2626135 2692675 2681011 2595463 2594623 2695507 2712726 2592349 2407442
2822 2407442 2480013 2681712 2554450 2435482 2425104 2342074 2272672 2331076 2425288 2194248 2140444
2811 2140444 2241326 2204323 2346471 2279543 2246089 2419418 2228067 1999833 1984089 2043524
2801 2043524 2037013 2035562 2088966 2015449 2108327 2073871 2196447 2379393 2430583 2307675 2086522
2790 2086522 1941122 1920396 1821484 1844614 1755951 1713807 1840694 1851416 1846467 1888345 1893354
2779 1893354 1949642 2036366 1913284 1946114 1984533 1811638 1822349 1844015 1811178 1949787 1996047
2768 1996047 1874867 1936298 1943507 2000711 1866945 1696330 1668646 1751464 1864874 1744563 1703395
2757 1703395 1782305 1855622 1855026 1689929 1774829 1959043 1988196 1826316 1735969 1812044 1710973
2746 1710973 1617102 1863809 1871946 1862274 1876880 1757169 1803314 1822120 1958551 1871191 1637595
2735 1637595 1785906 1765570 1880295 1996441 1895437 1810119 1646230 1489016 1418402 1446692
2725 1446692 1578138 1603476 1499991 1459364 1505845 1526186 1599664 1468817 1359602 1526265
2715 1526265 1479038 1376284 1411315 1423099 1331317 1306854 1381887 1419839 1416007 1321216 1421158
2704 1421158 1341948 1234626 1374023 1247732 1369446 1430626 1462291 1482925 1515658 1501488 1501026
2693 1501026 1388239 1409416 1363124 1316971 1299398 1411482 1311658 1243335 1343913 1323005 1434115
2682 1434115 1511795 1475057 1358752 1352479 1190040 1135951 1351442 1217395 1364882 1453745 1457169
2671 1457169 1435218 1360889 1378022 1571681 1414647 1328290 1250948 1182609 1191732 1255597 1339102
2660 1339102 1500146 1543320 1439423 1362457 1392604 1295024 1208138 1294878 1217221 1331168 1444633
2649 1444633 1556085 1363134 1292958 1512292 1505004 1375018 1710152 1706469 1342099 1430527 1523125
2638 1523125 1583179 1747649 1553257 1665162 1563487 1510290 1387504 1192827 1348721 1504999
2628 1504999 1477986 1585011 1442062 1458441 1529115 1358381 1375331 1446035 1395466 1442835 1478931
2617 1478931 1419109 1419991 1363944 1559585 1723623 1594374 1652548 1713374 1656767 1754724 1760499
2606 1760499 1962728 2054346 1956848 1925905 1955679 2120004 2164999 2060331 1970485 2006107 2182486
2595 2182486 2007427 2069544 2153032 2169354 2389013 2213258 2078828 1991831 2086065 2086840 2191490
2584 2191490 2289641 2460911 2490691 2301943 2357804 2536294 2543408 2419426 2398605 2434022 2584651
2573 2584651 2669024 2637303 2671766 2703755 2578001 2691182 2753182 2673398 2609833 2608562 2583626
2562 2583626 2577066 2659343 2754105 2669186 2642122 2762169 2899430 3150996 3283875 3192962 3240539
2551 3240539 3196746 3253852 3499966 3704675 3885680 3941778 4150730 4137229 4160723 4349756
2541 4349756 4494445 4565598 4880239 5247284 5150856 5192891 5465258 5697307 5730257 5921620
2531 5921620 6185380 6239744 6381651 6543145 6779406 6929563 7220406 7389357 7717118 8142566
2521 8142566 8358730 8388721 8698780 9370975 9907012 10657596 11606476 12645942 13506216 14191807
2511 14191807 15163180 16391016 17274604 18283563 19294205 19996591 21195363 22618761 24357908
2502 24357908 26986844 29827695 33529869 37109808 40634423 45079155 50160721 55298851
2494 55298851 61762286 68056467 69048724 63364181 55148770 48800240 43232659 36331180
2486 36331180 29326721 24536211 21413690 18978308 17301167 16032947 15065382 13982863
2478 13982863 12886760 11817151 10735553 10021489 9379212 8754195 8163913 7445328 7057828
2469 7057828 6714778 6376417 6141580 5851996 5480743 5186556 5092238 4872416 4703236 4327557
2459 4327557 4247988 4158683 3944228 3831601 3663276 3446850 3228069 3192181 3119757 2989351
2449 2989351 2770445 2644265 2612517 2460605 2421154 2463569 2586419 2634947 2501428 2400793
2439 2400793 2214488 2179660 2129943 2028401 2100105 2060523 1973680 2009372 1879989 1623923 1637247
2428 1637247 1659805 1663797 1564419 1580134 1444874 1260331 1350407 1310190 1326003 1376805 1360948
2417 1360948 1481723 1420225 1279618 1149919 1088467 1093444 1255252 1360008 1127680 1114513
2407 1114513 1283112 1163210 1105584 1082491 1077804 1063332 1136995 1173732 1342887 1231229 1134447
2396 1134447 1201879 1147486 991164 1033566 1179930 1106906 1110799 1015277 1026619 969394 910272
2385 910272 1012509 989558 905866 853464 778702 830936 851887 804631 723348 761678 872744
2374 872744 919570 970578 957893 1048528 1028143 909062 1005363 1078241 762983 902919 905417
2363 905417 919611 946820 692417 745049 774125 832480 963329 911069 646404 638651 595609
2352 595609 640145 709826 802613 656245 662696 538543 741964 717568 597576 574965 560423
2341 560423 516923 581982 680177 839064 751148 733186 769975 562717 705624 722163 667693
2330 667693 785717 601037 701095 685785 649855 729925 711502 635842 691746 538940 530514
2319 530514 589901 422410 274552 368786 671423 493756 587348 618071 505332 520839 569813
2308 569813 506321 534242 497249 597964 527817 641044 592351 446995 444241 539923 522660
2297 522660 502822 443221 356598 455426 444434 429109 530409 402315 428152 396966 331551
2286 331551 308544 494191 445220 459019 500858 304148 358740 394122 158538 281224 269335
2275 269335 208463 254340 494024 416603 409615 562252 645714 592325 497273 547083 577164
2264 577164 544415 526214 500291 368150 491127 356932 353069 401736 501744 479543 553715
2253 553715 385053 515528 708956 628747 495449 473497 525830 479699 313724 467501
2243 467501 418856 512675 472711 319799 280404 186677 272132 303683 400322 286060 378532
2232 378532 292908 279964 468515 393843 401973 332421 188987 216194 270606 352102 412258
2221 412258 160356 249549 125684 145918 221802 163121 151078 55950 233280 303157 260541
2210 260541 57315 222363 250501 161529 173945 275599 425237 415822 275255 115851 119544
2199 119544 273632 373901 195384 283944 313359 36925 48411 60807 150565 189107 96244
2188 96244 59159 -9804 248718 251049 154420 -35301 124785 164368 156979 171741 191681 159828
2176 159828 218629 244777 99889 68761 56246 155613 144692 104398 129761 124766 -55612
2165 -55612 6274 5934 29701 212434 121986 -78038 -47204 98932 223564 191608 182420 37329
2153 37329 -157348 -87182 138022 124341 300882 284947 234617 198100 192946 83791 -46511
2142 -46511 -97939 24619 56494 -36331 71940 -14514 10901 58763 128906 187161 212696
2131 212696 226064 16134 122723 228211 91040 112829 210059 113252 102241 171704 223529
2120 223529 136824 67690 -79772 -65245 77720 51954 105756 286698 186912 185955 -4838
2109 -4838 113458 187664 177200 199108 37624 22454 125083 115856 164501 117982 -35945
2098 -35945 91520 53228 -14600 -191726 -322432 -114329 -31658 21739 -43980 -83260 70837
2087 70837 -21605 -72042 -67264 116779 35233 98898 70522 25346 -54372 297 68857 75985
2075 75985 36693 -20560 5129 -4662 -12464 129318 57636 109984 -8902 -27939 -16033 51742
2063 51742 57617 -16813 -167483 -201407 -17130 32390 -119007 -102594 -47533 7298 -50299
2052 -50299 -36538 11187 -92738 -69505 61527 140714 42482 15574 -22772 -12277 60660
2041 60660 -41262 118594 46018 -65101 -88269 20149 18846 -155514 -55239 173445 79036
2030 79036 -69601 -164761 -118299 89035 -86918 82525 -32079 -113502 -127008 -13173 16245
2019 16245 -30329 -125975 -76739 23079 90030 -15616 58536 -11185 213017 183912 92577
2008 92577 344697 119672 78676 -109497 -180865 5836 -67729 93882 122471 13175 132022
1997 132022 139292 -37956 -17476 -29591 -121584 -83192 -190688 -88398 7910 894 -84161
1986 -84161 -93940 -68658 26629 98509 211553 20154 -20314 -146188 -262324 -175178 -240691
1975 -240691 -218436 -199817 -41243 -148611 38359 223979 73148 -145007 -100983 -14500
1965 -14500 -79189 -120735 -222839 -204781 -21238 53870 -12213 6467 -111744 -62698 -204821
1954 -204821 -298356 -205812 -153079 -38195 -181619 -119064 -170685 -117269 -66409 -17856 -177469
1943 -177469 -134720 -42142 -7734 28183 -121107 -161763 -127217 -22178 -39795 -14962 94907
1932 94907 69152 -83375 -135322 -58474 -15194 22994 -108035 -315731 -294136 -267393 -196885
1921 -196885 -26377 -70987 -121076 -114351 -124762 62764 148872 91162 -174193 -261192 -302959
1910 -302959 -362506 -106151 -36498 -183115 -198484 -9007 -126310 -270666 -41958 -83877
1900 -83877 30946 -38975 -128971 -106487 -208266 -145975 -220272 -74962 -186543 -253201 -202892
1889 -202892 -209815 -68256 37338 97978 51409 -104459 -342285 -330483 -284713 94915 29385
1878 29385 118324 107182 102230 6901 -104221 -25744 -124411 -204582 -245868 -279266 -139403 -86222
1866 -86222 -194287 -24633 -63502 -41993 -106886 -165966 -65931 -122820 75216 99142 -129175
1855 -129175 -257542 -210550 -209250 -211758 -159788 -274830 -252044 -327171 -216873 -178790 -24024
1844 -24024 -178156 -109633 2109 19394 69671 -44226 -49534 -83167 -162798 -262615 -236523
1833 -236523 -206560 -99289 -369461 -284193 -99308 -227511 -341558 -258402 -166799 -178011 -52600
1822 -52600 -67184 -27805 13306 -199574 -361141 -209675 10493 29389 -4111 -155245 -146263
1811 -146263 -177885 -209041 -166212 -224769 -175342 -151764 -177115 -216030 -155098 -131749 -200416 -243338
1799 -243338 -197212 -199947 -247553 -120636 -67669 -30415 6667 -109150 -137696 -155639 -248011
1788 -248011 -170776 88022 -59842 -183819 -211225 -156384 -103556 45080 -140437 -76006 -103679
1777 -103679 -214759 -64042 -154809 -185864 -398032 -151289 -56777 -103324 -247276 -147770 -225758
1766 -225758 -322430 -141979 -165677 -198118 -150831 -177523 -250014 -249050 -130715 -89773 -173576 -175950
1754 -175950 -200188 -219059 -128534 -53175 -111739 -7525 -42396 -126095 -176288 -210567 -265659
1743 -265659 -224134 -144129 -292451 -268794 -206311 -299652 -330422 -287612 -296628 -405339 -250245
1732 -250245 -254375 -169082 -328466 -253404 -378399 -314689 -462269 -487498 -479240 -440414 -273677
1721 -273677 -278269 -235493 -451057 -343082 -297702 -21687 -328 -164642 -108776 -127219 -212249
1710 -212249 -159361 -210878 -202733 -108092 -213144 -92496 -111259 -234726 -197913 -162737 -231562
1699 -231562 -277981 -250624 -299520 -335729 -351037 -199035 -134980 -226963 -239274 -264702 -296965
1688 -296965 -70351 -64886 -85595 -295252 -275011 -303214 -444960 -214510 -26522 -62585 17720
1677 17720 1137 -238736 -255507 -19838 -46796 -117046 -187623 -392453 -242161 -101944 -25629
1666 -25629 -78987 -273834 -390060 -181128 -95760 -176117 -223468 -171591 -157968 -148772 -371607
1655 -371607 -318261 -230271 -399259 -360031 -188588 -280107 -221702 -112008 -254944 -88449 -221844
1644 -221844 -204118 -352901 -133968 -100382 -204307 -120342 -133816 -338800 -228101 -248380 -179161
1633 -179161 -255614 -168949 -224562 -346766 -98554 -107383 -239078 -219394 -74616 -129388 -301192
1622 -301192 -162419 -90684 -303733 -232374 -244543 -131237 -223122 -314924 -449625 -427610 -171483
1611 -171483 -111572 -232283 -189126 -132671 -216860 -172486 -148269 -179301 -266335 -208587 -169442
1600 -169442 -251274 -175696 -141405 -200108 -47283 -232417 -429926 -239469 -146219 -139022 -57879
1589 -57879 -166192 -275589 -385676 -365625 -60354 -214501 -285567 -192401 -104348 -288680 -268871
1578 -268871 -78684 -94362 -269500 -223736 -318339 -119208 -80493 -132141 -331908 -341018 -208594
1567 -208594 -213413 -163350 -264826 -341405 -107462 -164295 -238943 -100760 -112479 -330166 -301128
1556 -301128 -193910 -87964 -131316 -232099 -212819 -222327 -113462 -264226 -358525 -264219 -242721
1545 -242721 -304218 63061 -12306 -39421 -82638 -204327 -83915 -258368 -208218 -267243 -366560
1534 -366560 -318962 -268513 -255857 -121787 -138686 -232893 -281250 -333390 -168198 -159652 -130628
1523 -130628 -136605 -131672 -221846 -252749 -296754 -153907 -166911 -251383 -272821 -247764 -271888 -181658
1511 -181658 -245203 -348921 -365700 -415329 -409758 -279669 -153464 -262725 -140756 -60939 -68088
1500 -68088 -157581 -316534 -363335 -302720 -437007 -396333 -324720 -296654 -382430 -390751 -303780 -312049
1488 -312049 -138235 -99650 -116393 -132916 -161786 -180263 -164021 -219819 -276344 -322166 -356454
1477 -356454 -206338 -144146 -184374 -247137 -195815 -156203 -82978 140431 116270 -88664 -300936
1466 -300936 -113308 -168853 -303624 -310411 -306814 -344251 -321323 -216586 -187234 -315019 -269238
1455 -269238 -242149 -219670 -127984 -154832 -404553 -536525 -321068 -300573 -320272 -180350 -3919
1444 -3919 -222965 -232053 -82183 -155876 -365920 -354086 -222768 -297651 -415483 -371886 -417285
1433 -417285 -358283 -140931 -267037 -271626 -233424 -246571 -315815 -335578 -247653 -103999 -196683
1422 -196683 -150171 -165897 -178488 -205968 -164501 -302538 -286748 -172624 -243618 -227076 -283695
1411 -283695 -183806 -253028 -261347 -238962 -287866 -168817 -253115 -214422 -190458 -171932 -214551 -287049
1399 -287049 -247234 -299391 -345469 -125246 -257110 -376212 -322280 -474586 -333442 -79309
1389 -79309 -129722 -139075 9844 -108002 -41836 -104838 -187631 -465486 -459335 -403857 -79720
1378 -79720 -317428 -208429 -57080 31155 -77382 -126322 -28250 -30329 -226259 -318830 -191294
1367 -191294 -342269 -244868 -205250 -85162 -22724 -66443 -45474 -148629 -78423 -189089 -226786
1356 -226786 -93974 -235462 -284119 -136471 -156382 -194184 -272201 -244429 -359243 -167666 -45121
1345 -45121 -214960 -221811 -201546 -154171 -255276 -100118 -255953 -354312 -402610 -451230 -303180
1334 -303180 -358834 -271060 -181298 -141440 -235228 -318145 -222315 -427116 -394018 -375454 -278478
1323 -278478 -271044 -254423 -237317 -123162 -334442 -341322 -186996 -32388 -46813 -102363 -34128
1312 -34128 -124834 -229337 -226101 -348628 -273781 -161891 -199456 -233301 -243108 -265842 -179788 -299872
1300 -299872 -220950 -120067 -181216 -172978 -107421 -88397 -221948 -173663 -265852 -286643 -297093
1289 -297093 -380739 -364551 -111087 -122957 -347350 -179183 -175191 -167677 -239839 -211262 -167116
1278 -167116 -202314 -211677 -178117 -152498 -79023 -108292 -2358 158400 -109090 -80543 -91626
1267 -91626 -401697 -512938 -191045 -148622 -178627 -152503 27706 45358 24715 -113671 -165828
1256 -165828 -197257 -217487 -321534 -157076 -108487 -72623 84634 49758 -175338 -455078 -315118
1245 -315118 -388998 -348853 -299590 -241964 -255932 -300697 -67880 -90355 -350282 -103015 -131379
1234 -131379 -206075 -156622 -303982 -291631 -365620 -308179 -390123 -370542 -219690 -294710 -170162
1223 -170162 -114921 -229319 -109046 -228227 -369564 -372401 -329456 -86876 -138559 -109332 -137334
1212 -137334 -100603 -96675 -150686 -106654 -145315 -193061 -234851 -290344 -271759 -199198 -253266 -12110
1200 -12110 -14373 -86130 -265541 -307771 -298831 -241214 -132363 -136780 -82844 -124855 21662 -123287
1188 -123287 -175393 48101 -65798 -24822 -5463 23756 -94179 -143320 -109272 28953 -60192
1177 -60192 -138650 -78482 -211733 -81968 -157421 -88871 -35800 -122028 -121822 -188513 -288548 -268588
1165 -268588 -241542 -331460 -324007 -68174 -111551 -30381 105790 -16969 -105415 -160850 -128417
1154 -128417 -196760 -213811 -413160 -436992 -268647 -182613 -124478 21530 23184 -49519 140222
1143 140222 -61535 -201447 -77174 -58536 -24945 -119354 -32922 14205 38515 -37937 -152256
1132 -152256 -281284 -245011 -185101 -124562 47215 -11849 5095 -136737 -76383 109585 -91395
1121 -91395 -84516 -51786 -136813 -236076 -120512 -68256 -217213 -169889 -175836 -59146 -148029 -212492
1109 -212492 -29312 81873 -258806 -295221 -164503 -148545 -215532 -318827 -207772 -195701
1099 -195701 -144462 -38311 19016 -82730 -184150 -214460 -91721 -72371 -199931 -224270 -247916
1088 -247916 -182876 -124126 -59918 -111072 -58317 -32016 66984 132435 97870 -75062 -169003
1077 -169003 -179533 -210851 -171781 -157201 -124730 -64948 -138807 -63597 -88085 16310 37027
1066 37027 -133627 -96185 -38596 31160 -79677 3061 -129189 -163046 -314569 -190567 15110
1055 15110 -229650 -149710 164687 70288 -11931 -106761 -78094 -149143 -272882 -38585 40927
1044 40927 94581 -84824 -94439 -64343 -12185 -76983 -89399 -282942 -265303 -214165 -208135 -85986
1032 -85986 -94773 -34433 -58199 -84230 -96654 -133760 -132863 -159023 -251032 -204788 -11089 -104127
1020 -104127 -334988 -337308 -204233 -212154 -121157 -67792 -104528 -159876 -109833 47326 10755
1009 10755 -161649 -239060 -156945 -220510 73994 105499 -76492 -2018 -84716 -238831 -132964
998 -132964 -141462 -78721 52218 37449 -109365 7857 -121738 -228056 24422 89500 110019
987 110019 -29500 -95324 -122016 -23169 -155683 -229195 -218952 -304899 70824 5874 -78055
976 -78055 -172682 -229741 -169893 -194356 5812 75187 -27214 -33693 -199473 -179583 -67736
965 -67736 20397 -121468 -33887 55841 -118464 -368121 -257551 -144658 -159879 -159393 20979
954 20979 57226 80821 -207000 -282675 -238617 -203187 -198817 -116546 -139189 -234859 988 8863
942 8863 37441 -77422 -150223 -151024 -225583 -249966 -246286 -302134 1788 171797 130969 46769
930 46769 -156391 -119975 -31532 20052 -96199 -154756 94070 110200 -35821 -176737 -291676
919 -291676 -372998 -257228 -192992 -72106 -79670 -4786 -153836 -75796 -52770 123357 130147
908 130147 57997 -47191 33443 -98629 -47958 -124301 31175 50543 -159521 -164680 -4686
897 -4686 -27226 -15748 -51379 33407 59630 -70453 57342 -3830 -120366 -8192 105136
886 105136 179521 27988 -39146 92166 2035 43774 80178 -20805 -191106 -65550 5451
875 5451 -64105 -140182 -27779 57465 149541 135056 108408 -115994 -178743 -127840 44059 235748
863 235748 270958 254033 243283 188365 140449 41833 94844 155862 102180 73438 -171907 -188970
851 -188970 55714 63906 -11661 -83081 22782 81194 24969 -10756 6713 36316 -29672 88235
839 88235 137537 -85125 -113974 5862 -25940 -6084 -194149 -137173 160255 -8701 -59391
828 -59391 49503 202324 207431 70890 68610 171584 169456 131266 63816 29912 152983 147835
816 147835 -54403 -39662 128971 12303 107627 -46088 -80378 -78228 -39169 -78251 -95190
805 -95190 -76756 -116916 103572 73018 85620 -21329 -65190 -19739 100332 35843 -40
794 -40 217108 248054 168323 201610 151834 201313 -69379 128927 126809 100662 -13851 -58807
782 -58807 -80099 22925 168486 162238 139777 35011 99524 272841 -76631 -186755 -176923
771 -176923 -193675 -115344 -135790 -180296 -156877 -17960 69687 239010 45091 -126706 -50624
760 -50624 54166 203930 83764 -49735 -31184 27711 -11698 10230 2329 -116062 48536
749 48536 49291 167617 93877 22324 46595 27766 82244 110674 49575 -33645 43761 7852
737 7852 -120512 136718 47472 -34719 -9287 -2782 51740 -62258 -80598 48286 -106423
726 -106423 -98720 -32353 -2786 -63259 -44879 -22887 54072 27893 -33765 101333 279577 75543
714 75543 73986 231959 209868 47221 45497 90409 20062 -73018 121191 16005 86219 130050
702 130050 224057 48363 -102467 70735 138088 108193 64072 167112 211381 146179 106510
691 106510 -91836 -181903 -121493 -21385 116080 72569 153183 -85128 -128606 -83927 100373
680 100373 184620 159026 36338 33158 -35214 -113188 -90706 64389 230597 170228 167882 -12634
668 -12634 -31380 33833 51054 72451 -59902 63713 -16222 -27436 127017 163421 126271
657 126271 128043 114551 136275 241438 314223 152911 113863 145705 134840 -64798 -67883 9675
645 9675 -118933 18707 128133 109998 195126 213048 122063 7970 -46472 73112 59370
634 59370 -35115 90005 45680 7494 180972 171262 235016 372696 275335 -77839 -112230
623 -112230 -54623 187926 178427 94226 51972 217001 54886 -134385 -62888 -96757 85615
612 85615 209129 302641 150790 53287 164823 296110 272174 371362 263637 324536 107223
601 107223 154819 269028 92465 41455 81517 122903 190349 35339 215011 345277 324919
590 324919 376332 320404 343161 218394 198852 193646 204474 136885 295997 262645 66004
579 66004 116604 58020 15521 208236 163938 126907 195762 258763 409476 230222 144908
568 144908 201047 172663 288660 187631 88288 242699 223254 152334 195711 231858 105521
557 105521 169915 167613 148911 334530 241950 265226 349896 226736 69664 -20443 184770
546 184770 182359 69514 79982 103662 145065 194359 175119 251440 277776 129985 188335 191673
534 191673 348054 354909 132782 277980 269978 413369 322543 254467 349976 163877 136184
523 136184 312707 251945 204673 253148 118276 89191 278448 242548 199173 211804 192480
512 192480 234908 187172 275875 96616 133575 231453 308598 513644 504313 323920 322845 296386
500 296386 453216 486938 506242 431511 351284 244564 173955 364817 280885 294748 323378
489 323378 303074 519264 398840 248135 262348 160820 107050 379165 442969 611580 503646
478 503646 302484 284734 270131 154910 214507 299626 285665 425414 254646 131958 383798
467 383798 248462 175795 318234 231520 77170 274621 444559 288800 266783 273515 372130
456 372130 463544 405608 553861 330008 335702 313239 391427 357776 344426 374475 317804 575118
444 575118 416955 443378 162304 99593 402289 382165 503789 471560 380078 198911 169945
433 169945 123050 -73740 52176 158435 286724 275431 233039 241102 358938 280024 311205
422 311205 123336 302217 301346 445839 393838 388109 341193 563485 543374 315465 452322
411 452322 492032 352252 184551 377625 363276 320977 311637 331813 289872 441390 434927
400 434927 540206 478074 433778 308177 338280 400631 439858 505163 241949 253592 377738
389 377738 377219 319119 411482 229717 208628 214735 505645 517711 402587 431188 458390 353926
377 353926 326423 384939 336205 443554 564491 469141 520042 564370 309873 417687 453070
366 453070 402402 343015 251061 225331 216939 282751 347178 319223 417231 338531 143384 364708
354 364708 421738 410992 425097 550792 573567 361968 366274 432488 459365 486381 436246 441562
342 441562 365020 369968 320959 430118 520437 481944 392495 427318 393554 331370 382396 346885
330 346885 420644 416792 491674 490981 566039 400748 409460 625808 689487 509914 736024 592980
318 592980 555003 597293 499032 375983 274941 341181 461417 480124 437440 343918 271666
307 271666 237214 342047 234987 253197 351585 285525 469008 487122 468139 453339 527213
296 527213 388878 318493 343802 366917 322299 510101 709086 641912 575070 492384 544733
285 544733 585012 604333 504928 561543 475773 364627 333088 468443 553939 431702 494103
274 494103 494667 408203 468816 431753 439980 427406 417999 600282 470460 482010 499040 491984
262 491984 403262 497470 435226 361472 531445 421025 440509 427082 511848 451514 309997
251 309997 400772 582508 565210 541558 577541 760704 746202 578648 509962 603129 623182
240 623182 537451 470821 365624 360896 370387 420603 364542 472219 567373 475536 400537 456521
228 456521 466052 460350 535223 617906 443216 385106 407854 392115 361590 467752 674126 654636
216 654636 475679 496073 555603 568757 604547 688692 689969 542880 531281 492375 561332 506952
204 506952 479492 580342 507995 601285 303495 493313 715776 663398 577028 470971 373402
193 373402 389056 536054 553105 540439 738704 856173 731487 610885 541747 683589 495070
182 495070 515615 618077 517775 570451 612123 645800 665421 596148 618645 583480 503341
171 503341 514227 456371 247487 297315 421424 376472 409659 425210 441444 444225 372699 447473
159 447473 438936 491522 550873 466389 429543 384736 494285 666973 615239 569242 564387 552203
147 552203 646626 669214 556551 645342 720261 550793 552836 603615 585944 738359 745630 654264
135 654264 684722 609265 576375 569348 820912 913566 808720 781323 630035 699710 685947
124 685947 760784 717998 712937 710752 603439 483079 487866 562293 585048 549042 639897 527480
112 527480 391766 643173 657812 772517 702422 643626 643359 605532 632525 554689 566351 594700
100 594700 657690 619017 598721 614060 630510 655084 600123 567440 573414 498389 555345 710372
88 710372 620494 645420 679535 488275 512430 623495 711216 623842 471036 562246 599251
77 599251 600171 510014 562039 572280 674329 639773 446827 522959 658170 772195 897063
66 897063 779032 607942 491425 734336 734504 686308 768207 667784 670348 605752 527625 640575
54 640575 626052 516947 593540 679221 655541 720820 735816 669555 740503 756665 752974 827679
42 827679 659402 630952 610216 519478 640320 640093 613464 580992 483810 633987 767525 731848
30 731848 670059 541582 573528 627847 669806 691072 656121 649634 785554 702787 818449 864527
18 864527 765820 696892 603418 655179 780933 657521 699024 769096 642002 607247 657990
7 657990 700833 729333 745762 696058 606224 705790 762656
0 762656
$$ Imaginary data points
##PAGE= N=2
##DATA TABLE= (X++(I..I)), XYDATA
16383 -3213778 -3178634 -3084457 -3059131 -3042450 -2995413 -2898200 -2830430 -2798782 -2777701 -2717887 -2584489
16372 -2584489 -2483237 -2569780 -2458188 -2331752 -2338927 -2298751 -2192446 -2204260 -2207394 -2183364 -2069030
16361 -2069030 -2055739 -1951594 -1912808 -1915299 -1878162 -1790058 -1701259 -1695212 -1756684 -1598441 -1416101
16350 -1416101 -1401459 -1288814 -1416666 -1472817 -1204289 -1228212 -1248048 -1242739 -1275115 -1265531 -1064662
16339 -1064662 -1122622 -1010028 -859418 -924919 -913414 -850417 -783215 -695928 -680251 -801475 -755161
16328 -755161 -558762 -557358 -598170 -575618 -424086 -299827 -198537 -279805 -144252 -68173 -111204
16317 -111204 18577 113479 88182 157489 200411 262156 273694 258618 200988 168246 188841
16306 188841 251926 388628 468211 500985 586410 611681 604793 614929 735714 786113 777957
16295 777957 835397 832330 970281 996975 917006 970933 923233 971424 1181437 1246250 1133220
16284 1133220 1131511 1286815 1369570 1413601 1266195 1415092 1475326 1480238 1419849 1476178 1400409
16273 1400409 1484053 1592747 1587905 1541616 1801631 1758513 1670959 1782999 1782886 2026471 2062665
16262 2062665 2015242 1931005 2020364 2021213 1999927 2016568 2195803 2241119 2107399 2090763 2112321
16251 2112321 2320304 2279362 2283843 2282198 2132185 2209874 2334400 2215463 2319469 2452893
16241 2452893 2374829 2352952 2387516 2497754 2634439 2628554 2622383 2576371 2624515 2631961 2742507
16230 2742507 2655592 2707366 2760539 2879726 2946706 3041234 2823984 3063086 3080916 2939050
16220 2939050 2989455 2992450 2836746 2851243 3048683 3106677 3034163 2915427 2953970 3050402 3391194
16209 3391194 3272777 3182839 3310643 3378333 3159827 3194781 3360486 3383238 3441153 3477134
16199 3477134 3510198 3392350 3461935 3506165 3488848 3473719 3344796 3437195 3407536 3676789 3712158
16188 3712158 3622920 3591948 3707997 3648202 3623465 3589100 3566851 3647186 3769029 3900271 3847103
16177 3847103 3652184 3784304 3860321 3818427 3751862 3813026 3658793 3631570 3643908 3828079
16167 3828079 3911353 3954676 4135042 3921200 3873032 3837039 3843560 3935470 3795605 3908293 4105943
16156 4105943 4154510 4100499 3953788 4119364 4111921 3968912 3963549 3909721 3988449 4105326 4126740
16145 4126740 4168636 4133891 4102236 4197012 4244385 4189865 4101853 3958462 3924904 4104238 4110080
16134 4110080 4205478 4381678 4223167 4224979 4316776 4273554 4217647 4195757 4233983 4284415 4250577
16123 4250577 4126255 4139219 4342536 4555717 4224129 4220773 4199922 4205536 4407299 4414857 4472580
16112 4472580 4398850 4226529 4311651 4381723 4231474 4381071 4332066 4407643 4300927 4203301
16102 4203301 4234646 4339549 4317706 4283334 4525681 4446054 4454609 4437588 4295259 4483808 4515358
16091 4515358 4418889 4355126 4410733 4563841 4498333 4479621 4507044 4431498 4523096 4321662 4291397
16080 4291397 4244497 4390783 4422546 4449559 4396846 4316894 4381601 4576528 4523535 4615008 4447494
16069 4447494 4340721 4366987 4390047 4332804 4554131 4427984 4043174 4302125 4420345 4375850
16059 4375850 4286689 4422759 4538014 4558254 4474144 4399629 4513536 4510797 4240659 4237502 4225437
16048 4225437 4350721 4226584 4343280 4375708 4344852 4314776 4399703 4340659 4479637 4470180 4607823
16037 4607823 4546326 4493105 4415228 4567212 4716880 4513083 4428691 4424898 4470372 4520460 4654943
16026 4654943 4671437 4609559 4621598 4533997 4421451 4452346 4417539 4453812 4420200 4611172 4507008
16015 4507008 4610396 4491505 4201959 4286373 4224385 4366648 4560848 4421045 4541166 4466164
16005 4466164 4630086 4623810 4736050 4601204 4308657 4526668 4521863 4642483 4624557 4441310
15995 4441310 4555308 4595215 4415653 4479706 4648215 4562460 4340365 4435065 4352115 4460246
15985 4460246 4616764 4509454 4479544 4322438 4376313 4455987 4546674 4730454 4664365 4717342
15975 4717342 4489715 4499758 4469175 4321820 4372888 4374644 4513737 4616636 4692517 4641872 4564250
15964 4564250 4459133 4457157 4438857 4526987 4385504 4368099 4577005 4414133 4326785 4414819 4401163
15953 4401163 4515511 4556522 4578678 4747400 4675207 4446705 4389377 4493953 4458231 4448245 4587537
15942 4587537 4624312 4486651 4512788 4595793 4582120 4512483 4489252 4510228 4541811 4609642 4382074
15931 4382074 4432715 4566709 4730476 4643236 4707582 4667319 4485855 4529823 4589765 4491524 4550314
15920 4550314 4378000 4199240 4245676 4275647 4366149 4383374 4415098 4522246 4597686 4458503
15910 4458503 4486548 4521536 4607089 4531233 4609051 4503141 4507588 4444817 4438363 4392649 4521376
15899 4521376 4680810 4621102 4756065 4850357 4598328 4640776 4666966 4542008 4518969 4403551
15889 4403551 4557732 4539858 4388470 4493875 4622764 4688849 4730371 4488123 4542072 4502634
15879 4502634 4328939 4506570 4480316 4527437 4658522 4742414 4609662 4609116 4568851 4504192 4674994
15868 4674994 4664853 4559897 4601804 4579784 4562497 4527106 4530948 4534672 4480263 4529484 4491552
15857 4491552 4536326 4581844 4642492 4636996 4618987 4545959 4571474 4505237 4591197 4698049 4810179
15846 4810179 4784260 4607358 4719809 4775628 4764794 4699812 4730993 4755659 4815526 4624918 4651325
15835 4651325 4609764 4485653 4351172 4462612 4544727 4774517 4745882 4561858 4619652 4437794
15825 4437794 4434318 4623838 4636583 4489930 4381531 4521321 4771553 4798455 4636889 4437645
15815 4437645 4496152 4581887 4821322 4661888 4518362 4731273 4680575 4497917 4685655 4609402
15805 4609402 4626470 4483464 4585963 4618280 4748890 4661870 4529943 4456299 4343939 4521570
15795 4521570 4531856 4587035 4669994 4576685 4591382 4666865 4589613 4613653 4722240 4508372 4482094
15784 4482094 4554335 4537866 4741858 4715592 4730362 4782896 4771028 4643898 4717162 4717257 4561552
15773 4561552 4676997 4635186 4524067 4585232 4637469 4786025 4700181 4734378 4662338 4649109 4861405
15762 4861405 5046874 4803821 4445466 4547550 4612391 4639259 4484073 4505298 4564324 4703852
15752 4703852 4744921 4632298 4588028 4601483 4535559 4580069 4545826 4482702 4568426 4441112 4600483
15741 4600483 4611300 4591554 4682007 4711227 4592458 4626510 4650261 4675244 4710590 4597836 4325000
15730 4325000 4332881 4503031 4530754 4268817 4410145 4610633 4511118 4830779 4788603 4633341
15720 4633341 4603599 4645637 4595037 4534793 4630102 4785411 4745696 4742948 4645414 4601798 4651060
15709 4651060 4621498 4644811 4458549 4384112 4452138 4519910 4432329 4422997 4589724 4732344 4574892
15698 4574892 4677026 4772365 4637331 4686609 4663517 4647013 4475954 4618904 4695748 4550115
15688 4550115 4594211 4565693 4634476 4663876 4623582 4708433 4717669 4649165 4725294 4625007 4713058
15677 4713058 4832115 4815039 4774897 4786260 4656304 4630424 4731018 4709692 4697353 4879125
15667 4879125 4562187 4595186 4770609 4687778 4633079 4598165 4609240 4493112 4657592 4784058
15657 4784058 4871568 4904708 4800626 4603439 4648146 4711836 4943535 4862840 4890611 5006820
15647 5006820 4766502 4623707 4628873 4533417 4666434 4629811 4731440 4781683 4657175 4621415
15637 4621415 4775185 4713760 4792306 4870842 4727154 4824660 4828686 4769414 4690712 4702092 4682486
15626 4682486 4723321 4742322 4763582 4588936 4619487 4721529 4862441 4830405 4790833 4758960 4738821
15615 4738821 4704025 4637574 4588713 4603534 4769677 4880443 4870395 4763401 4698491 4664124 4634569
15604 4634569 4623376 4731293 4816905 4671382 4715378 4782999 4719943 4633635 4448980 4628261
15594 4628261 4599215 4749824 4763776 4710895 4743130 4605085 4589777 4662138 4790788 4625957
15584 4625957 4682850 4895430 4786495 4640491 4539921 4538637 4497923 4611957 4461989 4535098
15574 4535098 4561056 4722107 4699919 4537671 4709273 4871453 4925013 4791961 4833655 4819437
15564 4819437 4781717 4596070 4805106 4866341 4892199 4956724 4722660 4670466 4750726 4868022
15554 4868022 4714214 4635944 4752065 4703203 4836742 4762841 4888073 4762958 4715142 4688299
15544 4688299 4538059 4547724 4705113 4917298 4831145 4901980 4943993 4839367 4690886 4498771
15534 4498771 4542696 4717338 4832387 4808792 4930653 4840273 4731717 4700075 4908252 4906466
15524 4906466 4924131 4841338 4855757 4787457 4701332 4726860 4683612 4694281 4679541 4882898 4728953
15513 4728953 4623266 4544101 4742590 4838583 4862434 4883466 4864276 4701876 4937931 4889069
15503 4889069 4926657 4807047 4747827 4833157 4859394 4834482 4814107 4962386 5017106 4976567 4840530
15492 4840530 4724743 4562829 4667208 4928297 4992190 4859193 5044058 4894065 4870044 4818637
15482 4818637 4797217 4547586 4464200 4669925 4681118 4798394 4781543 4823721 4800696 4767261 4670454
15471 4670454 4684975 4563419 4739018 4901420 4755078 4545432 4779497 4863470 4876746 4797128
15461 4797128 4673502 4668547 4760174 4756791 4787478 4875005 4880144 4928550 4901465 4953166 4799324
15450 4799324 4698234 4751838 4735675 4546900 4827389 4843347 4829432 5023921 5014868 4899191
15440 4899191 5047336 4978431 4897460 4791377 4797993 4659168 4592182 4823527 4739301 4882718
15430 4882718 4972666 4958772 5019735 4905014 4823656 4911857 4928647 4670267 4667939 4765444 4931013
15419 4931013 4967867 4824482 5057266 4827347 4802954 4736823 4937852 5099762 5036210 4904740
15409 4904740 4834491 4913593 4924972 4913916 4846954 4888531 4778983 4743832 4735011 4723220 4819811
15398 4819811 4903459 4885891 4905374 4905201 4967482 4756066 4758131 4804061 4871567 4844841 4952006
15387 4952006 4870768 4829158 4845889 4953865 5073018 4967728 4853493 4881120 4918997 4847433
15377 4847433 4851379 4761445 4738444 4964261 4963072 4962955 4657374 4672078 4773402 4639724 4805546
15366 4805546 5013870 4975597 4889095 4724247 4815301 4849644 4622632 4519722 4604260 4786558
15356 4786558 4887133 5032977 4761592 4716250 4728795 4894503 4888107 5019712 5039232 4896998
15346 4896998 4864599 4816996 4865085 4896700 4817347 4972736 4915685 4993497 4810366 4720488 5100735
15335 5100735 4991049 4798624 4773004 4836124 4950401 4827945 4978101 4934615 4921936 4895408
15325 4895408 4870886 4891166 4935087 4858531 4742846 4742299 4750079 4773142 4898227 5048858 5092650
15314 5092650 5020135 4891454 4933302 4891626 4748287 4781998 4680691 4619017 4667397 4806883
15304 4806883 5035197 4949840 4923452 4917455 4897551 4963149 4942372 4921836 4996131 4795380 4904993
15293 4904993 4987787 5143191 4985497 4880628 4765459 4790302 4888051 4933040 5095343 5096892
15283 5096892 5112372 5120535 5122269 5008834 4858790 4974703 4901132 4823034 4873014 4970468 4953258
15272 4953258 4881532 5103567 4988230 5023150 4782902 4757852 5063479 5061013 5127303 4902056
15262 4902056 4906967 4877044 4967783 4848168 4709536 4740370 4825638 4978334 4909149 4955616 5026169
15251 5026169 5112450 4962697 4978203 4968317 5048014 4955419 4949393 4999026 5011322 4941927 5007840
15240 5007840 5100140 5128365 5137851 5166280 5107702 5191240 5192570 5045193 4936014 4871812 4831082
15229 4831082 4892792 5028403 5003616 5044548 5113552 5083683 4954319 5012941 4958462 4873619 4912906
15218 4912906 5180411 4868080 4836071 4877729 4834690 4964712 4936530 5005441 4954477 5023750 4994393
15207 4994393 4993439 5063352 5049929 5015965 4963878 4805534 4754839 4811638 4871345 5079613 4950855
15196 4950855 4951103 4952713 4838432 4795905 4971060 4976192 5033397 4905716 4945296 4873312 4867992 4941717
15184 4941717 4800407 5000336 5129123 5170882 5031057 4902857 4690420 4733793 4996618 5024644
15174 5024644 4931296 4790835 4884792 4965865 5076059 4959101 4895723 4863588 4716854 4972460
15164 4972460 5162265 5031928 4921992 5051266 5105863 5041376 4857513 4980253 5172823 5079579
15154 5079579 5049208 5012057 5085110 5147513 5081639 5093461 4931228 4934225 4786798 4925987 4922013
15143 4922013 4777607 4724205 4996078 4925851 4830685 4717542 4908363 5005263 5158731 5121617
15133 5121617 5063559 5017905 4921673 4787540 4852159 4824798 4726965 4876913 4919350 4993037 5063139
15122 5063139 4931620 4882215 5119898 5023533 5088413 5075398 5214417 5161139 5063387 5082483 5164820
15111 5164820 5108587 5091484 4897761 4877024 4825754 4840114 5018436 5030623 4908276 4895650 4946987
15100 4946987 4972624 4951688 5025373 5128780 5101783 5006647 4967922 5064588 4950812 4930385 5250896
15089 5250896 5228455 5136796 4961965 4946784 4978041 5034712 5037757 4908130 4869307 5126542 5097472
15078 5097472 5097300 5107250 5070802 5082523 4966846 4933995 4983908 4886474 5051129 5196372 5138029
15067 5138029 5126675 5003881 5058164 5194356 5145689 5139703 4990351 4980416 5052447 5112082 5118971
15056 5118971 5075152 4886613 4766660 5012014 5027278 4927002 4962744 5097029 5139775 5145353
15046 5145353 5035709 5056480 5204059 5096547 4956657 5147753 4991350 5109949 5166476 5089890
15036 5089890 5126526 5090023 5042248 5098192 4936728 5045969 5065358 4963131 5072110 4913513
15026 4913513 4885123 5044286 4988279 5045153 4845445 4901612 5117349 5264008 5365431 5210380
15016 5210380 5121711 4985235 5186758 5289672 5202413 5086227 5020710 5028566 4941572 5002244 4941451
15005 4941451 4937173 5023641 5101955 4955025 5003317 5109216 5057451 5037584 5071559 5096810 5295731
14994 5295731 5299558 5263041 5091921 5170220 5214405 5025220 5076793 4932060 4933864 5063109 5077681
14983 5077681 5052302 5033877 4881683 4911039 5044630 5155213 5083719 5102176 5104834 5121031 5058945
14972 5058945 5143344 5164732 5044206 5099913 5066018 5026441 5083093 5083699 5158984 5201673 5014211
14961 5014211 5044032 5015429 5026535 5053218 4930557 4963562 5013789 5124320 5234374 5105698
14951 5105698 5004843 5138361 5057043 5095857 5117186 5081674 4902311 4936898 4994624 5091500 5335037
14940 5335037 5241620 5139277 5120826 5048526 5187758 5166564 4945681 5116276 5235511 5091269
14930 5091269 5192033 5107465 5148413 5391823 5228502 5120033 4965166 4987303 5059788 5246186
14920 5246186 5197236 5045929 5086318 5201445 5278688 5248704 5241106 5117878 5217667 5207497 5179362
14909 5179362 5039258 5044083 5136841 5093709 5214879 5253986 5091633 4978050 5114432 5136187
14899 5136187 5299374 5458903 5424226 5339279 5143257 5125687 5131345 5064893 5101460 5184253 5129700
14888 5129700 5010693 5088239 5155867 5218375 5338298 5280301 5434668 5162340 5152341 5299269
14878 5299269 5255068 5219579 5231592 5204020 5293539 5117753 5013072 5078526 5133815 5088963 5063318
14867 5063318 5200083 5208301 5060730 5050898 5123530 5014921 5042737 5125943 5146940 5364670 5297462
14856 5297462 5147976 5240707 5213105 5146555 5212290 5262242 5209991 5207664 5112479 5131539 5381271
14845 5381271 5356213 5203924 5302242 5478910 5478340 5287201 5234687 5295147 5276964 5200623 5237019
14834 5237019 5075595 5264323 5256432 5351163 5325835 5296303 5183116 5024071 5030596 5173422 5130829
14823 5130829 5124810 5068794 5065019 5155911 5186381 5247228 5231377 5104898 5165026 5292226 5214477
14812 5214477 5119030 5129212 4905510 5036786 5192466 5172084 5144833 5308079 5406641 5327982
14802 5327982 5446474 5479824 5489546 5361010 5130338 5228790 5069754 5149771 5380301 5306410
14792 5306410 5312224 5356052 5289382 5074183 5019403 5167478 5241500 5227807 5128642 5027422 5291263
14781 5291263 5231416 5036869 5076569 4943079 5039581 5176103 5163522 5100379 5041130 5162633
14771 5162633 5269149 5256557 5020608 5122443 5232583 5199137 5137724 5196200 5349430 5282968
14761 5282968 5141609 5176355 5256286 5276774 5406263 5365445 5250762 5223820 5189218 5177278 5308648
14750 5308648 5443093 5324751 5266169 5094524 5269694 5407411 5461978 5386513 5169306 5171628
14740 5171628 5227171 5182357 5250469 5308936 5316963 5224922 5263395 5305279 5231483 5333193 5263290
14729 5263290 5214322 5133359 5280105 5443394 5267452 5406047 5317659 5256376 5345010 5197511
14719 5197511 5157898 5126935 5199672 5196592 5019212 5212762 5286460 5178102 5408934 5486322 5278274
14708 5278274 5319962 5373378 5423748 5270671 5250843 5228643 5007280 5244298 5431332 5471970
14698 5471970 5387449 5235087 5390075 5279758 5177573 5225286 5200768 5181560 5179747 5375025
14688 5375025 5466814 5342768 5390492 5364322 5409967 5353368 5424357 5243255 5319083 5348733 5293974
14677 5293974 5349773 5538347 5351450 5327119 5376156 5365410 5346386 5409105 5420861 5148321 5319498
14666 5319498 5280165 5273162 5221910 5336944 5507294 5326742 5377449 5380228 5269122 5438233 5336760
14655 5336760 5178852 5256988 5369969 5300679 5414453 5417140 5422390 5345510 5278031 5385076 5398702
14644 5398702 5383248 5519845 5361065 5439056 5413342 5342319 5322090 5253174 5196493 5267270 5411477
14633 5411477 5470811 5452877 5411459 5439716 5512243 5547629 5473085 5438475 5356106 5416424 5364291
14622 5364291 5122394 5311709 5465518 5321491 5271214 5218186 5034435 5181494 5342063 5344108
14612 5344108 5424509 5365145 5214175 5193234 5402577 5459883 5402420 5449586 5311451 5389963 5310011
14601 5310011 5416545 5461347 5293238 5425301 5633887 5502813 5513532 5363882 5422129 5367724
14591 5367724 5305493 5353482 5404742 5441082 5521296 5526609 5528030 5448368 5411682 5413245 5405459 5398541
14579 5398541 5357837 5427232 5393325 5340269 5314941 5373301 5292175 5345664 5207610 5286453 5427819
14568 5427819 5460239 5359894 5093371 5129129 5291087 5336924 5304631 5424001 5213009 5342383
14558 5342383 5343112 5258437 5321552 5383459 5519790 5435631 5495299 5409191 5327483 5351613 5521814
14547 5521814 5560084 5557975 5509325 5377001 5263797 5448635 5551117 5515407 5497558 5603327
14537 5603327 5315949 5477633 5474277 5438205 5324509 5362285 5475445 5620151 5535289 5384753
14527 5384753 5410609 5464843 5552862 5599351 5631203 5445755 5413093 5639950 5377880 5318983 5383610
14516 5383610 5432216 5404344 5435547 5628407 5528948 5405180 5586105 5628117 5489911 5707168
14506 5707168 5639579 5378238 5376133 5553172 5461379 5417750 5497576 5484079 5409360 5431305 5339103
14495 5339103 5365893 5465468 5434137 5472974 5642574 5572200 5483281 5603311 5660157 5378440 5396482
14484 5396482 5238532 5238470 5379637 5366605 5329530 5434059 5356239 5340171 5456583 5439910 5654823
14473 5654823 5617459 5618873 5488590 5590239 5486577 5489399 5590813 5568902 5522761 5649473 5428427
14462 5428427 5300960 5449240 5531707 5451149 5420199 5406793 5386984 5366520 5313720 5285974 5286102
14451 5286102 5363160 5508975 5591567 5434115 5573130 5623848 5560643 5416970 5316984 5626535
14441 5626535 5574897 5532783 5459538 5551667 5628954 5555017 5681643 5481553 5654339 5639165 5640638
14430 5640638 5465779 5555790 5384674 5528108 5819874 5563812 5522428 5559694 5537591 5524484
14420 5524484 5560646 5525280 5669518 5661456 5449177 5678342 5733280 5409625 5385598 5615790
14410 5615790 5711181 5555796 5472973 5649306 5576475 5547213 5641728 5525162 5575694 5513155 5563686
14399 5563686 5563537 5520460 5492227 5527984 5495998 5305745 5453153 5513046 5485430 5509304 5365716
14388 5365716 5466792 5645173 5557336 5665600 5776999 5584684 5624678 5725023 5653599 5625126
14378 5625126 5541606 5461343 5296543 5592083 5572429 5357214 5457078 5575762 5480853 5560306
14368 5560306 5681474 5405565 5190124 5488312 5585700 5642656 5380292 5291849 5271264 5466518
14358 5466518 5600575 5637136 5503462 5597872 5659402 5521468 5401361 5295315 5396724 5448683
14348 5448683 5676768 5761169 5608044 5370737 5395007 5344365 5297020 5415879 5495901 5610087
14338 5610087 5752017 5512734 5485800 5666185 5623801 5621215 5505272 5587359 5681037 5540627
14328 5540627 5502692 5580869 5711763 5664333 5723758 5461756 5529939 5525208 5574089 5604703 5761045
14317 5761045 5726225 5711289 5713100 5683350 5483017 5557262 5749403 5634041 5575439 5503339 5470323
14306 5470323 5566427 5603926 5548594 5650734 5722372 5722490 5530053 5680653 5722184 5589611 5545612
14295 5545612 5594884 5674398 5676815 5655272 5663071 5573315 5587746 5492224 5500006 5662171 5645340 5739173
14283 5739173 5558998 5613877 5665651 5734154 5464585 5350387 5419294 5561908 5485008 5376437
14273 5376437 5526180 5724301 5822312 5825479 5653631 5633062 5652722 5654675 5399957 5470024 5438113
14262 5438113 5583791 5726748 5753572 5763952 5559027 5690438 5557541 5615486 5840471 5752944
$$ [...]
##END NTUPLES=NMR SPECTRUM
##END=
