##TITLE=1H_CG-1150-D8
 CDCl3,8 sc, 
 3.9.2021
##JCAMPDX= 6.0         $$ Bruker NMR JCAMP-DX V2.0
##DATA TYPE= NMR SPECTRUM
##DATA CLASS= NTUPLES
##ORIGIN= UXNMR, Bruker Analytische Messtechnik GmbH
##OWNER= root
$$ XWIN-NMR		Version 3.5
$$ Fri Sep  3 10:20:41 2021 Russian Standard Time (UT+4h)  she@DPX200
##.OBSERVE FREQUENCY= 200.1313
##.OBSERVE NUCLEUS= ^1H
##.ACQUISITION MODE= SIMULTANEOUS
##.ACQUISITION SCHEME= undefined
##.AVERAGES= 8
##.DIGITISER RES= 18
##SPECTROMETER/DATA SYSTEM= spect
##.PULSE SEQUENCE= zg30
##.SOLVENT NAME= CDCl3
##.SHIFT REFERENCE= (INTERNAL, CDCl3, 0, 16.4952)
##AUDIT TRAIL= $$ (NUMBER, WHEN, WHO, WHERE, WHAT)
$$ ##TITLE= Audit trail, XWIN-NMR		Version 3.5
$$ ##JCAMPDX= 5.01
$$ ##ORIGIN= Bruker BioSpin GmbH
$$ ##OWNER= she
$$ F:/spectra/data/she/nmr/H-F/1/pdata/1/auditp.txt
$$ ##AUDIT TRAIL=  $$ (NUMBER, WHEN, WHO, WHERE, WHAT)
(   1,<2021-09-03 10:19:15.14 +0400>,<she>,<DPX200>,
      <created by zg, POWCHK disabled, PULCHK disabled
       configuration hash MD5:
       00 E9 B6 7A A2 85 ED C7 34 08 36 98 17 FE 4E 26
       data hash MD5: 16K
       EC ED AF 96 98 91 29 A6 B4 2D 3B E2 37 A1 5A 3D>)
(   2,<2021-09-03 10:19:17.57 +0400>,<she>,<DPX200>,
      <Start of raw data processing
       efp BC_mod = 2 LB = 0.24 FT_mod = 6 PKNL = 1 PHC0 = -13716.7 PHC1 = 15.80097 SI = 16K 
       data hash MD5: 16K
       1B 98 5E 81 24 6B 5E 2D 85 30 C1 E3 38 D3 75 6E>)
(   3,<2021-09-03 10:19:33.87 +0400>,<she>,<DPX200>,
      <pk PHC0 = 0.6245215 PHC1 = -1.8 
       data hash MD5: 16K
       D2 6C EC EF 6D 86 CC 12 BB F6 70 98 DB BE 91 5E>)
(   4,<2021-09-03 10:19:37.71 +0400>,<she>,<DPX200>,
      <abs ABSG = 5 
       data hash MD5: 16K
       47 6D D4 BA DD 0D B4 73 1C CA A9 25 40 10 76 C5>)
$$ ##END=
$$ 
$$ hash MD5
$$ DB 58 F3 5A FC 7A B1 40 91 84 ED D3 62 C2 D8 CC
##$RELAX= 
##$RELAX= 
##$RELAX= 
##$RELAX= 
##$RELAX= 
##$RELAX= 
$$ Bruker specific parameters
$$ --------------------------
##$DU= <F:/spectra>
##$EXPNO= 1
##$NAME= <H-F>
##$PROCNO= 1
##$TYPE= <nmr>
##$USER= <she>
##$AMP= (0..31)
100 100 100 100 100 100 100 100 100 100 100 100 100 100 100 100 100 100 
100 100 100 100 100 100 100 100 100 100 100 100 100 100 
##$AQSEQ= 0
##$AQ_mod= 1
##$AUNM= <au_zg>
##$AUTOPOS= <>
##$BF1= 200.13
##$BF2= 200.13
##$BF3= 200.13
##$BF4= 200.13
##$BF5= 200.13
##$BF6= 200.13
##$BF7= 200.13
##$BF8= 200.13
##$BYTORDA= 1
##$CFDGTYP= 0
##$CFRGTYP= 5
##$CHEMSTR= <none>
##$CNST= (0..31)
1 1 145 1 1 1 1 1 1 1 1 1 1 1 1 1 1 1 1 1 1 1 1 1 1 1 1 1 1 1 1 1 
##$CPDPRG= <>
##$CPDPRG1= <>
##$CPDPRG2= <>
##$CPDPRG3= <>
##$CPDPRG4= <mlev>
##$CPDPRG5= <mlev>
##$CPDPRG6= <mlev>
##$CPDPRG7= <mlev>
##$CPDPRG8= <mlev>
##$CPDPRGB= <>
##$CPDPRGT= <>
##$D= (0..31)
0 1.2 0 0 0 0 0 0 0 0.06 0 0.03 0 0 0 0 0.0002 0 0 0 0 0 0 0 0 0 0 0 0 
0 0 0 
##$DATE= 1630649954
##$DBL= (0..7)
120 120 120 120 120 120 120 120 
##$DBP= (0..7)
150 150 150 150 150 150 150 150 
##$DBP07= 0
##$DBPNAM0= <>
##$DBPNAM1= <>
##$DBPNAM2= <>
##$DBPNAM3= <>
##$DBPNAM4= <>
$$ [...]
##$SUBNAM3= <"">
##$SUBNAM4= <"">
##$SUBNAM5= <"">
##$SUBNAM6= <"">
##$SUBNAM7= <"">
##$SUBNAM8= <"">
##$SUBNAM9= <"">
##$SW= 20.0189088683792
##$SWIBOX= (0..15)
0 0 2 0 0 0 0 0 0 0 0 0 0 0 0 0 
##$SW_h= 4006.41025641026
##$TD= 16384
##$TD0= 1
##$TE= 0
##$TE2= 300
##$TE3= 300
##$TEG= 300
##$TL= (0..7)
0 120 120 120 120 120 120 120 
##$TP= (0..7)
150 150 150 150 150 150 150 150 
##$TP07= 0
##$TPNAME0= <>
##$TPNAME1= <>
##$TPNAME2= <>
##$TPNAME3= <>
##$TPNAME4= <>
##$TPNAME5= <>
##$TPNAME6= <>
##$TPNAME7= <>
##$TPOAL= (0..7)
0.5 0.5 0.5 0.5 0.5 0.5 0.5 0.5 
##$TPOFFS= (0..7)
0 0 0 0 0 0 0 0 
##$TUNHIN= 0
##$TUNHOUT= 0
##$TUNXOUT= 0
##$USERA1= <user>
##$USERA2= <user>
##$USERA3= <user>
##$USERA4= <user>
##$USERA5= <user>
##$V9= 5
##$VALIST= <valist>
##$VCLIST= <CCCCCCCCCCCCCCC>
##$VD= 0
##$VDLIST= <DDDDDDDDDDDDDDD>
##$VPLIST= <PPPPPPPPPPPPPPP>
##$VTLIST= <TTTTTTTTTTTTTTT>
##$WBST= 1024
##$WBSW= 4
##$XGAIN= (0..3)
0 0 0 0 
##$XL= 0
##$YL= 0
##$YMAX_a= 700452
##$YMIN_a= -845720
##$ZGOPTNS= <>
##$ZL1= 120
##$ZL2= 120
##$ZL3= 120
##$ZL4= 120
##$ABSF1= 16.47196
##$ABSF2= -3.547079
##$ABSG= 5
##$ABSL= 3
##$ALPHA= 0
##$AQORDER= 0
##$ASSFAC= 0
##$ASSFACI= 0
##$ASSFACX= 0
##$ASSWID= 0
##$AUNMP= <proc_1d>
##$AZFE= 0.1
##$AZFW= 0.1
##$BCFW= 0
##$BC_mod= 2
##$BYTORDP= 0
##$COROFFS= 0
##$CY= -3
##$DATMOD= 1
##$DC= 0
##$DFILT= <>
##$DTYPP= 0
##$F1P= 0
##$F2P= 0
##$FCOR= 1
##$FTSIZE= 16384
##$FT_mod= 6
##$GAMMA= 0
##$GB= 0
##$INTBC= 1
##$INTSCL= 1.334414e-10
##$ISEN= 128
##$LB= 0.24
##$LEV0= 0
##$LPBIN= 0
##$MAXI= 10000
##$MC2= 0
##$MEAN= 0
##$ME_mod= 0
##$MI= 1.114404
##$NCOEF= 0
##$NC_proc= -5
##$NLEV= 6
##$NOISF1= 3.799351
##$NOISF2= 2.8
##$NSP= 0
##$NTH_PI= 0
##$NZP= 0
##$OFFSET= 16.49518
##$PC= 1
##$PHC0= -13716.08
##$PHC1= 14.00097
##$PH_mod= 1
##$PKNL= yes
##$PPARMOD= 0
##$PSCAL= 0
##$PSIGN= 0
##$REVERSE= no
##$SF= 200.130002024096
##$SI= 16384
##$SIGF1= 3
##$SIGF2= 2
##$SINO= 5.538805
##$SIOLD= 16384
##$SREGLST= <1H.CDCl3>
##$SSB= 0
##$STSI= 16384
##$STSR= 0
##$SW_p= 4006.41025641026
##$SYMM= 0
##$S_DEV= 0
##$TDeff= 16384
##$TDoff= 0
##$TI= <>
##$TILT= no
##$TM1= 0
##$TM2= 0
##$TOPLEV= 0
##$USERP1= <user>
##$USERP2= <user>
##$USERP3= <user>
##$USERP4= <user>
##$USERP5= <user>
##$WDW= 1
##$XDIM= 16384
##$YMAX_p= 315470293
##$YMIN_p= -351310
$$ End of Bruker specific parameters
$$ ---------------------------------
##NTUPLES= NMR SPECTRUM
##VAR_NAME=  FREQUENCY,     SPECTRUM/REAL,   SPECTRUM/IMAG
##SYMBOL=    X,             R,               I
##VAR_TYPE=  INDEPENDENT,   DEPENDENT,       DEPENDENT
##VAR_FORM=  AFFN,          ASDF,            ASDF
##VAR_DIM=   16384,         16384,           16384
##UNITS=     HZ,            ARBITRARY UNITS, ARBITRARY UNITS
##FACTOR=    0.24454680195387, 1,            1
##FIRST=     3301.18043280571, 0,            0
##LAST=      -705.229823604554, 0,           0
##MIN=       -705.229823604554, -351310,     0
##MAX=       3301.18043280571, 315470293,    0
$$ Real data points
##PAGE= N=1
##DATA TABLE= (X++(R..R)), XYDATA
$$ [...]
$$ plain form
6522 -71660 -92416 -53847 -43903 -59197 9203 5436 5859 -26778 -67611 -48199 -25554 -18706 -62927
6509 -62927 -75357 -35285 18340 -6925 -61551 -727 31690 -68256 -55928 14857 -19973 39786
6497 39786 -52876 -87464 -75123 -20205 -20681 -60477 13781 -27905 -9315 -28395 -50714 -49346
6485 -49346 6623 7333 -22673 23390 9964 -5434 -570 -3207 60572 -6966 -17074 -20840 -12189
6472 -12189 -18080 -39554 -37221 -61644 -41865 -76779 -43438 -7240 -25395 22777 13109 -26031
6460 -26031 -34750 -13077 -58414 -96810 -56369 -35226 -27310 -54169 -37530 -63097 -59830 -38181
6448 -38181 -11395 -66238 -58680 -116858 -93893 -80952 -89452 -55716 -68477 -67005 -9784 -25014
6436 -25014 -6703 -24352 -81601 -28711 30328 15302 -20282 -1588 -7948 -31125 -19091 -4790
$$ packed form
6522g1660k0756L8569R944j5294O8400l767M23l2637m0833J9412K2645O848m4221
6509f2927j2430M0072N3625k5265n4626O0824L2417r9946J2328P0785l4830N9759
6497C9786r2662l4588J2341N4918m76l9796P4258m1686J8590j9080k2319J368
6485d9346N5969P10l0006M6063j3426j5398M864k637O3779o7538j0108l766Q651
6472a2189n891k1474K333k4423J9779l4914L3341L6198j8155M8172r668l9140
6460b6031q719K1673m5337l8396M0441K1143P916k6859J6639k5567L267K1649
6448c8181K6786n4843P558n8178K2965J2941q500L3736j2761J472N7221j5230
6436b5014J8311j7649n7249N2890N9039j5026l5584J8694o360k3177J2034J4301
$$ plain form
6424 -4790 16501 -35558 -85308 -22468 -20419 19476 -12769 26890 34014 46446 -14467 -62013
6412 -62013 -103453 -47253 3201 -36577 -52441 -39557 -6602 -98653 -100519 -60977 18355 -20018
6400 -20018 -21338 -40815 -58555 -25422 -36257 14380 76938 -9898 21864 33754 -21019 -32123
6388 -32123 -46187 -33712 16167 22068 -55217 -56960 -39016 -35866 39809 50245 -9971 11005
6376 11005 -3518 29651 2552 7848 26231 -38965 -12208 21971 25927 22417 15556 66019 107749
6363 107749 35381 29543 60418 63329 59651 -4965 -20500 2223 26209 12746 87183 88748
6351 88748 9742 15301 75119 25758 29335 24055 34998 -28425 -23504 53189 44530 4448 17010
6338 17010 -37699 -30873 58171 19399 -5780 38598 68345 71544 70257 87667 99508 109598
$$ packed form
6424d790K1291n2059m9750O2840K049L9895l2245L9659P124J2432o0913m7546
6412f2013m1440N6200N0454l9778j5864J2884L2955r2051j866L9542P9332l8373
6400b0018j320j9477j7740L3133j0835N0637O2558q6836L1762J1890n4773j1104
6388c2123j4064J2475M9879N901p7285j743J7944L150P5675J0436o0216K0976
6376A1005j4523L3169k7099N296J8383o5196K6757L4179L956l510o861N0463M1730
6363A07749p2368n838L0875K911l678o4616j5535K2723K3986j3463P4437J565
6351H8748p9006N559N9818m9361L577n280J0943o3423M921P6693q659m0082J2562
6338A7010n4709O826Q9044l8772k5179M4378K9747L199j287J7410J1841J0090
$$ plain form
6326 109598 100020 103002 124805 30343 11492 117956 147052 39117 -4723 -9265 41257 12232
6314 12232 -10567 -14622 -54631 -7656 48422 48345 -866 -40743 12488 52373 -10803 -32428 3509
6301 3509 -2052 -8409 45893 91868 75825 86715 122943 94650 53569 -3370 -17014 34076
6289 34076 66021 35646 52445 25013 38237 39502 32730 76149 21427 24175 2900 17296
6277 17296 28553 -584 -4003 -3809 21841 97821 42388 3867 44687 75545 62367 71310 8941
6264 8941 12240 105667 142457 134455 123784 103295 162772 159574 67446 104553 183198 155557 116991
6251 116991 98283 116983 164708 128700 156049 148937 187845 219253 222797 217716 168543 153187
6239 153187 185362 165766 156956 192293 173334 184755 197292 239879 207147 260637 252169 280781
$$ packed form
6326A09598r578K982K1803r4462j8851J06464K9096j07935m3840m542N0522k9025
6314A2232k2799m055m0009M6975N6078p7m9211l9877N3231L9885o3176k1625L5937
6301C509n561o357N4302M5975j6043J0890L6228k8293m1081n6939j3644N1090
6289C4076L1945l0375J6799k7432J3224J265o772M3419n4722K748k1275J4396
6277A7296J1257k9137l419J94K5650P5980n5433l8521M0820L0858j3178Q943o2369
6264H941L299R3427L6790q002j0671k0489N9477l198r2128L7107P8645k7641l8566
6251A16991j8708J8700M7725l6008K7349p112L8908L1408L544n081m9173j5356
6239A53187L2175j9596q810L5337j8959J1421J2537M2587l2732N3490q468K8612
$$ plain form
6227 280781 292156 299487 357098 358381 389809 391958 459597 501626 550447 576699 606254 634544
6215 634544 723236 870391 978115 1074469 1247290 1438070 1646885 1839244 2032816 2236116
6205 2236116 2398505 2637954 3025206 3343093 3344296 2975681 2417151 1940059 1600412 1366180
6195 1366180 1186567 1089532 1023478 891969 756061 762341 728099 669840 607148 524751 582747
6184 582747 614173 569765 580400 589541 555058 564180 600898 673498 641138 619160 564914 494589
6172 494589 406206 372067 372397 315007 333660 332506 257956 239510 213129 274234 256891 252847
6160 252847 205650 191742 192666 155889 184606 193735 185448 151962 188819 163178 152052 133335
6148 133335 108715 95117 126124 80703 79066 105945 96099 110480 109105 82554 102310 92913
$$ packed form
6227B80781J1375P331N7611J283L1428K149O7639M2029M8821K6252K9555K8290
6215F34544Q8692J47155J07724R6354J72821J90780K08815J92359J93572K03300
6205B236116J62389K39449L87252L17887J203l68615n58530m77092l39647k34232
6195A366180j79613r7035o6054j31509j35908O280l4242n8259o2692q2397N7996
6184E82747L1426m4408J0635R141l4483R122L6718P2600l2360k1978n4246p0325
6172D94589q8383l4139L30n7390J8653j154p4550j8446k6381O1105j7343m044
6160B52847m7197j3908R24l6777K8717R129q287l3486L6857k5641j1126j8717
6148A33335k4620j3598L1007m5421j637K6879r846J4381j375k6551J9756r397
$$ plain form
6136 92913 37938 73181 92109 84816 100710 129858 94963 84796 77156 53184 75486 83343
6124 83343 64163 64527 41884 25336 52525 108031 124440 143593 114965 98208 54800 37831
6112 37831 21041 85351 109677 58530 84968 50445 12734 1375 18005 55060 62762 19327
6100 19327 81751 69909 36956 40657 85978 121012 73967 62899 105520 25361 98313 103745
6088 103745 85358 68900 51467 69041 20801 91116 43942 -11188 21650 44394 47789 73827
6076 73827 16064 44818 87903 87661 122258 110534 69079 30498 70223 84119 111244 91655
6064 91655 116882 96411 63595 27382 16814 43273 89609 75379 68411 45887 30546 76547
6052 76547 103247 101292 30628 71369 101531 97074 96076 100317 72660 115867 124013 135339 134295
$$ packed form
6136I2913n4975L5243J8928p293J5894K9148l4895j0167p640k3972K2302P857
6124H3343j9180L64k2643j6548K7189N5506J6409J9153k8628j6757m3408j6969
6112C7831j6790O4310K4326n1147K6438l4523l7711j1359J6630L7055P702m3435
6100A9327O2424j1842l2953L701M5321L5034m7045j1068M2621q0159P2952N432
6088A03745j8387j6458j7433J7574m8240P0315m7174n5130L2838K2744L395K6038
6076G3827n7763K8754M3085k42L4597j1724m1455l8581L9725J3896K7125j9589
6064I1655K5227k0471l2816l6213j0568K6459M6336j4230o968k2524j5341M6001
6052G6547K6700j955p0664M0741L0162m457r98M241k7657M3207Q146J1326j044
$$ plain form
6039 134295 103751 68063 108986 117648 65361 48026 133416 150011 136172 171785 156371 179951
6027 179951 184245 163263 173742 234469 249712 239977 257978 208951 198310 238634 291946 298650
6015 298650 267310 296176 276005 363811 379791 351473 349878 424651 410842 392476 468450 503109
6003 503109 475329 396691 412821 401407 401876 438250 428128 461524 419387 446707 487588 506059
5991 506059 554641 581504 626748 624114 692791 768780 784542 884503 941798 1040052 1136381 1288059
5979 1288059 1412432 1520648 1682300 1887033 2161860 2425116 2677727 2894816 3120670 3441992
5969 3441992 3759802 4232846 4677569 4895738 4607678 3860199 3197421 2589128 2141059 1871572
5959 1871572 1684740 1450799 1287082 1176109 1129357 1106257 1066256 995288 994201 982415 1025627
$$ packed form
6039A34295l0544l5688M0923Q662n2287j7335Q5390J6595j3839L5613j5414K3580
6027A79951M294k0982J0479O0727J5243r735J8001m9027j0641M0324N3312O704
6015B98650l1340K8866k0171Q7806J5980k8318j595P4773j3809j8366P5974L4659
6003E03109k7780p8638J6130j1414M69L6374j0122L3396m2137K7320M0881J8471
5991E06059M8582K6863M5244k634O8677P5989J5762R9961N7295R8254R6329J51678
5979A288059J24373J08216J61652K04733K74827K63256K52611K17089K25854L21322
5969C441992L17810M73044M44723K18169k88060p47479o62778o08293m48069k69487
5959A871572j86832k33941j63717j10973m6752k3100m0001p0968j087j1786M3212
$$ plain form
5948 1025627 1019449 1046511 1103203 1157869 1139803 1088911 992180 942645 855251 788557 719160 628155
5936 628155 620292 615355 586774 548278 530326 519987 441573 436453 439954 374368 376451 432459 422059
5923 422059 317647 320723 379804 380366 391415 341205 360184 346963 374826 343065 340484 368476
5911 368476 363118 373367 416994 448675 385116 293167 348498 406960 415891 395804 385446 379214
5899 379214 418476 422718 400688 425631 372800 400745 380564 416847 366975 397562 406641 412462
5887 412462 366009 372353 352369 453686 444385 472901 475050 447909 524947 580662 538839 564623
5875 564623 586554 645609 654750 669803 624323 570866 569356 585847 571804 502230 492496 469720
5863 469720 469645 467999 474651 430713 485718 478879 477838 565478 538128 465981 488239 602963 612389
$$ packed form
5948A025627o178K7062N6692N4666j8066n0892r6731m9535q7394o6694o9397r1005
5936F28155p863m937k8581l8496j7952j0339p8414n120L501o5586K083N6008j0400
5923D22059j04412L076N9081N62J1049n0210J8979j3221K7863l1761k581K7992
5911C68476n358J0249M3627L1681o3559r1949N5331N8462Q931k0087j0358o232
5899C79214L9262M242k2030K4943n2831K7945k0181L6283m9872L0587R079N821
5887D12462m6453O344j9984J01317r301K8516K149k7141P7038N5715m1823K5784
5875E64623K1931N9055R141J5053m5480n3457j510J6491j4043o9574r734k2776
5863D69720p5j646O652m3938N5005o839j041Q7640k7350p2147K2258J14724R426
$$ plain form
5850 612389 526723 577897 609030 648580 690119 659633 646149 642888 631082 561303 529577 464430
5838 464430 396456 405940 394964 421646 449412 409597 334505 292863 348670 358636 319470 251210
5826 251210 276169 345992 327524 381098 406445 324570 337171 382407 360359 343310 351880 391011
5814 391011 358041 360789 320803 270937 265759 277303 290553 296990 271470 283386 257134 304417
5802 304417 222658 198299 217036 179108 246544 241793 204980 227928 198948 166719 169699 244845
5790 244845 196184 219834 197777 141757 250523 263033 224241 252109 219340 229849 172476
5779 172476 215974 246419 214140 164942 211484 240054 252181 245691 216608 232097 237703 292863
5767 292863 239445 259443 190694 176773 222721 207824 215245 250737 213924 248559 264713 288828
$$ packed form
5850F12389q5666N1174L1133L9550M1539l0486j3484l261j1806o9779l1726o5147
5838D64430o7974R484j0976K6682K7766l9815p5092m1642N5807R966l9166o8260
5826B51210K4959O9823j8468N3574K5347q1875J2601M5236k2048j7049Q570L9131
5814C91011l2970K748l9986m9866n178J1544J3250O437k5520J1916k6252M7283
5802C04417q1759k4359J8737l7928O7436m751l6813K2948k8980l2229K980P5146
5790B44845m8661K3650k2057n6020J08766J2510l8792K7868l2769J0509n7373
5779A72476M3498L0445l2279m9198M6542K8570J2127o490k9083J5489N606N5160
5767B92863n3418J9998o8749j3921M5948j4897P421L5492l6813L4635J6154K4115
$$ plain form
5755 288828 293766 270003 341081 327120 308342 314593 234482 227839 245867 348150 277395 263225
5743 263225 262465 246831 250900 236333 288593 295841 317428 337009 322009 286658 295536 245738 221218
5730 221218 274789 248537 249651 239521 268309 368669 360825 353712 359363 266532 266405 333509 266215
5717 266215 228116 283462 282424 285573 294740 258859 262761 290235 282480 319823 346867 316720 310151
5704 310151 317559 319157 323602 339841 360682 406796 358721 307818 372710 424266 462268 471086
5692 471086 548438 550138 584601 675520 682227 721191 819920 853161 898704 959625 956424 835999
5680 835999 734913 625196 621107 535634 440885 414653 398311 402617 400611 426656 361519 327143
5668 327143 330635 351214 324111 291421 332887 419653 394040 371244 378172 362893 313144 334340
$$ packed form
5755B88828M938k3763P1078j3961j8778O251q0111o643J8028J02283p0755j4170
5743B63225p60j5634M069j4567N2260P248K1587J9581j5000l5351Q878m9798k4520
5730B21218N3571k6252J114j0130K8788J00360p844p113N651r2831j27O7104o7294
5717B66215l8099N5346j038L149R167l5881L902K7474p755L7343K7044l0147o569
5704C10151P408J598M445J6239K0841M6114m8075n0903O4892N1556L8002Q818
5692D71086P7352J700L4463R0919O707L8964R8729L3241M5543O0921l201j20425
5680H35999j01086j09717m089q5473r4749k6232j6342M306k006K6045o5137l4376
5668C27143L492K0579k7103l2690M1466Q6766k5613k2796O928j5279m9749K1196
$$ plain form
5656 334340 333584 355469 325633 329309 323686 346189 343651 330156 316591 340036 296158 311056 314094
5643 314094 324444 367011 301429 315145 362428 394619 361031 290971 289010 277618 342859 382678
5631 382678 382096 390816 440455 437254 405209 334581 347183 363409 339324 394959 438906 426197
5619 426197 440855 468789 470060 437830 479696 487480 432222 422936 391471 458329 527722 509388
5607 509388 469838 492219 584980 608034 533013 581520 703241 715239 792801 820822 839821
5596 839821 945276 990911 1055530 1111749 1225179 1279915 1345570 1448193 1621920 1663147 1743853
5585 1743853 1778644 1807898 1874253 1949647 1927492 1880834 1865705 1859070 1817678 1834839 1808953 1769468
5573 1769468 1824283 1877726 1866332 1942344 2038490 2082949 2141505 2188746 2243353 2247056 2244169 2212017
$$ packed form
5656C34340p56K1885k9836L676n623K2503k538j3495j3565K3445m3878J4898L038
5643C14094J0350M2567o5582J3716M7283L2191l3588p0060j961j1392O5241L9819
5631C82678n82Q720M9639l201l2045p0628J2602J6226k4085N5635M3947j2709
5619D26197J4658K7934J271l2230M1866P784n5258r286l1465O6858O9393j8334
5607E09388l9550K2381R2761K3054p5021M8507J21721J1998P7562K8021J8999
5596H39821J05455M5635O4619N6219J13430N4736O5655J02623J73727M1227Q0706
5585A743853L4791K9254O6355P5394k2155m6658j5129o635m1392J7161k5886l9485
5573A769468N4815N3443j1394P6012R6146M4459N8556M7241N4607L703k887l2152
$$ plain form
5561 2212017 2194058 2173120 2127009 2084798 2076174 2117774 2169960 2146946 2177732 2248436 2376246
5550 2376246 2472316 2524477 2626629 2696941 2733282 2645037 2658124 2659481 2660804 2690844 2614579 2549442
5538 2549442 2582584 2590906 2568359 2555635 2492712 2437659 2349493 2240202 2241219 2184375 2142443 2078042
5526 2078042 1916920 1887553 1712948 1570688 1454382 1357005 1231560 1114207 1040081 970812
5516 970812 951893 872504 842153 864473 787554 711706 692300 710029 682838 641691 644074 673221
5504 673221 622932 568621 557105 542211 572533 550988 571235 588163 559634 552681 518967 538915
5492 538915 472272 481057 552795 491729 489612 519503 489003 490621 466135 462089 495658 507354
5480 507354 586636 626952 655877 677754 693073 684492 636951 623574 597046 597234 562593 470296
$$ packed form
5561B212017j7959k0938m6111m2211q624M1600N2186k3014L0786P0704J27810
5550B376246R6070N2161J02152P0312L6341q8245J3087J357J323L0040p6265o5137
5538B549442L3142Q322k2547j2724o2923n5053q8166j09291J017n6844m1932o4401
5526B078042j61122k9367j74605j42260j16306r7377j25445j17353p4126o9269
5516I70812j8919p9389l0351K2320p6919p5848j9406J7729k7191m1147K383K9147
5504F73221n0289n4311j1516j4894L0322k1545K0247J6928k8529o953l3714J9948
5492E38915o6643Q785P1738o1066k117K9891l0500J618k4486m046L3569J1696
5480E07354P9282M0316K8925K1877J5319q581m7541j3377k6528J88l4641r2297
$$ plain form
5468 470296 440018 445646 489126 472324 505461 472673 446206 383262 371951 404266 320249 345755
5456 345755 366484 381258 408507 416598 428877 451631 403671 415927 368900 361575 411381 412944
5444 412944 378858 418100 489607 493066 451979 462102 450817 405605 370334 387595 400044 444729
5432 444729 408336 400021 436882 394420 433348 468115 411635 457226 454904 442185 446354 428343
5420 428343 498183 472060 396086 370303 438297 395665 413405 427171 438093 516317 500839 449806
5408 449806 501398 520751 533442 546500 548472 586258 596494 612381 614161 657191 705063 720706
5396 720706 649309 622628 673132 664432 701093 761777 796753 822432 886259 942984 953775 1025126
5384 1025126 1003036 974476 1061524 1088183 1054997 1061036 1033403 991786 957019 870660 815248 833366
$$ packed form
5468D70296l0278N628M3480j6802L3137l2788k6467o2944j1311L2315q4017K5506
5456C45755K0729J4774K7249Q091J2279K2754m7960J2256m7027p325M9806J563
5444D12944l4086L9242P1507L459m1087J0123j1285m5212l5271J7261J2449M4685
5432D44729l6393q315L6861m2462L8928L4767n6480M5591k322j2719M169j8011
5420D28343O9840k6123p5974k5783O7994m2632J7740J3766J0922P8224j5478n1033
5408D49806N1592J9353J2691J3058J972L7786J0236J5887J780M3030M7872J5643
5396G20706p1397k6681N0504q700L6661O0684L4976K5679O3827N6725J0791P1351
5384A025126k2090k8560Q7048K6659l3186O039k7633m1617l4767q6359n5412J8118
$$ plain form
5372 833366 767013 824837 868838 821890 808019 812307 934565 925257 990058 996682 988928 984067
5360 984067 970125 1005599 1003895 978645 975630 959685 1024885 1043354 1040746 1081975 1129753 1122040
5348 1122040 1169825 1168885 1170258 1240125 1257284 1314133 1334004 1343613 1340096 1399924 1356698 1361268 1391351
5335 1391351 1339135 1308299 1270860 1249344 1192210 1198271 1168061 1155787 1195356 1191806 1226510 1281035
5323 1281035 1354022 1378047 1394071 1535649 1536792 1606549 1734386 1893839 1940744 2021664 2162052
5312 2162052 2251490 2328026 2376651 2388087 2467194 2571692 2661126 2767871 2921810 3089827 3227172
5301 3227172 3387769 3581287 3743560 3874736 4037092 4140848 4239578 4369112 4510047 4712885
5291 4712885 4899953 4988035 5159457 5404977 5637528 5802612 6044752 6301041 6518258 6838739
$$ packed form
5372H33366o6353N7824M4001m6948j3871M288J22258r308O4801O624p754m861
5360I84067j3942L5474j704k5250l015j5945O5200J8469k608M1229M7778p713
5348A122040M7785r40J373O9867J7159N6849J9871R609l517N9828m3226M570L0083
5335A391351n2216l0836l7439k1516n7134O061l0210j2274L9569l550L4704N4525
5323A281035P2987K4025J6024J41578J143O9757J27837J59453M6905Q0920J40388
5312B162052Q9438P6536M8625J1436P9107J04498Q9434J06745J53939J68017J37345
5301C227172J60597J93518J62273J31176J62356J03756R8730J29534J40935K02838
5291D712885J87068Q8082J71422K45520K32551J65084K42140K56289K17217L20481
$$ plain form
5281 6838739 7306597 7716670 8295326 8973645 9672220 10451378 11349726 12294278 13433605
5272 13433605 14653929 16255759 18077545 20130627 22229360 24486373 26962413 30138750
5264 30138750 33862864 37651448 41337655 44741028 48141045 51790563 55990240 60388679
5256 60388679 63414291 63481040 59702051 52998461 45423658 38331371 32460177 27864265
5248 27864265 24251392 21316131 19003391 17114588 15602553 14329709 13222727 12289068
5240 12289068 11626527 11007716 10629057 10337759 10145414 10011994 9926794 9812167 9687298 9690159
5230 9690159 9701178 9609965 9502440 9435950 9327218 9239247 9164634 9167397 9181340 9244029 9446453
5219 9446453 9730467 10015622 10358173 10831785 11410842 12088247 12853174 13759884 14793514
$$ packed form
5281F838739M67858M10073N78656O78319O98575P79158Q98348R44552J139327
5272A3433605J220324J601830J821786K053082K098733K257013K476040L176337
5264C0138750L724114L788584L686207L403373L400017L649518M199677M398439
5256F0388679L025612O6749l778989o703590p574803p092287n871194m595912
5248B7864265l612873k935261k312740j888803j512035j272844j106982r33659
5240A2289068o62541o18811l78659k91298j92345j33420q5200j14627j24869K861
5230I690159J1019r1213j07525o6490j08732q7971p4613K763J3943O2689K02424
5219I446453K84014K85155L42551M73612N79057O77405P64927R06710J033630
$$ plain form
5210 14793514 16003894 17502402 19281804 21220854 23242088 25523746 28087239 31143378
5202 31143378 34654626 38313910 42055483 45659396 49053998 52822512 57382553 61779302
5194 61779302 64300770 64433149 61381259 55011199 47448169 39976157 33659680 28658727
5186 28658727 24751097 21644415 19086770 17003355 15218406 13769913 12577586 11480915
5178 11480915 10568173 9854598 9229757 8770481 8456217 8216692 7977036 7741889 7530261
5169 7530261 7374611 7203918 6942720 6725833 6539732 6307102 6074552 5833452 5655533 5481150
5159 5481150 5249498 5025109 4841934 4670235 4547848 4334765 4176518 4030741 3956372 3909896
5149 3909896 3759637 3666645 3641933 3632997 3577541 3588963 3515909 3404344 3279067 3232047 3178368
$$ packed form
5210A4793514J210380J498508J779402J939050K021234K281658K563493L056139
5202C1143378L511248L659284L741573L603913L394602L768514M560041M396749
5194F1779302K521468J32379l051890o370060p563030p472012o316477n000953
5186B8658727l907630l106682k557645k083415j784949j448493j192327j096671
5178A1480915r12742p13575o24841m59276l14264k39525k39656k35147k11628
5169G530261j55650j70693k61198k16887j86101k32630k32550k41100j77919j74383
5159E481150k31652k24389j83175j71699j22387k13083j58247j45777p4369m6476
5149C909896j50259r2992k4712q936n5456J1422p3054j11565j25277m7020n3679
$$ plain form
5138 3178368 3117492 3029790 2906743 2893209 2854597 2839645 2808416 2811035 2791148 2714298 2709055 2688365
5126 2688365 2681100 2666973 2635050 2537843 2531029 2543526 2469219 2444318 2350290 2296074 2240049 2149512
5114 2149512 2144289 2154788 2094948 2108504 2068074 2009063 2049750 2044406 1985264 1937250 1905767 1879919
5102 1879919 1831539 1818477 1842775 1805391 1773851 1790260 1781833 1770335 1734089 1732403 1743964 1751828
5090 1751828 1725156 1729590 1717804 1706402 1719703 1667529 1712760 1716804 1707727 1714208 1675989 1661643
5078 1661643 1651199 1642574 1629804 1647488 1632519 1550907 1579355 1613093 1587415 1587444 1582115 1611276
5066 1611276 1651252 1582272 1622736 1642908 1663058 1657416 1671323 1686291 1725483 1756736 1704246 1653236
5054 1653236 1600639 1660254 1687107 1705699 1654148 1637321 1692555 1718951 1694011 1677971 1754510
$$ packed form
5138C178368o0876q7702j23047j3534l8612j4952l1229K619j9887p6850n243k0690
5126B688365p265j4127l1923r7207o814J2497p4307k4901r4028n4216n6025r0537
5114B149512n223J0499n9840J3556m0430n9011M0687n344n9142m8014l1483k5848
5102A879919m8380j3062K4298l7384l1540J6409q427j1498l6246j686J1561P864
5090A751828k6672M434j1786j1402J3301n2174M5231M044r077O481l8219j4346
5078A661643j0444q625j2770J7684j4969q1612K8448L3738k5678K9n329K9161
5066A611276L9976o8980M0464K0172K0150n642J3907J4968L9192L1253n2490n1010
5054A653236n2597N9615K6853J8592n1551j6827N5234K6396k4940j6040P6539
$$ plain form
5043 1754510 1673025 1628975 1718021 1683268 1719235 1760707 1808727 1790596 1853209 1841934 1809374
5032 1809374 1808673 1782304 1798475 1796789 1777028 1799335 1840679 1894882 1952896 2068760 2061946 2050639
5020 2050639 2156381 2138409 2191399 2274325 2337182 2331805 2383052 2452363 2433077 2500503 2495445 2488161
5008 2488161 2560838 2583473 2659752 2739170 2703567 2697448 2757585 2876275 2953271 2978009 3073985
4997 3073985 3173082 3209670 3322050 3461515 3538961 3667780 3747585 3832771 3952830 4087401
4987 4087401 4235187 4313946 4509595 4707602 4849030 4986500 5144290 5396593 5650620 5870953
4977 5870953 6049339 6292731 6564134 6776792 7083569 7398688 7667297 7939784 8253544 8538643
4967 8538643 8862826 9273235 9731457 10168534 10668804 11121847 11599207 12165879 12762487 13394819
$$ packed form
5043A754510q1485m4050Q9046l4753L5967M1472M8020j8131O2613j1275l2560
5032A809374p01k6369J6171j686j9761K2307M1344N4203N8014J15864o814j1307
5020B050639J05742j7972N2990Q2926O2857n377N1247O9311j9286O7426n058p284
5008B488161P2677K2635P6279P9418l5603o119O0137J18690P6996K4738R5976
4997C073985R9097L6588J12380J39465P7446J28819P9805Q5186J20059J34571
4987D087401J47786P8759J95649J98007J41428J37470J57790K52303K54027K20333
4977E870953J78386K43392K71403K12658L06777L15119K68609K72487L13760K85099
4967H538643L24183M10409M58222M37077N00270M53043M77360N66672N96608O32332
$$ plain form
4957 13394819 14022858 14768296 15504463 16358282 17138478 17953482 18793969 19691102 20538743
4948 20538743 21383824 22204542 22938410 23811208 24616037 25357410 26114460 26777133 27489583
4939 27489583 28212962 28929228 29591183 30298106 30974897 31711754 32489458 33246943 34007073
4930 34007073 34743948 35416891 36105604 36707348 37232906 37750784 38178396 38597298 38966238
4921 38966238 39256139 39424781 39658370 39893014 40121092 40358965 40525540 40757121 40985717
4912 40985717 41204048 41424889 41598273 41674789 41724680 41729005 41624042 41422316 41194178 40935770
4902 40935770 40657746 40391417 39996823 39504452 39013419 38470132 37841269 37120262 36314493
4893 36314493 35455773 34499096 33411614 32314629 31227903 30106183 28950483 27835975
$$ packed form
4957A3394819O28039P45438P36167Q53819P80196Q15004Q40487Q97133Q47641
4948B0538743Q45081Q20718P33868Q72798Q04829P41373P57050O62673P12450
4939B7489583P23379P16266O61955P06923O76791P36857P77704P57485P60130
4930C4007073P36875O72943O88713O01744N25558N17878M27612M18902L68940
4921C8966238K89901J68642K33589K34644K28078K37873J66575K31581K28596
4912D0985717K18331K20841J73384P6516M9891M325j04963k01726k28138k58408
4902D0935770k78024k66329l94594m92371m91033n43287o28863p21007q05769
4893C6314493q58720r56677j087482j096985j086726j121720j155700j114508
$$ plain form
4885 27835975 26798378 25739698 24842817 23969033 23099231 22398091 21662253 20953044 20314143
4876 20314143 19851031 19380651 18947402 18613567 18173915 17876783 17647215 17460114 17275588
4867 17275588 17113754 17001897 16972424 16864623 16804637 16779936 16823033 16910376 16982558 17143924
4857 17143924 17348709 17541342 17785914 18112834 18420355 18780305 19167517 19584933 20091802
4848 20091802 20549757 21054267 21573952 22138660 22737566 23384345 24022650 24683344 25463291
4839 25463291 26227096 27000375 27782474 28572008 29402724 30250967 31104087 31905761 32734779
4830 32734779 33584757 34333988 35017894 35665208 36233529 36754633 37256258 37658571 37890239
4821 37890239 38094017 38343516 38431256 38482198 38492823 38377553 38305593 38182582 38013086 37874631
$$ packed form
4885B7835975j037597j058680q96881q73784q69802p01140p35838p09209o38901
4876B0314143m63112m70380m33249l33835m39652k97132k29568j87101j84526
4867A7275588j61834j11857k9473j07801n9986k4701M3097Q7343P2182J61366
4857A7143924K04785J92633K44572L26920L07521L59950L87212M17416N06869
4848B0091802M57955N04510N19685N64708N98906O46779O38305O60694P79947
4839B5463291P63805P73279P82099P89534Q30716Q48243Q53120Q01674Q29018
4830C2734779Q49978P49231O83906O47314N68321N21104N01625M02313K31668
4821C7890239K03778K49499Q7740N0942J0625j15270p1960j23011j69496j38455
$$ plain form
4811 37874631 37764503 37625564 37564309 37514397 37413476 37323865 37219301 37110388 37011295 36919742
4801 36919742 36819948 36658175 36451875 36205398 35919774 35574224 35237104 34786813 34302619 33751448
4791 33751448 33202531 32636116 31967037 31389078 30740216 30006942 29326286 28699994 28034528
4782 28034528 27474437 26887134 26297907 25663555 25061854 24464029 23867861 23337081 22803498
4773 22803498 22236749 21607689 20987471 20459566 19936759 19310236 18743139 18173057 17693226
4764 17693226 17257419 16769834 16248498 15832627 15372469 14949463 14551752 14167304 13921223
4755 13921223 13615564 13310256 13018838 12766577 12506996 12264001 12038454 11867989 11612985
4746 11612985 11440030 11272318 11145384 10928181 10720352 10587418 10411877 10290843 10208275 10033046
$$ packed form
4811C7874631j10128j38939o1255m9912j00921q9611j04564j08913r9093r1553
4801C6919742r9794j61773k06300k46477k85624l45550l37120m50291m84194n51171
4791C3751448n48917n66415o69079n77959o48862p33274o80656o26292o65466
4782B8034528n60091n87303n89227o34352o01701n97825n96168n30780n33583
4773B2803498n66749o29060o20218n27905n22807o26523n67097n70082m79831
4764A7693226m35807m87585n21336m15871m60158m23006l97711l84448k46081
4755A3921223l05659l05308k91418k52261k59581k42995k25547j70465k55004
4746A1612985j72955j67712j26934k17203k07829j32934j75541j21034q2568j75229
$$ plain form
4736 10033046 9998902 9966710 9926729 9834012 9817497 9848914 9825576 9732377 9700082 9711191 9679470
4725 9679470 9671045 9624585 9604688 9618973 9561027 9488017 9444929 9385419 9395291 9362283 9346004 9287613
4713 9287613 9228796 9216909 9151501 9132477 9117509 9103090 9096168 9103115 9123676 9140174 9194222 9203822
4701 9203822 9249385 9330617 9365114 9425089 9487633 9479110 9522111 9463503 9501629 9503174 9606572 9638291
4689 9638291 9620901 9640428 9706385 9673543 9683557 9692950 9723726 9695799 9638161 9605848 9502150
4678 9502150 9442579 9393036 9375765 9337864 9425043 9369931 9385840 9464857 9545357 9626552 9718025
4667 9718025 9792679 9887988 10081147 10202923 10334800 10475973 10650238 10825575 11037758 11210560
4657 11210560 11408761 11612943 11878068 12261926 12574968 12867126 13273147 13736567 14216830
$$ packed form
4736A0033046l4144l2192l9981r2717j6515L1417k3338r3199l2295J1109l1721
4725I679470q425m6460j9897J4285n7946p3010m3088n9510R872l3008j6279n8391
4713I287613n8817j1887o5408j9024j4968j4419o922O947K0561J6498N4048R600
4701I203822M5563Q1232L4497N9975O2544q523M3001n8608L8126J545J03398L1719
4689I638291j7390J9527O5957l2842J0014R393L0776k7927n7638l2313j03698
4678I502150n9571m9543j7271l7901Q7179n5112J5909P9017Q0500Q1195R1473
4667I718025P4654R5309J93159J21776J31877J41173J74265J75337K12183J72802
4657A1210560J98201K04182K65125L83858L13042K92158M06021M63420M80263
$$ plain form
4648 14216830 14692754 15222695 15850332 16469871 17148236 17885354 18637523 19482262 20413775
4639 20413775 21393679 22456378 23548378 24659115 25956068 27461558 29049324 30623976
4631 30623976 32223878 33969239 35748066 37518730 39329347 40886866 42032840 42625396
4623 42625396 42476011 41847611 41090451 40397815 39948264 39777714 39875771 40294762 40846220 41553466
4613 41553466 42499634 43622578 44973241 46570223 48384090 50382468 52599798 55145950
4605 55145950 57803992 60702262 63759533 67122978 70745759 74593398 78702332 83090346
4597 83090346 87647309 92500965 97668677 103025181 108547873 114252002 119976036 125628495
4589 125628495 131246930 136574466 141454209 145682250 149095779 151538847 152923246 152858646
$$ packed form
4648A4216830M75924N29941O27637O19539O78365P37118P52169Q44739R31513
4639B0413775R79904J062699J092000J110737J296953J505490J587766J574652
4631C0623976J599902J745361J778827J770664J810617J557519J145974N92556
4623D2625396j49385o28400p57160o92636m49551j70550R8057M18991N51458P07246
4613D1553466R46168J122944J350663J596982J813867J998378K217330K546152
4605E5145950K658042K898270L057271L363445L622781L847639M108934M388014
4597H3090346M556963M853656N167712N356504N522692N704129N724034N652459
4589A25628495N618435N327536M879743M228041L413529K443068J384399o4600
$$ plain form
4581 152858646 151382631 148324267 143577735 137201208 129992880 122581763 115240432 108239083
4573 108239083 101640517 95476008 89868099 84696799 79978590 75718789 71896102 68479468
4565 68479468 65298905 62349562 59587043 57043308 54552586 52242230 49981517 47900460
4557 47900460 45931395 43980609 42181206 40460718 38860236 37280078 35729720 34224769
4549 34224769 32788846 31409530 30000553 28676609 27426448 26259386 25149631 24088333
4541 24088333 23143805 22267031 21439417 20704980 19993336 19299369 18691724 18089141 17558118
4532 17558118 17031469 16538955 16041923 15607043 15231297 14778262 14351347 14012197 13650042
4523 13650042 13360347 13087303 12847480 12651148 12443104 12231671 12006478 11880152 11772961
$$ packed form
4581A52858646j476015l058364m746532o376527p208328p411117p341331p001349
4573A08239083o598566o164509n607909n171300m718209m259801l822687l416634
4565F8479468l180563k949343k762519k543735k490722k310356k260713k081057
4557D7900460j969065j950786j799403j720488j600482j580158j550358j504951
4549C4224769j435923j379316j408977j323944j250161j167062j109755j061298
4541B4088333r44528q76774q27614p34437p11644o93967o07645o02583n31023
4532A7558118n26649m92514m97032m34880l75746m53035m26915l39150l62155
4523A3650042k89695k73044k39823j96332k08044k11433k25193j26326j07191
$$ plain form
4514 11772961 11656403 11494475 11332955 11213473 11068072 10867411 10663884 10479218 10285369
4505 10285369 10101885 9885653 9719696 9530132 9368493 9224256 9102152 9017349 8915567 8787763
4495 8787763 8705668 8649598 8558220 8568665 8496622 8437210 8407136 8376069 8332290 8302871 8304244 8266379
4483 8266379 8218820 8169485 8064450 7946916 7842943 7760457 7620727 7524829 7434531 7349537 7251428
4472 7251428 7188491 7035134 6957949 6957863 6899673 6757160 6709073 6692672 6599640 6513770 6467013 6426945
4460 6426945 6383974 6338762 6295072 6198011 6084717 6073950 5950310 5872326 5738820 5672514 5605303
4449 5605303 5604625 5556116 5438293 5414923 5390250 5475245 5462350 5438909 5473332 5446733 5479345 5490640
4437 5490640 5488787 5477418 5482201 5466810 5431043 5403832 5401630 5383052 5425599 5364037 5308169 5282592
$$ packed form
4514A1772961j16558j61928j61520j19482j45401k00661k03527j84666j93849
4505A0285369j83484k16232j65957j89564j61639j44237j22104q4803j01782j27804
4495H787763q2095n6070r1378J0445p2043n9412l0074l1067m3779k9419J373l7865
4483H266379m7559m9335j05035j17534j03973q2486j39730r5898r0298q4994r8109
4472G251428o2937j53357p7185q6n8190j42513m8087j6401r3032q5870m6757m0068
4460F426945m2971m5212m3690r7061j13294j0767j23640p7984j33506o6306o7211
4449E605303o78m8509j17823k3370k4673Q4995j2895k3441L4423k6599L2612J1295
4437E490640j853j1369M783j5391l5767k7211k202j8578M2547o1562n5868k5577
$$ plain form
4425 5282592 5323087 5322240 5251602 5195446 5186606 5142236 5064537 5064403 5007773 4982431 4977055 5039125 5010872
4412 5010872 5022670 5125562 5227353 5264305 5312473 5397850 5467677 5570689 5727121 5884590
4402 5884590 5972294 6071564 6192999 6296564 6419475 6443505 6517422 6557386 6613027 6681277 6690835
4391 6690835 6641616 6632955 6727733 6755944 6782445 6817757 6870372 6904435 6893282 6994714 7096328
4380 7096328 7189626 7263225 7326237 7379358 7447646 7596806 7672680 7725383 7859286 7960390 8054922
4369 8054922 8265923 8442657 8618526 8756395 9051806 9329928 9624141 9960994 10319413 10667695
4359 10667695 11061556 11474236 11943582 12449775 13027718 13609085 14258463 14966007 15626022
4350 15626022 16329905 16924074 17518907 18130720 18700970 19245334 19717352 20175838 20620052
$$ packed form
4425E282592M0495q47p0638n6156q840m4370p7699j34n6630k5342n376O2070k8253
4412E010872J1798J02892J01791L6952M8168Q5377O9827J03012J56432J57469
4402E884590Q7704R9270J21435J03565J22911K4030P3917L9964N5641O8250R558
4391F690835m9219q661R4778K8211K6501L5312N2615L4063j1153J01432J01614
4380G096328R3298P3599O3012N3121O8288J49160P5874N2703J33903J01104R4532
4369H054922K11001J76734J75869J37869K95411K78122K94213L36853L58419L48282
4359A0667695L93861M12680M69346N06193N77943N81367O49378P07544O60015
4350A5626022P03883N94169N94833O11813N70250N44364M72018M58486M44214
$$ plain form
4341 20620052 21049764 21533162 21997833 22430752 22821197 23183994 23586294 23936364 24197757
4332 24197757 24416602 24562369 24697975 24915498 25128571 25357759 25650487 25998589 26465664
4323 26465664 26978525 27615952 28305175 29100739 30088172 31038016 32080176 33323325 34684331
4314 34684331 36139118 37728056 39500946 41353467 43355270 45460320 47681067 49932302
4306 49932302 52196725 54438111 56625659 58630478 60463535 62122773 63484256 64517618
4298 64517618 65288835 65807844 66003614 65981710 65702886 65252989 64656827 63831685 62904947 61792202
4288 61792202 60417163 58880752 57112032 55156067 53012097 50686245 48338992 45865877
4280 45865877 43424089 41029073 38712222 36458518 34374816 32435186 30659785 28965556
$$ packed form
4341B0620052M29712M83398M64671M32919L90445L62797M02300L50070K61393
4332B4197757K18845J45767J35606K17523K13073K29188K92728L48102M67075
4323B6465664N12861O37427O89223P95564R87433R49844J042160J243149J361006
4314C4684331J454787J588938J772890J852521K001803K105050K220747K251235
4306D9932302K264423K241386K187548K004819J833057J659238J361483J033362
4298F4517618P71217N19009J95770k1904k78824m49897n96162q25142r26738j112745
4288F1792202j375039j536411j768720j955965k143970k325852k347253k473115
4280D5865877k441788k395016k316851k253704k083702j939630j775401j694229
$$ plain form
4272 28965556 27429729 26017583 24685510 23478048 22320860 21298955 20391573 19563533
4264 19563533 18868820 18193927 17559799 17029094 16469976 15919391 15477334 15110823 14718881
4255 14718881 14381344 14075703 13812165 13559683 13369852 13100443 12957223 12874750 12678080 12539152
4245 12539152 12421496 12364008 12348782 12333753 12279565 12250045 12220846 12133890 12105016 12057034 12032251
4234 12032251 12046929 11992065 11977733 11962815 11959435 11941625 11918254 11896885 11905018 11939052 11974361 12034759
4222 12034759 12078405 12116071 12147375 12272460 12347965 12444413 12612478 12846456 12998242 13250504
4212 13250504 13478573 13698370 14047957 14405004 14834272 15322961 15867792 16499563 17216072
4203 17216072 17912638 18710405 19695828 20638979 21761926 22997745 24292880 25787786 27303814
$$ packed form
4272B8965556j535827j412146j332073j207462j157188j021905r07382q28040
4264A9563533o94713o74893o34128n30705n59118n50585m42057l66511l91942
4255A4718881l37537l05641k63538k52482j89831k69409j43220q2473j96670j38928
4245A2539152j17656n7488j5226j5029n4188k9520k9199q6956k8874m7982k4783
4234A2032251J4678n4864j4332j4918l380j7810k3371k1369Q133L4034L5309O0398
4222A2034759M3646L7666L1304J25085P5505R6448J68065K33978J51786K52262
4212A3250504K28069K19797L49587L57047M29268M88689N44831O31771P16509
4203A7216072O96566P97767R85423R43151J122947J235819J295135J494906J516028
$$ plain form
4194 27303814 28853164 30597186 32302303 34069125 35768963 37456789 39138170 40624293
4186 40624293 41937351 43058689 43938529 44545795 44987326 45218911 45195764 45033090 44795732
4177 44795732 44361276 43843209 43290571 42755417 42112041 41509021 40849232 40102805 39474759
4168 39474759 38823481 38185355 37629098 37144067 36809200 36682169 36610426 36714319 36946154 37336160
4158 37336160 37964428 38773123 39758004 40826398 42199915 43744567 45509170 47530889 49775488
4149 49775488 52189193 54910601 57900000 61123160 64594229 68210052 72092044 76120368
4141 76120368 80256945 84531751 88784169 93050031 97077216 100910619 104500307 107605885
4133 107605885 110278778 112417893 113953764 114913317 115265521 115070301 114404923 113275989 111838885
$$ packed form
4194B7303814J549350J744022J705117J766822J699838J687826J681381J486123
4186D0624293J313058J121338Q79840O07266M41531K31585k3147j62674k37358
4177D4795732m34456n18067n52638n35154o43376o03020o59789p46427o28046
4168C9474759o51278o38126n56257m85031l34867j27031p1743J03893K31835L90006
4158C7336160O28268Q08695R84881J068394J373517J544652J764603K021719K244599
4149D9775488K413705K721408K989399L223160L471069L615823L881992M028324
4141G6120368M136577M274806M252418M265862M027185L833403L589688L105578
4133A07605885K672893K139115J535871R59553L52204j95220o65378j128934j437104
$$ plain form
4124 111838885 110024883 107895759 105476220 102806860 99937887 96794856 93426133 89973201
4116 89973201 86371977 82587367 78799538 74946883 71159292 67417713 63797208 60241303
4108 60241303 56911779 53738700 50743663 47960257 45379088 43015341 40829070 38780536
4100 38780536 36939044 35264253 33751432 32346236 31063427 29924972 28875439 27944905
4092 27944905 27096066 26329622 25615971 25031975 24477340 24068611 23674966 23254896 22916232
4083 22916232 22693860 22504407 22309038 22151792 22104240 21979739 21897513 21847221 21774784 21656276
4073 21656276 21501603 21339145 21107443 20882536 20556584 20254815 19816860 19327975 18881640
4064 18881640 18306509 17779843 17205923 16683336 16176699 15640681 15138761 14665207 14272816
$$ packed form
4124A11838885j814002k129124k419539k669360k868973l143031l368723l452932
4116H9973201l601224l784610l787829l852655l787591l741579l620505l555905
4108F0241303l329524l173079k995037k783406k581169k363747k186271k048534
4100C8780536j841492j674791j512821j405196j282809j138455j049533r30534
4092B7944905q48839p66444p13651n83996n54635m08729l93645m20070l38664
4083B2916232k22372j89453j95369j57246m7552j24501q2226n0292p2437j18508
4073B1656276j54673j62458k31702k24907l25952l01769m37955m88885m46335
4064A8881640n75131n26666n73920n22587n06637n36018n01920m73554l92391
$$ plain form
4055 14272816 13929784 13558682 13174148 12813188 12543524 12256133 11943599 11717164 11470487
4046 11470487 11267595 11061844 10890418 10792552 10649188 10499113 10385042 10269435 10179096 10124428
4036 10124428 10005490 9945814 9963149 9951368 9868887 9787754 9781870 9831336 9846080 9895296 9916500
4025 9916500 9904485 9990013 10120564 10192887 10254145 10350463 10465758 10574224 10663572 10731704 10828027
4014 10828027 10918789 11017046 11122918 11173720 11244502 11359130 11447610 11614980 11753135 11865317
4004 11865317 12021360 12180496 12417976 12624055 12874595 13174760 13450677 13774456 14132725
3995 14132725 14594775 15105734 15595579 16141209 16766696 17394596 18045606 18748810 19436849
3986 19436849 20086447 20772097 21451283 22044197 22628234 23233908 23798315 24351849 24930163
$$ packed form
4055A4272816l43032l71102l84534l60960k69664k87391l12534k26435k46677
4046A1470487k02892k05751j71426r7866j43364j50075j14071j15607r0339n4668
4036A0124428j18938n9676J7335j1781q2481q1133n884M9466J4744M9216K1204
4025I916500j2015Q5528J30551P2323O1258R6318J15295J08466Q9348O8132R6323
4014A0828027R0762R8257J05872N0802P0782J14628Q8480J67370J38155J12182
4004A1865317J56043J59136K37480K06079K50540L00165K75917L23779L58269
3995A4132725M62050N10959M89845N45630O25487O27900O51010P03204O88039
3986A9436849O49598O85650O79186N92914N84037O05674N64407N53534N78314
$$ plain form
3977 24930163 25577249 26284704 26991436 27654205 28357915 29108792 29779635 30460233 31140311
3968 31140311 31752965 32329135 32946459 33579431 34207865 34821607 35426728 36164125 36956843
3959 36956843 37696564 38512137 39494649 40491488 41628115 42895228 44134091 45535866 47072060
3950 47072060 48792099 50635693 52654976 54853455 57315230 59955939 62757776 65776415
3942 65776415 69039724 72351011 75780664 79344845 82883243 86338024 89796308 93136481
3934 93136481 96135356 98937478 101536047 103911094 106093104 108070442 109938358 111750979
3926 111750979 113500973 115124104 116564720 117805634 118925607 119734174 120174225 120230263 119976754
3917 119976754 119423192 118543852 117372462 115963166 114335816 112482023 110346181 107910613
$$ packed form
3977B4930163O47086P07455P06732O62769P03710P50877O70843O80598O80078
3968C1140311O12654N76170O17324O32972O28434O13742O05121P37397P92718
3959C6956843P39721Q15573R82512R96839J136627J267113J238863J401775J536194
3950D7072060J720039J843594K019283K198479K461775K640709K801837L018639
3942F5776415L263309L311287L429653L564181L538398L454781L458284L340173
3934I3136481K998875K802122K598569K375047K182010J977338J867916J812621
3926A11750979J749994J623131J440616J240914J119973Q08567M40051N6038k53509
3917A19976754n53562q79340j171390j409296j627350j853793k135842k435568
$$ plain form
3909 107910613 105230217 102223781 98937957 95375748 91511324 87653806 83737650 79724946
3901 79724946 75763254 71804156 67946589 64199614 60586366 57103306 53844524 50874206
3893 50874206 48094540 45536358 43232402 41205146 39317545 37602346 36126634 34687463
3885 34687463 33480682 32389331 31405775 30541554 29840068 29143063 28536568 28133740 27725090
3876 27725090 27372361 27110953 26869476 26695306 26554660 26426413 26200170 25974815 25823980
3867 25823980 25695763 25552096 25350853 25153595 24910757 24666111 24372710 24097154 23813575
3858 23813575 23444927 23131430 22803409 22467737 22084094 21660468 21287123 20816868 20317203
3849 20317203 19855628 19366745 18766986 18250881 17814674 17345892 16928509 16465862 16035062
$$ packed form
3909A07910613k680396l006436l285824l562209l864424l857518l916156m012704
3901G9724946l961692l959098l857567l746975l613248l483060l258782k970318
3893E0874206k779666k558182k303956k027256j887601j715199j475712j439171
3885C4687463j206781j091351r83556q64221p01486o97005o06495m02828m08650
3876B7725090l52729k61408k41477j74170j40646j28247k26243k25355j50835
3867B5823980j28217j43667k01243j97258k42838k44646k93401k75556k83579
3858B3813575l68648l13497l28021l35672l83643m23626l73345m70255m99665
3849B0317203m61575m88883n99759n16105m36207m68782m17383m62647m30800
$$ plain form
3840 16035062 15656802 15353017 15071014 14900924 14754172 14627283 14534325 14564155 14584777 14636470
3830 14636470 14697009 14801266 15002638 15228659 15450776 15670885 15975483 16235020 16552532 17024649
3820 17024649 17442308 17896314 18404005 18915076 19522529 20146560 20871729 21673253 22486647
3811 22486647 23331676 24225234 25220237 26297320 27364814 28473853 29663934 30807291 31946153
3802 31946153 33035315 34116308 35152003 36036588 36814386 37508373 38185863 38759811 39381508
3793 39381508 40024712 40755202 41575021 42671139 43965608 45483690 47310231 49414351 51875578
3784 51875578 54594021 57569685 60775166 64161043 67620920 71224918 74712187 78126773
3776 78126773 81224919 83927680 86066459 87453193 88057256 87706106 86476628 84221654
$$ packed form
3840A6035062l78260l03785k82003j70090j46752j26889r2958K9830K0622N1693
3830A4636470O0539J04257K01372K26021K22117K20109L04598K59537L17512M72117
3820A7024649M17659M54006N07691N11071O07453O24031P25169Q01524Q13394
3811B2486647Q45029Q93558R95003J077083J067494J109039J190081J143357J138862
3802C1946153J089162J080993J035695Q84585P77798O93987O77490N73948O21697
3793C9381508O43204P30490Q19819J096118J294469J518082J826541K104120K461227
3784E1875578K718443K975664L205481L385877L459877L603998L487269L414586
3776G8126773L098146K702761K138779J386734O04063l51150j229478k254974
$$ plain form
3768 84221654 81163524 77370210 73110992 68531644 63860136 59151904 54626562 50385008
3760 50385008 46389490 42762036 39482407 36523110 33866739 31453242 29309412 27504687
3752 27504687 25849067 24354169 23101504 22002420 20927197 19963813 19140769 18330247 17533227
3743 17533227 16913593 16282937 15621623 14997896 14423976 13842459 13361336 12899717 12422110
3734 12422110 12052246 11647570 11256851 10975126 10695950 10430619 10257111 10037820 9888593
3725 9888593 9681931 9525104 9381657 9316456 9217035 9065895 8925250 8773870 8640452 8475154
3715 8475154 8291941 8195352 8010120 7859667 7744788 7575900 7505296 7452840 7348900 7290608
3705 7290608 7229186 7171802 7116040 7129480 7064399 7061529 7078614 7017909 6997974 6865665 6786351
$$ packed form
3768H4221654l058130l793314m259218m579348m671508m708232m525342m241554
3760E0385008l995518l627454l279629k959297k656371k413497k143830j804725
3752B7504687j655620j494898j252665j099084j075223r63384q23044q10522p97020
3743A7533227o19634o30656o61314o23727n73920n81517m81123m61619m77607
3734A2422110l69864m04676l90719k81725k79176k65331j73508k19291j49227
3725I888593k06662j56827j43447o5201r9421j51140j40645j51380j33418j65298
3715H475154j83213r6589j85232j50453j14879j68888p0604n2456j03940n8292
3705G290608o1422n7384n5762J3440o5081k870J7085o0705j9935j32309p9314
$$ plain form
3694 6786351 6702000 6652073 6491287 6380512 6267821 6182105 6103748 5983080 5891934 5791165
3684 5791165 5715736 5675543 5601246 5519872 5490042 5494813 5511891 5519371 5561625 5547032 5555789 5568457
3672 5568457 5537843 5547848 5501234 5508142 5453786 5390075 5266372 5210138 5109875 5047883 5058947
3661 5058947 5009658 4966999 4954341 4955091 4847396 4862893 4828349 4775292 4754648 4767670 4738053 4727161
3649 4727161 4687335 4654655 4562675 4492101 4459766 4428182 4461486 4500869 4540724 4534216 4487235 4532605
3637 4532605 4612584 4638057 4683562 4737721 4766428 4764003 4834139 4826539 4940906 5008003 5096391 5255596
3625 5255596 5385376 5579908 5703849 5811879 5979320 6094236 6249328 6380569 6570262 6698559
3615 6698559 6875328 7088277 7243601 7374645 7539295 7736720 7951690 8105864 8291597 8514951
$$ packed form
3694F786351q4351m9927j60786j10775j12691q5716p8357j20668r1146j00769
3684E791165p5429m0193p4297q1374k9830M771J7078P480M2254j4593Q757J2668
3672E568457l0614J0005m6614O908n4356o3711j23703n6234j00263o1992J1064
3661E058947m9289m2659j2658P50j07695J5497l4544n3057k0644J3022k9617j0892
3649D727161l9826l2680r1980p0574l2335l1584L3304L9383L9855o508m6981M5370
3637D532605P9979K5473M5505N4159K8707k425P0136p600J14367O7097Q8388J59205
3625E255596J29780J94532J23941J08030J67441J14916J55092J31241J89693J28297
3615F698559J76769K12949J55324J31044J64650J97425K14970J54174J85733K23354
$$ plain form
3605 8514951 8742959 9015869 9289644 9705032 10100573 10541559 10989062 11450900 11779651 12289412
3595 12289412 12815549 13337526 13917474 14520897 15175995 15829020 16579903 17330684 18149584
3586 18149584 19000341 20011157 21002512 21962447 23059551 24316797 25594988 27024829 28577771
3577 28577771 30252433 31973437 33804694 35801775 37826168 39877001 42057491 44367986
3569 44367986 46881157 49571402 52523183 55891442 59713047 63979035 68649089 73558858
3561 73558858 78938129 84483967 90150251 95985979 101992664 107997288 113233962 116784087
3553 116784087 118073469 117630966 116492050 115857445 116246527 117807806 120632619 124826942
3545 124826942 130274739 137024483 145099460 154666153 165682114 178205980 192131836 207230941
$$ packed form
3605H514951K28008K72910K73775M15388L95541M40986M47503M61838L28751N09761
3595A2289412N26137N21977N79948O03423O55098O53025P50883P50781Q18900
3586A8149584Q50757J010816R91355R59935J097104J257246J278191J429841J552942
3577B8577771J674662J721004J831257J997081K024393K050833K180490K310495
3569D4367986K513171K690245K951781L368259L821605M265988M670054M909769
3561G3558858N379271N545838N666284N835728O006685O004624N236674L550125
3553A16784087J289382m42503j138916o34605L89082J561279K824813M194323
3545A24826942N447797O749744Q074977R566693J1015961J2523866J3925856J5099105
$$ plain form
3537 207230941 223083268 239374147 255512802 271301746 286288237 299812087 310341560
3530 310341560 315470293 312796400 301373737 282502620 259285594 234878537 211428138
3523 211428138 189998871 170922249 154154036 139429457 126491343 114999223 104948102
3516 104948102 96136040 88441897 81735339 75888178 70859179 66490932 62697046 59364985
3508 59364985 56458848 53873017 51478405 49314916 47287797 45333124 43419507 41516428
3500 41516428 39658067 37885031 36152817 34561168 33050932 31543695 30177144 28925527
3492 28925527 27671183 26525685 25540205 24579876 23733603 22965018 22387782 21770043 21244919
3483 21244919 20789113 20331650 19838282 19391967 18988819 18520230 18039488 17519140 16984726
$$ packed form
3537B07230941J5852327J6290879J6138655J5788944J4986491J3523850J0529473
3530C10341560N128733k673893j1422663j8871117k3217026k4407057k3450399
3523B11428138k1429267j9076622j6768213j4724579j2938114j1492120j0051121
3516A04948102q812062p694143o706558n847161n028999m368247l793886l332061
3508E9364985k906137k585831k394612k163489k027119j954673j913617j903079
3500D1516428j858361j773036j732214j591649j510236j507237j366551j251617
3492B8925527j254344j145498r85480r60329q46273p68585n77236o17739n25124
3483B1244919m55806m57463m93368m46315m03148m68589m80742n20348n34414
$$ plain form
3474 16984726 16458099 15987943 15547179 15134099 14790113 14502531 14254026 14036930 13785949
3465 13785949 13621179 13374655 13145260 12964116 12806012 12616120 12327322 12076206 11911450
3456 11911450 11626446 11327515 11007939 10720556 10358103 9983415 9641576 9368362 9082664
3447 9082664 8873607 8637991 8382630 8182943 8020239 7814625 7631435 7481738 7303190 7153633
3437 7153633 7037908 6922623 6767730 6686629 6600581 6462692 6337324 6216706 6114565 6039254
3427 6039254 5968535 5807215 5652790 5505285 5386019 5317611 5205964 5113446 4990939 4906893
3417 4906893 4802807 4704035 4538053 4413272 4316481 4196263 4117782 4000910 3950866 3834946
3407 3834946 3784452 3652710 3550233 3508748 3421946 3329875 3257185 3183151 3194342 3146868 3050700
$$ packed form
3474A6984726n26627m70156m40764m13080l43986k87582k48505k17096k50981
3465A3785949j64770k46524k29395j81144j58104j89892k88798k51116j64756
3456A1911450k85004k98931l19576k87383l62453l74688l41839k73214k85698
3447I082664k09057k35616k55361j99687j62704k05614j83190j49697j78548j49557
3437G153633j15725j15285j54893q1101q6048j37889j25368j20618j02141p5311
3427F039254p0719j61320j54425j47505j19266o8408j11647r2518j22507q4046
3417D906893j04086r8772j65982j24781r6791j20218p8481j16872n0044j15920
3407C834946n0494j31742j02477m1485q6802r2071p2690p4034J1191m7474r6168
$$ plain form
3396 3050700 3039955 2981314 2953196 2874435 2781193 2700299 2655017 2672848 2654856 2694019 2684820 2666539
3384 2666539 2688284 2625076 2618315 2583280 2561126 2449213 2362966 2274077 2223736 2141911 2089535
3373 2089535 2027403 2001394 1915560 1855779 1744760 1621110 1610218 1551040 1534227 1524969 1470770
3362 1470770 1456273 1509301 1498180 1533593 1515046 1582081 1603921 1621656 1674129 1643608 1579593
3351 1579593 1569439 1538271 1502307 1449422 1406419 1381430 1400186 1390430 1378314 1362728 1346147 1279395
3339 1279395 1343015 1359104 1322423 1384089 1455080 1504011 1557402 1574611 1562550 1630748 1643115
3328 1643115 1653032 1604780 1555813 1556223 1550229 1515342 1518857 1547850 1547135 1548070 1606585 1640408 1614130
3315 1614130 1592706 1632824 1630405 1672970 1690406 1675000 1702873 1719920 1724053 1755801 1738695 1776206
$$ packed form
3396C050700j0745n8641k8118p8761r3242q0894m5282J7831j7992L9163r199j8281
3384B666539K1745o3208o761l5035k2154j11913q6247q8889n0341q1825n2376
3373B089535o2132k6009q5834n9781j11019j23650j0892n9178j6813r258n4199
3362A470770j4497N3028j1121L5413j8547O7035K1840J7735N2473l0521o4015
3351A579593j0154l1168l5964n2885m3003k4989J8756r756j2116j5586j6581o6752
3339A279395O3620J6089l6681O1666P0991M8931N3391J7209j2061O8198J2367
3328A643115R917m8252m8967M10n994l4887L515K8993p15R35N8515L3823k6278
3315A614130k1424M0118k419M2565J7436j5406K7873J7047M133L1748j7106L7511
$$ plain form
3303 1776206 1749845 1801454 1784401 1812082 1844219 1823590 1756948 1757251 1769248 1813704 1767409 1789096
3291 1789096 1789152 1764108 1721559 1755666 1861564 1857846 1826731 1887141 1958662 2050275 2126261 2142311
3279 2142311 2224844 2279445 2336127 2369022 2352543 2366266 2298571 2292899 2213687 2011520 1922266
3268 1922266 1767551 1638699 1499417 1447012 1379180 1345360 1257670 1165925 1107759 1042465 966502
3257 966502 957996 937988 872567 866176 827067 797515 834110 860874 875682 912473 897566 835303
3245 835303 786021 760971 726208 736796 768342 697210 685965 669375 661373 601512 640323 615948
3233 615948 619281 660336 649834 632300 595137 632666 619455 607529 651185 683857 685336 620434
3221 620434 588797 627447 614339 571354 593707 552752 540924 527606 531596 504025 503458 522789
$$ packed form
3303A776206k6361N1609j7053K7681L2137k0629o6642L03J1997M4456m6295K1687
3291A789096N6k5044m2549L4107J05898l718l1115O0410P1521R1613P5986J6050
3279B142311Q2533N4601N6682L2895j6479J3723o7695n672p9212k02167q9254
3268A922266j54715j28852j39282n2405o7832l3820q7690r1745n8166o5294p5963
3257I66502q506k0008o5421o391l9109k9552L6595K6764J4808L6791j4907o2263
3245H35303m9282k5050l4763J0588L1546p1132j1245j6590q002n9861L8811k4375
3233F15948L333M1055j0502j7534l7163L7529j3211j1926M3656L2672J479o4902
3221F20434l1637L8650j3108m2985K2353m0955j1828j3318L990k7571n67J9331
$$ plain form
3209 522789 524745 516078 511732 509507 578201 597577 557208 565959 590378 561197 539348 539199 548128
3196 548128 538907 512360 519939 496128 462686 457672 467939 412395 380160 415341 388078 404579
3184 404579 356002 402037 463587 432709 447130 446411 378681 392803 462252 408654 403207 421727
3172 421727 407054 463593 451716 448389 398692 365382 372712 336271 334026 307687 315035 357061
3160 357061 349482 363228 362904 341492 375487 388050 364174 352684 340063 324099 364138 420700
3148 420700 374993 297293 339967 345986 320522 268141 281115 279371 316137 298374 246654 273882
3136 273882 272003 223213 235596 197011 200858 220166 214405 226608 280502 230986 295893 295439 311653
3123 311653 252101 203194 186687 185674 154522 159682 105551 155097 175557 153923 161383 162605
$$ packed form
3209E22789J956q667m346k225O8694J9376m0369Q751K4419k9181k1849j49Q929
3196E48128r221k6547P579k3811l3442n014J0267n5544l2235L5181k7263J6501
3184D04579m8577M6035O1550l0878J4421p19o7730J4122O9449n3598n447J8520
3172D21727j4673N6539j1877l327m9697l3310P330l6441k245k6339P348M2026
3160C57061p579J3746l24k1412L3995J2563k3876j1490j2621j5964M0039N6562
3148D20700m5707p7700M2674O019k5464n2381J2974j744L6766j7763n1720K7228
3136B73882j879m8790J2383l8585L847J9308n761J2203N3894m9516O4907m54J6214
3123C11653n9552m8907j6507j013l1152N160n4131M9546K0460k1634P460J222
$$ plain form
3111 162605 166835 187405 173422 146367 130749 166581 134067 25720 66118 116178 182820 113657
3099 113657 122342 73779 97802 132527 107208 129079 125326 133351 137367 159445 183016 221381
3087 221381 222940 235056 172479 191517 269632 252669 268282 275661 231103 205363 212638 196858
3075 196858 158276 240854 211182 162384 184701 225566 298801 273116 280908 215765 244750 296480
3063 296480 271159 215451 220367 181749 210468 173412 139647 108347 161306 192365 232672 170273
3051 170273 225939 227223 270776 228379 140245 160438 237592 260214 226320 282569 228626 188570
3039 188570 193940 213830 231074 230189 249437 261321 209494 222132 184585 263881 322412 263465
3027 263465 290815 310327 205715 220915 255519 234695 217359 171753 159234 219954 234573
$$ packed form
3111A62605M230K0570j3983k7055j5618L5832l2514j08347M0398N0060O6642o9163
3099A13657Q685m8563K4023L4725k5319K1871l753Q025M016K2078K3571L8365
3087B21381J559J2116o2577J9038P8115j6963J5613P379m4558k5740P275j5780
3075A96858l8582Q2578k9672m8798K2317M0865P3235k5685P792o5143K8985N1730
3063B96480k5321n5708M916l8618K8719l7056l3765l1300N2959L1059M0307o2399
3051A70273N5666J284M3553m2397q8134K0193P7154K2622l3894N6249n3943m0056
3039A88570N370J9890J7244q85J9248J1884n1827J2638l7547P9296N8531n8947
3027B63465K7350J9512j04612J5200L4604k0824j7336m5606j2519O0720J4619
$$ plain form
3016 234573 193627 154529 166663 180995 196298 216370 226263 255771 201976 224448 203780 231342
3004 231342 256642 246932 230538 202818 239442 221915 203366 245810 221508 170201 124634 104975
2992 104975 113956 171292 222359 195466 213480 168002 163414 164038 78081 115174 130414 157244
2980 157244 199356 180871 177387 87799 98344 146575 164013 146839 98690 67813 83382 107646
2968 107646 201335 206713 199547 215725 225445 197126 188203 198575 221258 189950 149547 163233
2956 163233 87273 121959 119374 86456 161447 135551 161892 134035 144024 169219 230470 278033
2944 278033 251851 234523 248562 342070 380253 376193 347940 327836 333793 427177 417490 391685
2932 391685 444466 497513 496219 550936 488818 521087 592559 641123 646770 663125 665217 615041
$$ packed form
3016B34573m0946l9098J2134J4332J5303K0072R893K9508n3795K2472k0668K7562
3004B31342K5300r710j6394k7720L6624j7527j8549M2444k4302n1307m5567j9659
2992A04975Q981N7336N1067k6893J8014m5478m588O24q5957L7093J5240K6830
2980A57244M2112j8485l484q9588J0545M8231J7438j7174m8149l0877J5569K4264
2968A07646R3689N378p166J6178R720k8319q923J0372K2683l1308m0403J3686
2956A63233p5960L4686k585l2918P4991k5896K6341k7857R989K5195O1251M7563
2944B78033k6182j7328J4039R3508L8183m060k8253k0104N957R3384r687k5805
2932C91685N2781N3047j294N4717o2118L2269P1472M8564N647J6355K092n0176
$$ plain form
2920 615041 631140 671542 676046 650455 664868 656601 729403 791017 822228 863876 935361 1042865
2908 1042865 1166378 1276632 1397021 1436720 1636073 1794732 1907475 2044039 2311546 2453681
2898 2453681 2696003 2964218 3174123 3456217 3832953 4389769 5268813 6285309 7230256
2889 7230256 8235220 9435790 10426242 11540831 13146224 15450393 16803275 14583687
2881 14583687 11251104 8757238 7114550 5999594 5162347 4463004 3887858 3413616 3056085
2872 3056085 2816455 2535847 2260012 2173599 2033926 1803556 1623109 1513213 1435066 1394204
2862 1394204 1325220 1291877 1279205 1257470 1184601 1198819 1204030 1058273 955207 935959 865928
2851 865928 849505 803602 796642 733008 676163 631757 550739 629845 564706 552681 510583 527616
$$ packed form
2920F15041J6099M0402M504k5591J4413q267P2802O1614L1211M1648P1485J07504
2908A042865J23513J10254J20389L9699J99353J58659J12743J36564K67507J42135
2898B453681K42322K68215K09905K82094L76736N56816Q79044J016496R44947
2889G230256J004964J200570R90452J114589J605393K304169J352882k219588
2881A4583687l332583k493866j642688j114956q37247o99343n75146m74242l57531
2872C056085k39630k80608k75835q6413j39673k30370j80447j09896p8147m0862
2862A394204o8984l3343j2672k1735p2869J4218N211j45757j03066j9248p0031
2851H65928j6423m5903o960o3634n6845m4406q1018P9106o5139j2025m2098J7033
$$ plain form
2839 527616 508748 513926 527999 584056 574186 540635 475354 499347 492823 435231 447844 412469
2827 412469 455475 374155 324760 369626 415851 397322 271453 297046 373115 346308 331640
2816 331640 393640 402794 421434 357456 344084 339648 362426 411999 348947 403115 355531 286188
2804 286188 243996 300649 274740 260791 272545 177074 192482 222392 214385 190033 167708 223257
2792 223257 254552 242512 274339 243762 196599 145949 171839 239806 246149 172035 210850 227069
2780 227069 209999 186519 161300 183170 200892 200370 177570 213504 217074 210704 183996 170238
2768 170238 171287 170586 205217 167606 145807 141549 76571 76792 161524 72219 57318 78868 92000
2755 92000 100671 80940 36998 54679 64562 43164 31373 103926 97579 86697 128562 121128 93865
$$ packed form
2839E27616j8868N178J4073N6057r870l3551o5281K3993o524n7592J2613l5375
2827D12469M3006q1320m9395M4866M6225j8529j25869K5593P6069k6807j4668
2816C31640O2000R154J8640o3978j3372m436K2778M9573o3052N4168m7584o9343
2804B86188m2192N6653k5909j3949J1754r5471J5408K9910q007k4352k2325N5549
2792B23257L1295j2040L1827l0577m7163n0650K5890O7967O343p4114L8815J6219
2780B27069j7070k3480k5219K1870J7722n22k2800L5934L570o370k6708j3758
2768A70238J049p01L4631l7611k1799m258o4978K21Q4732q9305j4901K1550J3132
2755I2000Q671j9731m3942J7681R883k1398j1791P2553o347j0882M1865p434k7263
$$ plain form
2742 93865 73632 77644 105192 169795 91363 74220 65375 52664 56848 103677 65310 19196
2730 19196 15506 108154 111143 129990 75680 103542 79300 68328 102284 115872 140940 90995
2718 90995 65760 40790 28101 91732 77533 64643 89292 108425 104318 136489 82212 44639
2706 44639 50870 38939 55805 97605 75462 62967 71600 55159 65097 32705 53569 52829 11497
2693 11497 45457 89137 71867 71237 102244 117018 99402 28827 31082 83412 99372 58460
2681 58460 49384 95718 78333 127946 110766 102218 120211 50460 32490 59148 69943 34398
2669 34398 77258 86816 61059 71968 54878 85190 69813 46422 43652 120806 84093 119458
2657 119458 70016 70817 80400 116543 52476 99929 122581 107923 117037 117877 104835 128093 125344
$$ packed form
2742I3865k0233M012K7548O4603p8432j7143q845j2711M184M6829l8367m6114
2730A9196l690R2648K989J8847n4310K7862k4242j0972L3956J3588K5068m9945
2718I0995k5235k4970j2689O3631j4199j2890K4649J9133m107L2171n4277l7573
2706D4639O231j1931J6866M1800k2143j2495Q633j6441R938l2392K0864p40m1332
2693A1497L3960M3680j7270o30L1007J4774j7616p0575K255N2330J5960m0912
2681E8460r076M6334j7385M9613j7180q548J7993o9751j7970K6658J0795l5545
2669C4398M2860R558k5757J0909j7090L0312j5377k3391k770P7154l6713L5365
2657A19458m9442Q01R583L6143o4067M7453K2652j4658R114Q40j3042K3258k749
$$ plain form
2644 125344 127992 123399 171375 162215 126029 167924 175000 138606 143927 128372 118769 116021 96839
2631 96839 108323 107187 133621 63063 93631 121339 37051 76596 116108 97706 130238 70537
2619 70537 43116 22289 98620 43127 76795 91431 42958 80811 66591 75634 97764 61406
2607 61406 49440 1094 22322 53685 105185 70375 7085 -10622 37869 25276 82524 129651
2595 129651 73276 -2345 22589 15931 10603 3991 12046 50532 83109 31037 28499 95556 55205
2582 55205 101039 70117 64866 82411 72852 92335 61625 57241 91430 79400 92190 65350
2570 65350 95593 -4230 17147 30515 10179 48503 59855 28464 42029 79371 118203 73940
2558 73940 17685 75659 137131 83808 49108 58133 51079 20548 33817 22522 1415 9258
$$ packed form
2644A25344K648m593M7976r160l6186M1895P076l6394N321j5555r603k748j9182
2631I6839J1484j136K6434p0558L0568K7708q4288L9545L9512j8402L2532n9701
2619G0537k7421k0827P6331n5493L3668J4636m8473L7853j4220R043K2130l6358
2607F1406j1966m8346K1228L1363N1500l4810o3290j7707M8491j2593N7248M7127
2595A29651n6375p5621K4934o658n328o612Q055L8486L2577n2072k538O7057m0351
2582E5205M5834l0922n251J7545r559J9483l0710m384L4189j2030J2790k6840
2570F5350L0243r9823K1377J3368k0336L8324J1352l1391J3565L7342L8832m4263
2558G3940n6255N7974O1472n3323l4700R025p054l0531J3269j1295k1107P843
$$ plain form
2546 9258 -3547 70827 55034 26347 86160 120729 91196 80396 118772 164177 115773 73019
2534 73019 6983 74061 100585 96299 69126 36140 39886 72467 16684 -11765 32418 22029
2522 22029 117278 58409 14775 2931 24184 34401 47214 67341 63454 86054 46427 39057
2510 39057 19059 -33146 -24261 -23011 2419 23697 -2333 -3003 4095 31454 34870 -27359 -7818
2497 -7818 -58509 -49139 9303 12989 58959 58457 103741 59049 105429 114061 112748 63272 86430
2484 86430 120120 125250 87412 108868 55221 15035 18965 46604 52931 70127 93308 65006
2472 65006 78017 -2782 59998 13038 -15367 90698 106830 63224 27604 8797 40239 33559
2460 33559 3280 44694 61901 19692 -9091 34151 34651 -3262 14295 15213 38300 54299 68049
$$ packed form
2546I258j2805P4374j5793k8687N9813L4569k9533j0800L8376M5405m8404m2754
2534G3019o6036O7078K6524m286k7173l2986L746L2581n5783k8449M4183j0389
2522B2029R5249n8869m3634j1844K1253J0217J2813K0127l887K2600l9627p370
2510C9057j9998n2205Q885J250K5430K1278k6030o70P098K7359L416o2229J9541
2497g818n0691R370N8442L686M5970n02M5284m4692M6380Q632j313m9476K3158
2484H6430L3690N130l7838K1456n3647m0186L930K7639O327J7196K3181k8302
2472F5006J3011q0799O2780m6960k8405J06065J6132m3606l5620j8807L1442o680
2460C3559l0279M1414J7207m2209k8783M3242N00l7913J7557R18K3087J5999J3750
$$ plain form
2447 68049 46106 69864 84188 54458 51016 39114 48364 98642 6630 27989 13451 25747
2435 25747 45873 1541 27955 27734 49222 111799 88865 39962 79366 71278 45121 124891
2423 124891 145289 42407 33480 -2193 1098 89393 37674 -6480 46188 63204 11580 14861
2411 14861 -12194 -51825 -30259 -13019 -2217 -6907 55284 22297 67049 12499 18560 66707
2399 66707 -8360 7582 12863 -1366 16794 65954 32818 19748 26226 64244 39563 42124
2387 42124 52073 16374 19417 2624 2323 102657 79855 69796 68842 40823 48801 71320 50064
2374 50064 -613 27126 24616 -32525 -39382 13502 37812 7472 -15276 51357 27835 9343
2362 9343 30778 5202 6757 64840 106215 58822 97451 108584 112758 73418 31101 53020
$$ packed form
2447F8049k1943K3758J4324k9730l442j1902R250N0278r2012K1359j4538J2296
2435B5747K0126m4332K6414k21K1488O2577k2934m8903L9404q088k6157P9770
2423A24891K0398j02882q927l5673L291Q8295n1719m4154N2668J7016n1624L281
2411A4861k7055l9631K1566J7240J0802m690O2191l2987M4752n4550O061M8147
2399F6707p5067J5942N281j4229J8160M9160l3136j3070O478L8018k4681K561
2387D2124R949l5699L043j6793l01J00334k2802j0059r54k8019P978K2519k1256
2374E0064n0677K7739k510n7141o857N2884K4310l0340k2748O6633k3522j8492
2362I343K1435k5576J555N8083M1375m7393L8629J1133M174l9340m2317K1919
$$ plain form
2350 53020 30569 45696 4830 28779 7192 68481 3776 -639 38960 38573 5515 56619
2338 56619 49515 44784 29277 21635 92620 73291 60684 -8299 -19217 38382 86723 45275
2326 45275 49450 51598 58795 -20069 7755 56596 -18833 -19462 -25616 -33201 -10669 -38360 -24130
2313 -24130 -5494 -15580 42199 42654 47066 23680 52598 80000 -12445 9042 -5949 29125
2301 29125 66704 48858 66583 67877 16776 42956 76365 71132 104462 63995 37018 10720
2289 10720 73964 97548 41873 61332 38858 15305 -4809 20551 -11625 9530 64728 66397
2277 66397 32485 104555 24425 10301 -32361 -21484 3225 25068 69462 -5660 39327 49404
2265 49404 96248 42540 -21302 8501 22422 33847 47413 -32351 -36010 -36568 -30478 -61356 -15557
$$ packed form
2350E3020k2451J5127m0866K3949k1587O1289o4705m415L9599l87l3058N1104
2338E6619p104m731j5507p642P0985j9329j2607o8983j0918N7599M8341m1448
2326D5275M175K148P197p8864K7824M8841p5429o29o154p585K2532k7691J4230
2313b4130J8636j0086N7779M55M412k3386K8918K7402r2445K1487j4991L5074
2301B9125L7579j7846J7725J294n1101K6180L3409n233L3330m0467k6977k6298
2289A0720O3244K3584n5675J9459k2474k3553k0114K5360l2176K1155N5198J669
2277F6397l3912P2070q0130j4124m2662J0877K4709K1843M4394p5122M4987J0077
2265D9404M6844n3708o3842K9803J3921J1425J3566p9764l659n58O090l0878M5799
$$ plain form
2252 -15557 13587 13822 -29136 20322 -6443 -5939 4946 26437 17818 1776 776 32908 58158
2239 58158 12905 3295 179 23736 16935 35048 43521 21770 37989 79640 77224 43297 -25989
2226 -25989 11494 1029 33357 22748 24029 78995 88561 67471 44225 78362 92165 12889
2214 12889 -38874 19961 15746 -19578 -35955 4545 -5293 -32892 49014 25607 -20695 -6125
2202 -6125 -18045 -38596 5574 4263 -30337 7372 2065 23165 6538 3363 -31376 -40216 -86571
2189 -86571 -52411 46612 -14608 -7682 -4339 25798 20375 -38450 -40030 34168 41537 15804 10018
2176 10018 6270 56326 -536 -20616 3467 25951 68102 45484 47596 66799 60131 -11517
2164 -11517 -48640 -20271 -6013 -6237 3555 -46897 -17212 -39137 21822 67151 21454 23915 19436
$$ packed form
2252a5557K9144K35m2958M9458k6765N04J0885K1491q619j6042j000L2132K5250
2239E8158m5253r610l116K3557o801J8113Q473k1751J6219M1651k416l3927o9286
2226b5989L7483j0465L2328j0609J281N4966R566k1090k3246L4137J3803p9276
2214A2889n1763N8835m215l5324j6377M0500r838k7599Q1906k3407m6302J4570
2202f125j1920k0551M4170j311l4600L7709n307K1100j6627l175l4739q840m6355
2189h6571L4160R9023o1220O926L343L0137n423n8825j580P4198P369k5733n786
2176A0018l748N0056n6862k0080K4083K2484M2151k2618K112J9203o668p1648
2164a1517l7123K8369J4258k24R792n0452K9685k1925O0959M5329m5697K461m479
$$ plain form
2151 19436 3648 20942 -5174 549 31338 22730 44118 40624 61053 64008 19757 17797 39977
2138 39977 56187 16148 -28399 -11652 13698 25282 -15470 55854 45162 26385 53045 21718
2126 21718 6521 12873 -6446 28256 59770 -1609 25146 41737 68287 1686 -16871 21128
2114 21128 38416 -11068 -385 28177 9605 13239 -23769 -48658 -15280 -11773 19344 69193
2102 69193 80350 67673 -7835 -3357 46116 -20076 33527 13971 -61261 -54230 -82172 -78576
2090 -78576 -61835 28576 -22061 -4311 19576 11962 -24312 -63376 -21345 -11366 -5497 2544 -45679
2077 -45679 -30754 -29628 -7059 -40622 -82192 -38078 -29648 -21702 24071 19940 19071 -20396 -27563
2064 -27563 14855 16145 34275 69396 -19427 10349 25052 -28275 -12696 3489 -7295 3708
$$ packed form
2151A9436j5788J7294k6116N723L0789q608K1388l494K0429K955m4251j960K2180
2138C9977J6210m0039m4547J6747K5350J1584m0752P1324j0692j8777K6660l1327
2126B1718j5197O352j9319L4702L1514o1379K6755J6591K6550o6601j8557L7999
2114B1128J7288m9484J0683K8562j8572L634l7008k4889L3378L507L1117M9849
2102F9193J1157j2677p5508M478M9473o6192N3603j9556p5232P031k7942L596
2090g8576J6741R0411n0637J7750K3887p614l6274l9064M2031R979N869Q041m8223
2077d5679J4925J126K2569l3563m1570M4114Q430P946M5773m131q69l9467p167
2064b7563M2418J290J8130L5121q8823K9776J4703n3327J5579J6185j0784J1003
$$ plain form
2052 3708 24313 24297 7801 -38906 18262 34169 55468 36660 18960 8316 -2910 -21150 -34904
2039 -34904 3668 -9714 16705 18548 -18488 -32642 -21573 -39521 -44355 -7982 7626 42515
2027 42515 5807 -16649 24042 4260 59130 14044 54515 53597 21128 62480 64868 21811
2015 21811 -48788 -52694 44947 -34860 -43923 7690 11734 -1437 -7744 -5840 -52938 2945 -3572
2002 -3572 14727 24330 31886 -2276 35911 -9980 -27653 -52584 -56122 -61799 -13679 24497 3345
1989 3345 -7011 -17248 -15955 22985 25770 -35826 -1769 73099 37818 21302 -15485 15304
1977 15304 61343 38762 25220 39601 8497 29100 60967 33050 20589 26124 14016 10820
1965 10820 -19979 -27870 13929 21867 505 -29899 -5647 -33726 -9279 -38499 -19682 -29551
$$ packed form
2052C708K0605j6j6496m6707N7168J5907K1299j8808j7700j0644j1226j8240j3754
2039c4904L8572j3382K6419J843l7036j4154J1069j7948m834L6373J5608L4889
2027D2515l6708k2456M0691j9782N4870m5086M0471r18l2469M1352K388m3057
2015B1811p0599l906R7641p9807r063N1613M044j3171o307J904m7098N5883o517
2002c572J8299R603P556l4162L8187m5891j7673k4931l538n677M8120L8176k1152
1989C345j0356j0237J293L8940K785o1596L4057P4868l5281j6516l6787L0789
1977A5304M6039k2581j3542J4381l1104K0603L1867k7917j2461N535j2108l196
1965A0820l0799p891M1799P938k1362l0404K4252k8079K4447k9220J8817r869
$$ plain form
1953 -29551 -28049 -19156 -13345 -7294 -26246 12601 -16253 -26177 -20854 2562 23086 28356 -22063
1940 -22063 -12511 24653 418 -23087 -40090 -13337 35071 -9719 -24309 21419 44077 25463
1928 25463 4440 -38986 -35331 -60104 9472 -12847 29693 -10867 -58144 -22743 -42374 -65136
1916 -65136 -32054 30031 -13718 -14407 -29446 -65303 -85834 -36134 -1324 -26174 -74478 -25807
1904 -25807 -8482 -16029 -47361 8627 -7638 -22650 -29536 -43440 -28339 -43244 -33548 20029
1892 20029 -16944 -15276 -41400 -72641 -56679 -59946 -11393 29371 59593 38989 -3248 -44740
1880 -44740 11974 -283 6132 37414 14128 -1435 -26960 -21689 -44929 28592 20235 6322
1868 6322 26811 37163 20794 11814 2783 -39629 -20674 -28709 -45486 -88067 -8157 48212 -39522
$$ packed form
1953b9551J502Q893N811O051j8952L8847k8854r924N323K3416K0524N270n0419
1940b2063R552L7164k4235k3505j7003K6753M8408m4790j4590M5728K2658j8614
1928B5463k1023m3426L655k4773O9576k2319M2540m0560m7277L5401j9631k2762
1916f5136L3082O2085m3749o89j5039l5857k0531M9700L4810k4850m8304M8671
1904b5807J7325p547l1332N5988j6265j5012o886j3904J5101j4905R696N3577
1892B0029l6973J668k6124l1241J5962l267M8553M0764L0222k0604m2237m1492
1880d4740N6714j2257O415L1282k3286j5563k5525N271k3240P3521q357j3913
1868F322K0489J0352j6369q980r031m2412J8955q035j6777m2581P9910N6369q7734
$$ plain form
1855 -39522 -47511 -39710 10668 12168 43881 3514 -581 17166 74446 45233 9641 1857 -35250
1842 -35250 -38618 -50084 -64889 -62641 6524 171 27325 23524 43024 26351 -2730 -12276 -17558
1829 -17558 -4696 -4533 -3015 -22977 65102 41230 7314 -27654 -97982 -5789 14716 -33989
1817 -33989 34505 -5639 17745 42372 -12881 -9050 2159 112790 47825 30229 10331 -13895
1805 -13895 5803 35742 25655 -9093 -8529 -41046 -43633 -11094 567 -43826 -43243 -31874 -29811
1792 -29811 -23787 59274 11547 9941 -2983 -48690 -101465 -74542 -52135 -48099 53130 -19578
1780 -19578 -19017 -35500 13754 -41369 -41143 -55830 6031 -25414 -50307 6810 -3785 -12144 -29937
1767 -29937 3319 15701 -20269 -3750 58076 16114 20715 24659 -39993 17678 -5954 -24046
$$ packed form
1855c9522p989P801N0378J500L1713m0367m095J7747N7280k9213l5592p784l7107
1842c5250l368j1466j4805K248O9165o353K7154l801J9500j6673k9081r546n282
1829a7558J2862J63J518j9962Q8079k3872l3916l4968p0328R2193K0505m8705
1817c3989O8494m0144K3384K4627n5253L831J1209J10631o4965j7596j9898k4226
1805a3895J9698K9939j0087l4748N64l2517k587L2539J1661m4393N83J1369K063
1792b9811O024Q3061m7727j606j2924m5707n2775K6923K2407M036J01229p2708
1780a9578N61j6483M9254n5123K26j4687O1861l1445k4893N7117j0595q359j7793
1767b9937L3256J2382l5970J6519O1826m1962M601L944o4652N7671k3632j8092
$$ plain form
1755 -24046 -40141 -27932 13475 18783 47837 18921 -3244 5737 22798 30995 51790 19813
1743 19813 -20890 -92170 -15118 -34273 -68346 -7624 -8109 -4971 50539 -32582 -64170 -34960
1731 -34960 9798 -6747 -42987 6411 6688 34740 45060 17599 -4954 45606 31832 40347
1719 40347 -22839 3470 60430 63805 53302 -3370 -34305 17678 59601 13129 -8778 5254
1707 5254 5892 -25730 -51285 -3367 6979 -7375 9652 -13603 -5207 36598 16707 38283 47760
1694 47760 -25557 -36246 -58497 -2282 -12851 -16842 -21411 -13561 -14048 -4012 -22506 -38641 -7089
1681 -7089 12422 -31231 -48928 -21078 -3243 -1072 -6641 -33353 -29383 -69922 -14299 -6598 -43192
1668 -43192 -18303 -31295 -7332 -28939 -21896 18901 -32088 -42518 -57969 -53493 -47743 -11651
$$ packed form
1755b4046j6095J2209M1407N308K9054k8916k2165Q981J7061Q197K0795l1977
1743A9813m0703p1280P7052j9155l4073O0722m85L138N5510q3121l1588K9210
1731c4960M4758j6545l6240M9398K77K8052J0320k7461k2553N0560j3774Q515
1719D0347o3186K6309N6960L375j0503n6672l0935N1983M1923m6472k1907J4032
1707E254O38l1622k5555M7918J0346j4354J7027k3255Q396M1805j9891K1576R477
1694D7760p3317j0689k2251N6215j0569l991m569P850m87J0036j8494j6135L1552
1681g089J9511m3653j7697K7850J7835K171n569k6712L970m0539N5623P701l6594
1668d3192K4889j2992K3963k1607P043M0797n0989j0430j5451M476N750L6092
$$ plain form
1656 -11651 28496 -14833 -12824 -18421 3687 -48710 -23177 -35898 -55417 -5119 -4588 -28336 -61919
1643 -61919 1154 -46995 -76302 -63037 -13256 57827 2986 -70985 -79478 -8143 7096 561
1631 561 -15967 25709 13564 -32002 -21748 -19741 -24477 -14852 -26559 47427 37872 17423 29168
1618 29168 38445 -7639 -14511 76168 77668 -32097 -13865 14351 5619 5953 -293 -35323 37951
1605 37951 75270 -7227 -49855 -23759 -14620 -17949 -15311 -25189 -31973 -17437 -26365 -89003 -56074
1592 -56074 -37283 -16320 -18455 -42644 -25545 -21640 -49601 -23657 -56016 -13357 -13724 -16881 -52058
1579 -52058 -18685 6433 21456 17963 38762 12951 -2667 -16070 -9066 10454 -8726 -52597
1567 -52597 -1977 -24400 -32642 -8253 -33334 -45343 -85354 -39368 -39670 6751 -19207 27290
$$ packed form
1656a1651M0147m3329K009n597K2108n2397K5533j2721j9519N0298N31k3748l3583
1643f1919O3073m8149k9307J3265M9781P1083n4841p3971q493P1335J5239o535
1631E61j6528M1676j2145m5566J0254K007m736R625j1707P3986r555k0449J1745
1618B9168R277m6084o872R0679J500j09765J8232K8216q732L34o246l5030P3274
1605C7951L7319q2497m2628K6096R139l329K638r878o784J4536q928o2638L2929
1592e6074J8791K0963k135k4189J7099L905k7961K5944l2359M2659l67l157l5177
1579e2058L3373K5118J5023l493K0799k5811j5618j3403P004J9520j9180m3871
1567e2597N0620k2423q242K4389k5081j2009m0011M5986l02M6421k5958M6497
$$ plain form
1555 27290 7676 11264 -7690 -63453 -69949 26526 41950 83198 91196 -27503 -61145 -77912
1543 -77912 -57353 -71863 -79763 -31078 -14326 -492 9308 27256 2894 40600 11213 -16967
1531 -16967 -11875 7444 -3348 8991 20850 21443 56778 2160 -50175 6608 -4788 -23745
1519 -23745 34934 -26537 -38244 -72820 -71280 -51083 -48809 -63592 -32006 -73436 -91816 -80179
1507 -80179 438 15874 -57147 -48774 -10942 -16372 -48256 -75297 -61732 -38043 12029 -2754
1495 -2754 28190 -25485 -32125 21203 63607 -3884 38706 57463 -46136 -36356 -29210 11536
1483 11536 36327 17600 5910 -61956 -90733 611 26158 27738 -38325 13851 13938 15605 4333
1470 4333 27374 25005 33642 18522 -41694 -30599 -4758 25826 47878 -78 29322 17623
$$ packed form
1555B7290j9614L588j8954n5763o496R6475J5424M1248P998j18699l3642j6767
1543g7912K0559j4510p900M8685J6752J3834R800J7948k4362L7706k9387k8180
1531a6967N092J9319j0792J2339J1859N93L5335n4618n2335N6783j1396j8957
1519b3745N8679o1471j1707l4576J540K0197K274j4783L1586m1430j8380J1637
1507h0179Q0617J5436p3021Q373L7832n430l1884k7041J3565K3689N0072j4783
1495b754L0944n3675o640N3328M2404o7491M2590J8757j03599R780P146M0746
1483A1536K4791j8727j1690o7866k8777R1344K5547J580o6063N2176Q7J667j1272
1470D333K3041k369Q637j5120o0216J1095K5841L0584K2052m7956K9400j1699
$$ plain form
1458 17623 54483 63031 36412 16385 13791 17215 -82678 -78520 -22201 -75907 -76220 -28084 -38588
1445 -38588 -13896 -30690 8018 22161 -29677 -29383 -35386 -32751 39688 9873 -32442 2718 14983
1432 14983 5119 368 29547 -60032 -47881 39127 15004 1111 37855 -13051 -33891 -35218
1420 -35218 -23011 -32708 -36004 -10500 -28650 8363 17910 -37055 -35415 -30254 -71154 -33452 -29821
1407 -29821 -98780 -109001 -75420 -99809 -87910 -57603 -34824 8310 35876 -23644 -38239 -41096
1395 -41096 -7791 -4892 -45242 -57139 24240 1871 -5499 5987 -73887 -74049 -83319 -14548 -18301
1382 -18301 -17581 6910 -14700 -34179 -43393 -18554 -40140 -8640 -26318 -13824 -14005 -86320 -26838
1369 -26838 -14170 -18535 16280 8989 27026 -44830 -86452 -55633 -9298 32818 -48333 -372
$$ packed form
1458A7623L6860Q548k6619k0027k594L424r9893M158N6319n3706l13M8136j0504
1445c8588K4692j6794L8708J4143n1838K94o003K635P2439k9815m2315L5160J2265
1432A4983r864m751K9179q9579J2151Q7008k4123j3893L6744n0906k0840j327
1420c5218J2207r697l296K5504j8150L7013R547n4965J640N161m0900L7702L631
1407b9821o8959j0221L3581k4389J1899L0307K2779M3134K7566n9520j4595k857
1395d1096L3305K899m0350j1897Q1379k2369p370J1486p9874j62r270O8771l753
1382a8301P20K4491k1610j9479r214K4839k1586L1500j7678J2494j81p2315N9482
1369b6838J2668m365L4815p291J8037p1856m1622L0819M6335M2116q1151M7961
$$ plain form
1357 -372 13078 -91379 -65194 -12797 -14923 -52476 -91681 -140677 -10885 -13884 -14027 -41852 -68675
1344 -68675 -35234 -20728 -7300 -58247 -41918 9267 21177 1938 63672 41355 7039 -64512
1332 -64512 -38470 -8372 27317 15796 13884 -37641 -44623 -31184 -45678 -46387 -21726 37237 31362
1319 31362 46821 111512 102471 -659 -40916 -69122 -64425 -49604 40272 67247 40769 12202
1307 12202 4820 -39150 50029 79720 46168 5279 2884 4720 -3414 -36686 -24184 -47969 -56790
1294 -56790 -77398 -83238 -78285 -72834 -19443 -61694 -68092 -19208 4042 -18403 -30834 -47788 -47533
1281 -47533 -59797 -284 13838 -19700 -27144 -16183 -38083 -27650 -41772 -91785 -89331 -46235
1269 -46235 -26665 -21568 -56951 -8761 5771 -16015 419 -38518 -75542 -34691 82601 104188
$$ packed form
1357c72J3450j04457K6185N2397k126l7553l9205m8996J29792k999j43k7825k6823
1344f8675L3441J4506J3428n0947J6329N1185J1910j9239O1734k2317l4316p1551
1332f4512K6042L0098L5689j1521j912n1525o982J3439j4494p09K4661N8963n875
1319C1362J5459O4691r041j03130m0257k8206M697J4821Q9876K6975k6478k8567
1307A2202p382m3970Q9179K9691l3552m0889k395J836q134l3272J2502k3785q821
1294e6790k0608n840M953N451N3391m2251o398M8884K3250k2445j2431j6954K55
1281d7533j2264N9513J4122l3538p444J0961k1900J0433j4122n0013K454M3096
1269d6235J9570N097l5383M8190J4532k1786J6434l8937l7024M0851J17292K1587
$$ plain form
1257 104188 -2675 -5162 23441 -27947 -55908 -69527 -45548 8592 -14534 -45625 -58235 -43549
1245 -43549 -28899 -39360 2966 14050 -28945 -22804 -4249 -5755 -27544 14831 29398 33067
1233 33067 4074 -7707 -43984 -40583 37827 59293 3347 -55449 -45303 -9683 -65592 -67429
1221 -67429 -65633 5845 25461 2534 -27413 -10210 5784 14426 -14303 6944 2408 -16878
1209 -16878 4362 28573 8407 -4861 -13820 -15667 -19405 -54954 -25906 -13005 -10781 -6912 -3921
1196 -3921 -28124 -29807 -80794 1719 -21216 -9493 -11648 -41990 -65446 -44197 -51056 30474 3265
1183 3265 -14252 -62756 -55365 -43307 -93943 -56806 -47647 -14007 -22038 -65548 -34412 19876 24351
1170 24351 -29196 -35956 -26062 -1899 -8429 8494 34770 1381 11510 -2223 2622 -29582 8752
$$ packed form
1257A04188j06863k487K8603n1388k7961j3619K3979N4140k3126l1091j2610J4686
1245d3549J4650j0461M2326J1084m2995O141J8555j506k1789M2375J4567L669
1233C3067k8993j1781l6277L401P8410K1466n5946n8796J0146L5620n5909j837
1221f7429J796P1478J9616k2927k9947J7203J5994Q642k8729K1247m536j9286
1209a6878K1240K4211k0166j3268q959j847l738l5549K9048J2901K224L869K991
1196c921k4203j683n0987Q2513k2935J1723k155l0342k3456K1249o859Q1530k7209
1183C265j7517m8504P391J2058n0636L7137R159L3640q031m3510L1136N4288M475
1170B4351n3547o760R894K4163o530J6923K6276l3389J0129j3733M845l2204L8334
$$ plain form
1157 8752 -5030 46326 7155 -49364 -15945 -11097 -5318 -14259 -6218 -5337 -52326 -12770 -36686
1144 -36686 -74989 5763 20761 25613 6005 38811 23844 44357 13303 -16935 -13187 -23503
1132 -23503 -44705 -63570 -14075 -3833 34142 35947 -19944 -64959 -93167 -99981 -34771 -18810
1120 -18810 -91102 -49576 -12097 -34351 -41198 -40230 -25131 11127 -7047 -9591 7195 44336 48263
1107 48263 16237 -27381 -47352 -73284 -78476 -23651 2872 -44389 706 1608 -26439 -11575
1095 -11575 -17120 -39549 -33427 -19942 3605 33544 13547 52128 14579 26709 49692 -2251
1083 -2251 14379 -15715 -4108 -18664 -40789 6711 -31295 -76317 -76149 -18690 -806 26541
1071 26541 6752 30507 -9201 -19606 -7631 20024 16812 -9146 -28685 -1486 24400 23911
$$ packed form
1157H752j3782N1356l9171n6519L3419M848N779q941Q041Q81m6989L9556k3916
1144c6686l8303Q0752J4998M852j9608L2806j4967K0513l1054l0238L748j0316
1132b3503k1202j8865M9495J0242L7975J805n5891m5015k8208o814O5210J5961
1120a8810p2292M1526L7479k2254o847R68J5099L6258j8174k544J6786L7141L927
1107D8263l2026m3618j9971k5932n192N4825K6523m7261M5095R02k8047J4864
1095a1575n545k2429O122J3485K3547K9939j9997L8581l7549J2130K2983n1943
1083b251J6630l0094J1607j4556k2125M7500l8006m5022J68N7459J7884K7347
1071B6541j9789K3755l9708j0405J1975K7655l212k5958j9539K7199K5886m89
$$ plain form
1059 23911 -6068 -57504 -44543 -37568 1491 -57992 -41016 20030 69434 66105 46086 71365
1047 71365 24565 -11781 -1662 27082 -17055 -12942 -10832 -34947 -96864 -94094 -11394 -1868 3504
1034 3504 13760 56954 -9384 19794 -10277 -87657 -85856 -67639 -9983 22277 51111 34951
1022 34951 -4297 -8127 44672 16572 8701 1542 21157 30398 -12732 -61370 -37122 -74473 -60947
1009 -60947 -53082 -66880 -35973 -19341 -32228 -58070 -75934 -37929 -4078 45986 9212 -3666
997 -3666 -4153 -55186 -24476 -33757 -43428 -55306 -70297 -43066 -31004 -64790 -133973 -73496 -45202
984 -45202 -9472 -34631 -62119 -9040 50707 41232 -11149 18576 33973 5693 13933 20122 -641
971 -641 -41907 37510 52134 3069 6920 -16663 -30906 -32526 2033 -30717 -2564 -30438 -39821
$$ packed form
1059B3911k9979n1436J2961O975L9059n9483J6976O1046M9404l329k0019K5279
1047G1365m6800l6346J0119K8744m4137M113K110k4115o1917K770Q2700R526N372
1034C504J0256M3194o6338K9178l0071p7380J801J8217N7656L2260K8834j6160
1022C4951l9248l830N2799k8100p871p159J9615R241m3130m8638K4248l7351J3526
1009f0947P865j3798L0907J6632j2887k5842j7864L8005L3851N0064l6774j2878
997c666m87n1033L0710r281r671j1878j4991K7231J2062l3786o9183O0477K8294
984d5202L5730k5159k7488N3079N9747r475n2381K9725J5397k8280Q240O189k0763
971f41m1266P9417J4624m9065L851k3583j4243j620L4559l2750K8153k7874r383
$$ plain form
958 -39821 -47974 -36849 -48668 -12114 -32023 -50186 -14766 7316 7360 -42808 -75709 -18832 -106
945 -106 23192 127 -67137 -11630 -63378 -50755 -7152 15079 22200 -30453 5332 10066 18228
932 18228 -2126 52148 -5109 23351 -15255 -6926 7674 -22712 -14719 -12949 -31087 -18375 -50863
919 -50863 6881 -2056 -8584 -17601 -55718 15071 50056 52892 26944 -30681 -77016 -54335 4801
906 4801 -30528 -57356 -27079 1709 -9409 -31763 -44013 -43676 24044 53882 56078 7647 18846
893 18846 -2681 7435 -13618 21052 21375 -19964 -4301 1080 -23356 -42080 -44978 -21946 -26930
880 -26930 -35459 -6327 -14808 12280 -30384 -28749 -12460 -6437 22164 -11185 -19930 -36604 -53080
867 -53080 -18578 1857 -18282 -15157 23267 -38001 -53775 -34285 2203 47021 23852 -5374
$$ packed form
958c9821q153J1125j1819L6554j9909j8163L5420K2082M4n0168l2901N6877J8726
945a06K3298k3065o7264N5507n1748J2623M3603K2231P121n2653L5785M734Q162
932A8228k0354N4274n7257K8460l8606Q329J4600l0386P993J770j8138J2712l2488
919e0863N7744q937o528r017l8117P0789L4985K836k5948n7625m6335K2681N9136
906D801l5329k6828L0277K8788j1118k2354j2250L37O7720K9838K196m8431J1199
893A8846k1527J0116k1053L4670L23m1339J5663N381k4436j8724k898K3032m984
880b6930q529K9132q481K7088m2664J635J6289O023K8601l3349q745j6674j6476
867e3080L4502K0435k0139L125L8424o1268j5774J9490L6488M4818k3169k9226
$$ plain form
855 -5374 -26542 37548 16058 12664 41979 47984 27938 -42235 -53842 -4364 -5787 19271 54314
842 54314 25389 1317 28131 -26217 -46416 -3885 56357 -48898 -49525 -49451 -1899 11925 20768
829 20768 -4783 3668 5269 30268 18010 11191 25968 49866 -16029 -11146 26605 27456 44792
816 44792 -18282 28655 7412 7853 -16757 -6105 -49629 -22325 -11176 29330 26767 -28086 -59164
803 -59164 -63064 -25646 -55649 -29328 -90318 -45291 -67806 -30311 24462 13226 -11463 -68243
791 -68243 -34372 -45740 -25087 9814 -16565 -14793 21439 76621 13263 20051 31943 12008
779 12008 13603 -22104 -42912 -67313 -97691 -36108 50563 -1796 -4521 -19700 -10367 -6803 -55603
766 -55603 -21898 50492 -13907 -7856 16080 62423 8915 -11239 -23442 6446 30147 70825
$$ packed form
855e374k1168O4090k1490l394K9315O005k0046p0173j1607M9478j423K5058L5043
842E4314k8925k4072K6814n4348k0199M2531O0242j05255o27P4M7552J3824Q843
829B0768k5551Q451J601K4999j2258o819J4777K3898o5895M883L7751Q51J7336
816D4792o3074M6937k1243M41k4610J0652m3524K7304J1149M0506k563n4853l1078
803e9164l900L7418l0003K6321o0990M5027k2515L7495N4773j1236k4689n6780
791f8243L3871j1368K0653L4901k6379J772L6232N5182o3358O788J1892j9935
779A2008J595l5707k0808k4401l0378O1583Q6671n2359k725j5179R333L564m8800
766e5603L3705P2390o4399O051K3936M6343n3508k0154j2203K9888K3701M0678
$$ plain form
754 70825 7306 -34121 -23115 -35855 -28804 -73061 -49709 -77256 -62180 -1445 -21576 -29667
742 -29667 11303 9089 -23701 -15137 -29917 25343 -3965 -22274 -16228 -79481 -53595 8978 74331
729 74331 38931 29310 31203 -21360 42311 21898 32190 24838 26936 -71314 -63969 25085 15394
716 15394 27928 28585 4269 -29651 -25840 -38168 11938 -4716 -78209 -36405 2543 -5194 -20127
703 -20127 -5110 -48409 -48202 -20350 -5352 -8904 -50584 -66668 -71453 -34633 -30161 -50757 -31418
690 -31418 24080 28572 23106 4079 -50057 -557 -33290 -7892 12484 -16333 -27203 -23769 23197
677 23197 34013 -27022 -16974 74570 13941 -17603 9629 7255 -24795 2152 6206 7141 -52692
664 -52692 -3860 12110 11042 17985 -17504 -25670 7234 25352 21447 21032 81079 42109 1406
$$ packed form
754G0825o3519m1427J1006j2740P051m4257K3352k7547J5076O0735k0131q091
742b9667M0970k214l2790Q564j4780N5260k9308j8309O046o3253K5886O2573O5353
729G4331l5400r621J893n2563O3671k0413J0292p352K098r8250P345Q9054r691
716A5394J2534O57k4316l3920L811j2328N0106j6654p3493M1804L8948p737j4933
703b0127J5017m3299K07K7852J4998l552m1680j6084m785L6820M472k0596J9339
690c1418N5498M492n466j9027n4136M9500l2733K5398K0376k8817j0870L434M6966
677B3197J0816o1035J0048R1544o0629l1544K7232k374l2050K6947M054R35n9833
664e2692M8832J5970j068O943l5489q166L2904J8118l905m15O0047l8970m0703
$$ plain form
651 1406 19635 26757 -4170 4994 34594 -11240 13564 30308 20063 58043 12590 21802 24595
638 24595 9927 22740 82990 29853 42027 27554 -37714 -12910 452 9964 28495 27643 -13059
625 -13059 13861 -2137 -58938 6597 35722 40529 10339 -16005 41727 26122 28019 28175 20765
612 20765 37321 -27478 -33338 10588 -36399 3643 46513 12874 20220 11090 32040 17481 33540
599 33540 55517 -51779 -36221 31192 65067 81279 69227 67876 23193 12062 -15751 -22779
587 -22779 -37911 31681 57965 -25673 -4445 -29581 6994 -17863 -19699 -2095 -17308 -7816
575 -7816 -31064 -81211 -55772 -21042 -50558 -47467 -30708 -41781 13641 4575 -5420 -19623 6238
562 6238 18640 16902 -7363 -61724 -36083 -54740 -41120 -39438 -7356 18971 6152 94000 57608
$$ packed form
651A406J8229P122l0927R164K9600m5834K4804J6744j0245L7980m5453R212K793
638B4595j4668J2813O0250n3137J2174j4473o5268K4804J3362R512J8531q52m0702
625a3059K6920j5998n6801O5535K9125M807l0190k6344N7732j5605J897J56p410
612B0765J6556o4799n860M3926m6987M0042M2870l3639P346r130K0950j4559J6059
599C3540K1977j07296J5558O7413L3875J6212j2052j351m4683j1131k7813p028
587b2779j5132O9592K6284q3638K1228k5136L6575k4857j836J7604j5213R492
575g816k3248n0147K5439L4730k9516L091J6759j1073N5422r066r995j4203K5861
562F238J2402j738k4265n4361K5641j8657J3620J682L2082K6327j2819Q7848l6392
$$ plain form
549 57608 33007 42997 -3012 37947 -41412 -35414 32605 89955 44747 21700 48874 -50165
537 -50165 -25219 -38688 73932 54278 -15940 -32525 5840 -10475 -29402 3162 36333 30637
525 30637 67084 63525 -10051 29421 13710 7434 -17182 -20708 8421 34945 38114 35354 -90
512 -90 -46723 -17614 40071 18838 56385 21599 -14528 10809 29469 -13204 34132 49341 -10516
499 -10516 -22799 4128 17680 75903 37515 21112 28560 37341 13337 -31355 35570 -11485
487 -11485 15117 -7622 158 -16299 -41215 -24937 4288 -8199 333 34662 68296 60627 62083
474 62083 35042 36388 70419 70941 59593 47589 13333 -38940 -10132 -28430 1763 46601 50169
461 50169 -11288 8633 28832 20140 -21078 -7495 -17244 -25494 12049 24298 58852 61239 47120
$$ packed form
549E7608k4601R990m6009M0959p9359N998O8019N7350m5208k3047K7174r9039
537e0165K4946j3469J12620j9654p0218j6585L8365j6315j8927L2564L3171n696
525C0637L6447l559p3576L9472j5711o276k4616l526K9129K6524L169k760l5444
512i0m6633K9109N7685k1233L7547l4786l6127K5337J8660m2673M7336J5209n9857
499a0516j2283K6927J3552N8223l8388j6403P448Q781k4004m4692O6925m7055
487a1485K6602k2739P780j6457k4916J6278K9225j2487Q532L4329L3634p669J456
474F2083k7041J346L4031N22j1348j2004l4256n2273K8808j8298L0193M4838L568
461E0169o1457J9921K0199q692m1218J3583r749q250L7543J2249L4554K387j4119
$$ plain form
448 47120 -33848 -30483 6478 -2348 -47292 -34370 -32237 2595 2239 -21038 15609 4398 -15248
435 -15248 -3264 53495 37044 33269 -8472 16009 3821 28317 39759 26683 36621 19766
423 19766 70512 11571 -18515 -52998 -18851 25399 8711 13569 3916 -5142 -16221 16414 65184
410 65184 92594 67513 64366 82696 71623 64521 78513 94175 105773 50180 53858 88109 51522
397 51522 56197 36851 54420 89163 59717 36616 1215 -52940 5141 17228 37583 56773
385 56773 26831 62287 68342 36582 44824 47053 28150 42067 60360 81309 16616 15018 93562
372 93562 81958 42707 58211 28033 91995 126382 106704 74650 39683 60711 58053 49990
360 49990 58664 63388 43959 77427 79432 33921 48213 93993 120718 30068 6360 41979 89842
$$ packed form
448D7120q0968L365L6961q826m4944J2922K133L4832l56k3277L6647j1211j9646
435a5248J1984N6759j6451l775m1741K4481j2188K4496J1442j3076R938j6855
423A9766N0746n8941l0086l4483L4147M4250j6688M858r653r058j1079L2635M8770
410F5184K7410k5081l147J8330j1073p102J3992J5662J1598n5593L678L4251l6587
397E1522M675j9346J7569L4743k9446k3101l5401n4155N8081J2087K0355J9190
385E6773k9942L5456O055l1760Q242K229j8903J3917J8293K0949o4693j598P8544
372I3562j1604l9251J5504l0178O3962L4387j9678l2054l4967K1028k658q063
360D9990Q674M724j9429L3468K005m5511J4292M5780K6725r0650k3708L5619M7863
$$ plain form
347 89842 133085 108963 50976 31822 30669 22620 35206 33937 63612 81081 41034 34517 19237
334 19237 -61030 -1236 81159 108985 32413 49501 60596 31437 32633 11836 26626 22636
322 22636 49036 97587 117399 100638 104510 72019 90031 106328 95638 66944 34142 33721 77397
309 77397 91588 100761 78649 53189 38492 77407 33848 109719 151034 134388 96719 81074
297 81074 73262 78627 92385 112325 121852 78842 47902 2509 37346 22382 24408 9305 69859
284 69859 31957 21398 58465 56042 71743 96445 86643 60565 65415 98697 79860 97900 53040
271 53040 49005 36656 75086 69273 42865 35652 46809 27236 22512 98262 88206 53281 110984
258 110984 116457 109523 111041 97604 43419 40332 82002 103639 54650 51533 63461 64759 90876
$$ packed form
347H9842M3243k4122n7987j9154j153q049J2586j269K9675J7469m0047o517j5280
334A9237q0267N9794Q2395K7826p6572J7088J1095k9159J196k0797J4790l990
322B2636K6400M8551J9812j6761L872l2491J8012J6297j0690k8694l2802m21M3676
309G7397J4191R173k2112k5460j4697L8915m3559P5871M1315j6646l7669j5645
297H1074p812N365J3758J9940R527m3010l0940m5393L4837j4964K026j5103O0554
284F9859l7902j0559L7067k423J5701K4702r802k6078M850L3282j8837J8040m4860
271E3040m035j2349L8430n813k6408p213J1157j9573m724P5750j0056l4925N7703
258A10984N473o934J518j3437n4185l087M1670K1637m8989l117J1928J298K6117
$$ plain form
245 90876 71481 57623 79399 117487 67820 30842 40370 84488 92268 77918 86490 107853 53298
232 53298 9663 36997 96611 103845 41324 76513 62115 29727 42192 122778 100260 80866
220 80866 74094 81643 33444 28993 74930 91089 42564 935 18887 -16881 69883 69445 89394
207 89394 75119 49634 35757 88112 116616 94377 52599 65383 76324 96129 62094 53468
195 53468 104791 98529 74962 67706 98315 80969 45714 87846 59044 49517 52490 62772 86639
182 86639 63688 86625 83710 38224 56358 26198 51608 127514 95995 54135 35827 26182
170 26182 58346 58155 84184 49067 107724 105232 99248 97697 72946 78818 71579 71105 38020 61998
156 61998 83183 48969 15600 65321 96780 77338 24798 29839 40089 45502 89575 64183
$$ packed form
245I0876j9395j3858K1776L8088m9667l6978R528M4118P780j4350Q572K1363n4555
232E3298m3635K7334N9614P234o2521L5189j4398l2388J2465Q0586k2518j9394
220H0866o772P549m8199m451M5937J6159m8525m1629J7952l5768Q6764m38J9949
207H9394j4275k5485j3877N2355K8504k2239m1778J2784J0941J9805l4035q626
195E3468N1323o262k3567p256L0609j7346l5255M2132k8802r527K973J0282K3867
182H6639k2951K2937k915m5486J8134l0160K5410P5906l1519m1860j8308r645
170B6182L2164j91K6029l5117N8657k492n984j551k4751N872p239m74l3085K3978
156F1998K1185l4214l3369M9721L1459j9442n2540N041J0250N413M4073k5392
$$ plain form
144 64183 52332 88583 116309 95399 106394 98516 90179 76942 93717 67261 93101 86396 99887
131 99887 140243 88386 47826 89462 44630 79806 138541 123325 87441 48646 35244 15902
119 15902 36807 68545 102431 70599 92049 121378 86715 44162 60962 80004 80948 61605
107 61605 101346 59421 59476 33162 36207 66242 114248 93486 97048 80026 61060 52011 88473
94 88473 122758 113601 81288 54921 108461 135581 113994 89985 101356 57999 28359 76829
82 76829 76195 66379 83635 137496 97257 110667 97295 67182 89987 66947 62838 53913 74414
69 74414 93665 87427 105493 104522 105520 92561 142178 139794 85008 30505 68083 88352 77851
56 77851 82201 87090 74362 81696 57525 74828 99638 106417 77634 69611 51579 51909 99108 70013
$$ packed form
144F4183j1851L6251K7726k0910J0995p878q337j3237J6775k6456K5840o705J3491
131I9887M0356n1857m0560M1636m4832L5176N8735j5216l5884l8795j3402j9342
119A5902K0905L1738L3886l1832K1450K9329l4663m2553J6800J9042R44j9343
107F1605L9741m1925N5k6314L045L0035M8006k0762L562j7022j8966r049L6462
94H8473L4285r157l2313k6367N3540K7120k1587k4009J1371m3357k9640M8470
82G6829o34r816J7256N3861m0239J3410j3372l0113K2805k3040m109q925K0501
69G4414J9251o238J8066r71R98j2959M9617k384n4786n4503L7578K0269j0501
56G7851M350M889j2728P334k4171J7303K4810O779k8783q023j8032L30M7199k9095
$$ plain form
42 70013 74259 88820 61719 91127 112997 127955 87507 91970 78689 53983 72076 94346 84496
29 84496 56333 44215 46897 89679 36092 50038 70436 56726 25501 40123 54172 86639
17 86639 63769 103720 113157 115017 130160 126064 93568 58400 82588 100233 97287 107437 86822
4 86822 100577 103898 105074 75805
$$ packed form
42G0013M246J4561k7101K9408K1870J4958m0448M463j3281k4706J8093K2270r850
29H4496k8163j2118K682M2782n3587J3946K0398j3710l1225J4622J4049L2467
17H6639k2870L9951R437J860J5143m096l2496l5168K4188J7645k946J0150k0615
4H6822J3755L321J176k9269
$$ [...]
##END NTUPLES=NMR SPECTRUM
##END=
