##TITLE=1H_CG-1150-D7
 CDCl3,8 sc, 
 3.9.2021
##JCAMPDX= 6.0         $$ Bruker NMR JCAMP-DX V2.0
##DATA TYPE= NMR SPECTRUM
##DATA CLASS= NTUPLES
##ORIGIN= UXNMR, Bruker Analytische Messtechnik GmbH
##OWNER= root
$$ XWIN-NMR		Version 3.5
$$ Fri Sep  3 10:14:28 2021 Russian Standard Time (UT+4h)  she@DPX200
##.OBSERVE FREQUENCY= 200.1313
##.OBSERVE NUCLEUS= ^1H
##.ACQUISITION MODE= SIMULTANEOUS
##.ACQUISITION SCHEME= undefined
##.AVERAGES= 8
##.DIGITISER RES= 18
##SPECTROMETER/DATA SYSTEM= spect
##.PULSE SEQUENCE= zg30
##.SOLVENT NAME= CDCl3
##.SHIFT REFERENCE= (INTERNAL, CDCl3, 0, 16.472)
##AUDIT TRAIL= $$ (NUMBER, WHEN, WHO, WHERE, WHAT)
$$ ##TITLE= Audit trail, XWIN-NMR		Version 3.5
$$ ##JCAMPDX= 5.01
$$ ##ORIGIN= Bruker BioSpin GmbH
$$ ##OWNER= she
$$ F:/spectra/data/she/nmr/H-F/1/pdata/1/auditp.txt
$$ ##AUDIT TRAIL=  $$ (NUMBER, WHEN, WHO, WHERE, WHAT)
(   1,<2021-09-03 10:13:09.84 +0400>,<she>,<DPX200>,
      <created by zg, POWCHK disabled, PULCHK disabled
       configuration hash MD5:
       00 E9 B6 7A A2 85 ED C7 34 08 36 98 17 FE 4E 26
       data hash MD5: 16K
       2C 53 8A 3D BB DC 0B 97 F0 7B 24 9C 6F DA 1C 84>)
(   2,<2021-09-03 10:13:12.43 +0400>,<she>,<DPX200>,
      <Start of raw data processing
       efp BC_mod = 2 LB = 0.24 FT_mod = 6 PKNL = 1 PHC0 = -13797.29 PHC1 = 14.20097 SI = 16K 
       data hash MD5: 16K
       6B 12 38 CC E7 53 C5 6B 4D 86 83 69 C5 4F 7C 20>)
(   3,<2021-09-03 10:13:35.20 +0400>,<she>,<DPX200>,
      <pk PHC0 = 80.5878 PHC1 = 1.599999 
       data hash MD5: 16K
       18 BF DB 44 B7 46 A7 66 F8 16 18 8D 2E 51 82 E6>)
(   4,<2021-09-03 10:13:38.28 +0400>,<she>,<DPX200>,
      <abs ABSG = 5 
       data hash MD5: 16K
       A0 7E 9B CD 11 EC AC B2 ED 09 7C CC C3 8E 67 03>)
$$ ##END=
$$ 
$$ hash MD5
$$ 2D 3A D9 8E FF 9D 86 E8 BA C1 D2 FE 4F 6A AF 38
##$RELAX= 
##$RELAX= 
##$RELAX= 
##$RELAX= 
##$RELAX= 
##$RELAX= 
$$ Bruker specific parameters
$$ --------------------------
##$DU= <F:/spectra>
##$EXPNO= 1
##$NAME= <H-F>
##$PROCNO= 1
##$TYPE= <nmr>
##$USER= <she>
##$AMP= (0..31)
100 100 100 100 100 100 100 100 100 100 100 100 100 100 100 100 100 100 
100 100 100 100 100 100 100 100 100 100 100 100 100 100 
##$AQSEQ= 0
##$AQ_mod= 1
##$AUNM= <au_zg>
##$AUTOPOS= <>
##$BF1= 200.13
##$BF2= 200.13
##$BF3= 200.13
##$BF4= 200.13
##$BF5= 200.13
##$BF6= 200.13
##$BF7= 200.13
##$BF8= 200.13
##$BYTORDA= 1
##$CFDGTYP= 0
##$CFRGTYP= 5
##$CHEMSTR= <none>
##$CNST= (0..31)
1 1 145 1 1 1 1 1 1 1 1 1 1 1 1 1 1 1 1 1 1 1 1 1 1 1 1 1 1 1 1 1 
##$CPDPRG= <>
##$CPDPRG1= <>
##$CPDPRG2= <>
##$CPDPRG3= <>
##$CPDPRG4= <mlev>
##$CPDPRG5= <mlev>
##$CPDPRG6= <mlev>
##$CPDPRG7= <mlev>
##$CPDPRG8= <mlev>
##$CPDPRGB= <>
##$CPDPRGT= <>
##$D= (0..31)
0 1.2 0 0 0 0 0 0 0 0.06 0 0.03 0 0 0 0 0.0002 0 0 0 0 0 0 0 0 0 0 0 0 
0 0 0 
##$DATE= 1630649589
##$DBL= (0..7)
120 120 120 120 120 120 120 120 
##$DBP= (0..7)
150 150 150 150 150 150 150 150 
##$DBP07= 0
##$DBPNAM0= <>
##$DBPNAM1= <>
##$DBPNAM2= <>
##$DBPNAM3= <>
##$DBPNAM4= <>
$$ [...]
##$SUBNAM3= <"">
##$SUBNAM4= <"">
##$SUBNAM5= <"">
##$SUBNAM6= <"">
##$SUBNAM7= <"">
##$SUBNAM8= <"">
##$SUBNAM9= <"">
##$SW= 20.0189088683792
##$SWIBOX= (0..15)
0 0 2 0 0 0 0 0 0 0 0 0 0 0 0 0 
##$SW_h= 4006.41025641026
##$TD= 16384
##$TD0= 1
##$TE= 0
##$TE2= 300
##$TE3= 300
##$TEG= 300
##$TL= (0..7)
0 120 120 120 120 120 120 120 
##$TP= (0..7)
150 150 150 150 150 150 150 150 
##$TP07= 0
##$TPNAME0= <>
##$TPNAME1= <>
##$TPNAME2= <>
##$TPNAME3= <>
##$TPNAME4= <>
##$TPNAME5= <>
##$TPNAME6= <>
##$TPNAME7= <>
##$TPOAL= (0..7)
0.5 0.5 0.5 0.5 0.5 0.5 0.5 0.5 
##$TPOFFS= (0..7)
0 0 0 0 0 0 0 0 
##$TUNHIN= 0
##$TUNHOUT= 0
##$TUNXOUT= 0
##$USERA1= <user>
##$USERA2= <user>
##$USERA3= <user>
##$USERA4= <user>
##$USERA5= <user>
##$V9= 5
##$VALIST= <valist>
##$VCLIST= <CCCCCCCCCCCCCCC>
##$VD= 0
##$VDLIST= <DDDDDDDDDDDDDDD>
##$VPLIST= <PPPPPPPPPPPPPPP>
##$VTLIST= <TTTTTTTTTTTTTTT>
##$WBST= 1024
##$WBSW= 4
##$XGAIN= (0..3)
0 0 0 0 
##$XL= 0
##$YL= 0
##$YMAX_a= 403302
##$YMIN_a= -476504
##$ZGOPTNS= <>
##$ZL1= 120
##$ZL2= 120
##$ZL3= 120
##$ZL4= 120
##$ABSF1= 16.48418
##$ABSF2= -3.534859
##$ABSG= 5
##$ABSL= 3
##$ALPHA= 0
##$AQORDER= 0
##$ASSFAC= 0
##$ASSFACI= 0
##$ASSFACX= 0
##$ASSWID= 0
##$AUNMP= <proc_1d>
##$AZFE= 0.1
##$AZFW= 0.1
##$BCFW= 0
##$BC_mod= 2
##$BYTORDP= 0
##$COROFFS= 0
##$CY= -3
##$DATMOD= 1
##$DC= 0
##$DFILT= <>
##$DTYPP= 0
##$F1P= 0
##$F2P= 0
##$FCOR= 1
##$FTSIZE= 16384
##$FT_mod= 6
##$GAMMA= 0
##$GB= 0
##$INTBC= 1
##$INTSCL= 1.334414e-10
##$ISEN= 128
##$LB= 0.24
##$LEV0= 0
##$LPBIN= 0
##$MAXI= 10000
##$MC2= 0
##$MEAN= 0
##$ME_mod= 0
##$MI= 1.114404
##$NCOEF= 0
##$NC_proc= -7
##$NLEV= 6
##$NOISF1= 3.799351
##$NOISF2= 2.8
##$NSP= 0
##$NTH_PI= 0
##$NZP= 0
##$OFFSET= 16.47196
##$PC= 1
##$PHC0= -13716.7
##$PHC1= 15.80097
##$PH_mod= 1
##$PKNL= yes
##$PPARMOD= 0
##$PSCAL= 0
##$PSIGN= 0
##$REVERSE= no
##$SF= 200.130006670944
##$SI= 16384
##$SIGF1= 3
##$SIGF2= 2
##$SINO= 5.538805
##$SIOLD= 16384
##$SREGLST= <1H.CDCl3>
##$SSB= 0
##$STSI= 16384
##$STSR= 0
##$SW_p= 4006.41025641026
##$SYMM= 0
##$S_DEV= 0
##$TDeff= 16384
##$TDoff= 0
##$TI= <>
##$TILT= no
##$TM1= 0
##$TM2= 0
##$TOPLEV= 0
##$USERP1= <user>
##$USERP2= <user>
##$USERP3= <user>
##$USERP4= <user>
##$USERP5= <user>
##$WDW= 1
##$XDIM= 16384
##$YMAX_p= 535868039
##$YMIN_p= -1511175
$$ End of Bruker specific parameters
$$ ---------------------------------
##NTUPLES= NMR SPECTRUM
##VAR_NAME=  FREQUENCY,     SPECTRUM/REAL,   SPECTRUM/IMAG
##SYMBOL=    X,             R,               I
##VAR_TYPE=  INDEPENDENT,   DEPENDENT,       DEPENDENT
##VAR_FORM=  AFFN,          ASDF,            ASDF
##VAR_DIM=   16384,         16384,           16384
##UNITS=     HZ,            ARBITRARY UNITS, ARBITRARY UNITS
##FACTOR=    0.24454680195387, 1,            1
##FIRST=     3296.53347824214, 0,            0
##LAST=      -709.876778168125, 0,           0
##MIN=       -709.876778168125, -1511175,    0
##MAX=       3296.53347824214, 535868039,    0
$$ Real data points
##PAGE= N=1
##DATA TABLE= (X++(R..R)), XYDATA
$$ [...]
6369A47681l4224J66418Q0143j59185Q7850j30086N6265K0627M0455R9729K3856
6358C99529k1472N5180O1951j0961j36495o2875j85750K501J73924p6439j22944
6347G6149J82712L3243O622k0303k28685P6217J09234o5053r8023K16637N8226
6336C46976m7117J06583j72149r4900K21458k34779j17025J46931J42994r0495
6326B08477O1559j58641m7246J11249N250J8911M2785K1589P9337j14770k4774
6315B03726K55451M2304j39951K2060l1480J22367J13638P697j15245J78289k5745
6304F33111k8860j84702k08213J32892J2574J54942r3360K0445j20038J43546
6294D62337j23415j58430k5724J10219N0522M4368l5079k46353K9219M11766K46839
$$ plain form
6369 147681 113457 279875 360018 200833 288683 158597 214862 235489 275944 375673 399529
6358 399529 378057 433237 495188 484227 347732 284857 99107 101608 275532 199093 76149
6347 76149 258861 292104 298726 278423 49738 125955 235189 170136 72113 288750 346976
6336 346976 299859 406442 234293 139393 360851 126072 9047 155978 298972 208477
6326 208477 270036 111395 64149 175398 180648 199559 242344 263933 343270 228500 203726
6315 203726 459177 501481 361530 383590 352110 474477 588115 595812 480567 658856 633111
6304 633111 604251 419549 211336 344228 356802 511744 418384 438829 318791 462337
6294 462337 338922 180492 154768 264987 315509 359877 324798 78445 107664 519430 766269
6283G66269l87964o0634N928j37781L34057j07244Q7724k294o6833o1670n7687
6272C11871K58919M1684N2204N2467k01358m5036M5335K68129Q8248J29006m7716
6261I53753j08819k10354K9734J27407J25611j12375K15616J18055l38712K33197
6251A033113J14129P2516J98029N047J28601R0718K86835N39698K79221L17544
6241C065451M61487L96566M83003P19534L63981L92050L85711O90079P49368l17528
6231G389702q01670q45006j194165q21170o09889n61006j37969m3012k21669q132
6221B146014k55840k9102j5917K0458J91758J29983k10850J83493K87178J30130
6211B577305J35327J02868k58357l57192l01752j09740j41581j34632k86108q2355
$$ plain form
6283 766269 378305 317671 323599 185818 519875 412631 500355 498061 431228 369558 311871
6272 311871 570790 612474 664678 717145 515787 470751 516086 784215 872463 1001469 953753
6261 953753 844934 634580 664314 791721 917332 804957 1020573 1138628 799916 1033113
6251 1033113 1147242 1219758 1417787 1422834 1551435 1642153 1928988 2468686 2747907 3065451
6241 3065451 3526938 3923504 4406507 5126041 5490022 5882072 6267783 6957862 7707230 7389702
6231 7389702 6588032 5743026 4548861 3727691 3117802 2556796 2418827 2375815 2154146 2146014
6221 2146014 1890174 1861072 1845155 1865613 2057371 2187354 1976504 2159997 2447175 2577305
6211 2577305 2712632 2815500 2557143 2199951 1898199 1788459 1646878 1512246 1226138 1143783
6201A143783j7951q496P618j62723L5544j30714k76589q5912j1826j27408k2515
6190C42811J62756P7308l8396o13M3038J13556k41339j11613j51818L6383J41462
6179C73535J19325J3387Q6103K0645n9020j43358j04151j81466L17466k39306
6169B03160l4556K139n6164P6876Q4621K8867n9041J48398k59455L40196l1193
6158D43848k5422k65896J86049J76560j14621Q1699k823j75623K7210J18617j2382
6147D37216o5703J45817J10168k72806K53306j89084j76284J87991M0920O8087
6137E39628o3494M1957o1596J15052M141P349j59726p9726M4039p1587R3406k67632
6125A41811J86014K9809j17085M4542n4448L8355K02768P1105K00472n623k27523
$$ plain form
6201 1143783 1125832 1117336 1124954 962231 997775 867061 590472 504560 492734 365326 342811
6190 342811 505567 582875 544479 543866 586904 700460 459121 347508 195690 232073 373535
6179 373535 492860 506247 592350 612995 553975 410617 306466 125000 442466 203160
6169 203160 168604 170743 114579 191455 276076 304943 245902 394300 134845 475041 443848
6158 443848 418426 152530 338579 515139 400518 482217 479394 303771 330981 449598 437216
6147 437216 371513 517330 627498 354692 607998 418914 242630 430621 471541 539628
6137 539628 476134 518091 456495 571547 575688 583037 423311 343585 387624 316037 409443 141811
6125 141811 327825 357634 240549 285091 230643 268998 471766 542871 743343 737720 510197
6114E10197j72406P8785q3386K9762l930m0492n8466K8840J23587L0989k4636
6103D18844j40895m7960L03646J1303J50595j77574k25003J15993P7192J02976
6093E89117k53156L41657k10724j53877L49828Q8069k06761Q3433J27285j07458
6083F47413l6533o8053R0329J48601K09689j05790j62734L94549l06488J25090
6073I36073L6725k07326j73142K17734N05559r9727j40433j59572J86238l5901
6063A066228k5288L03735K90589M8620l495O8655O8513N2206m5687q1445J41829
6052A884460K08567J12775K31539K14231L24626J49983J69825K96094J49481K8035
6042C769616R678n86392m56508J66491o51993k56867l6770p9788K50701m6153
$$ plain form
6114 510197 337791 416576 333190 362952 359022 318530 260064 288904 412491 443480 418844
6103 418844 277949 229989 533635 544938 695533 517959 292956 408949 486141 589117
6093 589117 335961 677618 466894 313017 662845 750914 544153 627586 754871 647413
6083 647413 610880 542827 633156 781757 991446 885656 722922 1117471 810983 936073
6073 936073 972798 765472 592330 810064 1315623 1215896 1075463 915891 1102129 1066228
6063 1066228 1040940 1344675 1635264 1683884 1680389 1749044 1817557 1869763 1824076 1742631 1884460
6052 1884460 2093027 2205802 2437341 2651572 2976198 3126181 3296006 3592100 3741581 3769616
6042 3769616 3779294 3192902 2736394 2902885 2250892 1994025 1957255 1877467 2128168 2082015
6032B082015J16876P2038j87686k01345l9731L72144J07262J22229p422R7593
6022B533973J84487J54362M01291J59496r919O08740N07267K28469Q44222Q84759
6012F497147R31159Q21877N42991O42326J003472Q97187M20815q60450j964821
6003H931703j700209j558986j078650o06306m41091p1846k76866l09564j52406
5994B735779m20434j31219Q5099O8038o8146Q8204J63178K19539K45724J08874
5984C094636M69674j32853P7578M20723K05827k97035n04264k09344k43117k23156
5974B658669l36271k45007k52220j50857J36449j24908k86146k8169o0591j30057
5964A180892n7690j97001p8775R8958P0011J07891j73273q6330k8042j16252J01060
$$ plain form
6032 2082015 2198891 2270929 2083243 1881898 1842167 2214311 2321573 2443802 2436380 2533973
6022 2533973 2718460 2872822 3274113 3433609 3423690 4032430 4539697 4768166 5612388 6497147
6012 6497147 7428306 8250183 8793174 9435500 10438972 11336159 11756974 10896524 8931703
6003 8931703 7231494 5672508 4593858 3987552 3546461 3474615 3197749 2888185 2735779
5994 2735779 2315345 2184126 2269225 2337263 2269117 2357321 2520499 2740038 2985762 3094636
5984 3094636 3564310 3431457 3509035 3929758 4135585 3838550 3334286 3124942 2881825 2658669
5974 2658669 2322398 2077391 1825171 1674314 1810763 1685855 1399709 1371540 1310949 1180892
5964 1180892 1123202 926201 847426 946384 1016395 1124286 951013 864683 836641 720389 821449
5953H21449P224J51484J16700P4143q1721o9723j05618l99579r4348N05008M02478
5942A327497l5903j22411q7580l8277j4558j57211j73074Q1101N1126r7994J27075
5931H59791o5940k36577K9066J0892J6771m5835j5707m2765M74379K386j84661
5920H01800J2538o2055N0314J26151M3479k53169O1018L7454J2966N1152o2126
5909H19522J50883K2673k09659J1525j07071m6200J04913L168J3425O6460j04952
5898G24687M0660J7973r6594j8159J54724J34748j85310p8351r8545j03596R2532
5887E84769M7692J23755j8146R7108O0338j59387p5457K26721J28424l11835Q3522
5876G87504Q2881n5946j1366j04355m4087Q5820L9250j85336Q4840m3311j89817
$$ plain form
5953 821449 828673 980157 1096857 1171000 1089279 1019556 913938 514359 420011 925019 1327497
5942 1327497 1291594 1169183 1081603 1043326 1028768 871557 698483 779584 830710 732716 859791
5931 859791 793851 557274 586340 597232 614003 568168 552461 509696 984075 986461 801800
5920 801800 814338 752283 802597 928748 972227 719058 780076 817530 830496 881648 819522
5909 819522 970405 993078 783419 794944 687873 641673 746586 749754 763179 829639 724687
5898 724687 765347 783320 686726 668567 823291 958039 772729 694378 595833 492237 584769
5887 584769 632461 756216 738070 835178 895516 736129 660672 887393 1015817 703982 787504
5876 787504 870385 814439 803073 698718 654631 740451 779701 594365 679205 635894 446077
5865D46077m461K17672L8560k4042P8902L5752R2966k8767p8902n405j20587J73302
5853H21067M4071k5293O9234K5808k35533k40025q4984J45947L518j19821P5945
5842D79934P3270L23143j93130J37029o0340p0583p9857J36692R9473m4001j70937
5831F30693K1738K82196p7797n3992j03496J37479J3647j17359P06j80312j60535
5820C92968J29348K81218o8545J11m3766j47509j8491J56844M276J80699j53716
5809G13437j145M8610n2990K157L5852J30351k18098M8314K84359J8636j41898
5798H67585q0280R5748J47570L0098j6834k11323J16605J07595j11493J5916J32490
5787A093677n0522M9191J03670K3027J6257j7550l72759N986N1038m3761N1393
$$ plain form
5865 446077 441616 659288 697848 673806 752708 788460 881426 852659 773757 768352 647765 821067
5853 821067 865138 839845 909079 934887 699354 459329 374345 520292 523810 403989 479934
5842 479934 553204 876347 683217 820246 759906 689323 609466 746158 845631 801630 630693
5831 630693 652431 934627 856830 802838 699342 836821 850468 733109 733815 553503 392968
5820 392968 522316 803534 734989 735100 691334 543825 525334 682178 686454 867153 713437
5809 713437 712292 760902 707912 710069 745921 876272 658174 706488 990847 1009483 867585
5798 867585 787305 883053 1030623 1060721 1043887 832564 949169 1056764 945271 961187 1093677
5787 1093677 1043155 1092346 1196016 1219043 1235300 1217750 844991 850977 902015 858254 909647
5776I09647j14161l1876o4332J57192J49576o4417m1740L1197K40893k1142J71403
5765A322240k64158j24380q0885k2895J95361K05738K5416o2270m199J0195N4823
5754A254986j99216M091L08342j25969r7128K60829l37136M8041J56737R1311
5744A364888k8243J5279J25226j14872J677J36243O0001Q2439j71903j39855n1202
5733A279678K31940n8406K60612L82302J40951K86138R7950J62113J58296K95471
5723C237045J56686J12043K61472K38649K5431n65765m49742o95394m85775j17583
5713A717067k47561m7753p72j09262n6383J61430L3935M7174l7324J00330l28270
5702A232611J03307p9421J93081q8564k19886J47386p6781L5110o1010j03628
$$ plain form
5776 909647 795486 763610 699278 856470 1006046 941629 899889 931086 1171979 1150837 1322240
5765 1322240 1058082 933702 852817 829922 1025283 1231021 1256437 1194167 1189968 1200163 1254986
5754 1254986 1055770 1059861 1368203 1242234 1145106 1405935 1068799 1116840 1273577 1364888
5744 1364888 1336645 1351924 1477150 1362278 1363955 1500198 1560199 1642638 1470735 1330880 1279678
5733 1279678 1511618 1453212 1713824 2096126 2237077 2523215 2621165 2783278 2941574 3237045
5723 3237045 3393731 3505774 3767246 4005895 4031326 3465561 3015819 2320425 1834650 1717067
5713 1717067 1469506 1421753 1420981 1311719 1255336 1416766 1450701 1497875 1460551 1560881 1232611
5702 1232611 1335918 1256497 1449578 1361014 1141128 1288514 1211733 1246843 1185833 1082205
5692A082205n2483o594P7401J98984J04488j21583l26025K2458K59517q3982j94089
5681I60297N7721j01795o7779Q0232R1750J02626r0374M9713J25641J26323j22513
5670A211842j24764l8413K94913j31244k49185K98520n9962l9055l31035J53366
5660I84983J28557J67908n0504l8563j85607J39960K14304j30012q064M2013m2057
5649A222918J58294r0202j67188j58452k64259M05842k19313J09474j49447J95871
5639A043538Q1545P1602j50010k0130K15388l6802J45701l37674J7837J08178
5629A139173J20631J1937l22046N6070O6441O0128J80072m2238j8009P6803J05013
5618A433975J91318M549k43641Q4476Q7499l7486R5067K7392q3238J28146P034
$$ plain form
5692 1082205 1029722 1023128 1100529 1299513 1404001 1282418 956393 978851 1238368 1154386 960297
5681 960297 1018018 916223 848444 928676 1020426 1123052 1032678 1082391 1208032 1334355 1211842
5670 1211842 1087078 1048665 1343578 1212334 963149 1261669 1201707 1162652 831617 984983
5660 984983 1113540 1281448 1230944 1192381 1006774 1146734 1361038 1231026 1222962 1264975 1222918
5649 1222918 1381212 1291010 1123822 965370 701111 1106953 887640 997114 847667 1043538
5639 1043538 1125083 1196685 1046675 1026545 1241933 1205131 1350832 1013158 1030995 1139173
5629 1139173 1259804 1271741 949695 1005765 1072206 1132334 1312406 1270168 1252159 1328962 1433975
5618 1433975 1625293 1629842 1386201 1470677 1558176 1520690 1615757 1643149 1559911 1688057 1695091
5607A695091L0031l46885n7921n6678K76530r928J32545J0126k25197J65990R5085
5596A708789n1931J79445N4415J9513l7688j14956P0889M0146o043J833K35831
5585B100243J71543m6793k36774l2275J94235J38472K75364K0662j66160J12987
5575B531504R7537k24516o8539K15276M0362m1963J0021j2729k03142r2841K56611
5564B507581k25338k749K01485j8286K81580O3025l4630K00313P8932O1363K7310
5553C140586j15902K14650N3192J31434L03921Q6820J35756j12821J1967M89289
5543D338892N9114K79591J79902L38660J25261K06108J85313L76844J89362M06158
5533F685205J73338K07322M64475N32161L68927J31085J60879K55162J35097J54821
$$ plain form
5607 1695091 1725122 1378237 1320316 1263638 1540168 1530240 1662785 1672911 1447714 1613704 1708789
5596 1708789 1656858 1836303 1890718 1910231 1872543 1757587 1828476 1868622 1862579 1864412 2100243
5585 2100243 2271786 2224993 1988219 1955944 2150179 2288651 2564015 2584677 2418517 2531504
5575 2531504 2629041 2404525 2335986 2551262 2591624 2549661 2559682 2546953 2343811 2250970 2507581
5564 2507581 2282243 2279494 2480979 2462693 2744273 2807298 2772668 2972981 3051913 3113276 3140586
5553 3140586 3024684 3239334 3292526 3423960 3727881 3814701 3950457 3837636 3849603 4338892
5543 4338892 4398006 4677597 4857499 5196159 5321420 5527528 5712841 6089685 6279047 6685205
5533 6685205 6858543 7065865 7530340 8062501 8431428 8562513 8723392 8978554 9113651 9268472
5523I268472L82163R8040K34686K48656Q7704J31065J77630j63529k35705q0767
5513A0148415K65452J40633R9949O8977K33300L51233J98185K03993J86082l0929
5503A1865290J99428j0365n4049n5023k00319J36857j17233K5977o8801O2371
5493A1784133K10153K17973L32785J43744J74375J28385L30922M50241J98163
5484A3970874M25582O17907L59113K35367M60352K55165J98844L15044q817j20342
5474A6709089N7247J4035J92600k07379M95336L32553l2377J99565o2926L08080
5464A8005823k3607k34921J09945K82832j5722m2631l7325R131N7002K2341j02332
5453A8030536q3087q9765j84304m46649m14470r4977M0359J39581j30589j37130
$$ plain form
5523 9268472 9650635 9748675 9983361 10232017 10319721 10450786 10628416 10464887 10229182 10148415
5513 10148415 10413867 10554500 10654449 10723426 10956726 11307959 11506144 11710137 11896219 11865290
5503 11865290 12064718 12054353 12000304 11945281 11744962 11881819 11764586 11790563 11721762 11784133
5493 11784133 11994286 12212259 12545044 12688788 12863163 12991548 13322470 13772711 13970874
5484 13970874 14396456 15014363 15373476 15608843 16069195 16324360 16523204 16838248 16829431 16709089
5474 16709089 16766336 16780371 16972971 16765592 17260928 17593481 17561104 17760669 17697743 18005823
5464 18005823 17982216 17747295 17857240 18140072 18124350 18081719 18044394 18053525 18110527 18132868 18030536
5453 18030536 17947449 17857684 17673380 17226731 16812261 16717284 16757643 16897224 16766635 16629505
5443A6629505j69102J95595R6958l40601Q4298k97743P4914k01646k75272l52633
5433A5444273l02004l13497k73682K8503q0474L2651o5394J69655K54473p4791
5423A4819713K66139N81770M46230J1762J65143J30818N29588K40433K57410N10967
5413A7959973J79371J26518J82716L23991L68616j96345K4711r5875q9583k19418
5403A8564675q7956n7984k77547k73521n15446n03506n99251q20258q83711m25104
5393A4120391o37053l92269n71406n25536k72581j14915j81181k97751m44824
5384A0682875j51945R8286j26890j16727R821K71681L7463k7180J04183L974k06837
5373A0578704p683J93147j20870l583j2127J87969j98571L36412k15762l86708
$$ plain form
5443 16629505 16460403 16655998 16752956 16412355 16496653 16198910 16273824 16072178 15796906 15444273
5433 15444273 15142269 14828772 14555090 14583593 14503119 14535770 14470376 14640031 14894504 14819713
5423 14819713 15085852 15667622 16113852 16125614 16290757 16421575 16951163 17191596 17449006 17959973
5413 17959973 18139344 18265862 18448578 18772569 19141185 18944840 18969551 18873676 18784093 18564675
5403 18564675 18476719 18418735 18141188 17867667 17352221 16848715 16249464 15429206 14545495 14120391
5393 14120391 13483338 13091069 12519663 11994127 11721546 11606631 11425450 11127699 10682875
5384 10682875 10530930 10629216 10502326 10385599 10395420 10667101 10704564 10677384 10781567 10785541 10578704
5373 10578704 10571021 10764168 10643298 10639715 10627588 10815557 10616986 10953398 10737636 10350928
5363A0350928K02246J02814J00701m242Q6012k40285l24089K04495J56589j57111
5353A0478058J27107J71860j91240j78395k50199k706j09184j22506k02452P0453
5343I790796j13386l42580l84998j93203n5747l34737k01198k10645q565j15543
5333G830194j4937j71590K78445J36681p4493n6372L24257K89784J05164J95393
5323H842526J99076K35712r8715q6275m1005m970j17679J7711k15940o4226j06570
5312H559645J06273N475K54371K14052N4141K38871M42273L21047K94558N30524
5302A1021230O63010Q19169P03008Q24262P98283O57053J032122M72886N06090
5293A7497113R35431M3819q80084k157329j900480j767298j455679j237108m96226
$$ plain form
5363 10350928 10553174 10655988 10756689 10752447 10838459 10598174 10274085 10478580 10635169 10478058
5353 10478058 10605165 10777025 10585785 10407390 10157191 10154485 10045301 9922795 9720343 9790796
5343 9790796 9677410 9334830 8949832 8756629 8700882 8366145 8164947 7954302 7945737 7830194
5333 7830194 7815257 7643667 7922112 8058793 7984300 7927928 8252185 8541969 8647133 8842526
5323 8842526 9041602 9277314 9178599 9092324 9051319 9046349 8928670 8946381 8730441 8666215 8559645
5312 8559645 8665918 8671393 8925764 9139816 9193957 9432828 9875101 10196148 10490706 11021230
5302 11021230 11684240 12503409 13206417 14030679 14828962 15486015 16518137 16991023 17497113
5293 17497113 18432544 18476363 17596279 15438950 13538470 11771172 10315493 9078385 8582159
5284H582159k89687o11190m92747j88227j11540r0854l79855J45332J17906j05186
5274F576111M3766l0377k65991k42825Q0560j85307j46926L1452o09P7672K67
5263E937793J65522p5696j82050L57063k3266j88134K70946K74008J89510J17795
5253F843491K21639K96215Q7387J1124j39164L92984M16318J60224M07431L29792
5243I027441M73619Q43068P59390R26309J141265J175780R01647Q85249Q43325
5234A6977093P36879k93974n63014j140901j712867j732290j193191q56555n86988
5225I634192n2376k43154m23991r1064k98023j55286j23113o5573q8365p8170
5215H015077k59641o5572O0076j19198O9106k59937j38072J16045J33903l9705
$$ plain form
5284 8582159 8292472 7681282 7188535 7000308 6888768 6797914 6418059 6563391 6681297 6576111
5274 6576111 6619877 6589500 6323509 6080684 6161244 5975937 5829011 5860463 5859854 5937526 5937793
5263 5937793 6103315 6027619 5845569 6202632 6179366 5991232 6262178 6536186 6725696 6843491
5253 6843491 7065130 7361345 7448732 7459856 7320692 7713676 8129994 8290218 8697649 9027441
5243 9027441 9501060 10344128 11103518 12029827 13171092 14346872 15248519 16133768 16977093
5234 16977093 17713972 17419998 16856984 15716083 14003216 12270926 11077735 10221180 9634192
5225 9634192 9581816 9338662 8914671 8823607 8525584 8370298 8247185 8181612 8093247 8015077
5215 8015077 7755436 7689864 7749940 7630742 7699848 7439911 7301839 7417884 7551787 7512082
5205G512082O5660q050O0132j43369j33242J30230q0202j48848R955l20505j49612
5194F794231p2629Nj29316l90461o482k00057j49127j31029k44849J29720k05325
5183E394681m1344N681L03434L8680L1058q4865O3402R8857J78190q4042O0599
5172E964331R354j97517q6011j28944l06598k97265l9060J3349l75125k76832
5162D279682L5422R5529O965n7071M69274Q0173l38462K17235J88322j76564K23813
5151E024318J8485j18221j58128K41790k05519k62569o4799j60479l4278l93842
5141C886758j32098o2100j32483P4531o0244p0449l39855q9936m0669j94289K83214
5130C122380j75581o3073K50100j59987Q0328j98106M2328j1727r6932J94027
$$ plain form
5205 7512082 7577742 7569692 7629824 7486455 7353213 7483443 7403241 7254393 7264348 6943843 6794231
5194 6794231 6721602 6721607 6592291 6201830 6195348 5995291 5846164 5715135 5470286 5600006 5394681
5183 5394681 5353337 5359018 5662452 5701132 5732190 5647325 5710727 5809584 5987774 5903732 5964331
5172 5964331 5973685 5776168 5690157 5561213 5254615 4957350 4918290 4931639 4556514 4279682
5162 4279682 4315104 4410633 4417598 4360527 4829801 4909974 4571512 4788747 4977069 4800505 5024318
5151 5024318 5042803 4924582 4766454 5008244 4802725 4540156 4475357 4314878 4280600 3886758
5141 3886758 3754660 3692560 3560077 3634608 3574364 3503915 3164060 3074124 3033455 2839166 3122380
5130 3122380 2946799 2883726 3133826 2973839 3054167 2856061 2898389 2886662 2789730 2983757
5120B983757p2449n8345J51303k19543l41992K45339P3159r4890o0732J22967
5110B728574J3761L7777j04196l5171J95698p3982K038M3792j97586M8875Q1409
5099B740989R2972r0036J3868n1J07520J00938m9058N5965J85922k7154q0780
5088C051095M0524l8336j34152o8703L58705j94333o4892l50861J71781j85665
5078B585163K7957j61690K27091J06587K13865P165k09985J82742J87584K13115
5068C379594j68696m7344o8158L03213J55795n5475J9672n4059j16303Q3967J97402
5057C629608O4107j1176R4598o6525K05753j26486J50046J51238m2640k2497j10088
5046C915938K88462k14761n2416K03029Q3955K13325k12477j62451L9470k0441
$$ plain form
5120 2983757 2911308 2852963 3004266 2784723 2442731 2688070 2761229 2666339 2605607 2728574
5110 2728574 2742335 2780112 2675916 2640745 2836443 2762461 2764499 2808291 2610705 2659580 2740989
5099 2740989 2833961 2743925 2757793 2757742 2865262 2966200 2917142 2973107 3159029 3131875 3051095
5088 3051095 3091619 3053283 2919131 2850428 3209133 3014800 2949908 2599047 2770828 2585163
5078 2585163 2613120 2451430 2678521 2785108 2998973 3006138 2796153 2978895 3166479 3379594
5068 3379594 3210898 3163554 3095396 3398609 3554404 3498929 3518601 3464542 3348239 3432206 3629608
5057 3629608 3693715 3682539 3777137 3710612 3916365 3789879 3939925 4091163 4048523 4026026 3915938
5046 3915938 4204400 3989639 3937223 4140252 4224207 4437532 4225055 4062604 4102074 4081633
5036D081633q8661p4341P9840O9716k6553j78270J11064j99033l00005K2870L02191
5025C800451K5356n5018P5443j16531l0354j38984M4506J47756J46913L4044K53931
5014D187513q0445K13577R2947k60630L7795J77826r4135K62182j22494K3837
5004D437973O1380K70098J27792O6104j36982J97830J31300O2460M23702k84113
4994E357544R1633K34258J31933p6138J78897r056M9512K03695l12957K82171
4984F131492L60932k4111k77321l166K25444p7142p6562J17516K25104R1134Q706
4973F702026Q8966L89263J1091L5293K42963K15587J21101L42128Q5538L24591
4963H558547L82701M19360L20661J06930L77202M29237K56502L87898K72513J98166
$$ plain form
5036 4081633 3992972 3918631 3998471 4068187 4041634 3863364 3974428 3775395 3475390 3498260 3800451
5025 3800451 3825807 3770789 3846232 3729701 3699347 3560363 3604869 3752625 3899538 3933582 4187513
5014 4187513 4107068 4320645 4413592 4152962 4190757 4368583 4274448 4536630 4414136 4437973
5004 4437973 4499353 4769451 4897243 4963347 4826365 5024195 5155495 5217955 5641657 5357544
4994 5357544 5449177 5683435 5815368 5739230 5918127 5909071 5958583 6162278 5849321 6131492
4984 6131492 6492424 6468313 6190992 6187826 6413270 6336128 6259566 6377082 6602186 6693320 6702026
4973 6702026 6790992 7180255 7191346 7226639 7469602 7685189 7806290 8148418 8233956 8558547
4963 8558547 8941248 9360608 9681269 9788199 10165401 10594638 10851140 11239038 11511551 11709717
4953A1709717J29016j19462J65835J90952J69966L27233L99863K13353K03525
4944A3389998O2898J67299J43996K92313K14236o4297l14926M39561J78918m7784
4934A4462212J03604J82861L1424k19597j5860M6577l34Q1438M65726J50922J94629
4923A5483602j7009P5787j20338r5221j9656k63089k36741q3404K9153l8237j72383
4912A4542464R9268j9207J29823K63674K16909K61993O63612O60933M36518K26694
4902A7482681K11945L20164J91441K17759L37742p3429k654J81647m6687R9056
4892A8919665K22874l3790o2050P6873L67777J52736K14621L03509q933L30685
4882B0483967L10590J43289k03302L609o8962j46816k34293k68403o8624n72505
$$ plain form
4953 11709717 11838733 11719271 11885106 12076058 12246024 12573257 12973120 13186473 13389998
4944 13389998 13452896 13620195 13764191 14056504 14270740 14206443 13891517 14331078 14509996 14462212
4934 14462212 14565816 14748677 14780101 14560504 14544644 14591221 14590887 14672325 15138051 15288973 15483602
4923 15483602 15466593 15542380 15422042 15326821 15307165 15044076 14807335 14723931 14753084 14714847 14542464
4912 14542464 14641732 14622525 14752348 15016022 15232931 15494924 16158536 16819469 17255987 17482681
4902 17482681 17694626 18014790 18206231 18423990 18761732 18688303 18685649 18867296 18820609 18919665
4892 18919665 19142539 19108749 19046699 19123572 19491349 19644085 19858706 20162215 20153282 20483967
4882 20483967 20794557 20937846 20734544 20738153 20669191 20522375 20288082 20019679 19951055 19378550
4872A9378550l05267q7746m74988j13972k7581j51634J0224R3965l88614m32844
4862A7500093l16719j89972k49790M0941k28633j75629o6540L54631K06923Q7989
4852A6963294J18745J36905M18293N03854M81278N05729K96596N7576N45192P1164
4842B0098626J40852r3209J7037K64876J65390l81174K48106M26350k5942j1061
4832B0849851L43641N27606M69130O84586M46915K61819M82710O20604M69739
4823B5156601M10401K51036K37921M74145K83274L64468k9930M81417N30995M51528
4813B8611856P47096K34815M60649L40595L78682J40299K12098M77195O99916
4804C2303201O79448O31822Q54778N82233M42195O16866K64543j44789l41556
$$ plain form
4872 19378550 19073283 18985537 18510549 18396577 18368996 18217362 18227586 18321551 17932937 17500093
4862 17500093 17183374 16993402 16743612 16784553 16555920 16380291 16313751 16668382 16875305 16963294
4852 16963294 17082039 17218944 17637237 18141091 18622369 19128098 19424694 19482270 20027462 20098626
4842 20098626 20239478 20146269 20163306 20428182 20593572 20212398 20460504 20886854 20860912 20849851
4832 20849851 21193492 21721098 22190228 22874814 23321729 23583548 24066258 24686862 25156601
4823 25156601 25567002 25818038 26055959 26530104 26813378 27177846 27147916 27629333 28160328 28611856
4813 28611856 29358952 29593767 30054416 30395011 30773693 30913992 31126090 31603285 32303201
4804 32303201 32982649 33614471 34469249 35051482 35493677 36110543 36375086 36230297 35888741
4795C5888741k30436o06750p69635m45195n69357j18189j43307l70791J85178
4786C2820259o1919J66929P17830M52017N58688P43529O78367Q56135R51945Q40050
4776C8723830J151330J073800J232080J123666J042267J306605J374833J299491
4768D8327902J281850J638079J378183J278652J191266J350272J041293Q88282
4760E8375779R73283Q97594Q27302Q89110O89234Q64138Q02959R26905R58360
4751F6204664Q68965N12193N06325Q20747P77907J211133J012656J407558J889320
4742G5211468J722737K222402K285511K656598K776483L512484L774658M274595
4734I8436936M271241L627838L745497L153395K328078j68891l140335o187207
$$ plain form
4795 35888741 35658305 35051555 34281920 33836725 33267368 33149179 33005872 32635081 32820259
4786 32820259 32758340 32925269 33643099 34095116 34653804 35397333 36075700 36931835 37883780 38723830
4776 38723830 39875160 40948960 42181040 43304706 44346973 45653578 47028411 48327902
4768 48327902 49609752 51247831 52626014 53904666 55095932 56446204 57487497 58375779
4760 58375779 59349062 60246656 61073958 61963068 62652302 63516440 64319399 65246304 66204664
4751 66204664 67073629 67585822 68092147 68912894 69690801 70901934 71914590 73322148 75211468
4742 75211468 76934205 79156607 81442118 84098716 86875199 90387683 94162341 98436936
4734 98436936 102708177 106336015 110081512 113234907 115562985 115394094 112253759 106066552
4726A06066552o960282p002196o500798n580391m334142l254300k645865j987789
4718F7800789j362511q26816o04701j09891J7337L29932M45822K46162J38383
4709F6074506L61742K09620J98463M30673R4977L32455L48360N20964P12870Q01481
4699G0086111Q45693R96668R19667J112124J250364J198929J505563J782762J894275
4690H1592156K297097K629289K690089L505505M006734M742811N425832O404682
4682A13294195P938277R546976J1451084J4135363J6872080J9282254K1723964
4675B14244193K1534808J9388445J8644504J8024750J5511910J2211714j780744
4668C17779580k5850567l6918431l5286346k9817765k2733334j6307307j2497555
$$ plain form
4726 106066552 99106270 92104074 85603276 80022885 75688743 72434443 69788578 67800789
4718 67800789 66438278 65611462 65006761 64896870 64914207 65244139 65689961 65936123 66074506
4709 66074506 66436248 66645868 66844331 67275004 67369981 67702436 68050796 68571760 69284630 70086111
4699 70086111 70931804 71928472 72848139 73960263 75210627 76409556 77915119 79697881 81592156
4690 81592156 83889253 86518542 89208631 92714136 96720870 101463681 106889513 113294195
4682 113294195 121232472 130779448 142230532 156365895 173237975 192520229 214244193
4675 214244193 235779001 255167446 273811950 291836700 307348610 319560324 317779580
4668 317779580 291929013 255010582 219724236 189906471 167173137 150865830 138368275
4661A38368275r493144p583445o683821n605372m855087l992310k697146j571739
4653I5886211j482211j490079j337553j261480j390835j327071j787068j685597
4645H4124317j422943j015579j113505m71727k17605k66371j62350k77842m7389
4636G9129006j12645m42010p13670j146645j261879j580374j880244j558825j128855
4627F9303859r97565j150716p89451l48888n15193q97829r79162r36176j075294
4618F1613585r44916m74923m19528k83082M2998m44976k30133o42159p30457n21405
4608E6965004m83425j049820j149797q12291o50174r11905p72162p33942p88659
4599D9612829m31647p16105q28250j328124j274767r87955j302294r60794j071453
$$ plain form
4661 138368275 128875131 121291686 114607865 109002493 104147406 100155096 97457950 95886211
4653 95886211 94404000 92913921 91576368 90314888 88924053 87596982 85809914 84124317
4645 84124317 82701374 81685795 80572290 80100563 79882958 79616587 79454237 79176395 79129006
4636 79129006 79016361 78574351 77860681 76714036 75452157 73871783 71991539 70432714 69303859
4627 69303859 68306294 67155578 66366127 66017239 65502046 64604217 63625055 62688879 61613585
4618 61613585 60668669 60193746 59774218 59491136 59534134 59089158 58859025 58216866 57486409 56965004
4608 56965004 56481579 55431759 54281962 53469671 52819497 51907592 51135430 50401488 49612829
4599 49612829 49181182 48465077 47636827 46308703 45033936 44045981 42743687 41782893 40711440
4590D0711440r93416p37191q33637p55858r08881o82460n40814m44050o43425
4581C4171708j043291n90198m65491n00629j61666m19104k78621k41681J2908
4572C0483935m5535J97513Q0930l3479J24734J50461K48081K32332J49906L40852
4562C1929730M20570K50047L56776Q13872O23138O31130Q04394J123318J271291
4553C8224266J128748J705053K108816K140938K506211L083851L712198M312175
4545E8922256M844797N496793N822100O256264N943671N674435N132331M006533
4537A02099180K387802m24680l648497p078012q563353q777696q042367o869544
4529F1082833n844874m901469l861864l176328k668199k408994k006840j834566
$$ plain form
4590 40711440 39718024 38980833 38147196 37391338 36482457 35799997 35259183 34815133 34171708
4581 34171708 33128417 32538219 32072728 31572099 31410433 30991329 30712708 30471027 30483935
4572 30483935 30438400 30635913 30716843 30683364 30808098 30958559 31206640 31438972 31588878 31929730
4562 31929730 32350300 32600347 32957123 33770995 34394133 35025263 35829657 36952975 38224266
4553 38224266 39353014 41058067 43166883 45307821 47814032 50897883 54610081 58922256
4545 58922256 63767053 69263846 75085946 81342210 87285881 92960316 98092647 102099180
4537 102099180 104486982 104062302 100413805 93335793 84772440 75994744 67952377 61082833
4529 61082833 55237959 50336490 46474626 43298298 40630099 38221105 36214265 34379699
4521C4379699j544474j199521j252585j005675o88747o12018m28979o92352l45439
4512B6609909n30120l28027l75016m17813m17160k79163k94020n17659k76580
4503B3174351j40038l75286m490O3283n56372k76094l93934Q3465p5958p5428
4493B1423499o485K29526N0969J51460k8725M7074K86330N086L38967k10005J47230
4482B2434926K3636n660J15107N3720l5597j27923M8910J73409K61793K67572
4472B3209893L23153q5317L06869M1209K56418M82827L28815L24419L46162N33601
4462B6068049M94255L68947K78353N35882L88235L05465M39834N15947N83198
4453B9978165L12501K97921L73180Q64632M07299K41001K63449L14584M74830
$$ plain form
4521 34379699 32835225 31635704 30383119 29377444 28688697 28076679 27647700 26955348 26609909
4512 26609909 26079789 25751762 25376746 24958933 24541773 24262610 23968590 23450931 23174351
4503 23174351 23034313 22659027 22654537 22717820 22161448 21885354 21491420 21574885 21498927 21423499
4493 21423499 21417014 21646540 21697509 21848969 21820244 21867318 22153648 22158734 22497701 22287696 22434926
4482 22434926 22458562 22452902 22568009 22621729 22586132 22458209 22507119 22680528 22942321 23209893
4472 23209893 23533046 23447729 23754598 23795807 24052225 24535052 24863867 25188286 25534448 26068049
4462 26068049 26562304 26931251 27209604 27745486 28133721 28439186 28879020 29394967 29978165
4453 29978165 30290666 30588587 30961767 31826399 32233698 32474699 32738148 33052732 33527562
4444C3527562M51417K24425K60612J64750M34091M20059K98595J24107M91497
4435C6397115m1923K95348N10268O26233L86982M51805M02280O59367O97001O30253
4425D1014729Q57798R05492R84118J124402J174547J367071J567959J512191J929311
4416E2437618J840008J853304K262860K549031K238878K681702K729781K995504
4408G1588686L193228L133412L214497L396207L658593L824467L675425L662057
4400I9346572L494430L083766K913247L126144K471150K181407J768801J534630
4392A19920147J154350J220064O68968N14132M64463m14517k14477m97905j124219
4383A21691006j162844j737363k040580k301300k842726k945698k884225k974847
$$ plain form
4444 33527562 33978979 34203404 34464016 34628766 35062857 35482916 35781511 35905618 36397115
4435 36397115 36355192 36650540 37160808 37787041 38174023 38625828 39028108 39687475 40384476 41014729
4425 41014729 41872527 42778019 43762137 44886539 46061086 47428157 48996116 50508307 52437618
4416 52437618 54277626 56130930 58393790 60942821 63181699 65863401 68593182 71588686
4408 71588686 74781914 77915326 81129823 84526030 88184623 92009090 95684515 99346572
4400 99346572 102841002 105924768 108838015 111964159 114435309 116616716 118385517 119920147
4392 119920147 121074497 122294561 122963529 123477661 123942124 123527607 123313130 122815225 121691006
4383 121691006 120528162 118790799 116750219 114448919 111606193 108660495 105776270 102801423
4375A02801423l399844l555748l332619l138732l197957l380230l278499k771371
4367G6746423k841714k655757k251066k072764k002757j709841j327469j278647
4359F0606408m14024n93791r02024m41788k90965m61088j9614k91787q2872k35319
4349E6873136O7263K44296L7319J93321K24889L71523M76298P24621N31563Q13366
4339F0557595R33301J091475Q37016J012807J044138Q64298Q67244J059439J448065
4330F9715378J125318J680776J877853K075743K080606K120736K385306K497559
4322H5559275K020244J873630J606224J181644Q57211J004645Q65424R57300P20733
4313I6646330R18821J029303J085204J694686J322408J181037Q20048M23733j94439
$$ plain form
4375 102801423 99401579 95845831 92513212 89374480 86176523 82796293 79517794 76746423
4367 76746423 73904709 71248952 68997886 66925122 64922365 63212524 61885055 60606408
4359 60606408 60192384 59598593 58696569 58254781 57963816 57502728 57483114 57191327 57108455 56873136
4349 56873136 56940399 57184695 57222014 57415335 57640224 58011747 58488045 59212666 59744229 60557595
4339 60557595 61490896 62582371 63419387 64432194 65476332 66340630 67207874 68267313 69715378
4330 69715378 70840696 72521472 74399325 76475068 78555674 80676410 83061716 85559275
4322 85559275 87579519 89453149 91059373 92241017 93098228 94102873 94968297 95925597 96646330
4313 96646330 97565151 98594454 99679658 101374344 102696752 103877789 104697837 105121570 104927131
4304A04927131p85543j235568j588388k380184k520059k610362k744566k487061
4296H8575400k063437j733551j578623j521613j193638j116099j044398j550187
4288G6773854j236354j127957j523766j184964j531341j484897j188643j198657
4280F6297275j083708p57556o68915m49547l6149J62879L38809J48399O04444
4271F4555931M81173Q89772R25859R90741J220769J391104J319834J602569J547331
4262G4925083J832480J950858K107286K438803K732829K786336L528033L796240
4254I6097948M294861M761458M966752N892905O693220P305169P956176R160962
4246A47129451R560165R971152J0526994J0860436J1140220J0860914J0039435
$$ plain form
4304 104927131 104141588 102906020 101317632 98937448 96417389 93807027 91062461 88575400
4296 88575400 86511963 84778412 83199789 81678176 80484538 79368439 78324041 76773854
4288 76773854 75537500 74409543 72885777 71700813 70169472 68684575 67495932 66297275
4280 66297275 65213567 64456011 63787096 63337549 63301400 63464279 63803088 63951487 64555931
4271 64555931 65037104 65926876 66852735 67843476 69064245 70455349 71775183 73377752 74925083
4262 74925083 76757563 78708421 80815707 83254510 85987339 88773675 92301708 96097948
4254 96097948 100392809 105154267 110121019 116013924 122707144 130012313 137968489 147129451
4246 147129451 156689616 166660768 177187762 188048198 199188418 210049332 220088767
4239B20088767R020597P645419O124669M256354K017283m05159k425413m729583
4231B41592934o662666q190986r392750j0782582j1646754j1509755j1529431
4224A71878010j1230820j0752619j0117489r446957q107641p351099o840966n691110
4216A02339309n088980m323607l674955l225990l048131k756909k241171k057860
4208G5921706j820984j716250j827103j374347j356311r93235q85079j142469
4200F4805928q20484o90575o43242l31466k63783k00290j57997r8828K78781K84108
4190F2162152K60423L71337J16136O93114M86846O13822J153144J276405J501793
4181F8635172J149512J607299J386939J677324K017611K666737L255514L131432
$$ plain form
4239 220088767 229109364 236754783 242879452 247135806 249153089 248747930 246322517 241592934
4231 241592934 234930268 226739282 217346532 206563950 194917196 183407441 171878010
4224 171878010 160647190 149894571 139777082 130330125 122222484 114871385 108030419 102339309
4216 102339309 97250329 92926722 89251767 86025777 82977646 80220737 77979566 75921706
4208 75921706 74100722 72384472 70557369 69183022 67826711 66833476 65948397 64805928
4200 64805928 63985444 63294869 62651627 62320161 62056378 61856088 61698091 61599263 61878044 62162152
4190 62162152 62422575 62793912 62910048 63603162 64090008 64703830 65856974 67133379 68635172
4181 68635172 69784684 71391983 72778922 74456246 76473857 79140594 82396108 85527540
4173H5527540L730229M552336N068211N500472O238328O177007O824994O592354
4165A30211471O536126O641174O089132N276583M224932L138251J738884O36004
4157A64492557m44568j600490k438648k891759k870304k980737l143619k673556
4149A45448876k587658k954168k892560l119210l546736m076122m109368m803246
4141A17359808n480882n925824o101142o253583n871960n682465n473094n090907
4133G1479951m671521m441026l520639l486924k923985k574890k343901j894030
4125D5623035j966033j516565j344354j210412j454406j144227q74380p60145
4117C5352513p65516p58126m28879l87679o78577n33799n60917k26851p78850
$$ plain form
4173 85527540 89257769 93810105 98878316 104378788 110617116 116794123 123619117 130211471
4165 130211471 136747597 143388771 149477903 154754486 158979418 162117669 163856553 164492557
4157 164492557 164047989 162447499 160008851 157117092 154246788 151266051 148122432 145448876
4149 145448876 142861218 139907050 137014490 133895280 130348544 126272422 122163054 117359808
4141 117359808 111878926 105953102 99851960 93598377 87726417 82043952 76570858 71479951
4133 71479951 66808430 62367404 58846765 55359841 52435856 49860966 47517065 45623035
4125 45623035 43657002 42140437 40796083 39585671 38131265 36987038 36112658 35352513
4117 35352513 34586997 33828871 33399992 33012313 32333736 31799937 31239020 31012169 30233319
4108C0233319n33664k74277k26783k40805o37755l00099l00163k95567o6782l11413
4098B7046011j99626k56739j35920q1782q0194k36139k12582J61982j00093j98914
4088B5706004L1713K31902R5928o3879L12342L37494J29238M83495K77185N04766
4078B8046188N92490K28899N73577N70396O27037L42958P45574M81678P15088
4069C2923885P76656Q28411J054397J019552R69580J016543J139971R34475J046971
4060D1710441J162459R31933P63421L99846O61935M28255M55785K04579M49770
4051D7168424M87703J82247K79301J41286N03286R4173L08355M13001N1824k06452
4041D9423148k04847Q9704J694J61893r6979M18996M74495O81259Q14486J327194
$$ plain form
4108 30233319 29699655 29425378 29198595 28957790 28320035 28019936 27719773 27424206 27357424 27046011
4098 27046011 26846385 26589646 26453726 26371944 26291750 26055611 25843029 26005011 25904918 25706004
4088 25706004 25737717 25969619 26065547 26001668 26314010 26651504 26780742 27264237 27541422 28046188
4078 28046188 28638678 28867577 29441154 30011550 30638587 30981545 31727119 32208797 32923885
4069 32923885 33700541 34528952 35583349 36602901 37572481 38589024 39728995 40663470 41710441
4060 41710441 42872900 43804833 44568254 44968100 45630035 46058290 46514075 46718654 47168424
4051 47168424 47656127 47838374 48117675 48258961 48762247 48856420 49164775 49577776 49629600 49423148
4041 49423148 49218301 49308005 49309699 49471592 49374613 49793609 50268104 50949363 51763849 53091043
4031E3091043J106635J483662J717188J685312K069441K062943K173720K589238
4023F7979182K614310K493357L101561K708084L170679L637253L727747L893864
4015I3326037M271090M517326M568557M390452M610643M180984L892223L145816
4007A26903128K907673K478589J843841J124143J097453R67371O38782M25670
3999A38386650N48582O52116P53235K84461K2777K89402J59110J03253P7518J21828
3989A41398932J52185M09023R14332J473989K081209K837807L496706L918855
3981A56683038M608445M699822M694695M824863M774462M536374M090263L695831
3973A92607793L336542K308522K060313J739959J357015O04548k36157n30842
$$ plain form
4031 53091043 54197678 55681340 57398528 59083840 61153281 63216224 65389944 67979182
4023 67979182 70593492 73086849 76188410 78896494 82067173 85704426 89432173 93326037
4015 93326037 97597127 102114453 106683010 111073462 115684105 119865089 123757312 126903128
4007 126903128 129810801 132289390 134133231 135257374 136354827 137322198 137960980 138386650
3999 138386650 138935232 139587348 140340583 140625044 140647821 140937223 141096333 141199586 141277104 141398932
3989 141398932 141551117 141960140 142874472 144348461 146429670 149267477 152764183 156683038
3981 156683038 161291483 165991305 170686000 175510863 180285325 184821699 188911962 192607793
3973 192607793 195944335 198252857 200313170 202053129 203410144 204014692 203778535 203247693
3965B03247693n00399j245526j679063k179192k197848k659314k908261l086884
3957A86791206l035681k996741k767794k322861k013786j847254j290871m10806
3949A70105412k93068J81023M64740P92593J181719R26219J210463J852429K255703
3940A78677233K626436K850145L440239M125822M341196L989182M369891K927801
3932B07347945J937517N63793j805194m630220p210679j0510365j1757413j2013866
3924A61921518j1880860j0578505r550073q512203p453424o469897n602114m951283
3916I6923159m545571l721073l486661k861976k716361k678486k476926k110337
3908G2325768j889721j982230j675824j333093j136597q27196o25471j091991
$$ plain form
3965 203247693 202747294 201501768 199822705 197643513 195445665 192786351 189878090 186791206
3957 186791206 183755525 180758784 177990990 175668129 173654343 171807089 170516218 170105412
3949 170105412 169812344 169993367 170458107 171250700 172432419 173358638 174569101 176421530 178677233
3940 178677233 181303669 184153814 187594053 191719875 196061071 200050253 204420144 207347945
3932 207347945 209285462 209849255 208044061 203413841 196203162 185692797 173935384 161921518
3924 161921518 150040658 139462153 129912080 121399877 113946453 107476556 101874442 96923159
3916 96923159 92377588 88656515 85169854 82307878 79591517 76913031 74436105 72325768
3908 72325768 70436047 68453817 66777993 65444900 64308303 63481107 62855636 61763645
3900F1763645m52211m21476l76442m97069m51057o90356l85207l99487q49521
3891E7240819n76291m75255l76561n19072o85134l00000n72377o04190n52550
3882E2579389o36188o77380m70063k08020n84214n22388k54624n69899l65148
3873D8291465k41251j91684K35892L39556J73751O45840P13100Q14333J064256
3864E1845258J117020J253370J662576J669641K009148K479008K304725K964802
3856F7305548L307889L882694M027152M527336M925960N280416N457605N815328
3848A04529928N836375N503080N486462M694361M358945L848175L106704K357870
3840A39721900J259774j83060j476427l007764m028526m737700n794526o069493
$$ plain form
3900 61763645 61311434 60889958 60513516 60016447 59565390 58875034 58489827 58090340 57240819
3891 57240819 56664528 56189273 55812712 55293640 54608506 54308506 53736129 53131939 52579389
3882 52579389 51943201 51265821 50795758 50587738 50003524 49481136 49226512 48656613 48291465
3873 48291465 48050214 47858530 48094422 48433978 48607729 49253569 49966669 50781002 51845258
3864 51845258 52962278 54215648 55878224 57547865 59557013 62036021 64340746 67305548
3856 67305548 70613437 74496131 78523283 83050619 87976579 93256995 98714600 104529928
3848 104529928 110366303 115869383 121355845 126050206 130409151 134257326 137364030 139721900
3840 139721900 140981674 140798614 139322187 136314423 132285897 127548197 121753671 115684178
3832A15684178o298329o233958o017736m945611m075400l779135l080994k350912
3824G8902103j374235o18021m88507L76136N96224J554236J849378K322805K484908
3815H5605027L181324L225687L610812L774977L453653L642788L228379K712639
3807A12435286J934195J241625J6832r67241k388871l546710m444875n041244
3799I9238997n721027o083004o025324n924393n485325n029081m650230m045586
3791E6275027l440388k972759k853724k614124k155728j715418j814373j570357
3783C7138156j590801j257089j280964j527422j096166j179037j044082q75519
3775B7287076j127129n78223p05485o82489n27965p68034o19092k25199n70145
$$ plain form
3832 115684178 109385849 103151891 97134155 92188544 88113144 84334009 81253015 78902103
3824 78902103 77527868 76909847 76421340 76797476 77393700 78947936 80797314 83120119 85605027
3815 85605027 88786351 92012038 95622850 99397827 102851480 106494268 109722647 112435286
3807 112435286 114369481 115611106 115627938 114660697 112271826 108725116 104280241 99238997
3799 99238997 93517970 87434966 81409642 75485249 69999924 64970843 60320613 56275027
3791 56275027 52834639 49861880 47008156 44394032 42238304 40522886 38708513 37138156
3783 37138156 35547355 34290266 33009302 31481880 30385714 29206677 28162595 27287076
3775 27287076 26159947 25581724 24876239 24193750 23665785 22897751 22278659 22053460 21483315
3766B1483315o98349j42705m36495k91141j93392P9013n29959j52171j6781k30549
3756A8870786j80955k92547l14176k90182l55723J79299j79965k39701j01146
3747A7095690n1022n2175j22463k50755Q153k51756j83908n9766r2513K7870j17010
3736A5950345j88392k43284n7236j83807M9352l79586n3742q8690K3798J242j11942
3725A4718058n5334o32k3113N3243Q6394p8187N2136k1460q6590L7745J40448
3714A4822708J48124M21993J27734R3619r523k01756M42028o584K60379p1989
3704A6026733J35986L06956j09823J08131j02619j85003Q3582L9597N33845N5029
3694A6892414q1747R1571L94362K02667J65165J23901J03807L18536j06595N35959
$$ plain form
3766 21483315 20784966 20642261 20205766 19914625 19721233 19800246 19270287 19118116 19101335 18870786
3756 18870786 18689831 18397284 18083108 17792926 17437203 17616502 17436537 17196836 17095690
3747 17095690 17044668 16992493 16870030 16619275 16627428 16375672 16191764 16131998 16039485 16067355 15950345
3736 15950345 15761953 15518669 15461433 15277626 15326978 14947392 14893650 14804960 14828758 14830000 14718058
3725 14718058 14662724 14662092 14638979 14692222 14778616 14700429 14752565 14731105 14644515 14682260 14822708
3714 14822708 14970832 15392825 15520559 15614178 15604655 15402899 15844927 15838343 16098722 16026733
3704 16026733 16162719 16469675 16359852 16467983 16365364 16180361 16263943 16303540 16837385 16892414
3694 16892414 16810667 16902238 17296600 17499267 17664432 17788333 17892140 18210676 18104081 18640040
3684A8640040M35965N708L76479O04432N20182J55302P15800O13276O87907O20378
3674B3375469O87138P19248L72326N67381O62818N79438M80101L55964L93477
3665B8193360N09109O93322O58011N40930L94200N44235R50489P14075J001849
3656C4199580P06326P97397R06352R48231R74955P70324Q05947J176423Q56752
3647D2142287J050254P89659J184035J101122J214823J440318R32366J276662
3639E1131526J601040J659112J460391J518345J756335J756785J887130K419321
3631F5189985K562173K708236K862264L232694L295487L494450L612910L504238
3623I0462437L931310M155430L670715L511732L450930L874334M713919N081314
$$ plain form
3684 18640040 19076005 19081713 19458192 20062624 20582806 20738108 21453908 22067184 22755091 23375469
3674 23375469 24062607 24781855 25154181 25721562 26384380 26963818 27443919 27799883 28193360
3665 28193360 28702469 29395791 30053802 30594732 30988932 31533167 32483656 33197731 34199580
3656 34199580 34905906 35703303 36609655 37557886 38532841 39303165 40109112 41285535 42142287
3647 42142287 43192541 43982200 45166235 46267357 47482180 48922498 49854864 51131526
3639 51131526 52732566 54391678 55852069 57370414 59126749 60883534 62770664 65189985
3631 65189985 67752158 70460394 73322658 76555352 79850839 83345289 86958199 90462437
3623 90462437 94393747 98549177 102219892 105731624 109182554 113056888 117770807 122852121
3615A22852121N629311O184952P013792P698495Q560957R830157J1100942J2686450
3607A91557177J5147795J7839195K1179872K4496064K8136495L1869074L4610466
3600C64836138L5320576L4313698L2345005K9348796K4380187J5323639l49280
3593E35518759k1396792l9441242m7570410m6084317l9893191l1716267k4049131
3586B85367409j7780945j3486266j0735094q455213o379807m321305k178062M25098
3578B22455815K761223M734459P294064R770689J2668558J5734795J8527436K0508708
3570C14455747K1851455K2018078K0789326J8672370J5028376Q492915k159765
3563D19148502j5968956k8943799l6204325l7825537l4663143k9858323k4897933
$$ plain form
3615 122852121 128481432 134666384 141680176 149378671 157939628 167769785 178870727 191557177
3607 191557177 206704972 224544167 245724039 270220103 298356598 330225672 364836138
3600 364836138 400156714 434470412 466815417 496164213 520544400 535868039 535518759
3593 535518759 514121967 474680725 427110315 381025998 341132807 309416540 285367409
3586 285367409 267586464 254100198 243365104 234909891 228530084 224208779 222030717 222455815
3578 222455815 225217038 229951497 237245561 247016250 259684808 275419603 293947039 314455747
3570 314455747 336307202 358325280 379114606 397786976 412815352 421308267 419148502
3563 419148502 403179546 374235747 338031422 300205885 265542742 235684419 210786486
3556B10786486k0377935j6726051j3947635j2260227j1076667r730257q646243
3549A18021471p248493o649984n947475n251626m825431m343177l682813l699770
3541G6372702l603407l241768k990012k958575k665558k648388k430644j986099
3533E3848251k039620j740610j893447j836074j330743j343764j376386j243346
3525D1044261j191132j377281q87420p40342j161254p04367j103815p16822p84666
3516C2377162r01446p88623j050651r16553o73420l95481m37221n02874p36573
3507B5974320o75147o74809o68320o66133o13353n71564p74808o52524p12123
3498A9965539o44792n26721n39046q05471l98941n75541l88645m45970n78375
$$ plain form
3556 210786486 190408551 173682500 159734865 147474638 136397971 126667714 118021471
3549 118021471 110772978 104122994 98175519 92923893 88098462 83755285 80072472 76372702
3541 76372702 72769295 69527527 66537515 63578940 60913382 58264994 55834350 53848251
3533 53848251 51808631 50068021 48174574 46338500 45007757 43663993 42287607 41044261
3525 41044261 39853129 38475848 37588428 36848086 35686832 34982465 33878650 33161828 32377162
3516 32377162 31475716 30687093 29636442 28719889 28046469 27650988 27213767 26710893 25974320
3507 25974320 25299173 24624364 23956044 23289911 22676558 22104994 21330186 20677662 19965539
3498 19965539 19320747 18794026 18254980 17449509 17050568 16475027 16086382 15640412 15062037
3489A5062037m82453j93420m44744k64929k45487j03214k53731m04213j34545
3480A2535301j18935k97257k00840K1861j82614j23084k35224n31937k90889L9389
3470A0615771r8251q5080k27590k81289l34924k21619k12606j293l627j29520
3460I019972j34957k61537k75216o9651k07037j66467q4015l09124j59279P2926
3450G425615n0240l73683j82658R2881L8882r6400J63549n7726J45483j30041
3440F975662p6893J71821l05540J7609k06671O0086K2859j05734J28021k59519
3430F421701K9177J9452R8997l36051P0525l31400m07394K01436j12728K299j06428
3419E549586J08433j99763J45071q8821k45671J03178Q4749J34487o0239r557
$$ plain form
3489 15062037 14579584 14386164 13941420 13676491 13431004 13327790 13074059 12669846 12535301
3480 12535301 12416366 12119109 11918269 11940130 11757516 11634432 11399208 10867271 10576382 10615771
3470 10615771 10517520 10432440 10204850 9923561 9588637 9367018 9154412 9153119 9149492 9019972
3460 9019972 8885015 8623478 8348262 8278611 8071574 7905107 7821092 7511968 7352689 7425615
3450 7425615 7375375 7001692 6819034 6911915 6950797 6854397 7017946 6960220 7105703 6975662
3440 6975662 6898769 7070590 6765050 6782659 6575988 6636074 6658933 6553199 6681220 6421701
3430 6421701 6450878 6470330 6569327 6233276 6303801 5972401 5565007 5766443 5653715 5656014 5549586
3419 5549586 5658019 5458256 5603327 5514506 5268835 5372013 5456762 5591249 5531010 5521453
3409E521453J58355j38049k3483N4938N5993n7538k52588Q1164j50616J55664
3399E405293P2502r2005j25523k34740o9353j92745k74313J22972m964k66731
3389D340393N6761q7866l57517j34508J60012j15655J54561q588J18907p7865
3379D048635j64273n4502j34293j09524K38597P9111q128l3196J09477j97337
3369C774567M0285o9126J3666k36555J66117M7710l7865J97994q0087M2062j55872
3358C702896N1483r0957m36922K44692J11883N6217L8888L866N5741K4876N7556
3347C820219P76K19841J6493K66969J25784N5245q3667N2578J25708j60333k33734
3336D205879j28279j98069k28470m8775l64831L0144k47641j74765L6207p3452
$$ plain form
3409 5521453 5679808 5541759 5518276 5573214 5629207 5571669 5319081 5400245 5249629 5405293
3399 5405293 5477795 5385790 5260267 5025527 4956174 4763429 4489116 4612088 4607124 4340393
3389 4340393 4397154 4309288 3951771 3817263 3977275 3861620 4016181 4007593 4126500 4048635
3379 4048635 3884362 3829860 3695567 3586043 3824640 3903751 3895623 3862427 3971904 3774567
3369 3774567 3814852 3745726 3759392 3522837 3688954 3736664 3698799 3896793 3816706 3858768 3702896
3358 3702896 3754379 3663422 3226500 3471192 3583075 3639292 3678180 3682046 3737787 3762663 3820219
3347 3820219 3820995 4040836 4057329 4324298 4450082 4505327 4421660 4474238 4599946 4439613 4205879
3336 4205879 4077600 3879531 3651061 3602286 3237455 3267599 3019958 2845193 2881400 2807948
3326B807948J02107q9651L7544Q1256M4039J10466p0739k13407L01372K68614
3316C379549k09868r1739o450M5258j3999J43896j51458M7734K94705m44270J2416
3305C005774k29576k63620P0508l0976k06110j39442l36979K82868m11418k2263
3295A718766l3603K49343J26210o0305j80447K7181j94167q3748P5269q0022j19466
3284A445011n76J62849M6820m1812J50721p7057l2901j84162r432q0023k7168
3273A352270J93888J69678k4907j67538j52172O0537Q2218j21238K11991J044
3263A605771J18264j62859K06481k37044k1159K6057J82169j27941O4617o7223
3253A587133q4153l9131J43433j25982M21j10648o8228J91378o3616j28585R1696
$$ plain form
3326 2807948 2910055 2820404 2857948 2939204 2983243 3093709 3022970 2809563 3110935 3379549
3316 3379549 3169681 3077942 3071492 3116750 3102751 3246647 3095189 3142923 3437628 2993358 3005774
3305 3005774 2776198 2512578 2583086 2552110 2346000 2206558 1869579 2152447 1741029 1718766
3295 1718766 1685163 1934506 2060716 2000411 1819964 1847145 1652978 1569230 1644499 1564477 1445011
3284 1445011 1444435 1607284 1654104 1612292 1763013 1685956 1653055 1468893 1459461 1379438 1352270
3273 1352270 1546158 1715836 1690929 1523391 1371219 1431756 1513974 1392736 1604727 1605771
3263 1605771 1724035 1561176 1767657 1530613 1509454 1535511 1717680 1589739 1654356 1587133
3253 1587133 1502980 1463849 1607282 1481300 1481721 1371073 1302845 1494223 1430607 1302022 1393718
3242A393718j17590P4786J6842k07825K21619j79566j02500j32438J49400M7065
3232A163511l9053J49735j81232j41909K62436j5679r4749O9268K11655j0655
3222A373328j63864n5229J76627M1975j91717L2908J53493j7556q3743p4996j60838
3211A030388N5411j29185J09869J07938k1385p7629k5792m9241k40506P5857K79524
3200A115249L37K39375k4633j69518J3286M8598j05307Q5707R6352p1212k40794
3189I87440k02860K85280j50765l7000J75932J02402R4197J57978l86148J7671
3179A044127J25298j25321k49935k38792K38155K39144j2062k42957R5077K63960
3169A136694k92955K39538K82768k81660R6008o0845R7762p6154j17242J50772
$$ plain form
3242 1393718 1276128 1350914 1367756 1159931 1381550 1201984 1099484 967046 1116446 1163511
3232 1163511 1124458 1274193 1092961 951052 1213488 1197809 1103060 1172328 1383983 1373328
3222 1373328 1209464 1154235 1330862 1372837 1181120 1214028 1367521 1349965 1266222 1191226 1030388
3211 1030388 1085799 956614 1066483 1174421 1153036 1075407 1049615 1000374 759868 835725 1115249
3200 1115249 1115586 1354961 1330328 1160810 1174096 1222694 1117387 1203094 1299446 1228234 987440
3189 987440 784580 1069860 919095 882095 1058027 1160429 1254626 1412604 1026456 1044127
3179 1044127 1169425 1044104 794169 555377 793532 1032676 1020614 777657 872734 1136694
3169 1136694 843739 1083277 1366045 1084385 1180393 1119548 1217310 1141156 1023914 1174686
3159A174686j34040K38366m2232j11076J0096m3611J18492O6659J08794L9588
3149A425722J3309l16324L3077J51623K54382m4994M2731k40694q4976R1711O2274
3138A387841l03925o0388m0467j25328J42684J49662o1366j90056P6494l8362
3128I36789k4488j21215K99243L0505P9915m1524j52089J56476k03410j50778
3118H09424q8570K18427j35423K05503j4861l4406j99648l2154M13819m8080m04367
3107F89664j53043o9509J61647K28762j11038R1494K3935R0247q6713R550k70630
3096F04366k6743k3395l3870l0426M7147l3953K06185j75391N1588J96619M8944
3085H31071K5951R0615k60122R6672J87666m8428j04999j3047Q5068J48205m6444
$$ plain form
3159 1174686 1040646 1279012 1236780 1125704 1135800 1092189 1210681 1277340 1386134 1425722
3149 1425722 1439031 1122707 1155784 1307407 1561789 1516795 1559526 1318832 1233856 1325567 1387841
3138 1387841 1083916 1023528 983061 857733 1000417 1150079 1088713 898657 975151 936789
3128 936789 912301 791086 1090329 1120834 1200749 1159225 1007136 1163612 960202 809424
3118 809424 720854 939281 803858 1009361 994500 960094 760446 728292 1142111 1094031 689664
3107 689664 536621 467112 628759 857521 746483 837977 861912 952159 865446 874996 604366
3096 604366 577623 554228 520358 489932 537079 503126 709311 533920 585508 782127 831071
3085 831071 857022 947637 687515 784187 971853 923425 818426 805379 890447 1038652 992208
3074I92208p1882Q9374m3253k06497J06174O3353P9311m586j72049j48419J9292
3063G03026M3861o7037J65118L3653m0863Q0223r360j0373j5772o2194N4343J3352
3051H87977J07721k96335j2084j69685L3171K18425N9577J81150j34076j68565
3041G07276j19907J58850j8702J28818L3863L5592m3263Q8318p7226p820J17760
3030A003559K39625r5478j36224J24752J03748k74420k19611L25963l0201p3533
3020I68180J57907K81961q8189J4450P0094j20337j63829N1623M460K9066J04845
3009A310231m1531k27997J01125J01282j13004j66210J17961j26031J1969k2625
2999I45170L02365K2818J45439J57748k71128l9674L78054j94604j63728J31187
$$ plain form
3074 992208 920326 1009700 966447 759950 866124 929477 1008788 1004202 832153 683734 703026
3063 703026 746887 679850 844968 878621 837758 917981 908621 898248 882476 820282 874625 887977
3051 887977 995698 699363 687279 517594 550765 769190 828767 1009917 875841 707276
3041 707276 587369 746219 727517 856335 890198 925790 882527 970845 893619 885799 1003559
3030 1003559 1243184 1147706 1011482 1136234 1239982 965562 745951 1071914 1041713 968180
3020 968180 1126087 1408048 1319859 1334309 1404403 1284066 1120237 1171860 1176320 1205386 1310231
3009 1310231 1268700 1040703 1141828 1243110 1130106 963896 1081857 955826 967795 945170
2999 945170 1247535 1270353 1415792 1573540 1302412 1262738 1640792 1446188 1282460 1413647
2989A413647j49824J83675J34817q4641J34198j07868J58719j9139J68294L23536
2979B155414l1631J10470J0700j09380R6096J45527J33001j70144J0999J25462
2969B476514Q0564P5560L9694K43580j11514j90487j09301J84752P0447K67883
2959C027692O2019J73573r1866j21463j34876J71703j505J7542J9359R6099J39910
2948C358187O2456M4261K8930L05761p8011J34991L07339K37858J76183N26907
2938E104862K03071O0208L35846K38815M47659M67096L66854M80834K98745O50746
2928H654736L76340L70532M99454R21934Q28610R17841Q11265P90090J072789
2919A5243591J173482J586401J474151J585499J748561J899981L171120L785633
$$ plain form
2989 1413647 1263823 1447498 1582315 1497674 1631872 1524004 1682723 1663584 1831878 2155414
2979 2155414 2123783 2234253 2244953 2135573 2231669 2377196 2510197 2340053 2351052 2476514
2969 2476514 2557078 2632638 2672332 2915912 2804398 2613911 2504610 2689362 2759809 3027692
2959 3027692 3089711 3263284 3171418 3049955 2915079 3086782 3085277 3102819 3122178 3218277 3358187
2948 3358187 3420643 3464904 3493834 3799595 3721584 3856575 4163914 4401772 4577955 5104862
2938 5104862 5307933 5368141 5703987 5942802 6390461 6857557 7224411 7705245 8003990 8654736
2928 8654736 9031076 9401608 9901062 10822996 11651606 12569447 13380712 14170802 15243591
2919 15243591 16417073 18003474 19477625 21063124 22811685 24711666 27882786 31668419
2911C1668419M578174N841610O802810P447964P637238O734465P728821P972157
2903H6411658Q087339J601882j4992324j5677067j1916479j1360510q441873n496873
2895B8215753l721309k549342j947308k308399j588789j194407j247397j143803
2887A2514999j229819j108671n45191n36601o62647n52667j58854j91683l06284
2878G222582n32069k22669m49285m61274j22212k44406k69821l26263j68645J35682
2868D561620j17895m59759j53100k26765l2602l6775J59755j00916l12670L241
2858C284134k40523k77552j69806N8407p0377r4708j6751K2977K43358l82044
2848B357115k49265K68819k45689k51441M1738K08780n0594j49302m4279r0398
$$ plain form
2911 31668419 36246593 42088203 48891013 56338977 63976215 70710680 78439501 86411658
2903 86411658 94498997 96100879 81108555 65431488 53515009 42154499 33712626 28215753
2895 28215753 24494444 21945102 19997794 17689395 16100606 14906199 13658802 12514999
2887 12514999 11285180 10176509 9631318 9094717 8432070 7879403 7720549 7528866 7222582
2878 7222582 6690513 6467844 6018559 5557285 5435073 5190667 4920846 4594583 4425938 4561620
2868 4561620 4443725 3983966 3830866 3604101 3571499 3534724 3694479 3593563 3280893 3284134
2858 3284134 3043611 2766059 2596253 2654660 2584283 2489575 2472824 2495801 2739159 2357115
2848 2357115 2107850 2376669 2130980 1879539 1921277 2130057 2079463 1930161 1885882 1795484
2838A795484k04254M6668j19434M1351n2954p2346j29874O9377j15493m6347p9507
2827A132671j2247O14j53285J1780K85780K71615k77418l3485L0798n7985J6518
2816A215356k42850j52792O4247K70437l8272j27498L1114N7114K752l09020L4775
2805H05363L0748k3410J60001j69595j33171m0199l4650j90263M2825K17994j1033
2794F54610j59649Q9309j7703k15302K71790J2944L4283p4272n594q3041o7969
2783D39406K96741l4968k47805J33644R844K14479p9314j17903p3356k5401k1820
2772D93547j15677O6919m1138J17656k39489J29540m2114J99988m436j2919n2191
2761D99686m3920m2937J48606O2732j19402p1982p1235R9509q75j55785l5877
$$ plain form
2838 1795484 1591230 1637898 1518464 1559815 1506861 1434515 1304641 1374018 1258525 1212178 1132671
2827 1132671 1120424 1121038 967753 979533 1265313 1536928 1259510 1226025 1256823 1198838 1215356
2816 1215356 972506 819714 883961 1154398 1116126 988628 1019742 1076856 1079608 770588 805363
2805 805363 836111 812701 972702 803107 669936 629737 595087 404824 447649 665643 654610
2794 654610 494961 584270 566567 351265 623055 635999 670282 596010 590416 507375 439406
2783 439406 736147 701179 453374 587018 596862 811341 732027 614124 540768 515367 493547
2772 493547 377870 444789 403651 521307 281818 411358 369244 569232 564796 551877 499686
2761 499686 455766 412829 561435 624167 504765 432783 361548 461057 460182 304397 268520
2750B68520K9684m5988R9724J60633p4360j16569J97558j89684J26390k99600
2740A56308K00016j3497q6169P5920K33484k9984l2185J34617k30990j1125q9730
2729C06665M620o9303J22890N7521k6838j1239K22337R2328j01571j00483j43161
2718C53766K77636k7627q0143q7504M4700J07595k7789j47536K14688M2967M0513
2707G11266J543k21988j16459n0474O5814r2768J09631k0546Q2027J6617j68702
2696C15961j09899P6654o4656N9263Q2102P4431m3104l0217k8404J5001k535m6146
2684B98451p2841j1747m7665P8296J36940K55355j08670k28650J03760l355J943
2673D01817k8165R669j63683N4492l9339n3942K89504R4295L42062k25414n2296
$$ plain form
2750 268520 298204 252216 351940 512573 438213 321644 519202 329518 455908 156308
2740 156308 356324 342827 256658 332578 566062 536078 503893 638510 407520 396395 306665
2729 306665 311285 241982 364872 422393 395555 384316 606653 698981 597410 496927 353766
2718 353766 631402 603775 523632 436128 480828 588423 560634 413098 627786 670753 711266
2707 711266 712809 490821 374362 323888 389702 296934 406565 386019 468046 484663 315961
2696 315961 206062 282716 218060 277323 359425 433856 390752 360535 332131 347132 344597 298451
2684 298451 225610 213863 166198 244494 381434 636789 528119 299469 403229 399874 401817
2673 401817 373652 383321 219638 274130 234791 180849 470353 564648 906710 681296 629000
2662F29000j031r247J17163K53739l2537l17968L640l01827q7814k4857j18338
2651A09923J79274J02575r81R0898j02924R8950k63320j6582m5743M6177R9773
2640B98020M1977k7000N5546k23177m9050K86923J03802j5415K5285k77258k13625
2629F028J28306J15153J02595l9004J36457J6632j58355n809n9039j13347j11671
2618A7946p8127J50125n1553j44160J28974M09527j90587M384R64o7201N83l72734
2606a91859J4664L13043n773P5359l2445n5533k3055k45362K11860J16823K3601
2595B01323j16037n1784O0596P5364j99131P735N2725Q1467q713j5037j02640
2584a4132M4539J72894r9524J88843N8467J58992J15376l34395j11130Q3991o8100
$$ plain form
2662 629000 627969 618722 735885 989624 957087 639119 642759 340932 253118 228261 109923
2651 109923 289197 391772 390791 481689 378765 477715 214395 197813 152070 198247 298020
2640 298020 339997 312997 368543 145366 96316 383239 487041 471626 496911 219653 6028
2629 6028 134334 249487 352082 313078 449535 466167 307812 302003 242964 129617 17946
2618 17946 -60181 89944 38391 -105769 23205 432732 242145 246529 247493 180292 180875 -191859
2606 -191859 -177195 135848 130075 205434 172989 117456 94401 -150961 60899 177722 201323
2595 201323 85286 33502 94098 169462 -29669 -21934 30791 112258 103545 88508 -14132
2584 -14132 30407 203301 103777 292620 351087 510079 625455 291060 179930 263921 195821
2573A95821J91376J02682l16556j47988O7696k0491L8837j12796Q9816j00393
2563a1996K04958j0026o7496Q5366j95205j08161O2418J26436J44446l1236k54257
2552e4753r0331J05671p3712J01971J72657p966J1177J13430j72172M5805J05916
2541B57693L8313j74455K6838J10215R2617L5870P5780k27703r0585O780q8715
2530F2648L34215p2097J4161j23740J84422j92826l80088l6005J76174M07614
2520C74478l3163k88896Q3843N0676R5836M8975q1619n1916j64835Q3779K23005
2509C40163l20442m5274J16951J92830j57025O5470O1728j6158O1934N4371k68470
2498H6078o1193J10240j38595K3642L10340K77132r1851j89978k7470J71861k81619
$$ plain form
2573 195821 387197 489879 173323 25335 93031 72540 111377 -1419 88397 -11996
2563 -11996 192962 182936 115440 200806 5601 -102560 -40142 86294 230740 199504 -54753
2552 -54753 -145084 -39413 -113125 -11154 161503 153537 164714 278144 105972 151777 257693
2541 257693 296006 121551 148389 258604 351221 387091 462871 235168 144583 151363 62648
2530 62648 396863 324766 338927 215187 399609 206783 -173305 -209310 -33136 374478
2520 374478 341315 52419 136262 186938 282774 331749 250130 198214 33379 117158 340163
2509 340163 19721 -25553 91398 284228 127203 192673 254401 238243 300177 354548 86078
2498 86078 24885 135125 -3470 20172 330512 607644 515793 325815 298345 470206 188587
2487A88587j26749J64046J69875o0467k88418N604K01120O7304k15591p9257O9148
2476I5202j01853Q0539J15312k6317j71728K14395j16150M6923j1405K18868J05614
2465D49400j98385k704j239j35025Q7853N2274k1670K3375m0509M3164k9443j02620
2453A24471l78499K54609o818K36008M1608j44272P0499j8078j80549J61696o3687
2442I6988k31998J44421l0060J81156R8899j28451K3452J4478j1385K19827j04741
2431B72586J11929q8465J6340N3164j28431j71395l9935K16831J21858q89n3368
2420C10225j71291r3600J82430J96086j80385M8843n8632j60855N1157j8746N4385
2409A59617j69091j9992K02439J45864N165J28238J63198l71297j52176J00390
$$ plain form
2487 188587 61838 225884 395759 335292 46874 52478 253598 320902 105311 26054 95202
2476 95202 -6651 73888 189200 162883 -8845 205550 89400 136323 124918 343786 449400
2465 449400 251015 248311 247072 112047 199900 252174 230504 253879 213370 256534 227091 124471
2453 124471 -254028 581 -6237 229771 271379 127107 197606 179528 -1021 160675 96988
2442 96988 -135010 9411 -20649 160507 259406 130955 154407 168885 157500 377327 272586
2431 272586 384515 296050 312390 365554 237123 65728 25793 242624 364482 363593 310225
2420 310225 138934 45334 227764 423850 243465 292308 233676 72821 123978 105232 159617
2409 159617 -9474 -29466 172973 318837 324002 452240 615438 244141 91965 192355
2399A92355R0326r8779l07940K08435j2007l4526N4226j37651M5017O9837o3849
2388E444q83K44181Q5211q5967j72580j33742l1518o3707R1884J17847J88203
2377B44373k06120k19589K67140n5025n7446j30334J1414J17057K26640k7028
2367A71082k32501K140L7849J47082K185k51208j32156K14281J16168J30552k38860
2356c3386Q7107J08401j42568L5720p229J55638j10378q8729K61514k0285J8124
2345B63929l12586p7144l2483K39649j1981j52610L37444R216J10617k65279P466
2334A16238K20783Q0380l06266K10182l1409r7337m3398p6622K6094j28348J04629
2323G4926J15097P6466p2080n2136j05264K50813j69924O8669L9649j11972J50251
$$ plain form
2399 192355 282681 183902 -124038 84397 72390 37864 92090 -45561 -544 69293 5444
2388 5444 4561 248742 333953 247986 75406 -58336 -89854 -153561 -61677 56170 244373
2377 244373 38253 -181336 85804 30779 -26667 -157001 -145587 -28530 198110 171082
2367 171082 -61419 -59279 -21430 125652 127837 -123371 -255527 -41246 74922 205474 -33386
2356 -33386 53721 162122 19554 55274 48045 203683 93305 4576 266090 245805 263929
2345 263929 -48657 -125801 -158284 81365 69384 -83226 254218 263434 374051 108772 116238
2334 116238 337021 417401 111135 321317 289908 192571 149173 72551 98645 -29703 74926
2323 74926 190023 266489 194409 142273 37009 287822 117898 186567 226216 114244 264495
2312B64495r2642j72771O2953Q0475n5170j84000M03903P757k41976n8131J82663
2301A97556k8925j62454o1961j88719J72009J43027L3978O8404J970j52055j6574
2290F256r2330J25260J38947k7748p4592l6992K45011j16507l00173o8716L25455
2279A23871J17980r5696j03044K02532j44647k05887K13232J01355j78694j09106
2269g8104l5631l1838K85204J8557n3606Q6213j14658j97275K03866k2851J36140
2258A96017l45086R2309j59933m3472P25l4846L8599M7812J82708M7130k1148
2247H15J9713J8415l6541k5210J23852k1228o9216J12675m3491P9935J22812k64764
2235A7767J30173K4281l92305K81404J01373j65437J31899p6210J35256q6348
$$ plain form
2312 264495 171853 -918 62035 142510 87340 -96660 307243 315000 73024 14893 197556
2301 197556 168631 6177 -55784 -244503 -72494 70533 104511 172915 174885 22830 6256
2290 6256 -86074 39186 178133 150385 75793 38801 283812 167305 -132868 -201584 123871
2279 123871 241851 146155 43111 245643 100996 -104891 108341 209696 31002 -78104
2269 -78104 -113735 -145573 139631 158188 104582 190795 76137 -121138 82728 59877 196017
2258 196017 -149069 -56760 -216693 -260165 -259440 -294286 -255687 -207875 -25167 21963 815
2247 815 20528 38943 2402 -22808 101044 79816 10600 123275 79784 159719 282531 17767
2235 17767 147940 172221 -220084 61320 162693 -2744 129155 52945 188201 101853
2225A01853j20910o6385J82864J17353k92660n4931N8365R0603j81018O8062K18825
2214A22021J35169l00013k54921M0600M0871J25907J43242j19157K3680J16779
2204G4178R9382q0430j67503Q9984J74366l2455k632J55911j89391q7709j9840
2193A3861j71394J006K84302l5651k59877J29900O522n1539k02337K36101J17480
2182F8374Q3463n2998J06182j26841K90666r2822j08644j32959K39234O1352k14799
2171A20208j40930m3008J81079j84800P5886j21666k3999L0033P6043o9922k6725
2160a27801L33499J6388j03092m5856m7455n1868J1135R9544k66132p495r6883
2149b86016J77066j82557K70704K00607j70152J86L7260j78996K77869o2136k19229
$$ plain form
2225 101853 -19057 -85442 97422 214775 -77885 -132816 -74451 16152 -164866 -96804 122021
2214 122021 257190 -42823 -297744 -257144 -216273 -90366 52876 -66281 -42601 74178
2204 74178 173560 93130 -74373 15611 189977 157522 154890 310801 121410 33701 13861
2193 13861 -157533 -156527 127775 92124 -167753 -37853 -31331 -82870 -285207 -49106 68374
2182 68374 151837 98839 205021 78180 368846 276024 167380 34421 273655 335007 120208
2171 120208 -20722 -63730 117349 -67451 8435 -113231 -137230 -107197 -31154 -101076 -127801
2160 -127801 205698 222086 118994 73138 25683 -26185 -15050 84494 -181638 -189133 -286016
2149 -286016 -108950 -291507 -20803 179804 9652 9838 47098 -131898 145971 83835 -135394
2138a35394K40660J22855j04144j2475n58k95099n3894J57067n3623J81867o9056
2127b1794K2761L27808k9629q0066j00694o6944p2101K39947L0150j60753j08301
2116a9616P2430p4849j11755K63019j37208q6881L9755K68697P9441l55765m7590
2105a10322k47427J08770J34071J00977j54631m3742P0605K22382M6318m7702
2095G9299l9038J66173k46474q2861j43437l9200L02327K4962Q8823k22019J50183
2084C8738j4221j20179K47985L1889o0654o8481K1888j01796j9815l2837j85824
2073b63307J80333J74342L4101j22309P3310r9548O1349L6447K16672j48543k06216
2062f3369m1016J5300J32354k48344M25619j55424k61729J73122k6857K345J14778
$$ plain form
2138 -135394 105266 228121 123977 111502 110944 -184155 -238049 -80982 -134605 47262 -21794
2127 -21794 967 328775 299146 219080 118386 51442 -20659 219288 249438 88685 -19616
2116 -19616 52814 -22035 -133790 129229 -7979 -94860 -55105 213592 293033 -62732 -110322
2105 -110322 -357749 -248979 -114908 -13931 -168562 -212304 -141699 80683 127001 79299
2095 79299 40261 206434 -40040 -122901 -266338 -305538 -3211 21751 110574 -111445 38738
2084 38738 24517 -95662 152323 184212 123558 55077 76965 -24831 -44646 -77483 -263307
2073 -263307 -82974 91368 125469 3160 76470 -23078 38271 74718 291390 142847 -63369
2062 -63369 -104385 -89085 43269 -205075 220544 65120 -196609 -23487 -50344 -47999 66779
2051F6779K5223Q5121M0611j96497m561P4271O9997k36883M5321Q532J19930L0052
2039A27896m8653R5001J59566j57651j10677p8469j84270O1227J01451n1947k0987
2028a07513K5172Q9762o3374J30668J02276k13316j238P5080j19392l8350J09657
2017a0568M4113Q134K05504K0812k51024J8310J12149P2078j02780k5653j4237
2006G6838m2001M2700M1491k30410Q0290J06599j67904j6655K3807M2245L0823
1995a2177Q9902j12225J04821J50765j23402j46668J13237J59756j83165j79530
1985a38686N5313J03570r3160J47763P144n9150J6031J26323k19530j4352n0669
1974a19403O3269P9865P0226n3353k47531J25075J794N6305j5635M2153J17221
$$ plain form
2051 66779 92002 177123 217734 21237 16676 90947 160944 -75939 -30618 -22086 97844 127896
2039 127896 79243 174244 333810 176159 65482 -12987 -197257 -136030 -34579 -86526 -107513
2028 -107513 -82341 7421 -55953 74715 176991 -36325 -37563 37517 -81875 -120225 -10568
2017 -10568 33545 41679 247183 267995 16971 35281 147430 219508 116728 91075 76838
2006 76838 34837 77537 119028 -111382 -31092 75507 -92397 -109052 -85245 -43000 -12177
1995 -12177 77725 -34500 70321 221086 97684 -48984 64253 224009 40844 -138686
1985 -138686 -83373 20197 -72963 74800 81944 22794 38825 165148 -54382 -68734 -119403
1974 -119403 -56134 23731 93957 40604 -206927 -81852 -80058 -23753 -39388 2765 119986
1963A19986j91247j08059J71680N5889k36474J62205J68765j17715R1926r5142
1953B1814j43959J62607k0387r4970o576j01247j31419J36654P8344j22375J32386
1942h9128J93563O8112j59222P581k04005P523L05535k3561j32997R6559R8435
1931A68395k3336N4947q3110J641N2516j66893m15194N5690L96213J79596j8465
1920B02000l72196J57472o5816J46730L49307o0935k39228n9502P7592k59367
1910a23943J7717J03818J22212j97459l00266N18309r8920j02166O453O4319K1225
1899C1299j03150J89009j13179J73036r2846j91245j26613J68113l9703j93208
1889b98487N3193k3734J85586J96528J17920P8787M3465l12694k22019L5724J99556
$$ plain form
1963 119986 -71261 -179320 -7640 48249 -188225 -26020 142745 25030 116956 21814
1953 21814 -122145 40462 20075 -74895 -81471 -182718 -314137 -177483 -99139 -221514 -89128
1942 -89128 104435 172547 13325 20906 -183099 -175576 129959 106398 -26599 69960 168395
1931 168395 145059 200006 116896 118537 171053 4160 -411034 -355344 40869 220465 202000
1920 202000 -170196 -12724 -78540 68190 417497 356562 117334 57832 135424 -123943
1910 -123943 -106226 -2408 119804 -77655 -377921 140388 41468 -60698 -54245 10074 31299
1899 31299 -71851 117158 3979 177015 84169 -107076 -233689 -65576 -105279 -298487
1889 -298487 -245294 -269028 -83442 113086 231006 309793 353258 40564 -181455 -145731 53825
1878E3825Q5606j39547K0350J27759J41107l67030R8354r5250n3114J24883q3
1867c140j15065J42132J00010N2869J34172p5064l87550J02929m4130N1226r7738
1856a39349O9252J09500J8192R4995j96619J59660k32150N2906k7674J34146m6632
1845c773L4403j72212K3773J29447j37345J00802J19636R8904R6890n5567k60932
1834b5974k28725J1710N6008K34897J51589j19861O1168k18749k58886m7918J30194
1823b54547J29535P4945J27611m1057O4153k31239J71138k43064L6543J03283
1813f2699M0911K96862j95802j11808K34646o7706j23281p3958q2524J7479J94636
1802F6756K7295j28579n261j8978o0659J00981J46218l33896j76891J71011J63094
$$ plain form
1878 53825 139431 -116 20234 147993 289100 -77930 20424 -74826 -127940 -3057 -3140
1867 -3140 -118205 23927 123937 176806 310978 235914 -151636 -48707 -92837 -41611 -139349
1856 -139349 -70097 39403 57595 152590 -44029 115631 -116519 -63613 -91287 42859 -3773
1845 -3773 30630 -141582 -117809 11638 -125707 -24905 94731 193635 290525 234958 -25974
1834 -25974 -254699 -242989 -186981 47916 199505 79644 140812 -77937 -336823 -384741 -254547
1823 -254547 -125012 -50067 77544 36487 100640 -130599 40539 -202525 -165982 -62699
1813 -62699 -21788 275074 79272 -32536 202110 134404 11123 -62835 -145359 -127880 66756
1802 66756 94051 -34528 -39789 -58767 -119426 -18445 127773 -206123 -383014 -212003 -48909
1791d8909m0522O997J39835Q2353j83065o2348k6201J80761J53677m3838n5866
1780A02874j17059K2293K66504j15125j28271K3302N8960r7162J82954m7698j96742
1769d5170K99596K8904l05058M5319n1619R3700K7319n5884M2302M2234R2623
1758B14266q4918j57138p5508J31984K1199j53681J88932P8562j59591J88503
1748A92610j40970L18367P4155j64286k21091j00953j21298M8035K50892l7898
1738I7563N2754k98505J73639J70156j65298m3713j7140k7553J73936j1115q4092
1727B0632J26134r1856J60818n9364j69457j49345L09162Q586k29215L13269j25047
1716A14317j99668M3814n3261R180K31368o2411k13525q7644N8023L5962J10673
$$ plain form
1791 -48909 -89431 -82434 57401 139754 -43311 -105659 -131860 48901 202578 158740 102874
1780 102874 -14185 8108 274612 159487 31216 54518 113478 16316 199270 151572 -45170
1769 -45170 254426 283330 -21728 23591 -28028 65672 92991 37107 79409 121643 214266
1758 214266 129348 -27790 -103298 28686 49885 -103796 85136 163698 4107 192610
1748 192610 51640 370007 444162 279876 58785 -42168 -163466 -115431 135461 97563
1738 97563 150317 -148188 25451 195607 30309 -13404 -30544 -58097 115839 104724 20632
1727 20632 146766 54910 215728 156364 -13093 -162438 146724 155310 -73905 239364 114317
1716 114317 -85351 -41537 -94798 -85618 145750 83339 -130186 -217830 -159807 -123845 -13172
1705a3172J43028L9014j17770l99064L2125J78708M1186K00091j96694J09625
1695A7077p0120J56770P2593K535M0414k40746j74254N521J47430J77328k11826
1684g7278O9036j82158o4120J68333k9231K47033j72478m7333j5753l8819p7820
1673b20588m8691R3417J43993N7692j9149j91226J98056O7797p6896J96524J1958
1662B12887J42764K4207k24484k068J28452q1972n3199P4859l10449J5758K23202
1651A49957Q2464j63575j7523j18571N5396l3011r4232K72290k88488J79253p98
1640B3162k2163j40521J45348P7133k94206j13676P560K69825l4013j25318L13058
1629A06189J81444l23852K78951l8827J2185q2769j02802q0490l1643J92303r5692
$$ plain form
1705 -13172 129856 168870 51100 -347964 -315839 -137131 -95945 104146 -92548 17077
1695 17077 -53043 103727 176320 178855 219269 -21477 -195731 -190210 -42780 134548 -77278
1684 -77278 -8242 -190400 -254520 -86187 -115418 131615 -40863 -88196 -103949 -142768 -220588
1673 -220588 -269279 -175862 -31869 25823 6674 -184552 13504 81301 4405 200929 212887
1662 212887 355651 379858 155374 153306 281758 199786 146587 221446 -89003 -73245 149957
1651 149957 232421 68846 51323 -67248 -11852 -44863 -139095 133195 -155293 23960 23162
1640 23162 999 -139522 5826 82959 -211247 -324923 -317363 -47538 -81551 -206869 106189
1629 106189 287633 -36219 242732 203905 216090 133321 30519 -49971 -81614 110689 14997
1618A4997m0525M5470N7288l5719k71117l3992J00758P2654J87006N4343j85356
1607c4193J67207k2709j4251j57670p3028K47068J7742j25814Q1693j60265J53701
1596G9481n7178J14725J73088k40816J73974j76418q0057R4511k41927R4534J49156
1585H3073j25535o5908N4756Q6042J47513R5879k40240k44291j06900K95389n3153
1574g3375p9619M1765K39983k05789K252Q3574J53745K1422k52535L4133Q5022
1563E0578q5744q5590K41223P9318p259k86189j00016R5685j972K4883J43979
1552F8896K1577j07684N3202J3103j06823j24405O4821j16043M7348J07318K44320
1541A65630k72229k18010J70993k55976Q8787K32830L19569k2885j49197O3340
$$ plain form
1618 14997 -25528 19942 77230 41511 -229606 -263598 -162840 -90186 96820 151163 -34193
1607 -34193 133014 110305 96054 -61616 -134644 112424 130166 4352 86045 -74220 79481
1596 79481 22303 137028 310116 69300 243274 66856 -13201 81310 -160617 -66083 83073
1585 83073 -42462 -108370 -53614 32428 179941 275820 35580 -208711 -315611 -20222 -73375
1574 -73375 -152994 -111229 128754 -77035 -74783 8791 162536 183958 -68577 -34444 50578
1563 50578 -35166 -120756 120467 199785 192526 -93663 -193679 -97994 -99966 -75083 68896
1552 68896 90473 -17211 35991 49094 -57729 -182134 -117313 -233356 -186008 -78690 165630
1541 165630 -106599 -324609 -153616 -409592 -320805 -87975 231594 208709 59512 122852
1531A22852n0425Q1901j98629j59430J1300J28163r7233J51314p0701P9502K74974
1520B73588k78365n5742J70210J42482j81537j66198J57081n97j39496J53818
1510G5244O729J63223Q783k54494m7179r1435o1964j75773J18051M791K25699
1499b8325J65319j39201j09513K419J19226J27992j78530J86517P8852N8798r3391
1488A90163k10295L2649l42152J34055J00957L0487j86428k9523J40442l1720
1478a71365K45476o1009j84806j01707m6888P0387J23094j22188k38662K66368
1468b21300J02762J27479P246j9839K2325q3754k46565J06425J81314j52964L4555
1457a42316o1291k7333J58368q2361J494J4469n3314o901K99440J32611J28957
$$ plain form
1531 122852 72427 154328 -44301 -203731 -192431 -64268 -161501 -10187 -80888 -1386 273588
1520 273588 -4777 -60519 109691 252173 70636 -95562 61519 60922 -78574 75244
1510 75244 81973 245196 253979 -515 -47694 -139129 -201093 -376866 -258815 -254024 -28325
1499 -28325 136994 -2207 -111720 -109301 9925 137917 -40613 145904 224756 283554 190163
1488 190163 -20132 12517 -329635 -195580 -94623 -64136 -250564 -280087 -139645 -171365
1478 -171365 74111 13102 -171704 -273411 -320299 -249912 -126818 -249006 -487668 -221300
1468 -221300 -118538 8941 16187 -3652 18673 -65081 -311646 -205221 -23907 -176871 -142316
1457 -142316 -203607 -230940 -72572 -154933 -153439 -138970 -192284 -199185 100255 232866 361823
1446C61823k19505k19096k09284J48035J54173O2063J51057j37294l6850j19000
1436f3878O8311N7298m5819P6198j55729J95692j50710L7847P2009j54825P312
1425e6294O4903K2166n6353j54932Q2582k4845l8668J61201p9160J84444J56989
1414B62033k70115j3384J0434k262N8068j21499N265o230J35965J23067j39664
1403D1678k71289K13036K74920j82726j40736m6119P0495m6892J0437J67643j04049
1392a3602J12027O6625L4679o6581O1230p1748Q0713j12287k6384K25241j23010
1381A66903k58338R9200O7241M639j23311j2488l082K0844J06603K34435j84164
1370A18482M0513Q3078m7284j71618P2923L5684P0345j16059j9060k83817Q2099
$$ plain form
1446 361823 142318 -76778 -286062 -138027 16146 78209 229266 91972 55122 -63878
1436 -63878 4433 61731 15912 92110 -63619 132073 -18637 19210 91219 -63606 -56294
1425 -56294 8609 30775 -25578 -180510 -97928 -122773 -161441 -240 -79400 105044 262033
1414 262033 -8082 -21466 -11032 -13294 44774 -76725 -71460 -77690 58275 181342 41678
1403 41678 -229611 -16575 258345 75619 -65117 -111236 -40741 -87633 -77196 90447 -13602
1392 -13602 98425 165050 199729 133148 194378 122630 203343 91056 64672 289913 166903
1381 166903 -91435 7765 75006 79645 -43666 -56154 -59236 -38392 68211 302646 118482
1370 118482 158995 242073 194789 23171 96094 131778 202123 86064 67004 -216813 -134714
1359a34714K801m6317q7829O7721l7941k08596J41544J83229J17474j38067K13128
1348G2433j75152q0493K36147m5169R1824L5187j19622J89884m765K8481L8086
1337B66841J3513j02772j17320L0327k3852k2084K13002l897o9223k72343n5645
1326a43453M2026j3214J20851j2508R2893J0785j86299J65173m4608j16687J0083
1315g4958K25080j67465o7556j16749K59459K7468o9984J39983Q4401j47328J11693
1304B04044k63967j13256J50933o0748j14685J59203j08434j12028O4825K55755
1294F1642l2947k02648K34006k74517r2727M4588J32493K26516M4682p8363j86819
1283a24094K34002R602k24699K6035O5107R5991j66722K63893j63737K12862j87451
$$ plain form
1359 -134714 -131913 -178230 -266059 -198338 -236279 -444875 -303331 -120102 -2628 -140695 72433
1348 72433 -102719 -183212 52935 7766 99590 134777 15155 205039 200274 228755 266841
1337 266841 280354 177582 60262 90589 66737 44653 257655 253758 184535 -87808 -143453
1326 -143453 -101427 -114641 6210 -6298 86595 97380 -88919 76254 31646 -85041 -74958
1315 -74958 150122 -17343 -84899 -201648 57811 85279 15295 155278 239679 92351 204044
1304 204044 -59923 -173179 -22246 -82994 -197679 -38476 -146910 -258938 -194113 61642
1294 61642 28695 -173953 60053 -214464 -307191 -262603 -130110 96406 141088 62725 -124094
1283 -124094 109908 119510 -105189 -79154 -14047 81944 -84778 179115 15378 228240 40789
1272D0789k37408m6513L24943o1656k38528R6577j84963L969J34964J49841K1714
1261C729J31233r2514o497L8292j26063L6517K03067j25824j37772n3367J5004
1250a14195K44559j15569k8224J6193q3404l6468R0773l8987k8727k40713k5687
1239c60449J52524J87414J01091k58996J79751l9697J8283J19735k21089j37678
1229b59111L16705J82576k11755j02461k14277P0860N2209j73524J43954o8902
1219b63726Q759M2675M45172j73398j37445P5493J03522o8913R2006j00322j86188
1208a62365L39924j2474j98209j78872J32156L1676P9177k02944J9521J2227m2473
1197a82656L4912J05102J72508r2966n5470J35394j45942j1059J44347M8747p4863
$$ plain form
1272 40789 -196619 -243132 81811 20155 -218373 -121796 -306759 -302790 -167826 -17985 3729
1261 3729 134962 42448 35951 74243 -51820 -15303 187764 61940 -75832 -129199 -114195
1250 -114195 130364 14795 -13429 2764 -80640 -117108 -26335 -65322 -94049 -334762 -360449
1239 -360449 -207925 -20511 80580 -178416 1335 -38362 -20079 99656 -121433 -259111
1229 -259111 57594 240170 28415 -74046 -288323 -217463 -165254 -338778 -194824 -263726
1219 -263726 -254967 -212292 232880 59482 -77963 -2470 101052 32139 124145 23823 -162365
1208 -162365 177559 165085 -33124 -211996 -79840 -48164 31013 -171931 -152410 -140183 -182656
1197 -182656 -147744 -42642 129866 36900 -18570 116824 -29118 -40177 104170 152917 78054
1186G8054k7950j30665J601j6504J1003k3345l1123O3373k7375j4245J36904M5071
1174F4799j9076n3563n8843K50749J0349j59139R5454j67045n563n2495j4269
1163a08642J11021n4280J58417j47138j14964R7841K4463K9571K02444j77402
1153B1331j37593L50K26451O587l42629n9865l2093J949K0226J97938j1428K2740
1141h6036N6778J23933k0047r8079q5759m2471J53199l465K0361O1572L9001r2294
1129B6693L1423O1932j4513O1655L8947O5906k18549j70687K45641J4825j60842
1118a7569J19746k7696j21322j95549J46517K1966J2416q923j95984K40941J69537
1107A44080j58259j48249m7840J52988j6752P6978K49685j88361M7805j20483
$$ plain form
1186 78054 50104 -80561 -78960 -95464 -84461 -107806 -138929 -75556 -102931 -117176 19728 64799
1174 64799 45723 -7840 -66683 184066 194415 35276 130730 -36315 -41878 -94373 -108642
1163 -108642 2379 -51901 106516 -40622 -155586 -57745 -33282 -3711 198733 21331
1153 21331 -116262 -115912 110539 117126 -225503 -285368 -317461 -315512 -295286 -97348 -108776 -86036
1141 -86036 -29258 94675 74628 -23451 -109210 -151681 1518 -1947 18414 79986 118987 26693
1129 26693 58116 120048 105535 167190 206137 272043 53494 -117193 128448 143273 -17569
1118 -17569 102177 74481 -46841 -242390 -95873 -73907 -61491 -70414 -266398 -25457 144080
1107 144080 -14179 -162428 -210268 -57280 -74032 2946 252631 64270 112075 -8408
1097h408j96341O8195P0599J09556J01795j57784k9986O2308k6403J92237J46788
1086C32556l73942J48464q570j34942j63650K87016K41173l12843J78836N1106
1076B45204q8348j41258J2990J77362j57296J9284j17460m9608n6164n854p6352
1065b37500K36604K0915q0413J9782M1597J06312J29712L8849R9665j28962l58066
1054a11505l4896J07748O1637k25993J39382N8638j23445J80878j8784O0311L2454
1043A26425j73836j09298K3953J55422j80824o720k9916j2538K37733J89246k89420
1032f9773r8635J3928J26721J0843j59763N7789L9561J90089j47064J4337J07286
1021H5319k8478j11023M6804J06017j42429r3243q2896K36418N2163q6590j05626
$$ plain form
1097 -8408 -204749 -136554 -65955 43601 145396 -12388 -42374 19934 -6469 185768 332556
1086 332556 -41386 107078 98508 -36434 -200084 86932 328105 15262 194098 245204
1076 245204 156856 15598 28588 205950 48654 67938 -49522 -99130 -155294 -161148 -237500
1065 -237500 -896 20019 -60394 -40612 985 107297 237009 275858 375523 246561 -111505
1054 -111505 -146401 -38653 22984 -203009 -63627 -4989 -128434 52444 33660 93971 126425
1043 126425 -47411 -156709 -132756 22666 -158158 -164878 -194794 -207332 30401 219647 -69773
1032 -69773 -168408 -154480 -27759 -16916 -176679 -118890 -79329 110760 -36304 -21967 85319
1021 85319 56841 -54182 -7378 98639 -43790 -137033 -219929 16489 68652 -17938 -123564
1010a23564Q0922j57077O6795M6468k4623r7363K2300R1231J00143j0992m1924
999d7684j03060Q3903N4988J5371O1907J96252j38189j33849K8265m5050N2892
988B5746O3664j11047K6557o0871L3932N9701R5572M0171J4916j6482k68662J61555
976F4752J4056L8894j31273j44763K16998q7254j29179j0433j99024L56579J32054
965A21407k37899P534J01993Q4988O4363k76128J81022j18846j82102m8558J09803
954a92423J80499l4876J14086k4507J2566j50139J98707j04082K3910K5208Q735
943E7684P46k79751K06776Q6316j17636J21911j30025j02408M7169P2577j21307
932a57948M6319K36775N9178K83598k91768j50353o0087O1121J54029l93763k7479
$$ plain form
1010 -123564 -42642 -199719 -132924 -86456 -111079 -208442 -186142 -94911 5232 -5760 -47684
999 -47684 -150744 -66841 -11853 3518 65425 261677 123488 -10361 17904 -27146 25746
988 25746 89410 -21637 4920 -55951 -22019 37682 133254 173425 188341 171859 -96803 64752
976 64752 78808 117702 -13571 -158334 58664 -28590 -157769 -168202 -367226 -10647 121407
965 121407 -116492 -108958 -6965 78023 142386 -133742 47280 -71566 -253668 -302226 -192423
954 -192423 -11924 -46800 67286 42779 55345 -94794 103913 -169 23741 48949 57684
943 57684 58430 -221321 -14545 71771 -45865 76046 -53979 -156387 -109218 -36641 -157948
932 -157948 -111629 125146 184324 467922 176154 25801 -34286 26835 180864 -212899 -240378
921b40378P7593J7965j42297J35491N4519J2090K16720k01258j90250j2915J13940
910a58780P578R9803J37916j92937j21869K40115J07815j02012n4042J43576q0620
899B6543J37076j0428k74337k20962K1388J95634J56354r3282Q6501K22122p4325
888A72284J9089l4810j06224K00482j54754j34768M0516L68857j68475q5257k22487
877a05547K09373K9796j18933O9607n2851m2065K4974K14534P3910j58485j03494
866D0819J52981k32111r3039Q3890k3857R4955o038m4885M9731j82992K9712j74218
854c05052R462n0616K28301J99654j45200m0056J53500P1497j69201j1570L9592
843a9689q1044K79341j42230J9154j5080j39941J2944k0371P647J63771K38267
$$ plain form
921 -240378 -162785 -144820 -287117 -151626 -97107 -85017 131703 -69555 -259805 -272720 -158780
910 -158780 -151202 -51399 86517 -106420 -228289 11826 119641 17629 -36413 107163 26543
899 26543 163619 153191 -121146 -342108 -320720 -125086 31268 -62014 24487 246609 172284
888 172284 191373 156563 50339 250821 96067 -38701 1815 370672 202197 116940 -105547
877 -105547 103826 133622 14689 84296 31445 -10620 14354 228888 302798 144313 40819
866 40819 193800 -38311 -131350 -47460 -71317 23638 17600 -27285 22446 -160546 -130834 -305052
854 -305052 -295590 -346206 -117905 81749 -63451 -103507 49993 121490 -47711 -59281 -19689
843 -19689 -100733 178608 36378 55532 40452 -99489 -86545 -106916 -99269 64502 302769
832C02769L1839l36627L1346J74560k67904N49J9982p2632j86235J39969J57864
821d520k14359k727Q7532n2417K08245r3035l2294J96223L6722l01731j38128
810c10489J63359j34476Q498k723J40110J95142p2044K04691m3961l02018j1688
799a65599n9379J02223m6972K5716j2317M3614K08761J2224R639R6242Q2117o4444
787B31825j96517R5989j93790J14699K1407j8096N1563P8239m1852k31227O059
776h1701J87078r0664o3135l89981K75584R2000j39292J66255M4261j33995J66679
765C3089L9112q8885p5040J03768j0014K33196M5113k61251O5713k35549J46490
754d258j98477j29298P0326R2801J77092J73389J08073p5364j77590o9156m2341
$$ plain form
832 302769 334608 -2019 29327 203887 -64017 -63468 -43486 -116118 -302353 -162384 -4520
821 -4520 -218879 -221606 -134074 -186491 21754 -71281 -103575 92648 129370 -172361 -310489
810 -310489 -147130 -281606 -273108 -275831 -135721 59421 -12623 192068 148107 -153911 -165599
799 -165599 -224978 -122755 -169727 -144011 -156328 -112714 96047 108271 117910 214152 296269 231825
787 231825 35308 131297 -62493 52206 73613 55517 107080 185319 143467 -87760 -81701
776 -81701 105377 14713 -48422 -438403 -162819 -70819 -210111 -43856 405 -133590 33089
765 33089 72201 -16684 -91724 12044 2030 235226 280339 19088 84801 -150748 -4258
754 -4258 -202735 -332033 -261707 -168906 8186 181575 289648 214284 36694 -32462 -74803
743g4803J8562k18599R1506K19668J55845k61135n2644R1976P1819j54925q2822
732a95552J29990J26533J64938p0230j10464K22785k13407j06r9488p766R5501
721D2734k3161j52384K07473j34172L04634n6452j29524k3198m9935J21398K740
710A10153J62765K51091j21936k23987P1068n4585k99951j29336J40201l8759
700a33276Q2735J76837j00291K3016n2166j1488k41810J24733J50485j53982K00146
689F4939J23134M3073O7689k4827o8266j07939k35864J70546k0106M8439q1893
678b1075R649j14753J75153P5801O2113k86167Q786j29622m9205K44853K0721
667c746J37158j96303k6266M0382J30735N1366j24367N9409k46847j58677J72826
$$ plain form
743 -74803 -56241 -274840 -183334 36334 192179 -68956 -121600 -29624 42195 -112730 -195552
732 -195552 -65562 60971 225909 155679 45215 268000 54593 54487 -45001 -52767 42734
721 42734 19573 -132811 74662 -59510 245124 188672 59148 35950 -13985 107413 110153
710 110153 272918 524009 402073 178086 249154 194569 -105382 -234718 -94517 -133276
700 -133276 -50541 126296 26005 49021 -3145 -14633 -256443 -131710 18775 -135207 64939
689 64939 188073 231146 298835 274008 205742 97803 -138061 32485 12379 60818 -21075
678 -21075 -11426 -126179 48974 124775 186888 -99279 -90493 -220115 -269320 -24467 -3746
667 -3746 133412 -62891 -89157 -48775 81960 133326 8959 68368 -178479 -337156 -164330
656a64330L00870K52294o4933l81638j46520O624m4286N0941K91927j96971k19742
645c15764J857L10903J8806m4109J29698l6261o4865O2872k7921r3663l04666
634c63113L05995R1524j56747j0276j78885j30860K12989J80333j12689J5102
624a46627l8067K45277j18600N6786k2154p903j7041J83317M8975J15097j63050
613A36010n8133K66178k68730p939n9412N5702P8658M6663j20937q8517Q2641
602F2184J59766k13459P858J71572j00696j26925j16188J83256o593j8660N8391
591F0506q5853o3086o882P785j05692l4485N4221R3946R1302K00227K2723k14624
579B0088J36570P606O8999k16000J78676k97743r9898k844p7231J13286N1289
$$ plain form
656 -164330 136540 388834 323901 -57737 -204257 -197633 -241919 -190978 100949 -96022 -315764
645 -315764 -313907 -3004 15802 -28307 101391 65130 265 63137 35216 -58447 -363113
634 -363113 -57118 34406 -122341 -132617 -311502 -442362 -229373 -49040 -161729 -146627
624 -146627 -184694 60583 -58017 -1231 -23385 -31288 -48329 134988 183963 299060 136010
613 136010 77877 344055 75325 67386 7974 63676 142334 188997 68060 -20457 62184
602 62184 221950 8491 16349 187921 87225 -39700 -155888 27368 20775 2115 60506
591 60506 -25347 -88433 -95315 -87530 -193222 -227707 -173486 -79540 11762 211989 234712 20088
579 20088 156658 164264 233263 17263 195939 -101804 -201702 -204546 -281777 -168491 -117202
568a17202N1054P8086j21057j31394K09958r836j24553J46329J5954r2041J40354
557D5652j37688j19356l3927J37534m3263K33729K2745k72496O1925M9225K35160
546A79240n6208q4425J8500j53693L51331J0904k30187J19180R3742k89988J37832
535I6228Q4794o5632j06520L9531O4156J44935q7108k19718K56598k6845j87161
524f742j13706N6512J16387L3871k04298Q8738j47940R5023J60913k62822o3117
513b47181K57889J3439m6002k42702J7775Q9710q3520J39924j08147J9095K83204
502I3484K3246k50657j71263J97339J5902J78558k09311N5950K8734j91538J47023
$$ plain form
568 -117202 -66148 11938 -109119 -240513 -30555 -40391 -164944 -18615 -2661 -94702 45652
557 45652 -92036 -211392 -245319 -107785 -151048 82681 105426 -167070 -105145 -55920 179240
546 179240 123032 38607 57107 -96586 254745 265649 35462 154642 248384 -41604 96228
535 96228 181022 115390 8870 48401 112557 257492 170384 -49334 207264 180419 -6742
524 -6742 -120448 -63936 52451 86322 -117976 -29238 -177178 -82155 78758 -184064 -247181
513 -247181 10708 24147 -21855 -264557 -246782 -157072 -240592 -100668 -208815 -189720 93484
502 93484 116730 -133927 -305190 -107851 -91949 86609 -122702 -66752 -38018 -229556 -82533
$$ [...]
##END NTUPLES=NMR SPECTRUM
##END=
